##TITLE=31Pdec_SR60_W
 D2O, 24 sc
 14.05.2021
##JCAMPDX= 6.0         $$ Bruker NMR JCAMP-DX V2.0
##DATA TYPE= NMR SPECTRUM
##DATA CLASS= NTUPLES
##ORIGIN= UXNMR, Bruker Analytische Messtechnik GmbH
##OWNER= root
$$ XWIN-NMR		Version 3.5
$$ Fri May 14 10:08:25 2021 Russian Standard Time (UT+4h)  she@DPX200
##.OBSERVE FREQUENCY= 81.013821
##.OBSERVE NUCLEUS= ^31P
##.ACQUISITION MODE= SIMULTANEOUS
##.ACQUISITION SCHEME= undefined
##.AVERAGES= 24
##.DIGITISER RES= 16
##SPECTROMETER/DATA SYSTEM= spect
##.PULSE SEQUENCE= zgpg30
##.SOLVENT NAME= D2O
##.SHIFT REFERENCE= (INTERNAL, D2O, 0, 248.564)
##AUDIT TRAIL= $$ (NUMBER, WHEN, WHO, WHERE, WHAT)
$$ ##TITLE= Audit trail, XWIN-NMR		Version 3.5
$$ ##JCAMPDX= 5.01
$$ ##ORIGIN= Bruker BioSpin GmbH
$$ ##OWNER= she
$$ F:/spectra/data/she/nmr/P31/1/pdata/1/auditp.txt
$$ ##AUDIT TRAIL=  $$ (NUMBER, WHEN, WHO, WHERE, WHAT)
(   1,<2021-05-14 10:07:00.04 +0400>,<she>,<DPX200>,
      <created by zg, POWCHK disabled, PULCHK disabled
       configuration hash MD5:
       00 E9 B6 7A A2 85 ED C7 34 08 36 98 17 FE 4E 26
       data hash MD5: 32K
       FB A7 0C F7 4F 53 A6 91 DA 79 B4 45 FA 18 B8 C2>)
(   2,<2021-05-14 10:07:17.31 +0400>,<she>,<DPX200>,
      <Start of raw data processing
       efp BC_mod = 2 LB = 1 FT_mod = 6 PKNL = 1 PHC0 = -6759.025 PHC1 = 483.0005 SI = 64K 
       data hash MD5: 64K
       E4 4D 26 62 F9 95 36 E6 5D 3C 65 4B 90 F8 BE 07>)
(   3,<2021-05-14 10:07:46.93 +0400>,<she>,<DPX200>,
      <pk PHC0 = 123.6614 PHC1 = -328.6 
       data hash MD5: 64K
       2B F8 64 4C B7 59 71 39 74 18 A8 B0 89 0E AB 33>)
(   4,<2021-05-14 10:07:58.01 +0400>,<she>,<DPX200>,
      <abs ABSG = 5 
       data hash MD5: 64K
       04 AF BB E2 B8 86 12 9C 80 79 30 DF 85 5D 4F 8D>)
$$ ##END=
$$ 
$$ hash MD5
$$ 7B 09 0E 4B E3 9A 88 2D CE C3 26 2B 4E 2C 88 84
##$RELAX= 
##$RELAX= 
##$RELAX= 
##$RELAX= 
##$RELAX= 
##$RELAX= 
##$RELAX= 
##$RELAX= 
$$ Bruker specific parameters
$$ --------------------------
##$DU= <F:/spectra>
##$EXPNO= 1
##$NAME= <P31>
##$PROCNO= 1
##$TYPE= <nmr>
##$USER= <she>
##$AMP= (0..31)
100 100 100 100 100 100 100 100 100 100 100 100 100 100 100 100 100 100 
100 100 100 100 100 100 100 100 100 100 100 100 100 100 
##$AQSEQ= 0
##$AQ_mod= 1
##$AUNM= <au_zg>
##$AUTOPOS= <>
##$BF1= 81.014009
##$BF2= 200.13
##$BF3= 200.13
##$BF4= 200.13
##$BF5= 200.13
##$BF6= 200.13
##$BF7= 200.13
##$BF8= 200.13
##$BYTORDA= 1
##$CFDGTYP= 0
##$CFRGTYP= 5
##$CHEMSTR= <none>
##$CNST= (0..31)
1 1 145 1 1 1 1 1 1 1 1 1 1 1 1 1 1 1 1 1 1 1 1 1 1 1 1 1 1 1 1 1 
##$CPDPRG= <waltz16>
##$CPDPRG1= <>
##$CPDPRG2= <waltz16>
##$CPDPRG3= <>
##$CPDPRG4= <mlev>
##$CPDPRG5= <mlev>
##$CPDPRG6= <mlev>
##$CPDPRG7= <mlev>
##$CPDPRG8= <mlev>
##$CPDPRGB= <>
##$CPDPRGT= <>
##$D= (0..31)
0 1 0 0 0 0 0 0 0 0 0 0.03 2e-05 3e-06 0 0 0 0 0 0 0 0 0 0 0 0 0 0 0 0 
0 0 
##$DATE= 1620972419
##$DBL= (0..7)
120 120 120 11 120 120 24 19 
##$DBP= (0..7)
150 150 150 150 150 150 150 150 
##$DBP07= 0
##$DBPNAM0= <>
##$DBPNAM1= <>
##$DBPNAM2= <>
$$ [...]
##$SUBNAM3= <"">
##$SUBNAM4= <"">
##$SUBNAM5= <"">
##$SUBNAM6= <"">
##$SUBNAM7= <"">
##$SUBNAM8= <"">
##$SUBNAM9= <"">
##$SW= 501.771253377433
##$SWIBOX= (0..15)
0 1 3 0 0 0 0 0 0 0 0 0 0 0 0 0 
##$SW_h= 40650.406504065
##$TD= 32768
##$TD0= 1
##$TE= 0
##$TE2= 300
##$TE3= 300
##$TEG= 300
##$TL= (0..7)
0 120 53 12 22 120 120 120 
##$TP= (0..7)
150 150 150 150 150 150 150 150 
##$TP07= 0
##$TPNAME0= <>
##$TPNAME1= <>
##$TPNAME2= <>
##$TPNAME3= <>
##$TPNAME4= <>
##$TPNAME5= <>
##$TPNAME6= <>
##$TPNAME7= <>
##$TPOAL= (0..7)
0.5 0.5 0.5 0.5 0.5 0.5 0.5 0.5 
##$TPOFFS= (0..7)
0 0 0 0 0 0 0 0 
##$TUNHIN= 0
##$TUNHOUT= 0
##$TUNXOUT= 0
##$USERA1= <user>
##$USERA2= <user>
##$USERA3= <user>
##$USERA4= <user>
##$USERA5= <user>
##$V9= 5
##$VALIST= <valist>
##$VCLIST= <CCCCCCCCCCCCCCC>
##$VD= 0
##$VDLIST= <DDDDDDDDDDDDDDD>
##$VPLIST= <PPPPPPPPPPPPPPP>
##$VTLIST= <TTTTTTTTTTTTTTT>
##$WBST= 1024
##$WBSW= 4
##$XGAIN= (0..3)
0 0 0 0 
##$XL= 0
##$YL= 0
##$YMAX_a= 3168
##$YMIN_a= -5187
##$ZGOPTNS= <>
##$ZL1= 120
##$ZL2= 120
##$ZL3= 120
##$ZL4= 120
##$ABSF1= 248.5645
##$ABSF2= -253.2056
##$ABSG= 5
##$ABSL= 3
##$ALPHA= 0
##$AQORDER= 0
##$ASSFAC= 0
##$ASSFACI= 0
##$ASSFACX= 0
##$ASSWID= 0
##$AUNMP= <proc_1d>
##$AZFE= 0.1
##$AZFW= 0.5
##$BCFW= 0
##$BC_mod= 2
##$BYTORDP= 0
##$COROFFS= 0
##$CY= -3
##$DATMOD= 1
##$DC= 0
##$DFILT= <>
##$DTYPP= 0
##$F1P= 0
##$F2P= 0
##$FCOR= 1
##$FTSIZE= 65536
##$FT_mod= 6
##$GAMMA= 0
##$GB= 0
##$INTBC= 1
##$INTSCL= 5.30512e-09
##$ISEN= 30
##$LB= 1
##$LEV0= 0
##$LPBIN= 0
##$MAXI= 10000
##$MC2= 0
##$MEAN= 0
##$ME_mod= 0
##$MI= 50
##$NCOEF= 0
##$NC_proc= -7
##$NLEV= 6
##$NOISF1= 182.463
##$NOISF2= 159.3651
##$NSP= 0
##$NTH_PI= 0
##$NZP= 0
##$OFFSET= 248.5645
##$PC= 4
##$PHC0= -6635.363
##$PHC1= 154.4005
##$PH_mod= 1
##$PKNL= yes
##$PPARMOD= 0
##$PSCAL= 0
##$PSIGN= 0
##$REVERSE= no
##$SF= 81.014009
##$SI= 65536
##$SIGF1= 159.3651
##$SIGF2= -187.1042
##$SINO= 113.3802
##$SIOLD= 16384
##$SREGLST= <1H.CDCl3>
##$SSB= 0
##$STSI= 65536
##$STSR= 0
##$SW_p= 40650.406504065
##$SYMM= 0
##$S_DEV= 0
##$TDeff= 32768
##$TDoff= 0
##$TI= <>
##$TILT= no
##$TM1= 0
##$TM2= 0
##$TOPLEV= 0
##$USERP1= <user>
##$USERP2= <user>
##$USERP3= <user>
##$USERP4= <user>
##$USERP5= <user>
##$WDW= 1
##$XDIM= 65536
##$YMAX_p= 538215077
##$YMIN_p= -36610075
$$ End of Bruker specific parameters
$$ ---------------------------------
##NTUPLES= NMR SPECTRUM
##VAR_NAME=  FREQUENCY,     SPECTRUM/REAL,   SPECTRUM/IMAG
##SYMBOL=    X,             R,               I
##VAR_TYPE=  INDEPENDENT,   DEPENDENT,       DEPENDENT
##VAR_FORM=  AFFN,          ASDF,            ASDF
##VAR_DIM=   65536,         65536,           65536
##UNITS=     HZ,            ARBITRARY UNITS, ARBITRARY UNITS
##FACTOR=    0.620285442955139, 1,           1
##FIRST=     20137.2065510759, 0,            0
##LAST=      -20513.1999529892, 0,           0
##MIN=       -20513.1999529892, -36610075,   0
##MAX=       20137.2065510759, 538215077,    0
$$ Real data points
##PAGE= N=1
##DATA TABLE= (X++(R..R)), XYDATA
$$ [...]
39497A0174889K093073r54063R90406J645524l133699o842229k710444M574437
39489E837894N744204Q55570k352800j427307j517719m784689o034830j617120
39481e296797L909685M190581n5369k898253j406338K083723M521690M999520
39473A0048442L257832q99627n444006o194554j403366M923329O580270K064634
39465A2932954l690609m923880j219967K639295K318500j447307l972499k029561
39457F06926K413717M548299K524416p61032k211907k428959l085261l008319
39449a402120n82133J860956J098219n48985J831117O191794M779804k740659
39441A0487993o218234l42213N573197J489069o930216o856903J575845O490528
$$ y = [10174889, 12267962, 11313899, 12304305, 13949829, 10816130, 3973901, 1263457, 5837894, 11582098, 12437668, 10084868, 8657561, 7139842, 2355153, -3679677, -5296797, -1387112, 2803469, 2748100, -150153, -1556491, 527232, 5048922, 10048442, 13306274, 12406647, 6962641, 768087, -635279, 4288050, 10868320, 12932954, 9242345, 4318465, 3098498, 5737793, 8056293, 6608986, 2636487, 606926, 3020643, 7568942, 10093358, 9332326, 7120419, 4691460, 1606199, -1402120, -1984253, -123297, 974922, 425937, 2257054, 8448848, 13228652, 10487993, 4269759, 3927546, 9500743, 10989812, 4059596, -2797307, -1221462, 5269066]
39433E269066L543792L57942J029562J91274l907434l967362K397615N612509
39425A0526964m80328p051397m256585K565492K489814k631909k652693K928794
39417A438152N382431K843732K311657N434037N271004m46222m367143j556340
39409A6311308L305456M868618M592040M832041L270610j728083o541363p715517
39401B1195110o619471n059607j958880J994534K422956j763151m987357k952236
39393B271898J176149K676973K105691J838862J034436j185311k356302j147139
39385F415257m60711j729868j537929J408284K184983j708248m232411n83181
39377b43824L329346R7235n932333m984834K271155O090475K902330j505739l179729
$$ y = [5269066, 8812858, 9170800, 10200362, 10391636, 6484202, 2516840, 4914455, 10526964, 10046636, 2995239, -1261346, 1304146, 3793960, 1162051, -1490642, 1438152, 6820583, 9664315, 11975972, 17410009, 22681013, 22234791, 17867648, 16311308, 19616764, 24485382, 29077422, 33909463, 37180073, 35451990, 28910627, 21195110, 14575639, 9516032, 7557152, 9551686, 11974642, 10211491, 5224134, 2271898, 3448047, 6125020, 8230711, 10069573, 11104009, 9918698, 7562396, 6415257, 5954546, 4224678, 2686749, 4095033, 6280016, 4571768, 339357, -243824, 3085522, 3182757, -2749576, -7734410, -5463255, 627220, 3529550, 2023811, -1155918]
39368a155918l830143l397230P45555N957968N659917L68212k078097N86190J687019
39359D543473j982713m442349j588040J529468J92236j635003J011192N116826
39351B745090N156277J761955j296537l489429n066952l606268J033199L563721
39343H01056J084439j336173Q80619L663263J869665q87159J205217M846721K924558
39334A5052206k568353l714060n05099j26788l059824j810086M785642P539249
39326A5592887J409479n878339n518902n1449K466046O72432p86191k68289m63221
39317G174453k185191k549096L27147M269605N430376K380649k158297l590223
39309I099423m72869L295455L277390M11146j099512p14962j621733l994709l945573
$$ y = [-1155918, -4986061, -8383291, -7637736, -1679768, 3980149, 4348361, 2270264, 2856454, 4543473, 2560760, -1881589, -3469629, -1940161, -1747925, -3382928, -2371736, 2745090, 7901367, 9663322, 8366785, 4877356, -189596, -3795864, -2762665, 801056, 1885495, 549322, 1429941, 5093204, 6962869, 6075710, 7280927, 12127648, 15052206, 12483853, 8769793, 8264694, 8137906, 5078082, 3267996, 8053638, 15592887, 17002366, 11124027, 5605125, 5553676, 8019722, 8692154, 7905963, 7637674, 7174453, 4989262, 2440166, 2767313, 7036918, 12467294, 14847943, 12689646, 9099423, 8626554, 11922009, 15199399, 15610545, 14511033, 13796071, 12174338, 8179629, 4234056]
39300D234056o48812J205104j172610l925997k756339N89059K016239J413213
39292I53913R67999M80130j009542j561485Q97262M082730M213263J767239p4557
39283A0716952j119500l294356n245126l540075O18626J722855j472608l141827
39275d755059Q58494N905677M743987j823000n429990j271477N557682O701038
39267A0487352Q79890n235824n689187j736197J314431J228427J60159l5373l26351
39258A047327j614193k351586r85114J222797J974148J190692M46129L33499N43062
39249A806761J406004K813914K592393q30531m518288l641334J278863L871145
39241D778927P74087l045417j705419K122237J070102m725937o486233O8585P180408
$$ y = [4234056, 3585244, 4790348, 3617738, -308259, -3064598, -2475539, -459300, 953913, 1921912, 2402042, 1392500, -168985, 728277, 4811007, 9024270, 10791509, 10716952, 9597452, 6303096, 1057970, -2482105, -1863479, -140624, -1613232, -4755059, -3896565, 2009112, 6753099, 4930099, -499891, -1771368, 3786314, 10487352, 11367242, 6131418, 442231, -1293966, 20465, 1248892, 1409051, 1373678, 1047327, -566866, -2918452, -3903566, -2680769, -706621, 484071, 930200, 1263699, 1806761, 3212765, 6026679, 8619072, 7788541, 3270253, -371081, 907782, 4778927, 5553014, 2507597, 802178, 2924415, 3994517, -731420, -7217653, -7149068, 31340]
39232C1340N690033j732583m926324j083610K813032K146353P59081K392549L767439
39223I857310R94295l086819l675245j592844k57680R73390M061542O290154M126583
39214A7690686M65502L47770J506337k084721q190873p791470K08614N753389
39206G905234K436419l747358n204681l663279l961615m459585j465988K376821
39198i784032K356526L56025J267982L866107L411213J133466K429167O274940
39190A1311394N256830k380719q497133o048469J474875N342522K419143k835275
39182F043168m851554k467554J122624K204695L96418j332645p83278P28155J033688
39173B093717N88236J007029J981635K435619K914267L640174K241754k560235
$$ y = [31340, 5721373, 3988790, -937534, -2021144, 791888, 2938241, 3697322, 6089871, 9857310, 10851605, 7764786, 4089541, 2496697, 2239017, 3212407, 7273949, 13564103, 17690686, 18156188, 18503958, 20010295, 17925574, 9734701, 1943231, 2151845, 7905234, 10341653, 6594295, 1389614, -2273665, -6235280, -10694865, -12160853, -9784032, -7427506, -7071481, -5803499, -1937392, 1473821, 2607287, 5036454, 11311394, 16568224, 14187505, 5690372, -358097, 1116778, 6459300, 8878443, 6043168, 1191614, -1275940, -153316, 2051379, 2447797, 1115152, 331874, 1060029, 2093717, 2681953, 3688982, 5670617, 8106236, 11020503, 14660677, 16902431, 14342196]
39165A4342196o815200n684500p32054K251432J856688J701456K682034J255479
39157A0857531l124401n443870k991296p7432r86885l090458j771305J621592
39149e006524K345725M63465N02029L410942M547832J115898k979629k633556
39141A766182J002066K321034m85990l029628j623180J070203M17489k529716
39133a091540k447720J595315M160710J727688j994925k104561M80474K054313
39125B379754K353831K883262K280364q98084l232974o78600L808214L610503
39117A2506270j291206m318930k517134L70235J643843K902087L955271J332319
39109A4582755m129159n642334n71461M462572L333532p63353j559260O30836
$$ y = [14342196, 7526996, 1842496, 1110442, 3361874, 5218562, 6920018, 9602052, 10857531, 7733130, 2289260, -702036, -779468, -1766353, -4856811, -6628116, -5006524, -2660799, -2197334, -1695305, 1715637, 6263469, 7379367, 4399738, 1766182, 2768248, 5089282, 4603292, 1573664, -49516, 1020687, 1438176, -1091540, -3539260, -1943945, 2216765, 3944453, 1949528, -155033, 325441, 2379754, 4733585, 7616847, 9897211, 8999127, 5766153, 5087553, 8895767, 12506270, 11215064, 6896134, 4379000, 4749235, 6393078, 9295165, 13250436, 14582755, 10453596, 4811262, 4239801, 8702373, 12035905, 11272552, 9713292, 10344128]
39101A0344128J434253J55742j055737k138462l453645k577517J511818M341978
39093H562558J991720j976655j968759M31859o7685k454375j221469L048124L796522
39084A0141840k39747k470629O08983L704345J645181k397186k450184R34190
39076I476793K089023j083159m208281k331727L546884O986658L637473k512756
39068A5600908l506369J154325K710513l465581q896395m040284N727088P106745
39060A2390950m83552m234036J093101N357253Q58366n330197m726391j354017
39052C571477k055828l014344J733113O394632K071207o284623o526257L67255
39044c743368K339729k417619k852596M148002P170972K44011o119892k573492
$$ y = [10344128, 11778381, 11934123, 10878386, 8739924, 5286279, 2708762, 4220580, 8562558, 10554278, 8577623, 6608864, 7040723, 6973038, 4518663, 3297194, 6345318, 10141840, 9902093, 7431464, 8040447, 11744792, 13389973, 10992787, 8542603, 9476793, 11565816, 10482657, 6274376, 3942649, 7489533, 14476191, 18113664, 15600908, 12094539, 13248864, 15959377, 12493796, 3597401, -442883, 5284205, 12390950, 11907398, 7673362, 8766463, 14123716, 14982082, 9651885, 4925494, 3571477, 1515649, -1498695, 234418, 6629050, 8700257, 2415634, -4110623, -3743368, -1403639, -3821258, -6673854, -2525852, 4645120, 4889131, -1230761, -3804253]
39036c804253L855555L064677j051526M03103M251723J501311n207088n259898
39028b246396J597599M943596J324910j398013R30053K164457j783926n091907
39020D40373k064860L694270N869806M188324J418992k041291n550431o011293
39012e6110l191378j765397l450772l139783J882125N401855J900654l169772
39004e588578j297008N192290O691180J523444k184532K24445L923919L637588
38996A2122748R06918o06132r76542j895809l135262l819510l800915k224692
38988c429196J626792N101578M195586p547j894069n4868K16569l740454o029310
38979d014919r78164O610888P012781m69261o269966l925172J690062K332299
$$ y = [-3804253, 51302, 3115979, 2064453, 2467556, 6719279, 8220590, 3013502, -2246396, -648797, 4294799, 5619709, 4221696, 5151749, 7316206, 5532280, 440373, -1624487, 2069783, 7939589, 12127913, 13546905, 11505614, 5955183, -56110, -3247488, -5012885, -8463657, -11603440, -9721315, -4319460, -2418806, -5588578, -6885586, -1693296, 4997884, 6521328, 4336796, 4561241, 8485160, 12122748, 13029666, 12423534, 11446992, 9551183, 6415921, 2596411, -1204504, -3429196, -1802404, 3299174, 7494760, 7487213, 5593144, 5538276, 5754845, 2014391, -4014919, -4993083, 1617805, 8630586, 8161325, 1891359, -2033813, -343751, 1988548]
38971A988548k120395m733369j976323J925528J838823j123063k068456L31731
38963e936976K707878K682330J786263J772551J704198P33725N26390K158868
38955H135227L403219K212106K22890o51861k034907n022396n641591o13228M911823
38946D921282L273227l105959m164037J867039M975345n66734o493867l531823
38938b825527M088871N899993J259395j680421R5388J548006q5143j262536K65911
38929G303937J510263Q0067k183189l505795m628811n031165k208329K911137
38921e751885N151483K564797l11081J04337Q86288j280318l403432j371598J894716
38912a516693L79950m783075o201874j441821L471246L553448J776651L014911
$$ y = [1988548, -131847, -4865216, -6841539, -4916011, -3077188, -4200251, -6268707, -5936976, -3229098, -546768, 1239495, 3012046, 4716244, 5449969, 5976359, 8135227, 11538446, 13750552, 13973442, 13321581, 11286674, 6264278, 622687, 9459, 4921282, 8194509, 5088550, 924513, 2791552, 7766897, 7200163, 706296, -2825527, 1263344, 7163337, 8422732, 6742311, 6837699, 8385705, 8300562, 7038026, 7303937, 8814200, 8894267, 6711078, 3205283, -1423528, -6454693, -8663022, -5751885, -600402, 1964395, 1653314, 1757651, 2643939, 1363621, -2039811, -3411409, -1516693, -1136743, -5919818, -12121692, -13563513, -10092267, -6538819, -4762168, -1747257]
38904a747257N760878M715534o61637m945055l892894O31226L546149K181910
38896E588854j743925m431126l552111p8076L033814L844847K742673J075280
38888F480230k12519n04135O6867l82371l628051p332926o023813J336646P781642
38879b418430O429430k1454k993650r7155K552727N41708k759283k775266o81475
38870b222848Q8476j95583M54410J235925O74700N41330K827230M853704K437314
38861A0694658l207956o524708n046565j471437J238308K508807K115996l9027
38853B68076j676387J58582M190841N390105J581791l458834m751949j560529
38845A41696K756561M315559J739806k585044m445564k601102n20175j280247
$$ y = [-1747257, 4013621, 8729155, 8067518, 3122463, -770431, -139205, 3406944, 5588854, 3844929, -586197, -4138308, -4216384, -1182570, 2662277, 5404950, 6480230, 6267711, 5763576, 5830443, 5448072, 1820021, -5512905, -11536718, -10200072, -2418430, 4011000, 3989546, 995896, 898741, 3451468, 3993176, 1233893, -1541373, -2222848, -2134372, -2329955, -1875545, -639620, 35080, 576410, 3403640, 8257344, 10694658, 7486702, 961994, -4084571, -5556008, -4317700, -1808893, 307103, 268076, -1408311, -1249729, 2941112, 8331217, 9913008, 6454174, 1702225, 141696, 2898257, 7213816, 8953622, 6368578, 1923014, -678088, -1198263, -2478510]
38837b478510k849125j782618O24125N73495j390139j196554J728583L784670
38829b986073L438485K651648J999188J03140j755579n51275K305429K060367
38821G265330j219886k412469m45425L7336j918581j088632L531329M758070r72015
38812G535057o213147l857354J557585J970923j192570j346062R94985M37265
38804a13318j982622k07351N158560O453313J004763m897108n614061k541238
38796b739062P98646L471804M836026L265580l57460k369117j500100l97808n89438
38787D419071k8366K599277M800003L665187r1218l081479k776444K82103K555235
38778A2343369O35889m123510n989444k166898K837343L422288M63289j646063
$$ y = [-2478510, -5327635, -7110253, -6486128, -5912633, -7302772, -8499326, -6770743, -2986073, 452412, 3104060, 5103248, 5206388, 3450809, 2899534, 5204963, 7265330, 6045444, 3632975, 3187550, 3224886, 1306305, 217673, 3749002, 8507072, 7535057, 1321910, -2535444, -977859, 993064, -199506, -1545568, -550583, -113318, -2095940, -2303291, 2855269, 9308582, 10313345, 5416237, -197824, -2739062, -1940416, 1531388, 6367414, 9632994, 9275534, 6906417, 5406317, 5008509, 4419071, 4390705, 6989982, 11789985, 15455172, 15363954, 12282475, 9506031, 9788134, 12343369, 12979258, 8855748, 2866304, 699406, 3536749, 6959037, 7422326, 5776263]
38770E776263k289079l231828k824488J210271M980409K535987l622049m627485
38762b091999J232895N641224L106844j699818l035988k567537l764868m658728
38754g837975k225994J205908J984492J412304K222435K535082n20200m115606
38746e339554l114162J659410M683767M144970L029393K338502l75708m716549
38738B310069n708068j004153M702673N748135K677363j66809j685926m153077
38730B720207p087912n960311J091687Q722881R871756M230351k121329m834075
38722F633255n178246n364708m331196o79221L456845M901825L887802K821430
38714F147786K109117M52169j794247k826182k385133j753591j336651o72010
$$ y = [5776263, 3487184, 255356, -2569132, -1358861, 3621548, 6157535, 2535486, -2091999, -859104, 4782120, 7888964, 6189146, 3153158, 585621, -3179247, -7837975, -10063969, -8858061, -6873569, -5461265, -3238830, -703748, -1223948, -5339554, -8453716, -6794306, -2110539, 2034431, 5063824, 7402326, 7026618, 2310069, -3397999, -4402152, 300521, 6048656, 8726019, 8559210, 6873284, 2720207, -4367705, -10328016, -9236329, -513448, 9358308, 13588659, 11467330, 6633255, 1455009, -3909699, -8240895, -8920116, -5463271, -561446, 3326356, 6147786, 8256903, 8709072, 6914825, 4088643, 1703510, -50081, -1386732, -2058742]
38706b058742L8916O30415J729352K566355M74725m319158o421580k218277L714872
38697e863122M574858J182588n56164J57513p43577k770603p73919M737348O345826
38688F290748J645827k151225L10061M298409L524480m4651j169069m18608j390715
38679A0895257l128875k300815q7510l75745k843056l524574j083954K195561
38671b53711M417039M946078K892518j206176l787691k316841N86052O99351j914855
38662D061764m113459m538939l479427m01030L970013N545353J813896l198935
38654c40764m065255j923045j474057k044286J047774O715712P750870K003072
38646G670021l400097k423769J369536J229864k544497m279296k131045R6914
$$ y = [-2058742, -2019826, -1389411, 339941, 2906296, 3381021, -938137, -7359717, -9577994, -5863122, -1288264, -105676, -661840, -504327, -1247904, -4018507, -4792426, -55078, 6290748, 7936575, 5785350, 6095411, 10393820, 13918300, 13873649, 12704580, 12285972, 10895257, 7766382, 5465567, 5378057, 5002312, 2159256, -1365318, -2449272, -253711, 4163328, 9109406, 12001924, 10795748, 7008057, 4691216, 5277268, 5976619, 4061764, -51695, -4590634, -8070061, -8471091, -4501078, 1044275, 2858171, -340764, -4406019, -6329064, -7803121, -9847407, -8799633, -2083921, 5666949, 7670021, 4269924, 1846155, 3215691, 4445555, 1901058, -2378238, -4509283, -4412369]
38638d412369j82834o89070J187680L807555L782022J220726m38327L87889J256120
38629E919392j54919k262795k371019j331839j906698l473190k699377M16575
38621g863870J987826Q62318O62198K892057L395450l99733l673215j147554L940795
38612F56272M296027l04726l268755j803989k51570j822877l412580j375885K255242
38603e032841K839537k49307l121706k387360J298158M423001M544136K815763
38595E129381K007746K202179P48734k598610l850458o93059L061460K877731
38587H885104N10348O04059K487582J480677k518322m361249k114509J92562r8578
38578E067674l03181J516762K070092j544405n932182n683498j038504K845582
$$ y = [-4412369, -4595203, -5284273, -4096593, -289038, 3492984, 4713710, 4275383, 4663272, 5919392, 5764473, 3501678, 1130659, -201180, -2107878, -5581068, -8280445, -7863870, -5876044, -5013726, -4351528, -1459471, 1935979, 1536246, -2136969, -3284523, 656272, 4952299, 4647573, 1378818, -425171, -676741, -2499618, -5912198, -7288083, -5032841, -2193304, -2442611, -5564317, -7951677, -6653519, -2230518, 2313618, 5129381, 7137127, 9339306, 10088040, 7489430, 3638972, 2945913, 6007373, 8885104, 9395452, 9999511, 12487093, 13967770, 11449448, 7088199, 4973690, 5166252, 5067674, 4764493, 6281255, 8351347, 6806942, 874760, -4808738, -5847242, -3001660]
38570c001660K825453N09541j101126q42020N00782J330830N74290j094216j831435
38561b129561r57964L07876R29152J444143K453849K995814J531476j942390n237521
38552f05126n362130j334658L776139N183987K144957p56667l85502k14081m394396
38543a947477r157550o716864K466331Q505825N294199j553774l521943m21883
38535g053136J961391J233986j51790m39013l14333k0333J054896K166304J749981
38526A87953n0017j640733k046013r09063K062007N505062O084671K471881j907705
38517I758043k911160r87664M54826L84994L70185O65907k7839j299385j169296
38508E238611M51346J705191K187442L041877L511224J134528l598186o248023
$$ y = [-3001660, -176207, 333334, -767792, -1609812, -1109030, 221800, 796090, -298126, -2129561, -3087525, -2779649, -1850497, -406354, 2047495, 5043309, 6574785, 4632395, -605126, -5967256, -7301914, -3525775, 1658212, 3803169, 3046502, 2661000, 2446919, -1947477, -11105027, -17821891, -15355560, -6849735, -1555536, -3109310, -6631253, -7053136, -5091745, -3857759, -4009549, -4448562, -4762895, -4783228, -3728332, -1562028, 187953, 137936, -1502797, -3548810, -4457873, -2395866, 3109196, 9193867, 11665748, 9758043, 6846883, 5859219, 6314045, 6699039, 7069224, 7735131, 7707292, 6407907, 5238611, 5689957, 7395148, 9582590, 12624467, 16135691, 17270219, 13672033, 7424010]
38500G424010l926536O74338K624043M69669k850001l561169n60428L530818M431283
38491H256027P05122l788845l916305K47228L524669K561300n37364k493391l107565
38482A450876l053792j101958K796696M431900J31769o529171p749068j503422
38474a1126170N849279P949990N294449J984637l38688k235654l053155j611211
38466B713477Q91957J843915O23087j231380k447338k451831o26598K123780K309492
38457C748561k055873o931834n968458R03790O760134O589430K719610l52511
38449E412849k084208l775560m217474j757726J602732K408037P31911o50880
38441b330319q04251o93944J08230K701833N325528M600064N45651l097015l861745
$$ y = [7424010, 3497474, 4171812, 6795855, 7265524, 4415523, 854354, 293926, 3824744, 8256027, 8961149, 5172304, 1255999, 1503227, 5027896, 7589196, 7051832, 4558441, 1450876, -1602916, -2704874, 91822, 4523722, 4655491, -1873680, -9622748, -11126170, -5276891, 2673099, 7967548, 9952185, 9613497, 7377843, 4324688, 2713477, 3605434, 5449349, 6072436, 4841056, 2393718, -58113, -684711, 1439069, 3748561, 1692688, -5239146, -11207604, -10303814, -3543680, 3045750, 5765360, 5412849, 3328641, -446919, -4664393, -6422119, -4819387, -2411350, -1679439, -2330319, -3134570, -3828514, -3720284, -1018451, 4307077, 8907141, 9452792, 6355777, 2494032]
38432B494032k779963j543436o27260l63940p75887l62451J792229L157019P94134
38423A784477l221403l985899j194270Q98936J162580K911872O275991O388581
38415A1020865K138118n41236J338118J701047m243817r964233o523141K860403
38407b213876O867253K581924j892370j141199R22363M244j713895j164283K12092
38398B462253N80533J387508L074032K395543j938734n620242m775083j416185
38390c850375R42018K652512M664943M440335L65907l531594k851525L25640J349283
38381D507144O44697J410020K566506Q94600j878985j461762Q49301j8432l663392
38372C849697m762168k743165k265623l326896m89579N699281O713965R128m892257
$$ y = [2494032, -285931, -1829367, -2456627, -2820567, -3596454, -3958905, -2166676, 990343, 1784477, -1436926, -5422825, -6617095, -5718159, -4555579, -1643707, 4632284, 11020865, 13158983, 12617747, 13955865, 15656912, 11413095, 1448862, -5074279, -2213876, 4653377, 7235301, 5342931, 4201732, 5124095, 5128339, 3414444, 2250161, 2462253, 3042786, 4430294, 7504326, 9899869, 7961135, 2340893, -2434190, -3850375, -2908357, -255845, 4409098, 8849433, 9215340, 5683746, 2832221, 3157861, 4507144, 5151841, 6561861, 9128367, 10022967, 8143982, 6682220, 7531521, 7513089, 3849697, -912471, -3655636, -5921259, -9248155, -9737734, -4038453, 2675512, 2684640, -2207617]
38363b207617q77415N215072M041876j084404r46098L452844L387106j975192
38355I006172m514181j282241J574251L49085j070009j30907j99545k555002k468006
38346a290383J982406M785478J343626l367890k259951L033686N219887K088946
38338A1535805j805677k493721o54539R16047M61075j551836k616018r65661J189527
38329D015002K17836k634831k199286J971892L794558L45198k969327j377102
38321A163940J334689j01193k919439j361456K821694L112875q32607k993713
38313B24790p99294K038174K258622M68089j809272l041396q38930M160037N574360
38304H235180p41340q063642o432456K265942O299067J448409l792570k568278
$$ y = [-2207617, -3085032, 2130040, 6171916, 5087512, 4141414, 7594258, 10981364, 9006172, 4491991, 3209750, 4784001, 5133086, 4063077, 3932170, 3732625, 1177623, -1290383, 692023, 5477501, 6821127, 3453237, 1193286, 4226972, 9446859, 11535805, 9730128, 7236407, 6581868, 7497915, 7958990, 6407154, 3791136, 2825475, 4015002, 4232838, 1598007, -601279, 1370613, 5165171, 5510369, 2541042, 1163940, 2498629, 2397436, -522003, -1883459, 938235, 4051110, 3218503, 224790, -574504, 1463670, 3722292, 4190381, 2381109, -660287, -1499217, 2660820, 8235180, 7493840, -569802, -7002258, -4736316, 1562751, 3011160, -781410, -3349688]
38296c349688R86572J109333m5111J673219M165259L360694L72821j553776k598243
38287D121080l543929k172523K001679M100584J006038k295852j15309M185103
38279G286871L376640j640285l328594K52087L016887J159386j758657k003598
38271F360737j447770l005930n136955m462573q54249K980199M881202M126021
38263C440682J009212k374831k710506Q20686M429845L675998p09758l239613
38255D341715o80483L369646L086221j411213l965292j349483J686770l47486
38247D730395m774446m586204M17101L104783K21499k835272j003999L020033
38239a706110M275425K985676J857021O98905j099746j076713J603196K062446
$$ y = [-3349688, -2363116, -1253783, -1298894, 374325, 4539584, 7900278, 8273099, 6719323, 4121080, 577151, -1595372, 406307, 4506891, 5512929, 3217077, 3101768, 7286871, 10663511, 9023226, 5694632, 5946719, 8963606, 10122992, 8364335, 6360737, 4912967, 1907037, -3229918, -7692491, -8546740, -5566541, -685339, 3440682, 4449894, 2075063, -635443, 185243, 4615088, 8291086, 7581328, 4341715, 3661232, 7030878, 10117099, 8705886, 4740594, 3391111, 5077881, 4730395, -44051, -4630255, -4213154, -1108371, -886872, -3722144, -4726143, -1706110, 2569315, 5554991, 7412012, 8110917, 7011171, 5934458, 7537654, 9600100]
38231I600100l068780q030490n365789J698927L321601j560141l783809Q72009
38223f316372N096986K561373j894417r08464L285083L164377j603278l999544
38215f14256p28353L597501L999378J256727j183160k084502j863978k95818K334886
38206D418425L521062R51525l669465n662129k884146J470150K654042j58798
38198F40666l501135m026438j755161R10950J900341R46744n31012q64200j45385
38189f424630j13064r74704p7659L701198O129762K599611l963299n849964j697654
38180f670403J625043J63930j354249J142660L353874O03843k813751n76516M127650
38171c97919L439523j864893m015358j650206q69785k707099p07759O432709J0340015
$$ y = [9600100, 6531320, -1499170, -6864959, -5166032, -1844431, -3404572, -7188381, -6316372, -1219386, 1341987, -552430, -1460894, 1824189, 4988566, 3385288, -614256, -1342609, 2254892, 6254270, 7510997, 6327837, 4243335, 2379357, 2083539, 4418425, 7939487, 8891012, 5221547, -440582, -3324728, -1854578, 799464, 640666, -2860469, -6886907, -8642068, -7731118, -5830777, -4884033, -5415045, -6279245, -6424630, -6537694, -7512398, -7590057, -3888859, 2240903, 4840514, 877215, -4972749, -6670403, -5045360, -4881430, -6235679, -5093019, -1739145, -1135302, -3949053, -4525569, -397919, 3041604, 1176711, -2838647, -4488853, -5358638, -8065737, -8773496, -2340787, 7999228]
38162G999228N639165j746320m286956l115064k931157l561128k682571j106980
38154e791783L58695L591809P327601N358231k971118p710433k208441M759354
38146B713915J462966p632964q158830J398951P471120K907031l203496j668122
38138d709429L037531K340421k500020m610108l196617k370767k378106j83310
38130a4570405L390151M411772K852693K531978M131931L862819o6644m242422
38122B301873m762607j813931J858620M386168N128097L536330m08024n054575
38114E171951p565932o119439j817087J976518K891680J738888M59710r90816
38106d254527l313280m318071p74352N518270Q000593L891496j666271l022761
$$ y = [7999228, 13638393, 11892073, 7605117, 4490053, 1558896, -2002232, -4684803, -5791783, -5433088, -1841279, 5486322, 10844553, 7873435, 163002, -2045439, 2713915, 4176881, -3456083, -11614913, -10215962, -2744842, 162189, -3041307, -4709429, -1671898, 668523, -1831497, -6441605, -9638222, -12008989, -14387095, -14570405, -11180254, -6768482, -3915789, -1383811, 2748120, 6610939, 6544295, 2301873, -2460734, -4274665, -2416045, 1970123, 7098220, 10634550, 10226526, 5171951, -2393981, -8513420, -10330507, -8353989, -5462309, -3723421, -3263711, -4254527, -7567807, -11885878, -12660230, -7141960, 858633, 4750129, 3083858, 61097]
38098F1097j558695j703965l091181k128434R94968K767193K497867K146439R34957
38089I20246l336378p544967n016612M091164J0842144R030497K762384j070046
38081A0678432k078608l208045l424700j90902L760882K977662k275853n833608
38073D05260l853122J289194N136930N123768R40399m786447o675416k038499
38065d457933M131365M528644k43045k544745O13618L488122J575764j199277
38057E892513J37055K849208J412937k798624l892357j384519l50751k094086
38049b28624k170569P77774J375587l614681q514918o132741J685169O726004
38041a0096999N833056L682712M186992M989165K640448j330328k980381j789934
$$ y = [61097, -1497598, -3201563, -6292744, -8421178, -7426210, -4659017, -2161150, -14711, 920246, -2416132, -9961099, -14977711, -10886547, -44403, 8986094, 11748478, 10678432, 8599824, 5391779, 1967079, 1776177, 5537059, 8514721, 6238868, 405260, -3447862, -2158668, 2978262, 8102030, 9042429, 4255982, -2419434, -4457933, -326568, 4202076, 3959031, 1414286, 2027904, 5516026, 7091790, 5892513, 6029568, 8878776, 10291713, 7493089, 3600732, 2216213, 1865462, -228624, -2399193, -1621419, -245832, -3860513, -12375431, -18508172, -16823003, -10096999, -4263943, -581231, 3605761, 8594926, 11235374, 9905046, 6924665, 5134731]
38033E134731l47521J40786M55174K98793j718849m788321n765440l266506N02536
38024i354617K883722L588843L626717L613782L963893M525019L395658j086352
38016A5156665o314830o966203k359563J600121N62382k195803j704359O51515
38008a570075M59519j391680m12002K960595L653202P12310j280427n03464n73136
37999B054842k902930l313915M23339L916107L124605M92103l54527p46307k637129
37990E6188l093528O05917M310243K387433k902185m467729j116960J817682J696707
37981g06232J278221K034284J707525j59013m98982J487318K278277L9427k163679
37972E297146j571007K61652J130043J641950K242034P71882l595473p113837
$$ y = [5134731, 4787210, 4927996, 5383170, 5681963, 3963114, -825207, -6590647, -9857153, -9354617, -6470895, -2882052, 744665, 4358447, 8322340, 12847359, 16243017, 15156665, 8841835, 1875632, -483931, 1116190, 1678572, -517231, -2221590, -1570075, -1110556, -2502236, -2914238, 46357, 3699559, 4411869, 3131442, 2627978, 2054842, -848088, -4162003, -3738664, 177443, 3302048, 3794151, 3439624, 2693317, 56188, -3037340, -2431423, 1878820, 4266253, 1364068, -3103661, -4220621, -2402939, -706232, 571989, 2606273, 4313798, 4154785, 3655803, 5143121, 7421398, 7460825, 5297146, 3726139, 3987791, 5117834, 6759784, 9001818, 9773700, 6178227, -935610]
37964i35610n717805n15199L745489L985522O20222l704136n284293j829445M063811
37955e571444O443850L189694j133071j930362o72717r96912k166039j164947
37947d001948J054826R01168j255026j272374J679837L323734J013128j943865
37939e00520j021403L260765O124907M145888j310889n334187l893759J674716
37931C145518N040682J809873m552994o771790l365668k2405n63705j445397J803455
37922d922431O730397P114063J963019l167679l452860J85256L455429L255030
37914A1160224l95464m687308o130302m064930j568586j072561n80171K610406
37906d728692N859176L723382l280237p817539n580686j023868l3687j357093
$$ y = [-935610, -6653415, -7168614, -3423125, 562397, 1182619, -2521517, -7805810, -9635255, -5571444, 872406, 4062100, 2929029, 998667, 325950, -670962, -2837001, -4001948, -2947122, -2045954, -3300980, -4573354, -2893517, 430217, 1443345, -500520, -1521923, 1738842, 7863749, 12009637, 10698748, 5364561, 1470802, 3145518, 8186200, 9996073, 5443079, -1328711, -4694379, -4716784, -5280489, -6725886, -4922431, 1807966, 8922029, 10885048, 7717369, 4264509, 4449765, 7905194, 11160224, 10764760, 6077452, -52850, -4117780, -5686366, -6758927, -7339098, -4728692, 1130484, 4853866, 1573629, -6243910, -11824596, -12848464, -12882151, -14239244]
37898a4239244r0685L511070M602501J902675n27017r3990Q98207K19171k74028
37889d091340J777966M694335M793040J390010k654871m545274l958963k429593
37881e024690j563869j513810p41916J908817M792903M680689J042331k576796
37873A003659k658857R6057J957045N65897l005469n730861n042816o26595M830137
37864h611803P118552M158838j515609m688083k447618K794544N744792M035397
37856F589010Q49068M48042J963224Q05057l299446m339133Q33539N945308L621348
37847A3416017k864926l818641J856561M639317q31583p579372p163983j353063
37839c699673K843264L664918L317137J207749l634793o791760l496165K384359
$$ y = [-14239244, -14329929, -10818859, -6216358, -4313683, -4840700, -4934690, -4036483, -3817312, -4091340, -2313374, 2380961, 7174001, 8564011, 5909140, 1363866, -2595097, -5024690, -6588559, -8102369, -8844285, -6935468, -2142565, 2538124, 3580455, 1003659, -1655198, -1559141, 397904, 963801, -2041668, -7772529, -12815345, -13441940, -8611803, -1493251, 2665587, 1149978, -3538105, -5985723, -3191179, 2553613, 6589010, 7438078, 7886120, 9849344, 10654401, 7354955, 3015822, 3849361, 9794669, 13416017, 10551091, 6732450, 8589011, 13228328, 12396745, 4817373, -2346610, -3699673, -856409, 2808509, 6125646, 7333395, 3698602, -3093158, -6589323, -4204964]
37831d204964K805035j726509k625339K737628O436869K530135l778302m504857
37823b330304k87519K475227J609370J37230j30375l4208O11354K582826L471643
37814H105244k37152o472752q143311k716607L170763K418904k434014k907868
37806i216793K933994P641948N295298l42788k250427m08718j60568k687280l581915
37797b777249q78328J665977R47900j032345j391559m76893P35941K937702N317927
37788E049073M482295q4052l622478k778383m46835q5298J6724J913319K498362
37779F942727q30314l585905r15805K893347N48555n176549m540969L561932R278370
37770H175389O396871j73090l895117m652885m038064j056752L154580L786206
$$ y = [-4204964, -1399929, -3126438, -5751777, -3014149, 3422720, 5952855, 2174553, -2330304, -2617823, -142596, 1466774, 1604004, 1473629, 1439421, 2050775, 4633601, 8105244, 7868092, 1395340, -6747971, -9464578, -6293815, -3874911, -6308925, -9216793, -6282799, 1359149, 6654447, 6311659, 4061232, 3652514, 3491946, 804666, -2777249, -3655577, -1989600, -1041700, -2074045, -3465604, -3942497, -3206556, -268854, 5049073, 9531368, 9447316, 5824838, 3046455, 2599620, 2514322, 2531046, 4444365, 6942727, 6112413, 2526508, 1610703, 4504050, 5052605, -123944, -4664913, -1102981, 8175389, 14572260, 14399170, 10504053, 5851168, 1813104, 756352, 3910932, 7697138]
37762G697138J16558k000694J11940Q55496l674179p790953n078444J049222L293335
37753e420581J813691J349859J258632k292949o718243n305996J259504M700949
37745i355134J591527k102745j043449K265688L434377K921361K682810J337583
37737A732018k373507n034835k776145K073102L660265J055003q84320O50179
37729a898240K537404J544056k05131Q62772L245990K575661p16857j473476J512525
37720G984704K640608j501696n490771k774174L693044N371241Q86528k714912
37712H094572j543311J84988j066347j953601Q48474L697372J699161k786406
37704G174902l523330J5359K296360K32779l010899l290049q92919O18400p91647
$$ y = [7697138, 7813696, 5813002, 5924942, 6780438, 3106259, -4684694, -9763138, -8713916, -5420581, -3606890, -2257031, -998399, -3291348, -10009591, -15315587, -14056083, -9355134, -7763607, -9866352, -10909801, -8644113, -5209736, -2288375, 394435, 1732018, -641489, -5676324, -8452469, -6379367, -2719102, -1664099, -2548419, -1898240, 639164, 2183220, 1978089, 2840861, 6086851, 8662512, 7945655, 6472179, 7984704, 10625312, 9123616, 3632845, 858671, 4551715, 9922956, 10809484, 8094572, 6551261, 6736249, 5669902, 3716301, 4564775, 8262147, 9961308, 7174902, 3651572, 3666931, 5963291, 6196070, 3185171, -104878, -997797, -379397, -1171044]
37695a171044l018718k142141K155070M694702J112856m774549m807494J547954
37687f403364N206328N20676n879457m818335J883223M952413J809113j034595
37679c763998P67810L604344L075796M63783r35740j055591j253598q99516O78383
37670F81673J415938o18891l130993k229120J189258J671843k774084o387872
37662a0182248k742114N786760J0264525O934197J417200p53327j840995n358963
37654C525035p310699k055512O001183O323516k003293q090642n083367J092487
37646g601292K770703J449763J840122K790985J407005J12500J939618L543270
37638H252674N07422m300465n065101k259188l23492N32477K722800M559224K978730
$$ y = [-1171044, -4189762, -6331903, -4176833, 517869, 1630725, -3143824, -7951318, -6403364, -1197036, -676360, -6555817, -11374152, -9490929, -4538516, -2729403, -3763998, -2996188, 608156, 3683952, 4147735, 3211995, 2156404, 902806, 3290, 681673, 2097611, 1478720, -1652273, -3881393, -2692135, -1020292, -3794376, -10182248, -12924362, -7137602, 3126923, 10061120, 11478320, 10724993, 8883998, 3525035, -3785664, -5841176, 160007, 6483523, 4480230, -3610412, -8693779, -7601292, -4830589, -3380826, -1540704, 1250281, 2657286, 2769786, 4709404, 8252674, 8760096, 4459631, -605470, -2864658, -3188150, -2655673, 67127, 4626351, 7605081]
37629G605081M37778J195318L079964J134221k757143k708713L65524J95811l348831
37620E199010l848527L01604L512242K968498J951174J930416L02034k433662
37612I882789k280436l24838k264590p069142o265631J784199P109589K930805
37604C502745m081303m648149J75562L581738L387667J273350j846770l609973
37596b265133j09943O008345N052606n046996j1850124n287726O298805Q126126
37588I25960O77596l414902j17742K413275k2068j778696M07176J626671q57354
37579a40084j936915J672545M753557K116935l106122n104242l610108j462906
37571f817340Q79568L292631L036296p80352l499967j030453L331293L515229
$$ y = [7605081, 8042859, 9238177, 12318141, 13452362, 10695219, 7986506, 8352030, 8547841, 5199010, 1350483, 1652087, 5164329, 8132827, 10084001, 12014417, 12316451, 9882789, 7602353, 7277515, 5012925, -2056217, -8321848, -6537649, 571940, 3502745, -578558, -5226707, -5051145, -1469407, 1918260, 3191610, 1344840, -2265133, -2375076, 3633269, 8685875, 3638879, -8211245, -13498971, -7200166, 925960, 1603556, -1811346, -1929088, 484187, 462119, -1316577, -909401, 717270, -140084, -2076999, -404454, 4349103, 6466038, 3359916, -1744326, -5354434, -6817340, -5937772, -2645141, 391155, -389197, -3889164, -4919617, -1588324, 1926905]
37563A926905k33493k361270o65621J530996J594933R27573J226585J470680K66147
37554E683435j501078j961773o86339J104960J738252L58469j876212k244967
37546F14747L27963K999132K062019j865159m211104k497585N57969J198989m32035
37537a245064j452449o94571L59658M42500J50100N88104J773907K702250K351124
37528D975559P00110r76967j448939j240207j619564j730696O55387M374612M394104
37519H083399q97283n339906k780996L265515L947678k050570p029657n923887
37511h725707j764806K031133O312956R682696O374171l302107q824490l989019
37503b205173K027147j467745q383923m911897O968893J0962619K036066n690478
$$ y = [1926905, 1693412, -667858, -1333479, 197517, 1792450, 2720023, 3946608, 5417288, 5683435, 4182357, 2220584, 1534245, 2639205, 4377457, 4735926, 2859714, 614747, 942710, 3941842, 6003861, 4138702, -72402, -2569987, -2012018, -813029, -1245064, -2697513, -3392084, -3032426, -2589926, -2439826, -1851722, -77815, 2624435, 4975559, 5675669, 4698702, 3249763, 2009556, 389992, -1340704, -685317, 3689295, 8083399, 7186116, 1846210, -934786, 2330729, 6278407, 4227837, -2801820, -8725707, -10490513, -8459380, -2146424, 7536272, 13910443, 10608336, 1783846, -2205173, -178026, -1645771, -10029694, -14941591, -7972698, 2989921, 5025987, -664491]
37495f64491j612001N709062M277424k399895l681874j0299L31812k823323k187685
37486c061270K524858L445352j514774m733201j423374L366915L984047K308811
37478D897364K064277J808633q12385l080197j687318M09429j817721o346482
37470d564400n918771R14044O774978N470863m6826k960858j826046m5817J211343
37461i91490L751134O439430M777752j525923n953816l903293L37406K53904k794731
37452C90373k544231J127731J724535k900735o528112l985663J707950N032248
37444e975904N368714M664694K566671j115693k884843o7830L615582K479579
37436H650970k622253n458731l368162l5163P90433j98554n82378J84359J214492
$$ y = [-664491, -2276492, 3432570, 7709994, 5310099, 1628225, 1617926, 1949738, -873585, -3061270, -536412, 2908940, 1394166, -3339035, -4762409, -1395494, 2588553, 4897364, 6961641, 8770274, 7957889, 4877692, 3190374, 3599803, 1782082, -4564400, -10483171, -9569127, -2794149, 2676714, 2629888, -330970, -2157016, -2202833, -991490, 2759644, 9199074, 13976826, 12450903, 6497087, 2593794, 2931200, 3185104, 390373, -2153858, -1026127, 698408, -2202327, -8730439, -12716102, -11008152, -5975904, -607190, 4057504, 6624175, 5508482, 2623639, 2555809, 6171391, 8650970, 6028717, 569986, -2798176, -2833339, -2042906, -2241460, -2823838, -2639479, -1424987]
37427a424987J744182J234343l32785j813817j989192j180368m33923K36943J161406
37418b798198J518185N68584n15709k71313M82252N6641j002343q79304J87069
37409b654136M61652J05465Q65249K471534K617632R37996j89101L47351O53391
37400E617033n98650j766632j284118n71472j409090k339972q32843J903735J847897
37391E65888j634355m037048k175785N74851q08317m548989l754151K855810P638555
37382e323541M684606j270342j988650J948136L099631l91579k539329j55548
37374a936616K504094K075102J239446J874513O08738l666648m992506K26086
37366b067791N217031K430305l859301l967967J555398L234774j476705m514648
$$ y = [-1424987, 319195, 1553538, 1220753, -593064, -2582256, -3762624, -4196547, -3959604, -2798198, -1280013, -711429, -1227138, -1498451, -1016199, -959558, -1961901, -2841205, -2654136, -2192484, -2087019, -1221770, 1249764, 3867396, 4805392, 4616291, 4963642, 5617033, 5018383, 3251751, 1967633, 1396161, -12929, -2352901, -3185744, -1282009, 565888, -1068467, -5105515, -7281300, -6706449, -7514766, -12063755, -15817906, -12962096, -5323541, -638935, -1909277, -3897927, -1949791, 1149840, 758261, -1781068, -1936616, 567478, 2642580, 3882026, 5756539, 6365277, 2698629, -2293877, -2067791, 3149240, 5579545, 1720244, -2247723, -692325, 2542449, 1065744, -3448904]
37358c448904r00807L932910M152123K257493K722607L737783J317308l100782
37350A0669731n091684m183407l093198k299453l97644J478233M14981l145177
37342e647618m918777k285567K287156M387685K791540M50908P14926L223142
37334A003395M351871K109955q08886o37025J898182K514504k53749k961246k483246
37325D733755k28619O64831j55650q11374n93438n25189j298473k312244k366812
37316b893213m95751L051320N987376N361378P84252m541028o772866m777452
37308d295984m37669L095733L302483K12152k928773k599503N93634K195744m18671
37299a280854m470404n336343k107657K222076M918278N664154N010471K930102
$$ y = [-3448904, -4349711, -416801, 3735322, 5992815, 8715422, 12453205, 13770513, 10669731, 5578047, 1394640, -1698558, -3998011, -4395655, -2917422, -2502441, -5647618, -10566395, -12851962, -10564806, -6177121, -3385581, -2934673, -2219747, 1003395, 5355266, 7465221, 6656335, 6019310, 7917492, 10431996, 10178247, 7217001, 4733755, 4505136, 5169967, 5014317, 4202943, 3609505, 3084316, 1785843, -526401, -2893213, -3388964, -337644, 5649732, 11011110, 11795362, 7254334, 481468, -4295984, -4733653, -1637920, 1664563, 1876715, -1052058, -3651561, -3057927, -862183, -1280854, -5751258, -11087601, -13195258, -10973182, -6054904, -390750, 4619721, 7549823]
37291G549823l82359l572106m983287m150202j947451M76609K297757K624435
37283b086781O91009k521309l786863q79815L653415M543040O12085l207488k614888
37274e597595J80213N89284q33193J30478L373752L781023l03080l487455j372360
37265c538933K291277J189397l503978m322779J499139P582447O955965J130784
37257I283319k750510j648533N67075k10310k897375m122563l422124k635506
37249g836527k007508l53196J653777J911249O67111M47373J732165K207774J178235
37240c99547R34801K272855K543232K10324k522603l925906n210945n914302k125628
37231a4137719N974068J0109840M367349m331465m590211K904194O566237J456972
$$ y = [7549823, 7167464, 3595358, -1387929, -5538131, -7485582, -7008973, -4711216, -2086781, -1395772, -3917081, -7703944, -8583759, -4930344, -387304, 224781, -2982707, -5597595, -5417382, -4828098, -5661291, -5530813, -2157061, 1623962, 1320882, -2166573, -3538933, -1247656, -58259, -3562237, -7885016, -6385877, 1196570, 8152535, 9283319, 6532809, 4884276, 5451351, 5241041, 2343666, -1778897, -5201021, -7836527, -9844035, -10197231, -8543454, -6632205, -5965094, -5517721, -3785556, -1577782, -399547, 535254, 2808109, 5351341, 5561665, 3039062, -886844, -6097789, -12012091, -14137719, -8163651, 1946189, 6313538, 1982073, -2608138, 296056, 6862293, 8319265]
37223H319265m200562k488273L189864N112990K181813j501174l582438l662613
37215C368872r85375K837140K730092k734021o693883k655457M999291O291384
37207G158043J76426l990400o00363M129300K143139m015670m895779J928142
37199B032838Q031292N610102j997179n075170p08585L707318J134110n320427
37191G414299p062736k149469K470388J297261k196001j388852L526964N903143
37183G814997K122047l515408m655438p56013L206062L450657J079110r80637
37175G765377j964401k611625k558275j175488j28232j728455m469717l814217
37167a0685033J140119N270584M191018L51637r77502N98394J091553r63579k536673
$$ y = [8319265, 4118703, 1630430, 4820294, 9933284, 12115097, 10613923, 7031485, 3368872, 2383497, 5220637, 7950729, 5216708, -1477175, -4132632, 866659, 7158043, 7334469, 3344069, 2743706, 6873006, 9016145, 5000475, 104696, 2032838, 10064130, 15674232, 13677053, 8601883, 7893298, 11600616, 12734726, 7414299, 351563, -1797906, 672482, 1969743, -226258, -1615110, 1911854, 7814997, 9937044, 6421636, 1766198, 1010185, 4216247, 7666904, 8746014, 7765377, 5800976, 3189351, 631076, -544412, -672644, -2401099, -6870816, -10685033, -9544914, -4274330, -83312, 268325, -709177, -110783, 980770, 17191, -2519482]
37158b519482j179246J546684K502098L66097l710738o704475n208144J110596
37150a3796610P539070Q444976L803886o79368n66594K199567K220000k407389
37142F757538p260272o355980K18007N305406L537914r04578k00503M633461M640001
37133A0370994k380244p059139k983392K881571J873239k219355q78285L502012
37125C107401K039846m126990m998332J432289O325920N009238K556350K166364
37117A3512086O2864m333650m733450M18091L194599j035012n648334m003923
37109b566729J77438O25493j149685n65657J739309L059092L847236L940033M33351
37100I539881m917025m210775L819539Q190605J454008p301283n749106K728248
$$ y = [-2519482, -3698728, -2152044, 350054, 716151, -2994587, -9699062, -14907206, -13796610, -6257540, 2187436, 5991322, 5311954, 4745360, 6944927, 9164927, 6757538, -502734, -6858714, -6640707, -1335301, 2202613, 1298035, 1097532, 5730993, 10370994, 7990750, 931611, -2051781, 829790, 2703029, 483674, -394611, 3107401, 5147247, 1020257, -3978075, -2545786, 3780134, 8789372, 11345722, 13512086, 13574950, 9241300, 4507850, 4925941, 8120540, 7085528, 1437194, -2566729, -2389291, -1763798, -2913483, -3479140, -1739831, 1319261, 5166497, 9106530, 9539881, 4622856, 412081, 4231620, 12422225, 13876233, 6574950, 825844, 3554092]
37092C554092N639301J390759q26093J778694K314603j854998m476344j951160
37084E568854R50013J44375j450579j49954K557599L478365K192606m5513j876369
37075A1369397j470388J522434L782371K172272j032792j284183J121143K169580
37067A8349834J032917J24545o29282l334805o418750n640396j029407K816426
37059E271082L466507K381844L35249l018014n156836k559936K786149M601584
37051H107629J070784k896225l131983r00070R67820J904850K203878J585803
37043H912486K88694j036965k271754k414195O22172N516015O179291j06455o555897
37034I133392n254390J212515L799681L34533l295236l704136l054467k119612
$$ y = [3554092, 9193393, 10584152, 9758059, 11536753, 13851356, 11996358, 7520014, 5568854, 6518867, 6663242, 5212663, 5062709, 7620308, 11098673, 13291279, 13245766, 11369397, 9899009, 11421443, 15203814, 17376086, 16343294, 15059111, 16180254, 18349834, 19382751, 19507296, 18878014, 15543209, 9124459, 3484063, 2454656, 5271082, 8737589, 11119433, 11454682, 8436668, 3279832, 719896, 3506045, 8107629, 9178413, 6282188, 3150205, 2250135, 3217955, 5122805, 7326683, 8912486, 9201180, 8164215, 5892461, 3478266, 4100438, 9616453, 15795744, 15689289, 9133392, 3879002, 5091517, 8891198, 9225731, 5930495, 2226359, -828108, -2947720]
37026b947720Q58460L996286K893353j274592k725884n99451O57404N20739K739116
37017D117711N802516L365657l765416o551790j880081K517187J471312K70109
37009E347205L471342N817052J797988m002950m330655n79012J180676J92656
37001H894302l75236k74507o76635J45245L158299M405312P46716l849205l921282
36992H253009j058691o61947l120889m385471l037620j002420R95801L433306
36984e84922M915787L719856J160439k33600k54030K38658J551013L097178K267575
36975A5877954j152721k756386L98514M697706N163128K770363K174899M598686
36967C1772143P306898Q382473Q432460R073998J2125606J8126328K4226731K7218479
$$ y = [-2947720, -2089260, 1907026, 4800379, 3525787, 799903, 200452, 857856, 1378595, 4117711, 9920227, 13285884, 9520468, 2968678, 1088597, 3605784, 5077096, 5347205, 8818547, 14635599, 16433587, 12430637, 8099982, 7520970, 8701646, 8894302, 8519066, 8244559, 7567924, 7713169, 10871468, 15276780, 16023496, 12174291, 8253009, 7194318, 6532371, 3411482, -973989, -4011609, -5014029, -4018228, -584922, 4330865, 8050721, 9211160, 8977560, 8723530, 8962188, 10513201, 13610379, 15877954, 14725233, 11968847, 12367361, 17065067, 22228195, 24998558, 27173457, 31772143, 39079041, 47461514, 55893974, 64967972, 77093578, 95219906, 119446637, 146665116]
36959A46665116K9816784L7812830M7763749M4713882J9095137j8331902m5507338
36952B62028258n1129571m2352084l2612171k7638503k3584802j5186333m245226
36945F5279568R44931l551633r983510q744504l258334m762506j2305842j1901997
36937A1716173r4964P095383j341625j2274534q307371M599710P344765j773790
36929F963747o538896k83654N807084L656805l14334L47996J519642j092687l460209
36920F605494k074353q12006k403404k461692J545840M164030J412449j758131
36912D218227l47260J944913K45346k068827L55011M591660L898413j334191m965287
36903F538005m797342l705698k973878j151392J460133K840427L021418L148263
$$ y = [146665116, 176481900, 214294730, 262058479, 306772361, 325867498, 307535596, 262028258, 210898687, 168546603, 135934432, 108295929, 84711127, 69524794, 65279568, 66224499, 62672866, 52689356, 43944852, 40686518, 35924012, 23618170, 11716173, 11621209, 18716592, 17374967, 5100433, -3206938, 1392772, 8737537, 6963747, 424851, 141197, 5948281, 9605086, 9290752, 9638748, 11158390, 10065703, 6605494, 4531141, 3719135, 1315731, -1145961, 399879, 4563909, 5976358, 4218227, 3870967, 5815880, 6061226, 3992399, 4347410, 8939070, 12837483, 11503292, 6538005, 1740663, -1965035, -4938913, -6090305, -4630172, -1789745, 1231673, 4379936]
36895D379936K041462j569030m717448l291082J222107L233186J269276m07590
36887B160817Q83130K383430J324219k79250M20282J538568q10937n497646o714508
36878d591895k217289K731160K250096k067645l674738l04150L729975M547111
36870D02625L321102K299158P03992k276076l914703j385957L185326M763057
36862G098524J522257l560070o076174l559601K406475O111223K991797l450416
36854C484015m551537J331747N441792J522221m521663m308746r1187M85977k166380
36845c373761j648567J866541K074278j473119k540460L10074J688376o0291k52412
36836c409341K445355L493942J734186J306123J976482j806506q745666q892628
$$ y = [4379936, 6421398, 4852368, 134920, -3156162, -1934055, 1299131, 2568407, 2160817, 3043947, 5427377, 6751596, 6472346, 6892628, 8431196, 7620259, 2122613, -4591895, -6809184, -4078024, -1827928, -3895573, -7570311, -7874461, -4144486, 402625, 3723727, 6022885, 6726877, 4450801, 536098, -849859, 2335467, 7098524, 8620781, 5060711, -1015463, -4575064, -2168589, 3942634, 6934431, 3484015, -1067522, 264225, 5706017, 7228238, 2706575, -1602171, -1693358, -1207381, -3373761, -5022328, -3155787, -1081509, -2554628, -5095088, -4785014, -3096638, -3156929, -3409341, -963986, 2529956, 4264142, 5570265, 7546747, 5740241, -3005425, -11898053]
36828a1898053N39011Q378691N634314j393235k430654J183604J869240m72034
36820A410884n84223J384665J415291L19655J474886K747839j50381m425069l423178
36811A70369K007097M029365l58924n689998o643511l592591Q57057M652760N222724
36802F54348J548581k187188p08164M064334M647736r79647n836965l708811K474463
36793c1313N239620K265050j870808k176154J086590L294781J095021l490395
36785E412392n396924k742930J219182K835289K106003Q04001n08813j581406
36777B146794j302696L21484J439985J436846J850806K582500J081397k450230
36769G106886l652095r66837R15454j322993l659478j611427J868582J806657
$$ y = [-11898053, -11359042, -2980351, 2653963, 1260728, -1169926, 13678, 1882918, 1410884, 826661, 2211326, 3626617, 3946272, 5421158, 8168997, 8018616, 3593547, 170369, 2177466, 6206831, 5847907, 157909, -6485602, -10078193, -9221136, -4568376, 654348, 2202929, 15741, -692423, 3371911, 8019647, 7040000, 1203035, -2505776, -31313, 5208307, 7473357, 5602549, 3426395, 4512985, 7807766, 8902787, 5412392, 15468, -2727462, -1508280, 1327009, 3433012, 4237013, 3728200, 2146794, 844098, 1165582, 2605567, 4042413, 5893219, 8475719, 9557116, 7106886, 3454791, 2487954, 3403408, 2080415, -1579063, -3190490, -1321908, 484749]
36761D84749Q5217J335274L491241J095664l978517m239080J169396M619845J775315
36752E839104k453355k118976J776158M184027K350177k620585o890966o030936
36744e965352J78556N533465M465656J43856k03270L240848L588198p13277l292842
36735F975838j204624M2579l200937n590211j893124L438339L107372j182394
36727D92838j633349L089534N916146K258295l547567m796048j047863K732753
36719C464739L256106J826980O08069q40645l470001n262162l333388Q16115K341491
36710e92696M04029l03932K126176K528358k491532o754395k979856M649862N575400
36701B161414r02424m371435O44180O968231O384144O94594l414233l906211k759328
$$ y = [484749, 569966, 1905240, 5396481, 6492145, 2513628, -1725452, -556056, 4063789, 5839104, 3385749, 1266773, 3042931, 7226958, 9577135, 6956550, 65584, -5965352, -5786796, -253331, 4212325, 4356181, 4152911, 7393759, 10981957, 10268680, 6975838, 5771214, 5813793, 2612856, -2977355, -4870479, -1432140, 1675232, 492838, -1140511, 1949023, 7865169, 10123464, 6575897, 1779849, 731986, 3464739, 6720845, 8547825, 9155894, 8315249, 4845248, -416914, -3750302, -2934187, -592696, -188667, -492599, 1633577, 4161935, 1670403, -5083992, -8063848, -3413986, 2161414, 1258990, -3112445, -2468265, 4499966, 10884110, 11578704, 8164471, 4258260, 1498932]
36692A498932r83437Q56588J061599k90827l61584J580260K347247N32986p28240
36683E513524L66675Q99095p83582j214960J716012L819028J222874k950479l951150
36674D637037k810378k637118k077068J048323L636585J855903j588483j842868
36666B21933k90634r09586j463145K659584P920158O108458j789379n525137j196935
36657E735317L001379K81785m578696m121865O9444J292715j533917l736193k681272
36648f271303r9457J727062J835561J83633j305632O14503N574055P811266L233419
36639A3303107l942758n943950j293438M384001O140245L757956r99038n990962
36631I415163p481167k746940M586265O640971J095918n216435n358546j079394
$$ y = [1498932, 515495, 1372083, 2433682, 2142855, 1781271, 3361531, 5708778, 6241764, 5513524, 5880199, 6779294, 5995712, 4780752, 6496764, 10315792, 11538666, 8588187, 4637037, 1826659, -810459, -2887527, -1839204, 1797381, 3653284, 2064801, 221933, -68701, -978287, -2441432, 218152, 8138310, 14246768, 12457389, 6932252, 5735317, 8736696, 9018481, 4439785, 317920, 387364, 1680079, 146162, -3590031, -6271303, -6370760, -4643698, -2808137, -2624504, -3930136, -3315633, 2258422, 10069688, 13303107, 9360349, 3416399, 2122961, 6506962, 12647207, 16405163, 15406125, 9415163, 1933996, -812944, 3773321, 10414292, 11510210, 6293775, 935229, -144165]
36623a44165J215389J9368p83433O53340J662720L07423j549619j778221r88696
36614a385894m28166J15280O82941J84610j229517j511832k12374K53478j032920
36605d564394j127702J706364L844066J590848j958833r38175L647052M591787
36597F791013n65632n430037m027724R71459L065297J189658m03732M22225J102066
36588C114593o82030l185840l367587j476231o64821k198640l176979o57291L311587
36579h983239L975894J217019K33051K946115L769316j525769p241511n131423
36571a0740547K328789M697694p22498n193145k660495J517550N10031l159777
36563a3422398l028473R13775L990315M727633M485758K733807p93279k161618
$$ y = [-144165, 1071224, 1090592, 307159, 960499, 2623219, 2930642, 1381023, -397198, -1385894, -1814060, -1698780, -1015839, -831229, -2060746, -3572578, -3784952, -3531474, -4564394, -5692096, -3985732, -141666, 1449182, -509651, -1447826, 2199226, 6791013, 6225381, 795344, -3232380, -2260921, 804376, 1994034, 1590302, 2012527, 3114593, 2432563, -753277, -4120864, -5597095, -6261916, -8460556, -11637535, -12294826, -8983239, -5007345, -3790326, -3557275, -611160, 3158156, 1632387, -5609124, -10740547, -8411758, -3714064, -4436562, -9629707, -12290202, -10772652, -10262621, -13422398, -16450871, -15537096, -11546781, -6819148, -2333390, 400417, -392862, -2554480]
36555b554480J784573O664404N605248l42218l684043j761482L79166j079544
36547E011624l440325k836638M55708M004199O152523N294387M21900n576200
36539I487178o926403j848715M220067M705448m61108n217659m523980K05196
36531c59976K927767K24714l946337k888192L266275O609781K402503l559522
36523D677013l216481J886365L624706M8952k675408j164695K07103k349510n306819
36514d268774l395061K443311O520597N257534K2918m737820m778527R2888M638287
36505A795353L633024r97236k490847P67659K831824k93780m232224l048035J935641
36496i8621M748708L227539K31787j715327k596096k530237j076433R41334J551639
$$ y = [-2554480, -769907, 5894497, 11499745, 11157527, 7473484, 5712002, 6091168, 5011624, 1571299, -1265339, -809631, 3194568, 9347091, 14641478, 15063378, 9487178, 2560775, 712060, 4932127, 9637575, 9176467, 3958808, -565172, -359976, 2567791, 2792505, -1153832, -4042024, -775749, 5834032, 8236535, 4677013, 1460532, 3346897, 6971603, 7020555, 4345147, 3180452, 3387555, 1038045, -4268774, -7663835, -5220524, 1300073, 6557607, 6580525, 1842705, -2935822, -2842934, 1795353, 5428377, 4431141, 1940294, 2707953, 5539777, 5245997, 1013773, -2034262, -98621, 4650087, 7877626, 8109413, 6394086, 3797990, 1267753, 191320, 1132654, 2684293]
36487B684293o79k392956l641200k647742J1470K346610K879535K323259K031551
36478C594141J376585r48609l524474l409389p93791J205581J611153K156416
36470A267613K386256l34427m371040l708622K293653N309051l65538p908465
36462e431519o849662J559132O104115J887298l371326j302023N442902P623518
36454E662435J945797n220675o081127m95891M405951L007959k224432m577263
36446c577246k172501M65216K40343M212K515453M444871J301452m510098o263945
36437g552243k551942J051669K75283k591769k966343R8508L828188N193482L296215
36428a918952q3201j786100l45581K431918M007117M041161L203706R45048k807974
$$ y = [2684293, 2683614, 290658, -3350542, -5998284, -5986814, -3640204, -760669, 1562590, 3594141, 4970726, 4022117, 497643, -2911746, -3705537, -2499956, -888803, 1267613, 3653869, 3319442, -1051598, -4760220, -2466567, 2842484, 2476946, -5431519, -12281181, -10722049, -4617934, -2730636, -6101962, -7403985, -1961083, 5662435, 7608232, 2387557, -3693570, -4189461, 216490, 3224449, 1000017, -3577246, -5749747, -5284531, -5044188, -5039976, -2524523, 1920348, 3221800, -1288298, -7552243, -10104185, -9052516, -8777233, -11369002, -14335345, -14236837, -10408649, -5215167, -1918952, -2002153, -3788253, -4133834, -1701916, 2305201, 6346362, 9550068, 10495116, 7687142]
36419G687142n343363l991468l32209J801248J679149J440824J313103o47089
36411C607337l939564m987407k102852K242125M898921M841954K227682j918002
36403D870194m583651k958313J344540L548473J975490l62590j077973j287637
36395A468533j919925j354501J112974L123265K936558J979702J483759J18235
36387H948600k361696k836217K20642K793080P36834l326070l507596L35924K424249
36378C427750n3250k990433j979807J218661J731271j257584l635656k193498
36370e732546J279813K609598M90163k386690l132198j855242l26189Q77654K080438
36361f095199K497370J116876o42487K3301L027651M790517K959202o15175k814451
$$ y = [7687142, 2343779, -1647689, -1979898, -178650, 1500499, 2941323, 4254426, 3607337, -332227, -5319634, -7422486, -5180361, -281440, 4560514, 6788196, 4870194, 286543, -2671770, -1327230, 2221243, 4196733, 3834143, 2756170, 1468533, -451392, -1805893, -692919, 2430346, 5366904, 7346606, 8830365, 8948600, 6586904, 3750687, 3971329, 6764409, 7501243, 4175173, 667577, 1003501, 3427750, 3374500, 384067, -1595740, -377079, 1354192, 96608, -3539048, -5732546, -4452733, -1843135, -1352972, -3739662, -6871860, -8727102, -9053291, -8175637, -6095199, -3597829, -2480953, -3123440, -3100139, -72488, 4718029, 7677231, 7062056, 4247605]
36352D247605k862088j605684M44265K500910K942426J366167m12236j034460
36344E586905j366041j993050j470467O28380J567082m77613k532669r40087K426642
36335A429082K640449n15435k328708r15636L4718k076821m128453k391881J242654
36326g010031K072972k63917j453615Q85310L615042K412974k083309m388800
36318f213374p14301N701572P475021J875535n098890n622991J15790M347960
36310A866322K207466k163122k123458K183913M853288K902793l83152j089117
36302H254933J55311L70410j052920k288000k362920j985300j434188M827J990106
36293A652259K516008O17158j662969j646860L28493J392509R6870j867121k158061
$$ y = [4247605, 1385517, -220167, 224098, 2725008, 5667434, 7033601, 6621365, 5586905, 4220864, 2227814, 757347, 1385727, 2952809, 2475196, -57473, -997560, 1429082, 4069531, 3554096, 1225388, 309752, 344470, -1732351, -5860804, -8252685, -7010031, -4937059, -5200976, -6654591, -5769281, -2154239, 258735, -1824574, -6213374, -6927675, -1226103, 6248918, 8124453, 3025563, -2597428, -2481638, 1866322, 4073788, 1910666, -212792, 1971121, 6824409, 9727202, 9344050, 8254933, 8410244, 8780654, 7727734, 5439734, 3076814, 1091514, -342674, -337847, 1652259, 4168267, 4785425, 3122456, 1475596, 1804089, 3196598, 3293468, 1426347, -731714]
36284g31714l50353K384261M368525L607690q18215o127457o959956j581517M814464
36275a394272N982319K427983k45672J36895J15711k523810m600870k737559J139196
36266a700079K801821J553504k99879j706939l070408l707766k679510j163165
36258i972421o92108j02040K180752L973009J965798j929806k056195K395548
36250d237463N466656K948309k080702m789861m869040l836690q23737M122841
36242h099687O455802K816858k321818k158961J917289K379975k242440m932621
36234f185603j537996K911934K724743j14786r48466m22465j539330k708772m31073
36225h251814L382339L561596K40414j331047L57852J047726j102838j882998
$$ y = [-731714, -1082067, 1302194, 5670719, 9278409, 8460194, 2332737, -4627219, -6208736, -1394272, 4588047, 7016030, 6770358, 6907253, 7022964, 4499154, -101716, -2839275, -1700079, 1101742, 2655246, 2355367, 648428, -2421980, -6129746, -8809256, -9972421, -10664529, -10766569, -8585817, -4612808, -2647010, -4576816, -6633011, -4237463, 1229193, 4177502, 2096800, -2693061, -7562101, -11398791, -12222528, -8099687, -1643885, 1172973, -1148845, -3307806, -1390517, 989458, -1252982, -6185603, -7723599, -4811665, -2086922, -2201708, -3150174, -3572639, -5111969, -7820741, -8251814, -4869475, -1307879, -1067465, -2398512, -2040660, -992934, -2095772, -3978770]
36217c978770J374069M385442K662019q58108n54672K448783K030732k697396
36209D812099n444311k287630K489187L039303J16630j430654n16108l86310k286284
36200a894078l320286j508285R36027J332678N46268O40837P35242j366887m288361
36191h186845l554772K131527P805840P278470J89222p273529q411527k421799
36183a2443413M793685O354278J555840l405902k959929J062522K737052P84462
36175a521405m56388R44733J019183k798371n837965k538169M595747Q047924
36167A455289N685033K274486J044351k05506l333388n733475m740897k176692
36159e730799j417007k529543k894876q21923L117118O466708N854396N01847
$$ y = [-3978770, -2604701, 1780741, 4442760, 3584652, 3029980, 5478763, 7509495, 4812099, -632212, -2919842, -430655, 2608648, 2725278, 1294624, 778516, 392206, -1894078, -5214364, -6722649, -5786622, -4453944, -3907676, -3266839, -2531597, -3898484, -8186845, -11741617, -9610090, -1804250, 5474220, 5663442, -1610087, -10021614, -12443413, -7649728, -1295450, 260390, -3145512, -6105441, -5042919, -2305867, -1521405, -1977793, -1033060, -13877, -2812248, -8650213, -11188382, -6592635, 1455289, 7140322, 9414808, 10459159, 10253653, 6920265, 1186790, -3554107, -5730799, -7147806, -9677349, -12572225, -13394148, -10277030, -3810322, 2044074, 2545921]
36151B545921m528006k800747M174274P248840K326142l023901r67269M066458
36143I041712K438355m574837o054883J108686O702729K775221m531697n076881
36135A828405L33588L058686L52467k531458k255961j378188j956993j916337
36127d465791M65598L394909M520949L255011m01422n101778o225880l40622P589305
36118B690279Q059840K82036n578999l139089J012995r22245m603368j561360
36110c759911M809810L459194n697999j0040269l168553O040807P807743M479709
36102C930531K677749J487064k813709o879822m959795M65312K126711j71415
36094d137374k07148L115809L934662n5082l494464k040087J629135L223912K646327
$$ y = [2545921, -1982085, -4782832, -608558, 6640282, 8966424, 5942523, 4975254, 9041712, 11480067, 6905230, 850347, 1959033, 8661762, 11436983, 6905286, 1828405, 2161993, 5220679, 5573146, 3041688, 785727, -592461, -2549454, -4465791, -4000193, -605284, 3915665, 7170676, 6769254, 1667476, -4558404, -4899026, 2690279, 10750119, 11032155, 5453156, 2314067, 3327062, 2404817, -2198551, -3759911, 1049899, 4509093, -1188906, -11229175, -14397728, -8356921, -549178, 3930531, 6608280, 8095344, 5281635, -1598187, -6557982, -6092670, -3965959, -4137374, -4344522, -1228713, 2705949, 2650867, -843597, -2883684, -1254549, 1969363, 4615690]
36085D615690J566453k0974j998486k795313k189520j946346k069453l82023K637983
36076b581989L212914O01797p07473J874852M274305J988961k664529l973537
36068B025301r85524J934617J229024k398602n442441m323527J511114P374161
36060I24123O821212m58093p075421o671301j097157L704873N238292M336303
36052E722831J353097k756750m451017j777804J572775J216045j071430n84112
36044g76365K312136L287976J694369P30386O56393j406763m575763m029972O49767
36035a457836L479714J090868k062000j006684K233246K693694K22456j448464
36027C744994r45514j73336k63714m07661l27217q86049k038380k269774n74965
$$ y = [4615690, 6182143, 6161169, 4162683, 1367370, -822150, -2768496, -4837949, -5219972, -2581989, 630925, 1232722, 525249, 2400101, 6674406, 8663367, 5998838, 2025301, 1039777, 2974394, 4203418, 1804816, -3637625, -7961152, -6450038, 924123, 7745335, 7287242, 211821, -6459480, -7556637, -3851764, 1386528, 5722831, 7075928, 4319178, -131839, -1909643, -336868, 879177, -192253, -776365, 1535771, 4823747, 6518116, 7248502, 7904895, 6498132, 1922369, -2107603, -1457836, 2021878, 3112746, 1050746, 44062, 2277308, 4971002, 5193458, 3744994, 2799480, 2626144, 2362430, 1954769, 1627552, 741503, -1296877, -3566651, -4141616]
36018d141616K071272L546107K639215L64241j031408o89652P3177K40722O32416
36009C704474J450459O94067k058803k813812J313472N641809L173911m154527
36001F951050o686631j047481M456848K128570m062001n250730n86679L130260
35993i66794J933350j327592k347275J00087M229299O293348L057400l515990
35985G455833o474122k581106K239456J138671l187394k947980K076950M477499
35977B197807J513102j120619M10986K154270K30889k454481j968348L2992L99888
35968A396486R9013N31507p97761m875570o134719l26407O205541M056742m305527
35959d150695p042678o73422N117838L237016o58362M06790K506367j003073n954128
$$ y = [-4141616, -2070344, 1475763, 4114978, 4479219, 3447811, 2758159, 2831336, 3072058, 3704474, 5154933, 5849000, 3790197, 976385, 2289857, 7931666, 11105577, 6951050, 264419, -783062, 3673786, 5802356, 1740355, -3510375, -4097054, -966794, 966556, -361036, -2708311, -2608224, 1621075, 7914423, 10971823, 7455833, 981711, -1599395, 640061, 1778732, -1408662, -4356642, -2279692, 2197807, 3710909, 2590290, 3001276, 5155546, 5386435, 2931954, 963606, 996598, 1396486, 1495499, 2027006, 1229245, -3646325, -9781044, -10107451, -3901910, 154832, -4150695, -11193373, -11866795, -6748957, -3511941, -4170303, -3763513, -1257146, -2260219, -8214347]
35950h214347l220129N274529Q190262K304671k951948r86565K597696J115475
35942D109644k205659j653558J18836k302929n894874l584678K988736N287977
35934c136505J737030k35023K825417N024918J857452k376639k574140r27733
35926B194777j421324k304382l25398K269306J435936j536235k714114k220258
35918d621692k292412j858257N03883J444510j763463l628712K493345J1223309
35910A500511R912983k184552j0708536o330059K357081K939033k778193m224619
35902i516351O68934M505523L808713K601619K729309N99503m184811n586591
35894d374152n67433N016342M809291R79980n22255L99482o38256l835374m573140
$$ y = [-8214347, -11434476, -6159947, 2030315, 4334986, 1383038, 396473, 2994169, 4109644, 1903985, 250427, 369263, -1933666, -7828540, -11413218, -8424482, -3136505, -1399475, -1634498, 1190919, 6215837, 8073289, 5696650, 3122510, 2194777, 773453, -1530929, -1856327, 412979, 1848915, 312680, -2401434, -4621692, -6914104, -8772361, -8268478, -6823968, -8587431, -12216143, -9722798, 1500511, 11413494, 9228942, -1479594, -7809653, -5452572, -2513539, -5291732, -9516351, -8847417, -4341894, -533181, 2068438, 4797747, 5397250, 1212439, -4374152, -4941585, 74757, 4884048, 5864028, 5341773, 5741255, 5102999, 1267625, -3305515]
35885c305515j332462J650951J076229q87904j062536l04360r43055k093130j344912
35876h546694N06489M55588j452081j796935P14818L106767K881965J504700R47867
35867a677516j1767k701672m308717j275787M114122N495252J244997l081815
35859b202903k683500M20015J763225J026711O64145Q35451j8828j196393n75666
35850a967743J324475K027033J367892J214605J274686m50158k831156k177324
35842b17690J080483J429862l276604p176000m351666K214995M711597J282013
35834d303010k588338k564779j29103J554717J794716J190927J7017q04260p7622
35825e909735J181993M64782k054036l009216o71217K651406M218452L833241
$$ y = [-3305515, -4637977, -2987026, -1910797, -2798701, -3861237, -4165597, -5108652, -7201782, -8546694, -8040205, -7584617, -9036698, -10833633, -10118815, -7012048, -4130083, -2625383, -1677516, -1689283, -4390955, -8699672, -9975459, -5861337, -366085, 878912, -2202903, -4886403, -4466388, -2703163, -1676452, -1012307, -176856, -195684, -1392077, -1967743, -643268, 1383765, 2751657, 3966262, 5240948, 4790790, 1959634, -217690, 862793, 2292655, -983949, -8159949, -12511615, -10296620, -5585023, -4303010, -6891348, -9456127, -9585230, -8030513, -6235797, -5044870, -5027853, -5832113, -5909735, -4727742, -4262960, -6316996, -9326212, -9997429, -7346023, -3127571, 705670]
35817G05670K089631p60267k645043n37133M115076N219122P00773l184577r01103
35808D802149L301890J729125m536675p367902m054157N4006J365244K177843
35800b528477L476338K001079k240509l431116M51551K767950j183432n488091
35792f174707l008534K373276K144961k296764k200286L057857M515147q90229
35784b479279m387028O12117P766346P522113P56826m426783m692403k925484
35776b253575r26502J985484M540116M267662K203993J294736P56740k268326
35768I600328n933676n038855J66833L129722Q06921k067073j422579k20576k018095
35759b997050l935610j909735J593050J892166N99871K078745L850212k66648
$$ y = [705670, 2795301, 2035034, -610009, -1147142, 2967934, 8187056, 8887829, 5703252, 4802149, 8104039, 9833164, 5296489, -2071413, -6125570, -6071564, -4706320, -2528477, 947861, 2948940, 708431, -2722685, -2271134, 496816, -686616, -6174707, -9183241, -6809965, -4665004, -6961768, -9162054, -6104197, -1589050, -2479279, -6866307, -6254190, 1512156, 9034269, 9791095, 5364312, 671909, -2253575, -3180077, -1194593, 3345523, 7613185, 9817178, 11111914, 11868654, 9600328, 3666652, -1372203, -1205370, 1924352, 2731273, 664200, -758379, -978955, -2997050, -6932660, -8842395, -7249345, -5357179, -4757308, -2678563, 1171649, 905001]
35751I05001p770407q344821L13869P299697M357496j822747r32926M383634L521641
35742A910437m391868q952631m305470L613075P425025O980823M734007O79894
35734G693292l754341l889719Q53276L684466R7734m538182l211951J753661L131097
35725A819333L47620j375926q92565j644734l438511k303493J209344J973394
35717d305538l26109j80690L242273L445468j668056m265431R30756O425749K913470
35708F211892n090446n047050M345583J0428271M548471o485281j0915024o990152
35700h993736j825665J49525R87158K808926L720651J806087o99243k50247K507534
35691B10990L135582m02854m444782m109559M73014M563373M661488J632554j618548
$$ y = [905001, -6865406, -15210227, -14896358, -7596661, -3239165, -5061912, -5994838, -1611204, 1910437, -2481431, -11434062, -15739532, -12126457, -4701432, 2279391, 7013398, 7693292, 3938951, 49232, 902508, 4586974, 4684708, 146526, -3065425, -1311764, 1819333, 2166953, 791027, -101538, -1746272, -5184783, -7488276, -6278932, -4305538, -4631647, -4812337, -1570064, 1875404, 207348, -4058083, -3127327, 3298422, 6211892, 1121446, -3925604, 419979, 10848250, 15396721, 8911440, -2003584, -8993736, -10819401, -10669876, -9682718, -6873792, -3153141, -1347054, -2046297, -2296544, 210990, 3346572, 2943718, -1501064, -5610623, -5137609, -574236, 4087252, 5719806, 4101258]
35682D101258k940197j360335K286006M536128K207586k851990n172357l052280
35674b246181o52695p77909l37532L264623N905085K736005k889919l617688K74844
35665A658633J205554l249985o094327j946027M448172N357101Q14620l014543
35657h20802k966949j054567O37420K079487K830974J880206K73502L12551J597783
35648D769605J159952j575302l162156j193305J704065J531721j114691j982743
35640A37146K60110J868317j75199l184206k655548N95783J454606j247402k317558
35631e263951J660251O115658M737854r89035l986123j988147L85995K85460P80797
35622A738759L845133N196734Q98196n022215n375955l48962K563750p52598n456976
$$ y = [4101258, 1161061, -199274, 2086732, 6622860, 8830446, 5978456, 806099, -2246181, -2898876, -3676785, -4014317, -749694, 5155391, 7891396, 5001477, 1383789, 1658633, 2864187, -385798, -6480125, -8426152, -3977980, 1379121, 2193741, -820802, -3787751, -4842318, -4204898, -2125411, 705563, 2585769, 2859271, 3171822, 4769605, 5929557, 4354255, 1192099, -1206, 1702859, 3234580, 2119889, 137146, 397256, 2265573, 2090374, -1093832, -3749380, -3153597, -1698991, -2946393, -5263951, -3603700, 2511958, 7249812, 6260777, 2274654, 286507, 672502, 957962, 1738759, 5583892, 10780626, 11678822, 6656607, 1280652, 931690, 3495440, 2742842, -2714134]
35613b714134m691857J291860N673060L593387k038809m012241M15238N704477
35605C220981M697252j732130n205819j102805M848979M635229p90984l644507
35597D926196j100696J399707n42068l722910l071487O85820L169434K994273
35589D738269J779690l54788m165532o877061m027871K923524N971663Q08107
35581G96001o158315n628317J987601P298496M921122j49902j019580J703094
35573C750200K940261J507765J26981n51041k092598l402527j749612J115351
35565A644780J51669m239295n198675o4557M421779K274308k235879j769032K009443
35556c005459J769660k531038l163015K601564P754712O058589L06811l226806
$$ y = [-2714134, -7405991, -6114131, -441071, 3152316, 1113507, -2898734, -2483496, 3220981, 7918233, 6186103, 980284, -122521, 4726458, 9361687, 8570703, 4926196, 3825500, 5225207, 4683139, 960229, -2111258, -1425438, 1743996, 4738269, 6517959, 6163171, 1997639, -4879422, -8907293, -5983769, -12106, 796001, -5362314, -10990631, -9003030, -1704534, 3216588, 3066686, 2047106, 3750200, 6690461, 8198226, 8325207, 7774166, 5681568, 2279041, 529429, 1644780, 1796449, -2442846, -7641521, -7706078, -3284299, -1009991, -3245870, -5014902, -3005459, -1235799, -3766837, -6929852, -4328288, 3426424, 9485013, 9791824, 6565018]
35548F565018k825834k75197L009760M809678J790849n085185q940066n655507
35540f606484m31423j93994k934798j435611M600136P994541N521316K073460
35532H587143J656414J422114j827502n204901m580523j561340m94843j361850
35524c365288p45299J794941L120553J646223r18715k618595k706665o73904K838083
35515a628666M860079L255079J77020j237176k061895m550495n600903m77153
35507g264110O944702O531371k649187q338391k342184O563011N521224l289783
35499A676653p404141l790485j063034k718932j690938N011963Q682382K866945
35491A570413m828936l804281L509167O365013K207121j496515l86087J240040
$$ y = [6565018, 3739184, 3463987, 6473747, 11283425, 13074274, 7989089, -950977, -6606484, -7037907, -7231901, -10166699, -11602310, -7002174, 992367, 6513683, 8587143, 10243557, 11665671, 9838169, 4633268, 52745, -1508595, -2003438, -3365288, -4110587, -2315646, 804907, 2451130, 1532415, -1086180, -3792845, -4466749, -1628666, 3231413, 6486492, 6663512, 5426336, 3364441, -1186054, -6786957, -7264110, -319408, 6211963, 3562776, -4775615, -7117799, -554788, 4966436, 1676653, -5727488, -9517973, -10581007, -13299939, -14990877, -9978914, -1296532, 1570413, -3258523, -7062804, -3553637, 2811376, 5018497, 3521982, 3135895, 4375935]
35483D375935q43018m106993m184563j400936O77917L40427r25157p30837J635828
35474e161397M165636L936222Q43083j729590j291093N29474R19704k11761j560019
35465D40259l032064m074252k234005K792778O380567M794064J335194J391227
35457G793768L528547J961554l216892n547031k593986K46118j366193m117255
35449c311370k847882J517014L760593J581989k011764k321921K286518P964275
35441F617452P939922o8104r500051j1319794m486731L521224O254345M030755
35433B989018K10394l136561m647993l365781q11274J12229o71430o35641P44409
35424i212630J655374K178300M052692N986053M492876P1208k808375k552262
$$ y = [4375935, 3532917, -574076, -4758639, -6159575, -5481658, -5141231, -6066388, -6797225, -5161397, -995761, 2940461, 3783544, 2053954, 762861, 1292335, 2212039, 2000278, 440259, -2591805, -6666057, -8900062, -6107284, 273283, 5067347, 6402541, 7793768, 11322315, 13283869, 10066977, 4519946, 1925960, 2172078, 805885, -3311370, -6159252, -4642238, -881645, 700344, -1311420, -3633341, -1346823, 6617452, 14557374, 14489270, 4989219, -6330575, -10817306, -7296082, -1041737, 2989018, 3199412, 62851, -4585142, -7950923, -8762197, -8649968, -9321398, -9957039, -9212630, -7557256, -5378956, -1326264, 4659789, 9152665, 9223873, 6415498, 3863236]
35416C863236j750808j283592N31333K389090Q22031k448420j908162J651334
35408A866042J450047k715620k629027L662383O511394M27190n747241l124659
35400b99491K630138J612257l725482m320770m53706Q49859j58990K240745O005500
35391D380060L276261m758273p554002j406115N083079M414303l70991k851096
35383B13226j971228l58214R8406j306285l354178k312499K970151O806219L951283
35374D736881r61114L27034N637692M882816l176567p944093l355121L437690
35366C585218M136704O29623j206963j011033j247031j475806j033729k047488
35358C29495m700182m605809J55664M225054K310097k748140m240519o87872L719331
$$ y = [3863236, 2112428, 828836, 1360169, 3749259, 4571290, 2122870, 214708, 1866042, 3316089, 600469, -2028558, 1633825, 8145219, 8572409, 2825168, -299491, 2330647, 3942904, 217422, -4103348, -4557054, -3707195, -3866185, -1625440, 4380060, 7656321, 2898048, -4655954, -6062069, -978990, 3435313, 3064322, 213226, -1758002, -2116216, -2017810, -3324095, -6678273, -8990772, -6020621, 785598, 4736881, 3775767, 4102801, 9740493, 14623309, 11446742, 3502649, 147528, 3585218, 7721922, 8351545, 7144582, 6133549, 4886518, 3410712, 2376983, 329495, -4370687, -8976496, -8820832, -4595778, -2285681, -5033821, -9274340, -9962212, -6242881]
35349f242881N135951K939073j019327l314795j493114K493429M119659K405451
35341E023446N65029K27700q6784k30552J820250M301960K432465l133621n522180
35332E397713k014333J756227J155156j036674j281481j051674j526553J59237
35324A557618M258405N185477O13435l297403j884191J95385j799140l326812
35316A502774O30878M375458k2269q010535q153684Q1316N726269L067719j666956
35307b469030j557791K321070N573004O201392L447305k612292q164646p880503
35299e141491j991045L347628L936032J599122j62298k63109P64857J716209O47262
35290D453167k576072m306369j570843K701161L417034Q88258n63223k30389j136195
$$ y = [-6242881, -1106930, 1832143, 812816, -2501979, -3995093, -1501664, 2617995, 5023446, 5588475, 5816175, 5729391, 5498839, 7319089, 11621049, 14053514, 10919893, 5397713, 3383380, 5139607, 6294763, 5258089, 3976608, 2924934, 1398381, 1557618, 5816023, 11001500, 11614935, 8317532, 6433341, 6628726, 4829586, 1502774, 2133652, 6509110, 6486841, -1523694, -9677378, -9596062, -3869793, -802074, -2469030, -4026821, -1705751, 3867253, 10068645, 13515950, 10903658, 2739012, -5141491, -7132536, -3784908, 151124, 1750246, 1587948, 1324839, 2089696, 3805905, 4453167, 1877095, -2429274, -4000117, -1298956, 2118078, 3006336, 2443113, 2212724, 1076529]
35281A076529l143912k546120J013704L445454K921992J748607O11555k728490
35273B399319p321619p908595k668420L267494M952626L493708J981605M33835
35265a370047j669661k131197M53858L052430K184592o44007j281250Q77763K590481
35256B062962J865613K85864K04287J682920K580641Q67739k960419n566816l832399
35247b809608J375843N651798N767899K742843l67278k316702l999761n599229
35239D45805n140278j030860M356097N687487R60881m699371m717708K329K207716
35230a927902q38337l085621N14204N196742L151254m137404p323683k373843
35222a0824590M261454N063601P91235k268944r83783J798268J895656q95851
$$ y = [1076529, -2067383, -4613503, -3599799, -154345, 2767647, 4516254, 5127809, 2399319, -4922300, -12830895, -15499315, -12231821, -7279195, -3785487, -1803882, -1370047, -3039708, -5170905, -4717047, -1664617, 519975, -124032, -1405282, -527519, 2062962, 3928575, 4214439, 4418726, 6101646, 8682287, 9550026, 6589607, 1022791, -2809608, -1433765, 4218033, 9985932, 12728775, 12361497, 10044795, 6045034, 445805, -4694473, -5725333, -1369236, 4318251, 5279132, 579761, -4137947, -4135618, -1927902, -2766239, -5851860, -5337656, -140914, 3010340, -1127064, -8450747, -10824590, -6563136, -1499535, -708300, -2977244, -3961027, -2162759, -267103, -1162954]
35214a162954k562441J90427N228155O779928K514814l247120m803278j529239
35206A408292K680656M422403L170303L88687j766227k193179k264751l494209
35198B351975l788349l5159N022246M307611k859239p876626m659637J861778
35190e675400M112425K543942J529149M91600k863816n118671j714528M220201
35182b475098N991819L532714J414153j18848l311403n285006k117440K046777
35174c22332M80344l750137k362719K965941L033969j776355j418587M987109
35166A837233N773727k880423q318015j277276Q890787R123587J761285k686260
35158A2224645k969469m748448p091965m270453K113450M517351J807693O2396
$$ y = [-1162954, -3725395, -3534968, 1693187, 8473115, 10987929, 7740809, 2937531, 1408292, 4088948, 8511351, 11681654, 12070341, 10304114, 8110935, 5846184, 2351975, -1436374, -1471533, 3550713, 7858324, 4999085, -2877541, -7537178, -5675400, -1562975, 980967, 2510116, 3001716, 137900, -4980771, -6695299, -2475098, 3516721, 7049435, 8463588, 8344740, 5033337, -251669, -2369109, -322332, 158012, -3592125, -5954844, -2988903, 45066, -1731289, -3149876, 1837233, 7610960, 4730537, -3587478, -4864754, 4026033, 13149620, 14910905, 12224645, 9255176, 4506728, -2585237, -6855690, -4742240, -224889, 1582804, 1645200]
35150A645200J354886J159241k116437l546560j48239L802741L299241k26996
35142E223077j789248o4102J646515O92501j429318j621827L00799J621849J061926
35133E642172L26002K44525j010731l269114k307230K890377N424223R8817o331190
35124A707851m074675L303916L380328m612047p585500n3368O466663K454834
35116I88002m258117k352829M371115M643161j464856m541557k245564p85517
35108e646162j841084k21525M832087O749578K504715k209586j994991P11557
35100B884589Q20115j560691k486139p14515Q05974l18190k035728l44715M440092
35091A490792O559077K407284l308731l775419n38072q30708m922183m969435
$$ y = [1645200, 3000086, 4159327, 2042890, -1503670, -1651909, 2150832, 5450073, 5223077, 3433829, 3369727, 5016242, 5708743, 4279425, 2657598, 2958397, 4580246, 5642172, 5968174, 6212699, 5201968, 1932854, -374376, 2516001, 7940224, 8039041, 1707851, -2366824, 937092, 4317420, -294627, -7880127, -7933495, -1466832, 988002, -3270115, -5622944, -1251829, 3391332, 1926476, -2615081, -4860645, -5646162, -7487246, -7708771, -2876684, 3872894, 6377609, 4168023, 2173032, 2884589, 3704704, 2144013, -342126, -1056641, -250667, -568857, -2604585, -2949300, 1490792, 8049869, 10457153, 7148422, 3373003, 2834931, 2004223, -2917960, -7887395]
35083g887395J387056N604855J201287o056094p112340j991433L231178N698524
35075e924362N414507J429127m604952o306901j037648M446174L638902K04853
35067b740300Q53712L936995L734100J118635O05702Q61836k167349n912961m675159
35058d384789O1387K189470J477630K058182K827579m06099m793086l211472L122662
35049a058536N269870N07901m199131m003092k064089j604681p36460J981860
35041e906358M017342L512736J715707n57247l401478m619508k023666J406536
35033e855936J063769j398548p15301K584248L330380J302422R62854K180259
35025C454147O00020k749270k237967J290028Q24196l766399m104291K121264
$$ y = [-7887395, -6500339, -895484, 305803, -5750291, -12862631, -14854064, -11622886, -5924362, -509855, 919272, -3685680, -9992581, -11030229, -6584055, -2945153, -2740300, -1886588, 2050407, 5784507, 6903142, 7508844, 8370680, 6203331, 290370, -4384789, -4323402, -2133932, -656302, 1401880, 4229459, 3823360, -969726, -4181198, -1058536, 4211334, 4719235, 520104, -3482988, -5547077, -7151758, -7888218, -5906358, -1889016, 1623720, 3339427, 2782180, -619298, -5238806, -7262472, -5855936, -4792167, -6190715, -6906016, -4321768, -991388, 311034, 1273888, 3454147, 4054167, 1304897, -933070, 356958, 1181154, -2585245, -6689536, -4568272]
35017d568272N981079J546274m759230m988073j074576J022368R69849J185112
35009d685469P51463j190202j313301K394598N443169K877517l085314o356179
35001e163718m888785j430626Q12546M40817j403680j118539L066664O794854
34993b890467M707098n51218j594015J389892P22059m757276o218427N93933P583162
34984a015259O982701K419358L44303p34212m192796o322948k822532J922536
34976c418849J562725j263784k03899K924980J510310l564933m986392r81203
34968h421045K849749L133805K033247J183048k01472j199502l8035J176800o71267
34959a54672k693549N87618O763749O899334q58043p309412n472958l93440k61912
$$ y = [-4568272, 1412807, 2959081, -1800149, -6788222, -7862798, -6840430, -5870581, -4685469, -3934006, -5124208, -6437509, -4042911, 1400258, 4277775, 1192461, -5163718, -10052503, -11483129, -10670583, -10229766, -11633446, -12751985, -9685321, -2890467, 1816631, 1265413, -328602, 1061290, 1783349, -2973927, -9192354, -8598421, -1015259, 5967442, 8386800, 8731103, 7996891, 3804095, -2518853, -5341385, -3418849, -1856124, -3119908, -3323807, -398827, 1111483, -2453450, -7439842, -8421045, -5571296, -2437491, -404244, 778804, 577332, -622170, -660205, 516595, -154672, -2848221, -2260603, 4503146, 11402480, 10544437, 3235025, -2237933, -2631373, -2893285]
34950b893285l650059k858610L087147O670599L371862j894543k657282j34479
34942i58650Q0655k406445k587809R31749L123031R28075j424736L00367K832079
34933H18316J091314k522004j917373J972518K481552j529322m203162l064380
34925f872541k156887k881822n83097N923696R554776N095723k292706m495777
34917A291365j407300J074991J18767k069097k535729p5356L994328N439726J229364
34908G061059m619491m694327P83382L536631K58620k340800K78084K424000r94605
34899A692553m205922j94531O197854N128188k670245p344189m417936J382070
34891d432158N088315N833269L506097j062894l508452o88696L061892J324865
$$ y = [-2893285, -6543344, -9401954, -6314807, 355792, 3727654, 1833111, -824171, -958650, -877995, -3284440, -5872249, -4940500, -1817469, -889394, -2314130, -2013763, 818316, 1909630, -612374, -2529747, -557229, 1924323, 395001, -3808161, -6872541, -9029428, -11911250, -12494347, -6570651, 2984125, 8079848, 5787142, 1291365, -115935, 959056, 1077823, -991274, -3527003, -3602359, 391969, 5831695, 7061059, 2441568, -2252759, -1469377, 2067254, 2325874, -14926, 263158, 2687158, 1692553, -2513369, -2707900, 3489954, 8618142, 5947897, -1396292, -5814228, -4432158, 656157, 6489426, 9995523, 8932629, 5424177, 4735481, 7797373, 9122238]
34883I122238m168637n928115k175211J569184J864483R76945R71395R30237N84887
34874C747406Q69913P23525j315573k969296j247427J573684J148687j172135
34866A358784p45098J457142L16344l493159l732348M05025K373184n02815k518940
34857e081881K19098L174804J801903m37816J361715M260753J792076n223448
34849A867204q915935n078806J569344L990802J266744j623192r32104J531798
34841f324145K074722R64913J378544L008035J506586l828141o816114k808560
34833a0844160L861036N947769L286706P91051l39540k143551k858565J037666
34825a261588O082724M253941l977820p774498j173148P319265O309019k681223
$$ y = [9122238, 4953601, -974514, -3149725, -1580541, 283942, 1260887, 2232282, 3162519, 3747406, 4617319, 5340844, 4025271, 1055975, -191452, 1382232, 2530919, 1358784, 613686, 2070828, 2387172, -1105987, -4838335, -4433310, -2060126, -2562941, -5081881, -4862783, -1687979, 113924, -323892, 1037823, 5298576, 7090652, 1867204, -7048731, -12127537, -10558193, -6567391, -5300647, -6923839, -7855943, -6324145, -4249423, -3284510, -1905966, 1102069, 2608655, -1219486, -8035600, -10844160, -6983124, -1035355, 2251351, 3042402, 2702862, 559311, -2299254, -1261588, 4821136, 9075077, 5097257, -2677241, -3850389, 3468876, 9777895, 7096672]
34817G096672p992269l784158L654624N665032J734842k043330j756115N52670
34809C127968J363143O44217M33827N30739r33501l040474k257965J807728M629441
34800F305123K740398j723996m464677l815203l87677M209340O392120K943493
34792A2198921l299307n303658k022454l17881l244004m411176K70153L914437
34784b214969K61241m079198q9035P290260O230966k522356o987066k975160J874611
34775c210706K956112L954284N700180L001782m106015p795154m879968j057767
34767e437252M14939K947132O073378L092601n572835q949007k226224M660380
34759d996888K948871j647628p16529K330236M29816l305182j891113K213065
$$ y = [7096672, -895597, -4679755, -1025131, 4639901, 6374743, 4331413, 2575298, 3127968, 4491111, 5135328, 5569155, 6099894, 5166393, 2125919, -132046, 1675682, 6305123, 9045521, 7321525, 2856848, -958355, -1346032, 2863308, 9255428, 12198921, 8899614, 3595956, 1573502, 1255621, -1988383, -6399559, -6129406, -2214969, -1953728, -6032926, -6121961, 1168299, 7399265, 4876909, -2110157, -5085317, -3210706, -254594, 3699690, 9399870, 12401652, 8295637, 500483, -4379485, -5437252, -5022313, -2075181, 3998197, 7090798, 1517963, -7431044, -9657268, -4996888, -2048017, -3695645, -4412174, -2081938, -1652122, -4957304, -6848417, -4635352]
34751d635352K060309q79489n09075J675149K1235l158963j065004M349949M860292
34742B719051M86596p90169K250877K252102k373250m043230l20005R70104l498993
34733b346917m720558L354231J1079077O715618m606864q103703j421759L729875
34725C679000J290503j299187J775790M065610j358880q709926p701848N59918
34717g699020N880975M254300R75101l98175k092569m225457k824540J438745
34709d690640J932955k376700l290563L010626P836628L342088m153510m060237
34701b449353J790063L619989K51678j056249J108927O67995l501635n216775
34693d785360k403571k08588q17667k44597K368557K058420k227008m272806n28469
$$ y = [-4635352, -2575043, -3454532, -3963607, -2288458, -2267223, -5426186, -6491190, -2141241, 2719051, 3205647, 2415478, 4666355, 6918457, 4545207, 501977, 181972, 1152076, -2346917, -7067475, -3713244, 7365833, 14081451, 9474587, 1370884, -50875, 3679000, 4969503, 3670316, 5446106, 9511716, 8152836, -557090, -8258938, -7699020, -1818045, 2436255, 3411356, 3013181, 920612, -3304845, -6129385, -4690640, -2757685, -5134385, -8424948, -5414322, 2422306, 5764394, 1610884, -2449353, -659290, 2960699, 3212377, 2156128, 3265055, 3933050, 431415, -4785360, -7188931, -7397519, -8215186, -8459783, -6091226, -4032806, -6259814, -10532620, -11061089]
34684a1061089M598771O373486N037012J484809l954480o767985j920096N697336
34676e12236N253126k831058n808554J059775O480061K147525l830635k103613
34668a45609K062699K39355k888303R58909O410574K597573o833378q104309M40887
34659e261602O017133K032956l118198j185825L897910M370792M49307k014959
34651E187514o00736J707621J356668j505443l051321l64627L720568L333992
34643I784236j690502m667838k307966j4893k527351n838788m615077j238173
34635a3116352N4688J743612O704246R167880K867559o076978o266686J499458
34627c422573N804531K356600k018911l026653l992050n577699k692840M531139
$$ y = [-11061089, -6462318, -88832, 4948180, 6432989, 2478509, -4289476, -6209572, -512236, 4740890, 1909832, -3898722, -2838947, 3641114, 5788639, 1958004, -145609, 1917090, 2156445, -731858, 227051, 6637625, 9235198, 2401820, -5702489, -5261602, 755531, 2788487, -329711, -1515536, 2382374, 6753166, 7202473, 5187514, 4586778, 6294399, 7651067, 6145624, 3094303, 2729676, 6450244, 9784236, 8093734, 3425896, 1117930, 1103037, -1424314, -7263102, -11878179, -13116352, -13061664, -11318052, -4613806, 4554074, 7421633, 1344655, -4922031, -3422573, 2381958, 4738558, 2719647, -307006, -4299056, -9876755, -12569595, -8038456]
34619h038456P610322K615744l028101k074124K256143L226266Q50682r09364
34611B509112j604368k752184k945573l51354K566465J895811j587829l089373
34603e359293j10079M430826N458177J288091m084301m994125r32407K788590
34595a514521K575883J238471K156205K978195J23211m093604m958204k984064
34587d478428j475457M65722M859777P627037L547063l297610l977107R93223
34579D264220K422658j900067l761520O11799L676663l64775n695885m803381
34571e550288k40833Q38068k047871l906965k531671L66811L017316L985249J891090
34562d179094j631616k184332J135436L683468K292559j72512k99173O72110O07692
$$ y = [-8038456, -428134, 2187610, -840491, -2914615, -658472, 2567794, 3418476, 2509112, 904744, -1847440, -4793013, -5144367, -2577902, -682091, -2269920, -5359293, -5469372, -1038546, 4419631, 5707722, 1623421, -3370704, -4303111, -1514521, 1061362, 2299833, 4456038, 7434233, 7557444, 3463840, -1494364, -4478428, -5953885, -5488163, -628386, 6998651, 10545714, 7248104, 3270997, 4264220, 6686878, 4786811, 1025291, 1637090, 5313753, 4948978, -746907, -5550288, -5791121, -4953053, -7000924, -10907889, -13439560, -13072749, -10055433, -6070184, -4179094, -5810710, -7995042, -6859606, -3176138, -883579, -1056091, -1355264, -683154, -75462]
34553g5462P39042K377548L606152K791852J353069N2941k821888o582309o797517
34544e356572k535906N72292j096044l021257j96834M223420M118510K17209j726968
34535d802150J75721K783305L606399K573007L3802k548747k126709J546235L709740
34526D950603J097117k423634j680926J378153J045491k553305l741823m43414
34518b371738L070706L049862Q18474m91931J76939K025166L338298J864062k761986
34509H717852o777464n529118M92713N473369M860042N1367m133908m778742k650525
34500d274414o880J813165K515190J806235k76432k079715j493116O99348J140549
34491a56070p45381r88238K336099M587578J563788k635319j640126K133488J203314
$$ y = [-75462, 663580, 3041128, 6647280, 9439132, 10792201, 10845142, 8023254, 1440945, -5356572, -7892478, -7320186, -8416230, -11437487, -11634321, -7410901, -3292391, -3075182, -4802150, -4626429, -1843124, 1763275, 4336282, 4370084, 1821337, -305372, 1240863, 4950603, 6047720, 3624086, 1943160, 3321313, 4366804, 1813499, -1928324, -2371738, 698968, 3748830, 4567304, 4075373, 4252312, 6277478, 9615776, 11479838, 8717852, 1940388, -3588730, -3096017, 2377352, 7237394, 7288761, 3154853, -1623889, -4274414, -4281294, -2468129, 47061, 1853296, 1576864, -502851, -1995967, -1296619, -156070, -901451, -1889689, 446410, 5033988, 6597776, 3962457, 2322331, 4455819, 5659133]
34482E659133l649133m135903Q22388K601986j658705k934985L927486R222708
34474I854975K715556r190890j1819977k961290N805194O402924K619222Q39433
34466D265147J060122j95544l249816m566131j272773M325029N532511p51470
34458E147075p685343n836252K753556O017555o4977m753276L06303P316880M956607
34449H158128l694918p342381m396350k165311k232224K34953M421452L999970
34441c016681o25759k101041R29507J937074r24270j591387J993867L643317M19079
34432F63706j701124J503352N042395L335276j247366l708434l658058k454641
34424b224894M22383L462212K110330l312734n202203J10046N076875J780943
$$ y = [5659133, 2010000, -2125903, -1303515, 1298471, -360234, -3295219, 632267, 9854975, 12570531, 3379641, -8440336, -11401626, -5596432, 806492, 3425714, 4265147, 5325269, 5129725, 1879909, -2686222, -3958995, 366034, 5898545, 5147075, -2538268, -8374520, -5620964, 396591, 331614, -4421662, -4115359, 3201521, 8158128, 4463210, -2879171, -7275521, -9440832, -11673056, -11438103, -7016651, -3016681, -3642440, -5743481, -4813974, -2876900, -3801170, -5392557, -3398690, 244627, 663706, -1037418, 465934, 5508329, 8843605, 7596239, 3887805, 229747, -2224894, -1802511, 1659701, 3770031, 457297, -4744906, -4634860, 442015, 2222958]
34416B222958n386231o019504Q61710O204058M532463K58030o28835J136570Q70518
34407D051737k565836n228548l494119Q48557K450879l09507k413133N69727M753165
34398a337078K958932l393736m818093K009971Q227398N351463k867063p252621
$$ y = [2222958, -3163273, -9182777, -8321067, -2117009, 2415454, 2673484, 2044649, 3181219, 4051737, 1485901, -3742647, -7236766, -6388209, -3937330, -4246837, -6659970, -6090243, -1337078, 1621854, -1771882, -6589975, -4580004, 3647394, 8998857, 6131794, -1120827]
$$ [...]
##END NTUPLES=NMR SPECTRUM
##END=
