##TITLE=31Pdec_SR60_0
 , 24 sc
 11.05.2021
##JCAMPDX= 6.0         $$ Bruker NMR JCAMP-DX V2.0
##DATA TYPE= NMR SPECTRUM
##DATA CLASS= NTUPLES
##ORIGIN= UXNMR, Bruker Analytische Messtechnik GmbH
##OWNER= root
$$ XWIN-NMR		Version 3.5
$$ Tue May 11 12:02:59 2021 Russian Standard Time (UT+4h)  she@DPX200
##.OBSERVE FREQUENCY= 81.013821
##.OBSERVE NUCLEUS= ^31P
##.ACQUISITION MODE= SIMULTANEOUS
##.ACQUISITION SCHEME= undefined
##.AVERAGES= 24
##.DIGITISER RES= 16
##SPECTROMETER/DATA SYSTEM= spect
##.PULSE SEQUENCE= zgpg30
##.SOLVENT NAME= CDCl3
##.SHIFT REFERENCE= (INTERNAL, CDCl3, 0, 248.564)
##AUDIT TRAIL= $$ (NUMBER, WHEN, WHO, WHERE, WHAT)
$$ ##TITLE= Audit trail, XWIN-NMR		Version 3.5
$$ ##JCAMPDX= 5.01
$$ ##ORIGIN= Bruker BioSpin GmbH
$$ ##OWNER= she
$$ F:/spectra/data/she/nmr/P31/1/pdata/1/auditp.txt
$$ ##AUDIT TRAIL=  $$ (NUMBER, WHEN, WHO, WHERE, WHAT)
(   1,<2021-05-11 12:01:27.26 +0400>,<she>,<DPX200>,
      <created by zg, POWCHK disabled, PULCHK disabled
       configuration hash MD5:
       00 E9 B6 7A A2 85 ED C7 34 08 36 98 17 FE 4E 26
       data hash MD5: 32K
       04 B7 C8 3D 26 DB 96 6D 50 1A CD 05 ED 96 A6 42>)
(   2,<2021-05-11 12:01:29.78 +0400>,<she>,<DPX200>,
      <Start of raw data processing
       efp BC_mod = 2 LB = 1 FT_mod = 6 PKNL = 1 PHC0 = -6196.862 PHC1 = -5.199165 SI = 64K 
       data hash MD5: 64K
       7A 96 BD 28 36 7D 82 37 50 0D 26 46 2D EA F2 24>)
(   3,<2021-05-11 12:02:20.32 +0400>,<she>,<DPX200>,
      <pk PHC0 = -39.48724 PHC1 = 107.2 
       data hash MD5: 64K
       9F 01 5E C7 EB 44 ED 1A FA C5 85 A4 AA 9C 19 72>)
$$ ##END=
$$ 
$$ hash MD5
$$ 99 85 B9 BD CB 2F F9 5A 7B 99 9A 6C 8D 0F DC 65
##$RELAX= 
##$RELAX= 
##$RELAX= 
##$RELAX= 
##$RELAX= 
##$RELAX= 
##$RELAX= 
##$RELAX= 
$$ Bruker specific parameters
$$ --------------------------
##$DU= <F:/spectra>
##$EXPNO= 1
##$NAME= <P31>
##$PROCNO= 1
##$TYPE= <nmr>
##$USER= <she>
##$AMP= (0..31)
100 100 100 100 100 100 100 100 100 100 100 100 100 100 100 100 100 100 
100 100 100 100 100 100 100 100 100 100 100 100 100 100 
##$AQSEQ= 0
##$AQ_mod= 1
##$AUNM= <au_zg>
##$AUTOPOS= <>
##$BF1= 81.014009
##$BF2= 200.13
##$BF3= 200.13
##$BF4= 200.13
##$BF5= 200.13
##$BF6= 200.13
##$BF7= 200.13
##$BF8= 200.13
##$BYTORDA= 1
##$CFDGTYP= 0
##$CFRGTYP= 5
##$CHEMSTR= <none>
##$CNST= (0..31)
1 1 145 1 1 1 1 1 1 1 1 1 1 1 1 1 1 1 1 1 1 1 1 1 1 1 1 1 1 1 1 1 
##$CPDPRG= <waltz16>
##$CPDPRG1= <>
##$CPDPRG2= <waltz16>
##$CPDPRG3= <>
##$CPDPRG4= <mlev>
##$CPDPRG5= <mlev>
##$CPDPRG6= <mlev>
##$CPDPRG7= <mlev>
##$CPDPRG8= <mlev>
##$CPDPRGB= <>
##$CPDPRGT= <>
##$D= (0..31)
0 1 0 0 0 0 0 0 0 0 0 0.03 2e-05 3e-06 0 0 0 0 0 0 0 0 0 0 0 0 0 0 0 0 
0 0 
##$DATE= 1620720086
##$DBL= (0..7)
120 120 120 11 120 120 24 19 
##$DBP= (0..7)
150 150 150 150 150 150 150 150 
##$DBP07= 0
##$DBPNAM0= <>
##$DBPNAM1= <>
##$DBPNAM2= <>
##$DBPNAM3= <>
##$DBPNAM4= <>
##$DBPNAM5= <>
##$DBPNAM6= <>
##$DBPNAM7= <>
##$DBPOAL= (0..7)
0.5 0.5 0.5 0.5 0.5 0.5 0.5 0.5 
##$DBPOFFS= (0..7)
0 0 0 0 0 0 0 0 
$$ [...]
##$SUBNAM2= <"">
##$SUBNAM3= <"">
##$SUBNAM4= <"">
##$SUBNAM5= <"">
##$SUBNAM6= <"">
##$SUBNAM7= <"">
##$SUBNAM8= <"">
##$SUBNAM9= <"">
##$SW= 501.771253377433
##$SWIBOX= (0..15)
0 1 3 0 0 0 0 0 0 0 0 0 0 0 0 0 
##$SW_h= 40650.406504065
##$TD= 32768
##$TD0= 1
##$TE= 0
##$TE2= 300
##$TE3= 300
##$TEG= 300
##$TL= (0..7)
0 120 53 12 22 120 120 120 
##$TP= (0..7)
150 150 150 150 150 150 150 150 
##$TP07= 0
##$TPNAME0= <>
##$TPNAME1= <>
##$TPNAME2= <>
##$TPNAME3= <>
##$TPNAME4= <>
##$TPNAME5= <>
##$TPNAME6= <>
##$TPNAME7= <>
##$TPOAL= (0..7)
0.5 0.5 0.5 0.5 0.5 0.5 0.5 0.5 
##$TPOFFS= (0..7)
0 0 0 0 0 0 0 0 
##$TUNHIN= 0
##$TUNHOUT= 0
##$TUNXOUT= 0
##$USERA1= <user>
##$USERA2= <user>
##$USERA3= <user>
##$USERA4= <user>
##$USERA5= <user>
##$V9= 5
##$VALIST= <valist>
##$VCLIST= <CCCCCCCCCCCCCCC>
##$VD= 0
##$VDLIST= <DDDDDDDDDDDDDDD>
##$VPLIST= <PPPPPPPPPPPPPPP>
##$VTLIST= <TTTTTTTTTTTTTTT>
##$WBST= 1024
##$WBSW= 4
##$XGAIN= (0..3)
0 0 0 0 
##$XL= 0
##$YL= 0
##$YMAX_a= 6120
##$YMIN_a= -7673
##$ZGOPTNS= <>
##$ZL1= 120
##$ZL2= 120
##$ZL3= 120
##$ZL4= 120
##$ABSF1= 0
##$ABSF2= 0
##$ABSG= 0
##$ABSL= 0
##$ALPHA= 0
##$AQORDER= 0
##$ASSFAC= 0
##$ASSFACI= 0
##$ASSFACX= 0
##$ASSWID= 0
##$AUNMP= <proc_1d>
##$AZFE= 0.1
##$AZFW= 0.5
##$BCFW= 0
##$BC_mod= 2
##$BYTORDP= 0
##$COROFFS= 0
##$CY= -3
##$DATMOD= 1
##$DC= 0
##$DFILT= <>
##$DTYPP= 0
##$F1P= 0
##$F2P= 0
##$FCOR= 1
##$FTSIZE= 65536
##$FT_mod= 6
##$GAMMA= 0
##$GB= 0
##$INTBC= 1
##$INTSCL= 5.30512e-09
##$ISEN= 30
##$LB= 1
##$LEV0= 0
##$LPBIN= 0
##$MAXI= 10000
##$MC2= 0
##$MEAN= 0
##$ME_mod= 0
##$MI= 50
##$NCOEF= 0
##$NC_proc= -6
##$NLEV= 6
##$NOISF1= 182.463
##$NOISF2= 159.3651
##$NSP= 0
##$NTH_PI= 0
##$NZP= 0
##$OFFSET= 248.5645
##$PC= 4
##$PHC0= -6236.349
##$PHC1= 102.0008
##$PH_mod= 1
##$PKNL= yes
##$PPARMOD= 0
##$PSCAL= 0
##$PSIGN= 0
##$REVERSE= no
##$SF= 81.014009
##$SI= 65536
##$SIGF1= 159.3651
##$SIGF2= -187.1042
##$SINO= 113.3802
##$SIOLD= 16384
##$SREGLST= <1H.CDCl3>
##$SSB= 0
##$STSI= 65536
##$STSR= 0
##$SW_p= 40650.406504065
##$SYMM= 0
##$S_DEV= 0
##$TDeff= 32768
##$TDoff= 0
##$TI= <>
##$TILT= no
##$TM1= 0
##$TM2= 0
##$TOPLEV= 0
##$USERP1= <user>
##$USERP2= <user>
##$USERP3= <user>
##$USERP4= <user>
##$USERP5= <user>
##$WDW= 1
##$XDIM= 65536
##$YMAX_p= 191202635
##$YMIN_p= -239263786
$$ End of Bruker specific parameters
$$ ---------------------------------
##NTUPLES= NMR SPECTRUM
##VAR_NAME=  FREQUENCY,     SPECTRUM/REAL,   SPECTRUM/IMAG
##SYMBOL=    X,             R,               I
##VAR_TYPE=  INDEPENDENT,   DEPENDENT,       DEPENDENT
##VAR_FORM=  AFFN,          ASDF,            ASDF
##VAR_DIM=   65536,         65536,           65536
##UNITS=     HZ,            ARBITRARY UNITS, ARBITRARY UNITS
##FACTOR=    0.620285442955139, 1,           1
##FIRST=     20137.2065510759, 0,            0
##LAST=      -20513.1999529892, 0,           0
##MIN=       -20513.1999529892, -239263786,  0
##MAX=       20137.2065510759, 191202635,    0
$$ Real data points
##PAGE= N=1
##DATA TABLE= (X++(R..R)), XYDATA
$$ [...]
##PAGE= N=2
##DATA TABLE= (X++(I..I)), XYDATA
13109e922580k33404K40362J225871K243668J834397J88190n25270P02595J989101
$$ -5922580 -6155984 -5915622 -4689751 -2446083 -611686 -423496 -948766 -246171 1742930
13100A742930J198324r08333j647558o6850J761243J367061j041165k808500j994725
$$ 1742930 2941254 2032921 385363 318513 2079756 3446817 2405652 -402848 -2397573
13091b397573L98246J846955J462315O54509O03779N09005p07677k106532j746866
$$ -2397573 -1999327 -152372 1309943 1964452 2568231 3077236 2369559 263027 -1483839
13082a483839L81726K061258J713598K92300k11246P35174J794638J379334o79819
$$ -1483839 -1102113 959145 2672743 2965043 2753797 3488971 5283609 6662943 5983124
13073E983124k801210k998548j024048R69168O51669j604184l011524j826286
$$ 5983124 3181914 183366 -840682 128486 780155 -824029 -3835553 -5661839
13065e661839M62935J139278k38615j433950n67502J522861K572711J885901R47972
$$ -5661839 -5198904 -4059626 -4298241 -5732191 -6299693 -4776832 -2204121 -318220 629752
13056F29752J021945J390821Q16520k93490o67685n53471j368926k899293l008307
$$ 629752 1651697 3042518 3859038 3565548 2897863 2344392 975466 -1923827 -4932134
13047d932134r39726J150553J293745M98077P07791J615029J680506J046918R26285
$$ -4932134 -5871860 -4721307 -3427562 -2929485 -2221694 -606665 1073841 2120759 3047044
13038C047044R28159k82436k009648j993398m6379J361481P12403o73704j080008
$$ 3047044 3975203 3692767 1683119 -310279 -356658 1004823 1717226 1043522 -36486
13029c6486n87658M0264P11424J202460O82521q73543k117938k022380r43036
$$ -36486 -624144 -583880 127544 1330004 2012525 1138982 -978956 -3001336 -3944372
13020c944372M92119K065078L007439K080178m97829k626846k656507r71646J098497
$$ -3944372 -3452253 -1387175 1620264 3700442 3202613 575767 -2080740 -3052386 -1953889
13011a953889K457331K135093p788k012188j414163J215769K554586J114474q76666
$$ -1953889 503442 2638535 2630747 618559 -795604 420165 2974751 4089225 3212559
13002C212559j151480l46080L8009o931k24654j114686k099583j365556P58262
$$ 3212559 2061079 1714999 1753008 1746077 1521423 406737 -1692846 -3058402 -2300140
12993b300140J291324n21197j289982Q85469K615278P37774j938138j129398J648984
$$ -2300140 -1008816 -1530013 -2819995 -1934526 680752 1418526 -519612 -1649010 -26
12984b6J820548l78230q28329Q22229Q17803j436426k074502K55144J991754R75122
$$ -26 1820522 1442292 613963 1436192 2253995 817569 -1256933 -1001789 989965 1965087
12974A965087k37838L62015O26383j241897k880474j700007Q10395J773154J018762
$$ 1965087 1727249 2089264 2715647 1473750 -1406724 -3106731 -2296336 -523182 495580
12965D95580j83846j609934k668257j424359K126799M489313L224447N48107m18527
$$ 495580 311734 -1298200 -3966457 -5390816 -3264017 1225296 4449743 4997850 4579323
12956D579323k93106j181205k392750k018811o85243r8194L30956J774326K646654
$$ 4579323 4286217 3105012 712262 -1306549 -1991792 -2089986 -1759030 15296 2661950
12947B661950Q72068j898572k323676n78365M15179N1605K19522J041089P35854
$$ 2661950 3534018 1635446 -688230 -1266595 -851416 -799811 -580289 460800 1196654
12938A196654m09652j85633J240695J343073m8999l27625Q93594Q40191j080310
$$ 1196654 787002 601369 1842064 3185137 3136138 2808513 3702107 4542298 3461988
12929C461988j598443O07070J792249j021075m675358m154990J58116L353746
$$ 3461988 1863545 2470615 4262864 3241789 -1433569 -5588559 -5430443 -2076697
12921b076697K763747L74266r26326n12821N73258J155790O30079m71208o96856
$$ -2076697 687050 1061316 134990 -377831 195427 1351217 1981296 1510088 813232
12912H13232N77422K081050K155127O56257j289367k442268j828186N47030K612618
$$ 813232 1390654 3471704 5626831 6283088 4993721 2551453 723267 1270297 3882915
12903C882915J732103j562586l384560j604122J040065J082681n77033o59051
$$ 3882915 5615018 4052432 667872 -936250 103815 1186496 609463 -49588
12895d9588J042512J690280K14965j360247j512942j072962r11940m15074Q21610
$$ -49588 992924 2683204 2898169 1537922 24980 -1047982 -1959922 -2374996 -1553386
12886a553386J777239J426911M3809j358400j786754o50991J264874J741752k05116
$$ -1553386 223853 1650764 1694573 336173 -1450581 -2101572 -836698 905054 699938
12877F99938k262720j650794O42226J260857k31629q24907Q45504K393542J738202
$$ 699938 -1562782 -3213576 -2571350 -1310493 -1542122 -2367029 -1521525 872017 2610219
12868B610219j5395j221349k120057k815967j823155J068429L078146K159035
$$ 2610219 2594824 1373475 -746582 -3562549 -5385704 -4317275 -1239129 919906
12860I19906K53628J99018J351065J144292n62557j640931j151415o3973O20515
$$ 919906 1173534 1372552 2723617 3867909 3305352 1664421 513006 449033 1069548
12851A069548L64473j092346k458473j221941K418516M213510J543614j975024
$$ 1069548 1434021 341675 -2116798 -3338739 -920223 3293287 4836901 2861877
12843B861877j628595Q99120M39716k722127l213858Q7690J915161m46018k633093
$$ 2861877 1233282 2132402 2572118 -150009 -3363867 -3276177 -1361016 -1807034 -4440127
12834d440127q54447J841265J415010o8766J205391L162316J072610l633212m544181
$$ -4440127 -5294574 -3453309 -2038299 -2107065 -901674 2260642 3333252 -299960 -4844141
12825d844141l1973M317042M041445J179830n53634j189719k244186k757126j149314
$$ -4844141 -4876114 -559072 3482373 4662203 4108569 2918850 674664 -2082462 -3231776
12816c231776J193192J593625K02157m50209N65312J564237J108597k44019j257052
$$ -3231776 -2038584 -444959 -242802 -693011 -127699 1436538 2545135 2301116 1044064
12807A044064j386776n53900R65589J999218J174339j162923k750797j919740
$$ 1044064 -342712 -896612 68977 2068195 3242534 2079611 -671186 -2590926
12799b590926M00893J883757J421939j42536j330970j223600J95009J865846K087865
$$ -2590926 -2190033 -306276 1115663 973127 -357843 -1581443 -1386434 479412 2567277
12790B567277K63780j824967j747845L60687J714257N81136j379070j554861J32994
$$ 2567277 2831057 1006090 -741755 -381068 1333189 1914325 535255 -1019606 -886612
12781h86612J677742J935496J359772M38929o38652j070162k59876N08380n06466
$$ -886612 791130 2726626 4086398 4525327 3886675 2816513 2556637 3065017 2558551
12772B558551k186541j363437K074851L767287P24552l724602l914522M58974
$$ 2558551 372010 -991427 1083424 4850711 5575263 1850661 -2063861 -1604887
12764a604887M044959L118134k51770k264095k486639k714211k939305j538087
$$ -1604887 2440072 5558206 5306436 3042341 555702 -2158509 -5097814 -6635901
12756f635901J188541K634613J573602j28235n19637k67757p99292j456127p33104
$$ -6635901 -5447360 -2812747 -1239145 -1367380 -1887017 -2154774 -2954066 -4410193 -5143297
12747e143297P07328Q48532k51887n69921K60045L49953q00587j212314k16191
$$ -5143297 -4435969 -3587437 -3839324 -4409245 -4149200 -3799247 -4599834 -5812148 -6028339
12738f028339Q690j301255j193243J961656M455426K543484r34845n57713K779356
$$ -6028339 -6019649 -7320904 -8514147 -6552491 -2097065 446419 -488426 -1046139 1733217
12729A733217L121772q17434l789959k836573j292187j635732r49990K522069
$$ 1733217 4854989 4037555 247596 -2588977 -3881164 -5516896 -6466886 -3944817
12721c944817M282841O10851l935851k624221K816811M627866P19657k990258
$$ -3944817 338024 948875 -2986976 -5611197 -2794386 1833480 2553137 -437121
12713d37121k124533P31004J713782J221008J135492Q52269p27266k151625j448229
$$ -437121 -2561654 -1830650 -116868 1104140 2239632 3091901 2364635 213010 -1235219
12704a235219N85403J597777R42930k35537j124602j698341j778388j092232P5774
$$ -1235219 -649816 947961 1890891 1655354 530752 -1167589 -2945977 -4038209 -3962435
12695c962435J123903J620527J238242J7424j061281q68573J71311L97720o43388
$$ -3962435 -2838532 -1218005 20237 37661 -1023620 -1892193 -1720882 -1323162 -1966550
12686a966550j422293o89133Q54770J911847K249207K044400R17004j068493k467549
$$ -1966550 -3388843 -4077976 -3223206 -1311359 937848 2982248 3899252 2830759 363210
12677C63210k026859n77986N5602l70855m98054K57774Q74442O36528M57523J356257
$$ 363210 -1663649 -2241635 -2186033 -2556888 -3054942 -2797168 -1922726 -1286198 -828675 527582
12667E27582K530087K199779J12827j984241k545748j845183r65347k55815L36729
$$ 527582 3057669 5257448 5370275 3386034 840286 -1004897 -1970244 -2226059 -1889330
12658a889330L78708k58543l92029R55147K324060J230900j842405l154413o05166
$$ -1889330 -1510622 -1769165 -2161194 -1206047 1118013 2348913 506508 -2647905 -3253071
12649c253071L013159L509017P29819j631843j097741Q63974J404431n0132j520168
$$ -3253071 -239912 3269105 3998924 2367081 1269340 2133314 3537745 3487613 1967445
12640A967445j138934O37517J617876N61975j217448j568777l90478M13849k26368
$$ 1967445 828511 1466028 3083904 3645879 2428431 859654 469176 883025 656657
12631F56657j296113j551139r93330j2746J200992J765588N81865j416340j616847
$$ 656657 -639456 -2190595 -3183925 -3196671 -1995679 -230091 351774 -1064566 -2681413
12622b681413M90036K170480J584533N29276R63135J436468n0410j895554j295524
$$ -2681413 -2191377 -20897 1563636 2092912 3056047 4492515 4442105 2546551 1251027
12613A251027P33944Q05304j092976j490175P61998K565151J444442j037186k173506
$$ 1251027 1984971 2790275 1697299 207124 969122 3534273 4978715 3941529 1768023
12604A768023j722282j040645p15305o09634p52473q91913k99513J066829K163526
$$ 1768023 45741 -994904 -1710209 -2319843 -3072316 -3964229 -4263742 -3196913 -1033387
12595a033387K164716J245469p5646j223027j236892L43986K151087K123911K95528
$$ -1033387 1131329 2376798 2301152 1078125 -158767 185219 2336306 4460217 4755745
12586D755745j043712l58924J310689J962802Q63481j215138k962487l412404
$$ 4755745 3712033 3353109 4663798 6626600 7490081 6274943 3312456 -99948
12578i9948k608055j466666n45505M95140J612549J710082L80434r35238j024778
$$ -99948 -2708003 -4174669 -4720174 -4225034 -2612485 -902403 -521969 -1457207 -2481985
12569b481985q11536j407356j769041n64665J102073J519748J468611K333392
$$ -2481985 -3293521 -4700877 -6469918 -7034583 -5932510 -4412762 -2944151 -610759
12561f10759K564059q336l282262k980388M55143K027906L9101j365799O03297
$$ -610759 1953300 1944964 -1337298 -4317686 -3862543 -1834637 -1795536 -3161335 -2558038
12552b558038K613352Q59935k551299k957708j99727J868089J429834L45717K78360
$$ -2558038 55314 915249 -1636050 -4593758 -4793485 -2925396 -1495562 -1149845 -871485
12543h71485O21540N55246M81945O80567L72978r69544k393968k292887k10350
$$ -871485 -249945 305301 787246 1467813 1840791 871247 -1522721 -3815608 -4025958
12534d025958K410867L340905J698170r90405k258453j253009N80427J245839
$$ -4025958 -1615091 1725814 3423984 2433579 175126 -1077883 -497456 748383
12526G48383J48643j532796k013406p31882Q00442P22096n30542p76343L63862
$$ 748383 897026 -635770 -2649176 -3381058 -2580616 -1858520 -2389062 -3165405 -2801543
12517b801543P35009m89189j024236M19557J290297m24541j936719j04821K352207
$$ -2801543 -2066534 -2555723 -3579959 -3160402 -1870105 -2294646 -4231365 -4336186 -1983979
12508a983979O66860l378932l204837J996717N208560K139732k356969k003538
$$ -1983979 -1317119 -4696051 -7900888 -5904171 -695611 1444121 -912848 -2916386
12500b916386J723256K806930o6948k416573r68903K324504L601905J875192m29943
$$ -2916386 -1193130 1613800 1546852 -869721 -1838624 485880 4087785 5962977 5533034
12491E533034q41689N1536m06812k729171l906642j824800R95404R43164j111339
$$ 5533034 4691345 4742881 4336069 1606898 -2299744 -4124544 -3129140 -2185976 -3297315
12482c297315j542186k889P03369J30275O64805K430851K681795Q64069n48928
$$ -3297315 -4839501 -4842390 -4139021 -4008746 -3343941 -913090 1768705 2632774 2083846
12473B083846r48894k274000l980944k799674J152176L560279K839386K125435
$$ 2083846 1134952 -1139048 -5119992 -7919666 -6767490 -3207211 -367825 1757610
12465A757610K569001J090126k553856l367592L16602K583159p14142m529582
$$ 1757610 4326611 5416737 2862881 -504711 -188109 2395050 1680908 -2848674
12457b848674k624469K336885L563454Q75127n76463N03109P89868p42736j583731
$$ -2848674 -5473143 -3136258 427196 1302323 725860 1228969 2018837 1276101 -307630
12448c07630p70035N5619K12860L49307J35111o72117l68064J810845K977343
$$ -307630 -1077665 -1022046 -809186 -459879 -324768 -996885 -1364949 445896 3423239
12439C423239P57995k097412j655738Q92182J591632L06590j00276N62232J30456
$$ 3423239 4181234 2083822 428084 1320266 2911898 3218488 3118212 3680444 3810900
12430C810900j212094j473995r31586r98864m60667K250326M467522K333609k531148
$$ 3810900 2598806 1124811 193225 -805639 -1266306 984020 5451542 7785151 5254003
12421E254003m710958k743690j68207N54273J77497o87062k075954k311503J9315
$$ 5254003 543045 -2200645 -2368852 -1814579 -1637082 -2324144 -4400098 -6711601 -6692286
12412f692286K373694J425486j032969o99892J770272J984737j32938k24452K319714
$$ -6692286 -4318592 -2893106 -3926075 -4625967 -2855695 -870958 -1003896 -1228348 1091366
12403A091366K984198K00192j826131m11383J507507J067246j74141l10118n74505
$$ 1091366 4075564 4275756 2449625 2038242 3545749 4612995 4438854 4128736 3554231
12394C554231j861384k139041k78980J316947N96556j057977j899474k485268
$$ 3554231 1692847 -446194 -725174 591773 1188329 130352 -1769122 -4254390
12386d254390l089616k042429R05558K898195K144539O89901O49288Q16112l43073
$$ -4254390 -7344006 -9386435 -8480877 -5582682 -3438143 -2748242 -2098954 -1282842 -1625915
12377a625915j320148k84171J228007O28750j279759j334203J191865L458947
$$ -1625915 -2946063 -3230234 -2002227 -1373477 -2653236 -3987439 -2795574 663373
12369F63373K865501K20968j548112j177663n64366j756981l258268j703855K442815
$$ 663373 3528874 3749842 2201730 1024067 459701 -1297280 -4555548 -6259403 -3816588
12360c816588M281965J428927k056090j832237K37027J07049j323344o98262R10128
$$ -3816588 465377 1894304 -161786 -1994023 -1756996 -1649947 -2973291 -3671553 -2761425
12351b761425J54903j420814L86892M019610L736322l61128k017494L81182J101595
$$ -2761425 -2606522 -4027336 -3640444 379166 4115488 3754360 1736866 2118048 3219643
12342C219643k460701m899786k242781J268531P56904j413644q55514J178081
$$ 3219643 758942 -4140844 -6383625 -5115094 -4358190 -5771834 -6627348 -5449267
12334e449267J186200J30334Q97419K363061J524121q86740j820933r56738j20822
$$ -5449267 -4263067 -4132733 -3235314 -872253 651868 -234872 -2055805 -3012543 -3133365
12325c133365L68780J013978Q43544o55635j431452m0037J343445L95706j322985
$$ -3133365 -2764585 -1750607 -907063 -1562698 -2994150 -3034187 -1690742 -1295036 -2618021
12316b618021j279300l84436o96322j058458P76163L446393L618363J181062r67266
$$ -2618021 -3897321 -4281757 -4978079 -6036537 -5260374 -1813981 1804382 2985444 2018178
12307B018178j433586j231976r77175l36236L11153L52354M27133J184580J550037
$$ 2018178 584592 -647384 -1624559 -1960795 -1649642 -1297288 -870155 314425 1864462
12298A864462M08508j138921j342283m43320J88633K06685j77958j115596j835780
$$ 1864462 2272970 1134049 -208234 -651554 -462921 -256236 -434194 -1549790 -3385570
12289c385570n41392K431843L706929J491002j294957j267228L94008M08745j133961
$$ -3385570 -3926962 -1495119 2211810 3702812 2407855 1140627 1534635 1943380 809419
12280H09419j458297l46J002044L39785q00278j176204p96547L1542J087631J771019
$$ 809419 -648878 -649224 352820 692605 -107673 -1283877 -2080424 -2048882 -961251 809768
12270H09768J530894N11249p96666j728361j197874J086225L124453K603570M04723
$$ 809768 2340662 2851911 2055245 326884 -870990 215235 3339688 5943258 6347981
12261F347981o76396o00157j687142l402791k429185R70978K155675k30388j572326
$$ 6347981 5671585 5071428 3384286 -18505 -2447690 -1476712 678963 448575 -1123751
12252a123751O42061K082221o99273l590318j726984J973213J831255q69403n59896
$$ -1123751 -481690 1600531 901258 -2689060 -4416044 -2442831 -611576 -1480979 -2040875
12243b040875K676541L382703M1l046155k657195o15738O47914R58315O17551
$$ -2040875 635666 4018369 4018410 972255 -1684940 -2300678 -1652764 -694449 -76898
12234g6898k34218m42210N95154J033468l72867j118480J084147L379483J831530
$$ -76898 -311116 -753326 -158172 875296 502429 -616051 468096 3847579 5679109
12225E679109j639464k195676k94521m00797k450308j809900K002699L805335
$$ 5679109 4039645 1843969 1549448 1148651 -1301657 -3111557 -1108858 2696477
12217B696477J362864j202878p50813K78167p10669j944417j302090j67048j43940
$$ 2696477 4059341 2856463 2105650 2383817 1673148 -271269 -1573359 -1740407 -1884347
12208a884347j3178J070201J119819r48608k538160j318424J012514J714993J043864
$$ -1884347 -1897525 -827324 292495 -656113 -3194273 -4512697 -3500183 -1785190 -741326
12199g41326O36167M12712k30897l51341Q36670J973648J490904m7023j257753
$$ -741326 -105159 307553 76656 -274685 561985 2535633 4026537 3979514 2721761
12190B721761j851564j747546l35689J743250K149289j0565k389107k442285o02009
$$ 2721761 870197 -877349 -1213038 530212 2679501 2668936 279829 -2162456 -2764465
12181b764465J062286J608251J218649J98478o18930j69789R19372O10940j174042
$$ -2764465 -1702179 -93928 1124721 1323199 704269 534480 1453852 2064792 890750
12172H90750j748471K19980K165141J321933j089159j870997n13426P70950P41995
$$ 890750 -857721 -637741 1527400 2849333 1760174 -110823 -624249 146701 888696
12163H88696L57144O15529J210796J366754O35982j020080k877132l471162j995792
$$ 888696 1245840 1861369 3072165 4438919 5074901 4054821 1177689 -2293473 -4289265
12154d289265N37011K288924K442659J505248L17195n47408q38223p59130q00254
$$ -4289265 -3752254 -1463330 979329 2484577 2801772 2254364 1416141 657011 -143243
12145a43243j074803j153071p61876j88630K02507L86217M44658L34588J349m98420
$$ -143243 -1218046 -2371117 -3132993 -3321623 -3119116 -2732899 -2288241 -1953653 -1952304 -2450724
12135b450724q43523l34869J397960L251390L255915J110383j018204j346149
$$ -2450724 -3294247 -3629116 -2231156 1020234 4276149 5386532 4368328 3022179
12127C022179r01937j514363k525352j752423P53562K297678J197605j030400
$$ 3022179 2120242 605879 -1919473 -3671896 -2918334 -620656 576949 -453451
12119d53451j804813n74167Q81009P16807p09405j014690J141672L509812K551306
$$ -453451 -2258264 -2832431 -1951422 -1234615 -1944020 -2958710 -1817038 1692774 4244080
12110D244080j466809m157188k825763J63140J529732J539198J753724J382928
$$ 4244080 2777271 -1379917 -4205680 -4042540 -2512808 -973610 780114 2163042
12102B163042n64295k017628q26841J015438M43315j226428o39202J436527J645553
$$ 2163042 1598747 -418881 -1245722 -230284 213031 -1013397 -1652599 -216072 1429481
12093A429481N33275J488550L701914K748288j290759l100603j072901q6497k650430
$$ 1429481 1962756 3451306 7153220 9901508 8610749 5510146 4437245 4350748 1700318
12084A700318m041717m77123L798654K992603j181333k784460q33230P06015J48917
$$ 1700318 -2341399 -2818522 980132 3972735 2791402 6942 -826288 -120273 28644
12075B8644l95931K6589j09645j065019j031493L46947J123425M24228k37773
$$ 28644 -367287 -340698 -450343 -1515362 -2546855 -2199908 -1076483 -652255 -890028
12066h90028J58567M16461o93287k367927k990051k233491j009923N0197J234810
$$ -890028 -731461 -315000 -1008287 -3376214 -6366265 -8599756 -9609679 -9559482 -8324672
12057h324672K795426L802431K819361K32765j221771J63599K070696J027090
$$ -8324672 -5529246 -1726815 1092546 1325311 103540 267139 2337835 3364925
12049C364925k077377k648427P35957L692911K261723j364398k320326j36243
$$ 3364925 1287548 -1360879 -624922 3067989 5329712 3965314 1644988 1508745
12041A508745J164732p98001l733005m099109j382573J765372K616830J103442
$$ 1508745 2673477 1875476 -1857529 -5956638 -7339211 -5573839 -2957009 -1853567
12033a853567l76051P733J172687R51130l45412m67028O63153M32718j828933
$$ -1853567 -2229618 -2221885 -1049198 -98068 -443480 -910508 -247355 185363 -1643570
12024a643570k954401q10140J811720J166017j705992k648641n34736J780180
$$ -1643570 -4597971 -5408111 -3596391 -2430374 -4136366 -6785007 -7319743 -5539563
12016e539563K163828J509705J118508P88396L45273O37289J783954K189044O47158
$$ -5539563 -3375735 -1866030 -747522 40874 386147 1023436 2807390 4996434 5643592
12007E643592j648480k452321j293919R6361J56656n25685j66308J493435K347421
$$ 5643592 3995112 1542791 248872 345233 501889 -23796 -190104 1303331 3650752
11998C650752N33087k742567m295290k851061m40202M83334n5925l61646K86353
$$ 3650752 4183839 1441272 -2854018 -5705079 -6145281 -5661947 -5717872 -6079518 -5793165
11989e793165R42161O19798k21594o1387J754972L606358L004474p2580k528259
$$ -5793165 -4851004 -4231206 -4452800 -4514187 -2759215 847143 3851617 3779037 1250778
11980A250778k045458k06921K21830l60007L16677J803870J446940o57782j381315
$$ 1250778 -794680 -1001601 -779771 -1139778 -823101 980769 2427709 1769927 388612
11971C88612J6849M62450j371766k388259m90009J351921j1442k318289j521116
$$ 388612 405461 867911 -503855 -2892114 -3382123 -2030202 -2041644 -4359933 -5881049
11962e881049J405674K089505o1237j208646M03672J842361N04503j947458k494192
$$ -5881049 -4475375 -2385870 -2447107 -3655753 -3252081 -1409720 -905217 -2852675 -5346867
11953e346867r81684N82976J273988J784424K462277K475580J092182j002258
$$ -5346867 -6328551 -5745575 -4471587 -2687163 -224886 2250694 3342876 2340618
11945B340618k100516j271475L85654P97602n63204j866598j163579J104237K541510
$$ 2340618 240102 -1031373 -645719 151883 -411321 -2277919 -3441498 -2337261 204249
11936B04249J528960r82741k376869j038778J658886K410877k63891l769705m162419
$$ 204249 1733209 750468 -1626401 -2665179 -1006293 1404584 1140693 -2629012 -6791431
11927f791431q90668K700625L582760K031989J70423n93931k7103J306440K039468
$$ -6791431 -7682099 -4981474 -1398714 633275 803698 209767 182664 1489104 3528572
11918C528572J040084q89116j731346j067888m90659q07831q51844K18176J433718
$$ 3528572 4568656 3679540 1948194 880306 389647 -418184 -1270028 -1051852 381866
11909C81866J681777R59231o63072l106184m658389l000049J002246L320364K080630
$$ 381866 2063643 3022874 2359802 -746382 -5404771 -8404820 -7402574 -4082210 -2001580
11900b001580M0436J0662Q50314L94282n74523l19454L28035k02066p95532M47743
$$ -2001580 -1961144 -1950482 -1100168 -705886 -1280409 -1599863 -1271828 -1473894 -2269426 -1821683
11890a821683K341590K159800R7018j174403p98244m19667q89798j200026o94343
$$ -1821683 519907 2679707 2776725 1602322 804078 384411 -505387 -1705413 -2399756
11881b399756O6212N98184P29921J1348j315159j677912m41586N27242j45705
$$ -2399756 -2333544 -1735360 -1005439 -994091 -2309250 -3987162 -4428748 -3901506 -4047211
11872d047211n03238J500108L584331K052585j787678k774353L22138K838455
$$ -4047211 -4550449 -3050341 533990 2586575 798897 -1975456 -1653318 1185137
11864A185137J346101j556285j869612r4074N47861n74054j278420n63221K42006
$$ 1185137 2531238 974953 -894659 -988733 -440872 -1014926 -2293346 -2856567 -2614561
11855b614561K56788M49784J443136J734303k57199l043253l021691O70630M057753
$$ -2614561 -2357773 -1907989 -464853 1269450 1012251 -2031002 -5052693 -4382063 -324310
11846c24310L032939j001092l052412j649920k79251j035744j277867J021824
$$ -324310 2708629 1707537 -1344875 -2994795 -3274046 -4309790 -5587657 -4565833
11838d565833K879552J212341j302515l33275K516745K025793j854587l680821
$$ -4565833 -1686281 -473940 -1776455 -2109730 407015 2432808 578221 -3102600
11830c102600j236078J452868J210230J41957N48195N90256j473084k976278j007992
$$ -3102600 -4338678 -2885810 -1675580 -1533623 -985428 -395172 -1868256 -4844534 -5852526
11821e852526K148433K161340o87213k268206r78200P07301Q00552K58931L95851
$$ -5852526 -3704093 -1542753 -2229966 -4498172 -5476372 -4769071 -3968519 -3709588 -3313737
11812c313737Q31259R08258Q71806P28800k20759j821788k598697j781981m88553
$$ -3313737 -2482478 -1574220 -702414 26386 -194373 -2016161 -4614858 -6396839 -6885392
11803f885392O4955L32061J283416K460173K590395J631322P25905K50371n58829
$$ -6885392 -6820437 -6488376 -5204960 -2744787 -154392 1476930 2202835 2453206 1894377
11794A894377j706852j758589o2960J599225J137075p74668j520330k73576R86469
$$ 1894377 187525 -1571064 -1634024 -34799 1102276 327608 -1192722 -1466298 -479829
11785d79829N71080o41142r57414l51146J49107M07964R10752J153439J7132k130352
$$ -479829 91251 -549891 -1507305 -1858451 -1709344 -1301380 -390628 762811 779943 -1350409
11775a350409l066820j176343K254376L984377K336654o89926j708941l17489
$$ -1350409 -4417229 -5593572 -3339196 645181 2981835 2291909 582968 265479
11767B65479M07760j333527k860274r24125K742906L377101K43818k304843j460314
$$ 265479 673239 -660288 -3520562 -4444687 -1701781 1675320 1919138 -385705 -1846019
11758a846019N23113R90981R09192J664912J657688m67057k279544j156771J028602
$$ -1846019 -1322906 -331925 577267 2242179 3899867 3432810 1153266 -3505 1025097
11749A025097Q71013r52939j323912k34692l2901l35471J162194L233651J936882
$$ 1025097 1896110 943171 -380741 -615433 -648334 -983805 178389 3412040 5348922
11740E348922k433214m484096j574530K153359K130453k24179p10928R75396J565284
$$ 5348922 2915708 -1568388 -3142918 -989559 1140894 916715 205787 1181183 2746467
11731B746467k16849j904637j103216J356461K736602J694451l94832j216909
$$ 2746467 2529618 624981 -478235 878226 3614828 5309279 4914447 3697538
11723C697538k77118O32133q8900j769118k557179j653970M17754K571988L081191
$$ 3697538 3420420 4052553 3963653 2194535 -362644 -2016614 -1598860 973128 4054319
11714D054319M11628m072155n982280k942408J767121L390793J972384J025132
$$ 4054319 4465947 393792 -5588488 -8530896 -6763775 -3372982 -1400598 -375466
11706c75466J350937N78029j601355k442325r87645M12280M81903R34793K651511
$$ -375466 975471 1553500 -47855 -2490180 -3477825 -3065545 -2583642 -1648849 1002662
11697A002662L663341K557781O04747r42153k418877l386287k257572K59078J034411
$$ 1002662 4666003 7223784 7828531 6886378 4467501 1081214 -1176358 -917280 117131
11688A17131n53726j419880k04993M45020p44041q45375J532619K586860k77236
$$ 117131 -436595 -1856475 -2061468 -1616448 -2360489 -3205864 -1673245 913615 636379
11679F36379k930494q36940K904196K198095k026894l388664l18445K303873J723250
$$ 636379 -2294115 -3131055 -226859 1971236 -55658 -3444322 -3762767 -1458894 264356
11670B64356O28073Q04171M3157k304985k586560R51527M003099K290119j781735
$$ 264356 892429 1696600 1739757 -565228 -3151788 -2200261 1802838 4092957 2311222
11661B311222k838685l91502J422820N68595p01172k80652P76672O05717n51328
$$ 2311222 -527463 -918965 503855 1072450 371278 90626 867298 1473015 921687
11652I21687j063626k85472Q62976J260745Q95948O70550R63391Q77916l99934
$$ 921687 -141939 -427411 435565 1696310 2592258 3262808 4226199 5104115 4704181
11643D704181j918200j945027n82561K84621j327R7053J357912K017096O26563
$$ 4704181 2785981 840954 258393 543014 541687 638740 1996652 4013748 4640311
11634D640311j189803j158589j00521m34548j810195j519722P33090J927520N71715
$$ 4640311 3450508 2291919 2191398 1756850 -53345 -1573067 -839977 1087543 1659258
11625A659258p82284K32031J784708P81491k053336l177774j483384N51099R33306
$$ 1659258 876974 1109005 2893713 3675204 1621868 -1555906 -3039290 -2488191 -1554885
11616a554885N20292O43470Q23528J00648j078015j631104j392371q30098j11041
$$ -1554885 -1034593 -391123 432405 533053 -544962 -2176066 -3568437 -4398535 -4509576
11607d509576O76365J129309J078293Q56145N82776K1585n40830m03202J42682
$$ -4509576 -3833211 -2703902 -1625609 -769464 -186688 -165103 -705933 -1109135 -966453
11598i66453j52216j406439j980060q57768P00794J045623M82452M57072J338444
$$ -966453 -1118669 -2525108 -4505168 -5362936 -4662142 -3616519 -3134067 -2676995 -1338551
11589a338551K245413K366722J499794k731j203088j455765j581385k603041l214152
$$ -1338551 906862 3273584 4773378 4770647 3567559 2111794 530409 -2072632 -5286784
11580e286784j147862K238838K343480j702767m255376q63934M575559N125199
$$ -5286784 -6434646 -4195808 -1852328 -3555095 -7810471 -8674405 -4098846 1026353
11572A026353Q69539j945709o48062J119319O21983j26798N53577N64088j591270
$$ 1026353 1895892 -49817 -697879 421440 1043423 916625 1470202 2034290 443020
11563D43020l417363k564093p55071l88120l43073J382200L423412L095466R08791
$$ 443020 -2974343 -5538436 -6293507 -6681627 -7024700 -5642500 -2219088 876378 1785169
11554A785169m25467k95650l27402j055527j368501q52834k61833Q2203M48246
$$ 1785169 1359702 1064052 736650 -318877 -1687378 -2540212 -2802045 -2719842 -2271596
11545b271596P13277Q05445J348939K346887K350690O73945q71285n07206N21503
$$ -2271596 -1558319 -752874 596065 2942952 5293642 5967587 5096302 4589096 5110599
11536E110599j36612k128130l085982k298223j020563J89624J593153K167439
$$ 5110599 4973987 2845857 -240125 -2538348 -3558911 -3369287 -1776134 391305
11528C91305M92334k177698k750614p02541J151307R70698K21152O84890J750017
$$ 391305 883639 -1294059 -4044673 -4747214 -3595907 -2625209 -2404057 -1719167 30850
11519C0850K057648J617549Q31596n54313k035977j923055n2347J034588l13860
$$ 30850 2088498 3706047 4537643 3983330 1947353 24298 -28049 1006539 692679
11510F92679j926844j016106J213325J311344q42560j753101J20774J949006J025299
$$ 692679 -1234165 -2250271 -1036946 274398 -568162 -2321263 -2200489 -251483 773816
11501G73816j188837j629327k05949O87727Q4243o76731n83216j51397J45921
$$ 773816 -415021 -2044348 -2250297 -1562570 -1478327 -2155058 -2738274 -2889671 -2743750
11492b743750O58805J323844J324563N39072j38816m17386r89215j710962j201175
$$ -2743750 -2084945 -761101 563462 1102534 963718 546332 -442883 -2153845 -3355020
11483c355020P10695J901253P95324j230316j962109j407799p49187K81410K283676
$$ -3355020 -2644325 -743072 52252 -1178064 -3140173 -4547972 -5297159 -5015749 -2732073
11474b732073L477618J445822k473419l898036j279950J972663K483129J120898
$$ -2732073 745545 2191367 -282052 -4180088 -5460038 -3487375 -1004246 116652
11466A16652M28451N09826P3197l72594N59952J943576J284825j516147l458832
$$ 116652 545103 1054929 1128126 755532 1315484 3259060 4543885 3027738 -431094
11457d31094k283142P90342K864120K606166R85797l52039p60328q97931j542025
$$ -431094 -2714236 -1923894 940226 3546392 4532189 4180150 3419822 2521891 979866
11448I79866k145118j276702J047531K572694J552492n96227j088219L05094J171400
$$ 979866 -1165252 -2441954 -1394423 1178271 2730763 2134536 1046317 1351411 2522811
11439B522811K52588r55785j014552p10690j110714j344657k13101J295262J240332
$$ 2522811 2775399 1819614 805062 94372 -1016342 -2360999 -2574100 -1278838 -38506
11430c8506j99330j039116o16256k43473n84499n88827K55684O92873m9060n68217
$$ -38506 -237836 -1276952 -1893208 -2136681 -2721180 -3310007 -3054323 -2361450 -2410510 -2978727
11420b978727M71381J794204J224536r07304k204360j670822n95018N7192R44225
$$ -2978727 -2507346 -713142 511394 -395910 -2600270 -4271092 -4866110 -4808918 -3864693
11411c864693K438298L313633K411602L51222j360504j948925j415551l5411J395769
$$ -3864693 -1426395 1887238 4298840 4650062 3289558 1340633 -74918 -110329 1285440
11402A285440J755226Q39898l05569q24779r43892j034992r29587o99978q66603
$$ 1285440 3040666 3880564 3574995 2750216 1806324 771332 -158255 -858233 -1724836
11393a724836j178016n74221Q08798J129830m81951k175311j773317K51254J754454
$$ -1724836 -2902852 -3477073 -2668275 -1538445 -2020396 -4195707 -5969024 -5717770 -3963316
11384c963316J882805J416688R38349L81108Q184L07755R87737J138267L35900
$$ -3963316 -2080511 -663823 274526 655634 663818 971573 1959310 3097577 3433477
11375C433477r53504j703523r21173J129665K253597M82353k813834m058990k279493
$$ 3433477 2479973 776450 -144723 984942 3238539 3720892 907058 -3151932 -5431425
11366e431425k33878J80800M76594J776807J988401k56312j954709N4937L522547
$$ -5431425 -5665303 -5484503 -5007909 -3231102 -1242701 -1499013 -3453722 -3398785 123762
11357A23762L718913M45374k199723k142604j183639r34526q95292n89668k18262
$$ 123762 3842675 4288049 2088326 -54278 -1237917 -2172443 -3067735 -3657403 -3875665
11348c875665O34051J921809J659799j073465k995101p20070L249198L664939
$$ -3875665 -3241614 -1319805 339994 -733471 -3728572 -4448642 -1199444 2465495
11340B465495P89615k82547J608639K024688r91919l624343l076953j608633j201806
$$ 2465495 3255110 2972563 4581202 6605890 5613971 1989628 -1087325 -2695958 -3897764
11331c897764n5714K439803K921345J36777j470583J212029M137925K417275j671758
$$ -3897764 -3953478 -1513675 1407670 1544447 73864 1285893 5423818 7841093 6169335
11322F169335k631300m35751O48812l57144o59966N02960J034811L89250P6754
$$ 6169335 3538035 3102284 3751096 3393952 2733986 3236946 4271757 4661007 4737761
11313D737761J50663o11736j508703r00652J99167m29178j768683q78295J618978
$$ 4737761 4888424 4276688 2767985 1867333 2066500 1637322 -131361 -1009656 609322
11304F09322J884853r02060l006718j861309M94926J092022n2115j167762j287982
$$ 609322 2494175 1592115 -1414603 -3275912 -2780986 -1688964 -1741079 -2908841 -4196823
11295d196823k67352J557463K715657J625652r68363k506561j998600p83830L27653
$$ -4196823 -4464175 -2906712 -191055 1434597 466234 -2040327 -4038927 -4822757 -4495104
11286d495104J968125L527558K526840j572749n196952m502962j62287L574680
$$ -4495104 -2526979 1000579 3527419 1954670 -3242282 -7745244 -7907531 -4332851
11278d332851L864168J738306l9697j74560L96633K34877o85503j067056j69971
$$ -4332851 -468683 1269623 1229926 1055366 1451999 1686876 1001373 -65683 -235654
11269b35654J106106J416133N39298q14844j968712k330333j442161P5116O60051
$$ -235654 870452 2286585 2825883 2011039 42327 -2288006 -3730167 -3655051 -2995000
11260b995000K3585K0473J816366L489694K558865r5617j369141n03263K26939
$$ -2995000 -2971415 -2950942 -1134576 2355118 4913983 4818366 3449225 2945962 3172901
11251C172901n15770j273375p17106O6285l39069j135914o06844J075611J973549
$$ 3172901 2657131 1383756 666650 732935 393866 -742048 -1348892 -273281 1700268
11242A700268R94259q30198j728636j120539L8976M67600k01223j353527k160856
$$ 1700268 2694527 1864329 135693 -984846 -945870 -478270 -679493 -2033020 -4193876
11233d193876k013037n91116J603318K970964K313097P22903M91869J762019K093454
$$ -4193876 -6206913 -6798029 -5194711 -2223747 89350 812253 1304122 3066141 5159595
11224E159595K06523j864571j805780k89374P23340J156446J830552J799685k66996
$$ 5159595 5366118 3501547 1695767 1406393 2129733 3286179 5116731 6916416 6649420
11215F649420k861134l047291r36926M15644k08853p97970j78733k3552j227553
$$ 6649420 3788286 740995 -195931 219713 10860 -787110 -965843 -989395 -2216948
11206b216948j549227O30031K819365J881254q16348j363111M61774R41395j317431
$$ -2216948 -3766175 -3136144 -316779 1564475 748127 -614984 -153210 788185 -529246
11197e29246k985911j537189N18341j07294j775830n01019L255646M924746K860607
$$ -529246 -3515157 -5052346 -4534005 -4641299 -6417129 -6918148 -3662502 1262244 4122851
11188D122851M21813k8583o00681l018027m515936k248383J418078K281396O89380
$$ 4122851 4544664 4516081 3915400 897373 -3618563 -5866946 -4448868 -2167472 -1478092
11179a478092P7587Q62724O41224n83539m70589P38650M92880q12455j58872J991532
$$ -1478092 -1400505 -537781 103443 -480096 -950685 -212035 280845 -531610 -690482 1301050
11169A301050J561462j920115l773112j875581l1128p69887p86279K333846M483083
$$ 1301050 2862512 942397 -2830715 -4706296 -4737424 -5507311 -6293590 -3959744 523339
11160E23339J600633k676421k240232J780994L132693L98154j684843l83609J525991
$$ 523339 2123972 -552449 -2792681 -1011687 2121006 2519160 834317 450708 1976699
11151A976699J109617p12955j776136j751709j400977j084862o68250M56470K692388
$$ 1976699 3086316 2373361 597225 -1154484 -2555461 -3640323 -4308573 -3852103 -1159715
11142a159715M447879K955636j306463l757460j997216K64144o71581j991124
$$ -1159715 3288164 6243800 4937337 1179877 -817339 -553195 -1224776 -3215900
11134c215900O00148M346850K966456k682704n152573k004909P95321r15909l117052
$$ -3215900 -2615752 1731098 4697554 2014850 -3137723 -5142632 -4347311 -5263220 -8380272
11125h380272j084758K743648L238431O62232q16689k4255O24332J3673m24596
$$ -8380272 -9465030 -6721382 -3482951 -2820719 -3637408 -3661663 -3037331 -3023658 -3448254
11116c448254Q7758O07071O36367P44885Q43960N4947j267212j278830O53886
$$ -3448254 -3360496 -2753425 -2117058 -1372173 -528213 -473266 -1740478 -3019308 -2365422
11107b365422K341156J297557j575217k579425j65024K397052J196486k562112
$$ -2365422 -24266 1273291 -301926 -2881351 -3046375 -649323 547163 -2014949
11099b014949l943539j293399J745935K192897J685959K237955K048100p64163
$$ -2014949 -5958488 -7251887 -5505952 -3313055 -1627096 610859 2658959 1894796
11091A894796l515687k632581L12347J068177m41063p97264N15773Q07162j36763
$$ 1894796 -1620891 -4253472 -3941125 -2872948 -3314011 -4111275 -3595502 -2788340 -2925103
11082b925103L80795K320722K272567m22413k061238p53890O18530k22962j107759
$$ -2925103 -2544308 -223586 2048981 1626568 -434670 -1188560 -570030 -792992 -1900751
11073a900751K92877K121174J449289j033951k417916j686076o3359J134368J170336
$$ -1900751 -1607874 513300 1962589 928638 -1489278 -3175354 -3238713 -2104345 -934009
11064i34009j11854j615395j726261m35466Q87500J859554K862890K731470O0319
$$ -934009 -1045863 -2661258 -4387519 -4822985 -3935485 -2075931 786959 3518429 3578748
11055C578748l035140k627504O69181J625292j570735l987273j557358K483741
$$ 3578748 543608 -2083896 -1414715 210577 -1360158 -5347431 -6904789 -4421048
11047d421048K845692K77723m77632J457973K472988R31070n14106L50846J970552
$$ -4421048 -1575356 -1297633 -1775265 -317292 2155696 3086766 2572660 2923506 4894058
11038D894058J766848j91765j705550j366664J21000J055905N41290q48524j964554
$$ 4894058 6660906 6469141 4763591 3396927 3517927 4573832 5115122 4266598 2302044
11029B302044k129215j066955J155378L126767K371968j387673m390136l018831
$$ 2302044 172829 -894126 261252 3388019 5759987 4372314 -17822 -3036653
11021c036653Q76868K204124n1995j676912j3866K270468J826411p26098k873950
$$ -3036653 -2159785 44339 -7656 -1684568 -1698434 572034 2398445 1672347 -1201603
11012a201603l621219k695772L16017L663951L687114J69390k045728j31632J730393
$$ -1201603 -4822822 -7518594 -7202577 -3538626 148488 317878 -1727850 -1859482 -129089
11003a29089j029190n066322l521595K972110O456227L162048j605499k143276
$$ -129089 -1158279 -6224601 -9746196 -6774086 -317859 2844189 1238690 -904586
10995i04586j48660j70505j748568j179437J283488J559119j150860k486892K75292
$$ -904586 -1053246 -1223751 -2972319 -4151756 -2868268 -1309149 -2460009 -4946901 -4671609
10986d671609L716518L387654L71401j008213r7112q464j401679j208510J366510
$$ -4671609 -955091 2432563 2803964 1795751 1698639 1690175 288496 -920014 446496
10977D46496K512989L6087k459475j279322J168303N27199k021073j874051J113309
$$ 446496 2959485 2995572 536097 -743225 425078 952277 -1068796 -2942847 -1829538
10968a829538K650662J253293k98127q04382k090621l724691k233128K406508
$$ -1829538 821124 2074417 1776290 971908 -1118713 -4843404 -7076532 -4670024
10960d670024M934734K289682j712383k234418J44234K047988K598570K595954
$$ -4670024 264710 2554392 842009 -1392409 -1248175 799813 3398383 5994337
10952E994337J620967m81161j830280j397236j128693k312551k746601p40876
$$ 5994337 7615304 7134143 5303863 3906627 2777934 465383 -2281218 -3022094
10944c022094J159049L01574j085266M80771L406115L251647r9463k431622j746670
$$ -3022094 -1863045 -1561471 -2646737 -2165966 1240149 4491796 4392333 1960711 214041
10935B14041j99500L95523O14075O45906m36624j878655j411709P65613J563166
$$ 214041 14541 410064 1024139 1670045 1233421 -645234 -2056943 -1291330 271836
10926B71836j86716j630977k80115K178313K497247M18714j445565j213922M15973
$$ 271836 85120 -1545857 -1825972 352341 2849588 3268302 1822737 608815 1024788
10917A024788J393251M32171j674860k567110r10989J565305J992477L17107o93754
$$ 1024788 2418039 2850210 1175350 -1391760 -2302749 -737444 1255033 1572140 878386
10908H78386N4663J05343k172176l837523j295616L389901M320794K45744l168075
$$ 878386 933049 1038392 -1133784 -4971307 -6266923 -2877022 1443772 1689516 -1478559
10899a478559j583971J551366O32695l067710l423427O36552L390097J446042
$$ -1478559 -3062530 -1511164 -878469 -3946179 -7369606 -6733054 -3342957 -1896915
10891a896915j350633q52895Q51483K7698j815849q91971J829363K230751K00741
$$ -1896915 -3247548 -4100443 -3248960 -3221262 -5037111 -5929082 -4099719 -1868968 -1668227
10882a668227m41577J270844K112809N70566p86369L18J326502J213289J06043
$$ -1668227 -2109804 -838960 1273849 1844415 1058046 1058364 2384866 3598155 3704198
10873C704198q11781j290489j060736J97300J339860P58219q52731j358085p41386
$$ 3704198 2892417 1601928 541192 738492 2078352 2836571 1983840 625755 -115631
10864a15631q51965j776089j718529m06513P09127J394759K296350K276895J47010
$$ -115631 -967596 -2743685 -4462214 -4868727 -4159600 -2764841 -468491 1808404 1955414
10855A955414j651864J21146L465799L347631j52101j908516m10078K65516j588678
$$ 1955414 303550 424696 3890495 7238126 7086025 5177509 4767431 5032947 3444269
10846C444269k320217k10407J066682n59923j605148J92990J415154l99699j702276
$$ 3444269 1124052 913645 1980327 1420404 -184744 8246 1423400 1023701 -678575
10837f78575M63118K417734J27344l343490k804632N70141J865518L64291r75328
$$ -678575 -215457 2202277 2329621 -1013869 -3818501 -3248360 -1382842 -1018551 -1993879
10828a993879j251582j333679m32928J767569K223852q80584l415460r44829L444093
$$ -1993879 -3245461 -4579140 -5012068 -3244499 -1020647 -1901231 -5316691 -6261520 -2817427
10819b817427L266873j237134l681902j365234J820621K336828J149138K54491
$$ -2817427 449446 -787688 -4469590 -5834824 -4014203 -1677375 -528237 -273746
10811b73746j96799m03985j38217P7287k83948l41116L93433L62931j090522j500145
$$ -273746 -470545 -874530 -1012747 -935460 -1219408 -1560524 -1167091 -804160 -1894682 -3394827
10801c394827N28029J799884l27595k377806r129L821130K784461k320369m466766
$$ -3394827 -2866798 -1066914 -1394509 -3772315 -3781444 39686 2824147 503778 -3962988
10792c962988j499026J260921M73134n51180J032265K446166P42697j808891j627881
$$ -3962988 -5462014 -4201093 -3727959 -4279139 -3246874 -800708 -58011 -1866902 -3494783
10783c494783O96787K305590K474564K073548J079462n75160j524492p04571P40291
$$ -3494783 -2797996 -492406 1982158 4055706 5135168 4560008 3035516 2330945 3071236
10774C071236R34274m59925k347215l274614k037586J068790L431740K614657
$$ 3071236 4005510 3545585 1198370 -2076244 -4113830 -3045040 386700 3001357
10766C001357k10890j655933r52557n18549j353161j283746R02297K742410J612158
$$ 3001357 2790467 1134534 181977 -336572 -1689733 -2973479 -2071182 671228 2283386
10757B283386j338685k941342k094095j45872J529642K447378K325054J203168
$$ 2283386 944701 -1996641 -4090736 -4236608 -2706966 -259588 2065466 3268634
10749C268634p8948p23522j000062j533793j998054j543554l17945N47277O29751
$$ 3268634 3189686 2466164 1466102 -67691 -2065745 -3609299 -3927244 -3379967 -2750216
10740b750216Q01093J484211J414745l88365k072204p55532K713733L647235j37243
$$ -2750216 -1949123 -464912 949833 561468 -1510736 -2266268 447465 4094700 3957457
10731C957457m564443m671817j379920P79600P36271R61600J628618K86938k418720
$$ 3957457 -606986 -5278803 -6658723 -5879123 -5142852 -4181252 -2552634 -2265696 -4684416
10722d684416k389396J202413M016944L196930J008766j36138j208543k621887
$$ -4684416 -7073812 -5871399 -1854455 1342475 2351241 2215103 1006560 -1615327
10714a615327j936680J253268K916428O87532k012413j644505L4934J82153N7254
$$ -1615327 -3552007 -2298739 617689 1305221 -707192 -2351697 -2316763 -2134610 -2077356
10705b077356J473079K186432j20022k783723k224254L2944M47596l56035L17190
$$ -2077356 -604277 1582155 1462133 -1321590 -3545844 -3512900 -3065304 -3421339 -3104149
10696c104149J629825J022167n86450n53663M72504J63521q09495m32351L55059
$$ -3104149 -1474324 -452157 -1038607 -1592270 -1119766 -956245 -1765740 -2198091 -1843032
10687a843032k42179o35782J316565L325953J769942j919236l188107j319940
$$ -1843032 -2085211 -2720993 -1404428 1921525 3691467 1772231 -1415876 -2735816
10679b735816N30384R93404J314526J630732J029906L40166P20590P44229j227092
$$ -2735816 -2205432 -1212028 102498 1733230 2763136 3103302 3823892 4568121 3341029
10670C341029l444483l379018j842827p11273P31479K960950L001760q72319m379932
$$ 3341029 -103454 -3482472 -5325299 -6036572 -5305093 -2344143 657617 -214702 -4594634
10661d594634k845313J261359K333583M57818j34679R87986Q61565l50143l4613
$$ -4594634 -7439947 -6178588 -3845005 -3387187 -3521866 -2533880 -1672315 -2022458 -2057071
10652b057071J035652J34578j401866j47875K556829K355425l96121j244208O23960
$$ -2057071 -1021419 -886841 -2288707 -2436582 120247 2475672 2079551 835343 1459303
10643A459303J702569Q13830K03514L15341n23813j522045l55259J661274R63789
$$ 1459303 3161872 3975702 4179216 4494557 3970744 2448699 2093440 3754714 4718503
10634D718503k077785l675683k677403j072008L63974J825075J573837j311847
$$ 4718503 2640718 -1034965 -3712368 -4784376 -4420402 -2595327 -1021490 -2333337
10626b333337l279576j076042K149741J616362q80976l71673K264155K211097
$$ -2333337 -5612913 -6688955 -4539214 -2922852 -3803828 -4175501 -1911346 299751
10618B99751m08434j313651n8484L53872J71626J583992K561625q7576l415440
$$ 299751 -108683 -1422334 -1480818 -1126946 -955320 628672 3190297 3102721 -312719
10609c12719k313666J152853J029769j850669j704920J317353J805462m17493
$$ -312719 -2626385 -1473532 -443763 -2294432 -3999352 -2681999 -876537 -1294030
10601a294030l65140K076843K008606p52878j427120K66531j31582k610274k605562
$$ -1294030 -1659170 417673 2426279 1673401 246281 512812 381230 -2229044 -4834606
10592d834606n1192P43160j15175J206030L514648K251287j060779j070838J014851
$$ -4834606 -4885798 -4142638 -4257813 -3051783 462865 2714152 1653373 582535 1597386
10583A597386o3964k454325k18231M124398K863045k300934k572649J753909K005875
$$ 1597386 1533422 -920903 -1139134 2985264 5848309 3547375 974726 2728635 4734510
10574D734510k112306k126631J947123O25420o234856o810487J979076P847023
$$ 4734510 2622204 495573 2442696 3068116 -3166740 -9977227 -7998151 -151128
10566a51128L388080k723771j918104J505292J516926P50898J813827O15779l929646
$$ -151128 3236952 513181 -1404923 100369 1617295 2368193 4182020 4797799 868153
10557H68153n113482l70124L199903J467821l1059K197824L169078L74254j053440
$$ 868153 -4245329 -4615453 -1415550 52271 21212 2219036 5388114 5762368 4708928
10548D708928M23144q87417n064856l910981L150947N137701j861389o974921
$$ 4708928 5132072 4244655 -820201 -4731182 -1580235 3557466 1696077 -5278844
10540e278844k942995K623743K432226J125191L043747K948695j894036m312292
$$ -5278844 -8221839 -5598096 -3165870 -2040679 1003068 3951763 2057727 -2254565
10532b254565p34528J656969p24152r48815L291078L446286k804988m936823J158727
$$ -2254565 -2989093 -1332124 -2056276 -3005091 285987 3732273 927285 -4009538 -2850811
10523b850811M658272j11832l237683J104340L409426j811220m743183J44061
$$ -2850811 1807461 1695629 -1542054 -437714 2971712 1160492 -3582691 -3438630
10515c438630K890377j841619l918297J179827K279019m338766n369817L138547
$$ -3438630 -548253 -2389872 -6308169 -5128342 -2849323 -7188089 -12557906 -9419359
10507i419359N655584k867535n317709M203670O930000l486100n804987O678799
$$ -9419359 -3763775 -6631310 -11949019 -7745349 -815349 -4301449 -10106436 -3427637
10499c427637Q522826q785443j4546235L882040J1385945q577168j4387231J5184001
$$ -3427637 5095189 -3690254 -18236489 -14354449 -2968504 -11545672 -25932903 -10748902
10491a0748902K5879514j4690506k7825799O2265303J69421560J33658235l7973575
$$ -10748902 15130612 440106 -27385693 34879610 204301170 337959405 299985830
10484B99985830j57295112j11532009l437704K3644816j8035369k9167431L909320
$$ 299985830 142690718 31158709 27721005 51365821 33330452 4163021 8072341
10477H072341J6523991n909453j5491869J832150R501396m000067q811828M006600
$$ 8072341 24596332 18686879 3195010 5027160 14528556 10528489 1716661 5723261
10469E723261Q117831l964724p867028L773378Q339103k199716p591624M91085
$$ 5723261 13841092 9876368 2009340 5782718 14121821 11922105 4330481 4821566
10461D821566M334938l725489p383023P98934N620827n95041m184270K192001
$$ 4821566 9156504 5431015 -1952008 -1153074 4467753 3872712 -311558 1880443
10453A880443N680139j209266o262557q64629M749853J482978l279816j726691
$$ 1880443 7560582 6351316 88759 -775870 3973983 5456961 2177145 450454
10445D50454P17443j488485l060805R4962K180673m53948j746634J866790M189580
$$ 450454 1167897 -320588 -3381393 -3286431 -1105758 -1559706 -3306340 -1439550 2750030
10436B750030J311228r52933J638857M043452J729589j813277k658835k345818
$$ 2750030 4061258 3108325 4747182 8790634 10520223 8706946 6048111 3702293
10428C702293k196255p07851O43294j701703m978777k690525L244009M106936
$$ 3702293 1506038 798187 1441481 -260222 -5238999 -7929524 -4685515 -578579
10420e78579o17817k111876J943480L419253j070437m034409q48400K576253J365078
$$ -578579 -1196396 -3308272 -1364792 2054461 984024 -3050385 -3898785 -1322532 42546
10411D2546l63899R74134J467987j409932k616105J104161M223180J502402l319069
$$ 42546 -321353 652781 2120768 710836 -1905269 -801108 3422072 4924474 1605405
10402A605405m207863j737830M02016J896430L505558L491761J024466j313937
$$ 1605405 -2602458 -4340288 -3938272 -2041842 1463716 4955477 5979943 4666006
10394D666006j852252k101808k388687o58311K172256J757293k185283m033975
$$ 4666006 2813754 711946 -1676741 -2335052 -162796 1594497 -590786 -4624761
10386d624761q02443L315130L828129J784638n6729j447858k334188j490059J02370
$$ -4624761 -5427204 -2112074 1716055 3500693 3443964 1996106 -338082 -1828141 -1725771
10377a725771m82469k566260j926049J873789M003362K170699j02307k41555m80053
$$ -1725771 -2208240 -4774500 -6700549 -4826760 -823398 1347301 1244994 1003439 523386
10368E23386k180119k343996P30250L578682K964190P00867j36637J77138P6570
$$ 523386 -1656733 -4000729 -3270479 308203 3272393 3973260 3836623 4013761 4090331
10359D090331k48869l21711o74761j009837k73798O01046k42762j505437k34652
$$ 4090331 3841462 3519751 2844990 1835153 1561355 2162401 1919639 414202 179550
10350A79550K366497J953296j515983l125694r73038J117739N33947l50379M99731
$$ 179550 2546047 4499343 2983360 -142334 -1115372 2367 536314 185935 685666
10341F85666J309819Q19619P75802J565554N23351k695137m050497j380383J897213
$$ 685666 1995485 2815104 3590906 5156460 5679811 2984674 -1065823 -2446206 -548993
10332e48993K282098J021435N39143K98288o97457j183164m88610n69681k297989
$$ -548993 1733105 2754540 3293683 3591971 2894514 1711350 1222740 653059 -1644930
10323a644930l106904j165894J301517J659427Q17149P62706Q87477l19673k026185
$$ -1644930 -4751834 -5917728 -4616211 -2956784 -2139635 -1376929 -489452 -809125 -2835310
10314b835310k187041n31887J494086K637370K514259J522821O59661L58136k46505
$$ -2835310 -5022351 -5554238 -4060152 -1422782 1091477 2614298 3273959 3632095 3385590
10305C385590j593514k320596j498853o04387p59764j92361K208478L388162P03596
$$ 3385590 1792076 -528520 -2027373 -2631760 -3391524 -3583885 -1375407 2012755 2716351
10296B716351k476738j371068K023234J874516j633805k698797Q4259J737878
$$ 2716351 239613 -1131455 891779 2766295 1132490 -1566307 -1482048 255830
10288B55830r4939j592380j55625J456432R25917J97370P89762P81708q77403
$$ 255830 160891 -1431489 -1587114 -130682 795235 992605 1782367 2564075 1686672
10279A686672k013769j441817p86525m53268J105082K782049J345461j905773
$$ 1686672 -327097 -1768914 -2555439 -3008707 -1903625 878424 2223885 318112
10271C18112j586544K519160L753290o78854m483701k241996K095853K203329
$$ 318112 -1268432 1250728 5004018 4325164 -158537 -2400533 -304680 1898649
10263A898649q03314j710966N047J001797N68586M95351N97624n49947j995853
$$ 1898649 1095335 -615631 -610584 391213 959799 1455150 2052774 1502827 -493026
10254d93026j783734n45841k03869n68130k70058N19409R56203J360422J910646
$$ -493026 -2276760 -2822601 -3026470 -3594600 -3864658 -3345249 -2389046 -1028624 882022
10245H82022J518001N8400n82774L24812P02205q26588k442056k153621o13121
$$ 882022 2400023 2458423 1875649 2200461 2902666 2076078 -365978 -2519599 -3132720
10236c132720R29405K538776L661099K504283o63168k816278k654294k336471
$$ -3132720 -2203315 335461 3996560 6500843 5837675 3021397 367103 -1969368
10228a969368k978937k466243n334J438340J50838r84944N77100K594390K022952
$$ -1969368 -4948305 -7414548 -7419882 -5981542 -5830704 -6815648 -6238548 -3644158 -1621206
10219a621206l0068q88433o56736o01612k68671O00424M55524p72752l74723K084800
$$ -1621206 -1651274 -2539707 -3196443 -3798055 -4066726 -3466302 -3010778 -3783530 -4158253 -2073453
10209b073453K636530m87183k734517m24508K501053Q03137k918040k427379J495907
$$ -2073453 563077 75894 -2658623 -3083131 -582078 221059 -2696981 -5124360 -3628453
10200c628453K326707j262515l381329o24811L013655L046194Q08018k356R24956
$$ -3628453 -1301746 -2564261 -5945590 -6570401 -3556746 -510552 297466 295110 1220066
10191A220066J320519L66346p94918j200738p94738J40165R96316R15383k38519
$$ 1220066 2540585 2906931 2112013 911275 116537 256702 1253018 2168401 1929882
10182A929882j376687j323977l31625Q2506q54171j664106k31405K768934L796526
$$ 1929882 553195 -770782 -1102407 -1019901 -1874072 -3538178 -3769583 -1000649 2795877
10173B795877J195505j876571j751648K46942J59740j957408k254221K31490K008363
$$ 2795877 3991382 2114811 363163 610105 769845 -1187563 -3441784 -3210294 -1201931
10164a201931J074804l29472l46950k68837q19383j99040J866499K475804N45757
$$ -1201931 -127127 -456599 -803549 -1072386 -1891769 -2090809 -224310 2251494 2797251
10155B797251p70838N04829J593280M4013j731193q13402J049660P27959j039371
$$ 2797251 2026413 2531242 4124522 4168535 2437342 1623940 2673600 3401559 2362188
10146B362188j770868j686245j953765j376436Q65258J884574p73925l905986
$$ 2362188 591320 -1094925 -3048690 -4425126 -3559868 -1675294 -2449219 -6355205
10138f355205k596738K053656M187539J632484j532687j183311J807306L633676
$$ -6355205 -8951943 -6898287 -2710748 -1078264 -2610951 -3794262 -1986956 1646720
10130A646720K271902p13288k115617q21573N74334o51886k767581j839390J508224
$$ 1646720 3918622 3205334 1089717 268144 842478 190592 -2576989 -4416379 -2908155
10121b908155K358027l49475j598564J130831L049771J13735l646975k531617
$$ -2908155 -550128 -899603 -2498167 -1367336 1682435 1796170 -1850805 -4382422
10113d382422J609225K988256J288944O96967J904366J832646k3084j195489j288566
$$ -4382422 -2773197 215059 1504003 2200970 4105336 5937982 5914898 4719409 3430843
10104C430843j781696j793177L82281K524467J076704k264471k507741M36674
$$ 3430843 1649147 -144030 238251 2762718 3839422 1574951 -932790 -496116
10096d96116J601373p45816k628511j168145J488877K380910J344012o25503k530606
$$ -496116 1105257 359441 -2269070 -3437215 -1948338 432572 1776584 1151081 -1379525
10087a379525k358327R53673M305617L536923k49778k184348j286984j087982
$$ -1379525 -3737852 -2784179 1521438 5058361 4808583 2624235 1337251 249269
10079B49269k315548j353379K425951M143607J085060k637939k539299j49620
$$ 249269 -2066279 -3419658 -993707 3149900 4234960 1597021 -942278 -1091898
10071a091898P32639P4203m3557K68245q947P8195J340781J830575m1322j903683
$$ -1091898 -359259 -285056 -328613 -60368 -69315 8880 1349661 3180236 3138914 1235231
10061A235231p09039K074741K458677M2589j789477j432841r88994k035080k843482
$$ 1235231 526192 2600933 5059610 5102199 3312722 1879881 890887 -1144193 -3987675
10052c987675j428134R52765J461804j95300j352200r9400K228278L066950J957738
$$ -3987675 -5415809 -4463044 -3001240 -3196540 -4548740 -4648140 -2419862 647088 2604826
10043B604826M86220m39701j293794j877124r24115J236676J906053k85964k743916
$$ 2604826 3091046 2651345 1357551 -519573 -1443688 -207012 1699041 1413077 -1330839
10034a330839k216093O73224K645991K386130J241793J23281j311975k527045
$$ -1330839 -3546932 -2873708 -227717 2158413 3400206 3523487 2211512 -315533
10026c15533k041493j80J448629R30171o95807j891900j872714m84258J643931
$$ -315533 -2357026 -2357206 -908577 21594 -674213 -2566113 -4438827 -4923085 -3279154
10017c279154K816557J845153l2770m24543R60048J903276P40061j542259k621364
$$ -3279154 -462597 1382556 1349786 925243 1885291 3788567 4528628 2986369 365005
10008C65005j413493Q41527J774460N05657j056360o60239Q66910Q35732p02105
$$ 365005 -1048488 -206961 1567499 2073156 1016796 356557 1223467 2059199 1357094
9999A357094q24907J016017J628018k15541j113572Q72190J966100j053797m371438
$$ 1357094 532187 1548204 3176222 2960681 1847109 2719299 4685399 3631602 -739836
9990g39836k604587K215456L504923J80900k636972k148264p01924j12194P51405
$$ -739836 -3344423 -1128967 2375956 2556856 -80116 -2228380 -2930304 -3042498 -2291093
9981b291093J974999J666404k978n73041K52398M58068J23845J050752K072522
$$ -2291093 -316094 1350310 1347332 774291 1026689 1484757 1608602 2659354 4731876
9972D731876L17784k689136k331484J048562J961678j071618l004515r63719J419738
$$ 4731876 5049660 2360524 29040 1077602 3039280 1967662 -1036853 -2000572 -580834
9963e80834J186801P26763J723495J158853k160268l424552M39072M432680K901270
$$ -580834 605967 1332730 3056225 4215078 2054810 -1369742 -930670 3502010 6403280
9954F403280j420662k161858O80987K085134N79054r71799j340082j776974k086407
$$ 6403280 4982618 2820760 3501747 5586881 6165935 5194136 3854054 2077080 -9327
9945i327j073048J49325r9637m24703R97752J901631p94517m619762m082473R46965
$$ -9327 -1082375 -933050 -1032687 -1457390 -459638 1441993 647476 -3972286 -8054759 -7107794
9935g107794M777465L950128Q63942j027303j093201L1658J744115K418833O65749
$$ -7107794 -2330329 1619799 2483741 1456438 363237 394895 2139010 4557843 5223592
9926E223592j775670j752008M35145J372471m7097j304156q43407j64540m05910
$$ 5223592 3447922 1695914 2131059 3503530 3456433 2152277 1308870 1144330 738420
9917G38420m41287L68848P39066J00832j89660M46655O02059l48075q20944K40357
$$ 738420 297133 665981 1405047 1505879 1316219 1762874 2364933 2016858 1195914 1436271
9907A436271J471420J321156K60719n04874q73123j246959j390103p36569R50632
$$ 1436271 2907691 4228847 4489566 3984692 3111569 1864610 474507 -262062 688570
9898F88570L229533M455661K647326j440948l593304j214561K247035J623068
$$ 688570 3918103 8373764 11021090 9580142 5986838 4772277 7019312 8642380
9890H642380k218931l511949l72666K654992J935023l30551n75521J043146K462619
$$ 8642380 6423449 2911500 2538834 5193826 7128849 6798298 6222777 7265923 9728542
9881I728542K880816J923692m71452j363775K983895R108693O479570q578870
$$ 9728542 12609358 14533050 14061598 12697823 15681718 24790411 31269981 22691111
9873B2691111k3714875k3061473p013548Q168110J0351903L627622j125283m18835
$$ 22691111 -1023764 -24085237 -31098785 -22930675 -12578772 -8951150 -10076433 -10495268
9865a0495268J425874J120651j5530N9921R52644J086367Q291j244457j487203
$$ -10495268 -9069394 -7948743 -7964273 -7904352 -6951708 -5865341 -5857050 -7101507 -8588710
9856h588710q62722o05288r11999j11674K608716M808095L553855q7035k257173
$$ -8588710 -9451432 -10056720 -10968719 -11080393 -8471677 -3663582 -109727 -196762 -2453935
9847b453935j789236j117053j434195q29610J463616K821636J486377k69479P645
$$ -2453935 -4243171 -5360224 -6794419 -7624029 -6160413 -3338777 -1852400 -2121879 -2114234
9838b114234Q67682o4508j559603j003492O88736M69992j537265k216064o22796
$$ -2114234 -1246552 -1311060 -2870663 -3874155 -3185419 -2715427 -4252692 -6468756 -7091552
9829g091552R13452J065997J148961J759900J324017o66789j982661r27768J083207
$$ -7091552 -6178100 -5112103 -3963142 -2203242 -879225 -1546014 -3528675 -4456443 -3373236
9820c373236J862685J339595N55156k96649j081864o71357J317357K854257J560739
$$ -3373236 -1510551 -170956 384200 87551 -994313 -1665670 -348313 2505944 4066683
9811D066683k030200m765638m248723j080582J920194K255945R6510j684397o90107
$$ 4066683 2036483 -2729155 -6977878 -8058460 -6138266 -3882321 -3785811 -5470208 -6160315
9802f160315J844028K562474O45449j266286j329516r37799j457020j347982R12185
$$ -6160315 -4316287 -1753813 -1108364 -2374650 -3704166 -4641965 -6098985 -7446967 -6534782
9793f534782L297704K901594P10390J10183J283317R83862j748525l522898j791797
$$ -6534782 -3237078 -335484 374906 485089 1768406 2752268 1003743 -2519155 -4310952
9784d310952J101770J487066k69396q40093Q00130K194711J473708l3285j88876
$$ -4310952 -3209182 -1722116 -1991512 -2831605 -2031475 163236 1636944 1603659 1414783
9775A414783Q17733J163833J80754j081986j703499j873112j905461j503904m95122
$$ 1414783 2232516 3396349 3577103 2495117 791618 -1081494 -2986955 -4490859 -4985981
9766d985981O01923J293924J671006J757420J123320k32134j423785j788563j591937
$$ -4985981 -4384058 -3090134 -1419128 338292 1461612 1229478 -194307 -1982870 -3574807
9757c574807j005994L44499J857461J625775o70422k128138k66456K917169L404551
$$ -3574807 -4580801 -4236302 -2378841 -753066 -1423488 -3551626 -3818082 -900913 2503638
9748B503638Q68185j305725j331166p61427p04526j47758R67995P66839q73159
$$ 2503638 3371823 2066098 734932 -26495 -731021 -878779 89216 856055 -17104
9739a7104j171929R76871K595650J253015r57127r73744L73554L62111q85691
$$ -17104 -1189033 -212162 2383488 3636503 2679376 1705632 2079186 2441297 1555606
9730A555606j142365r1919P08692Q63440J100009J019895k57188j803170j842886
$$ 1555606 413241 321322 1030014 1893454 2993463 4013358 3756170 1953000 110114
9721A10114n52280L48742K60688n0246k06786l99289n83951r45771j902207k424997
$$ 110114 -442166 -93424 167264 117018 -89768 -489057 -1073008 -2018779 -3920986 -6345983
9711f345983n28213K906248L693343L28467k705375j184654K254700K268399q94027
$$ -6345983 -6874196 -3967948 -274605 53862 -2651513 -3836167 -1581467 686932 -207095
9702b07095k507896j174410J30238M4636K08264P23763k72593k064232j634036
$$ -207095 -2714991 -3889401 -3759163 -3714527 -3506263 -2782500 -3055093 -5119325 -6753361
9693f753361Q19064J797627P43897R60322L058806L145932l59060l473369k937146
$$ -6753361 -5934297 -4136670 -3392773 -2432451 626355 3772287 3413227 -60142 -2997288
9684b997288q57843q4238L66431J790330K072041m46038k934018k101817O19309
$$ -2997288 -3855131 -3939369 -3572938 -1782608 289433 -156605 -3090623 -5192440 -4573131
9675d573131J889352J790716K256226K517352N63171k354055k941505q97970Q80754
$$ -4573131 -2683779 -893063 1363163 3880515 4443686 2089631 -851874 -1749844 -869090
9666h69090P13328k96621p70022n36611J19892O95565M81692j44249L54470J934692
$$ -869090 -155762 -452383 -1222405 -1759016 -1639124 -943559 -461867 -606116 -251646 1683046
9656A683046K027787n91732l049123k194327O24796J717370N19809m50773r2099
$$ 1683046 3710833 3119101 69978 -2124349 -1499553 217817 737626 286853 194754
9647A94754L35508K89309N90789R74607N7760j903336k873285k059823p35371
$$ 194754 530262 819571 1410360 2384967 2442727 539391 -2333894 -4393717 -5129088
9638e129088K82940J610945L166268L283298J072548j782612k675447q91480J715337
$$ -5129088 -4846148 -3235203 -68935 3214363 4286911 2504299 -171148 -1062628 652709
9629F52709K538683P73454j623319k060379n40671M22789n15929j740243j502405
$$ 652709 3191392 3964846 2341527 281148 -259523 163266 -352663 -2092906 -3595311
9620c595311m90029Q600M40726J390258J602989K06498q52274L32411J777748
$$ -3595311 -4085340 -4076740 -3636014 -2245756 -642767 -436269 -1288543 -956132 821616
9611H21616K45070l119433l770057m59580K927137L085510J326543M43181N60429
$$ 821616 1066686 -2052747 -5822804 -6282384 -3355247 -269737 1056806 1499987 2060416
9602B060416J66354q23108j205078n99672K19744N42752L16579j7039Q7229M89088
$$ 2060416 2226770 1403662 198584 -401088 -181344 361408 677987 660948 748177 1237265
9592A237265J73073j142643j784743k92136J650176J010229j680991k310186P04601
$$ 1237265 1410338 267695 -1517048 -1809184 -159008 851221 -829770 -3139956 -2435355
9583b435355L383627J719554k161266k780319Q80637M064680K998859m41461k300705
$$ -2435355 948272 2667826 506560 -2273759 -1393122 2671558 5670417 5228956 2928251
9574B928251k080898k192847l282389l079248j48805L485315M577885K313763
$$ 2928251 847353 -1345494 -4627883 -7707131 -7855936 -4370621 207264 2521027
9566B521027j202219l217820k346421O75573L240630K806796k25847k431762j488176
$$ 2521027 1318808 -1899012 -4245433 -3569860 -329230 2477566 2251719 -180043 -1668219
9557a668219O31976N04865j577803k007798N62313L012895K249107n51637j945119
$$ -1668219 -1036243 -531378 -2109181 -4116979 -3554666 -541771 1707336 1155699 -789420
9548g89420q07809R71934J435012M99365o37903q60177l9956Q48994Q12368R7490
$$ -789420 -1597229 -625295 809717 1309082 671179 -188998 -228954 620040 1432408 1529898
9538A529898k96620j77606p8730J37329R49259J515575L77209j872320k760279
$$ 1529898 1233278 1055672 976942 1114271 2063530 3579105 3956314 2083994 -676285
9529f76285j370095M60803R80947M35715l80066j083541p06674J461227L406954
$$ -676285 -2046380 -1585577 -604630 -168915 -548981 -1632522 -2339196 -877969 2528985
9520B528985K087771j456401k540889J19369K159482O30175j458448j010017l07125
$$ 2528985 4616756 3160355 619466 738835 2898317 3528492 2070044 1060027 752902
9511G52902j876158k574096R20891M466472J908269m052129m805971Q12662M692679
$$ 752902 -1123256 -3697352 -2776461 1690011 3598280 -453849 -5259820 -4447158 245521
9502B45521K249081j318612o83201J347690J20800k468442j967800M63596L48330
$$ 245521 2494602 1175990 492789 1840479 1961279 -507163 -2474963 -2011367 -1663037
9493a663037k016233k038011J289151L592181J915830j155116j739609J60380
$$ -1663037 -3679270 -5717281 -4428130 -835949 1079881 -75235 -1814844 -1654464
9485a654464J651978J167553k17061q77577n84320k42718l65820l77069L01375
$$ -1654464 -2486 1165067 948006 70429 -513891 -756609 -1122429 -1499498 -1198123
9476a198123R60544M18970q98374j074781N20340J906676J047608j245165k298360
$$ -1198123 -237579 181391 -716983 -1791764 -1271424 635252 1682860 437695 -1860665
9467a860665r52116J329651K516554K007744N39542p92464j041589J33963J757938
$$ -1860665 -2812781 -1483130 1033424 3041168 3580710 2788246 1746657 1880620 3638558
9458C638558J826709n99778l580766l808894o58428K407291J884682j086374k126103
$$ 3638558 5465267 4865489 1284723 -2524171 -3182599 -775308 1109374 23000 -2103103
9449b103103M22196L348455L114839K05334k420937l163823k315680n73882R02047
$$ -2103103 -1680907 1667548 4782387 4987721 2566784 -597039 -2912719 -3486601 -2584554
9440b584554M59825j754714k752072l58982L156509L724954R45959j773241k015034
$$ -2584554 -2124729 -3879443 -6631515 -6990497 -3833988 -109034 836925 -936316 -2951350
9431b951350n46093J007052J911628J701704L57830p08760j63018Q13433O8532
$$ -2951350 -3497443 -2490391 -578763 1122941 1480771 772011 608993 1422426 1490958
9422A490958j690406j598934N61056J532194m20624k744904k503747n29966L88579
$$ 1490958 -199448 -1798382 -1237326 294868 -125756 -2870660 -5374407 -5904373 -5515794
9413e515794l07669p58738K45309J844354K540888J910812P94375J91160R4842
$$ -5515794 -5823463 -6582201 -6336892 -4492538 -1951650 -40838 753537 944697 1039539
9404A039539k63196r27363r20209J1881O43669K68546m4085M47132N66115m16936
$$ 1039539 776343 -151020 -1071229 -1059348 -415679 -147133 -191218 255914 822029 405093
9394D05093q13129O39632J968324J021105o45822n02204L25346n56414j678062
$$ 405093 -408036 231596 2199920 3221025 2575203 2072999 2398345 1841931 163869
9385A63869k12562J814107N8078l863680l589387J638054M980421K520775j159291
$$ 163869 -48693 1765414 1823492 -2040188 -5629575 -3991521 988900 3509675 2350384
9376B350384j209553K26982n72131j975297q35610J253599J110805j44732K43922
$$ 2350384 1140831 1367813 795682 -1179615 -2015225 -761626 349179 204447 448369
9367D48369J109613j33553j922853r72585J600735J946071o6009j203106p07461
$$ 448369 1557982 1424429 -498424 -1471009 129726 2075797 2009788 806682 99221
9358I9221p34749j521606j021001O73414J077327j75901o28869P12489J999227
$$ 99221 -635528 -2157134 -3178135 -2504721 -1427394 -1603295 -2232164 -1519675 479552
9349D79552J945509J347828P51726l90767j802729k296754j853727j400506p13179
$$ 479552 2425061 3772889 4524615 4133848 2331119 34365 -1819362 -3219868 -3933047
9340c933047R11187K284645J487329p68787j711341m03616J397099J988412R84591
$$ -3933047 -3021860 -737215 750114 -18673 -1730014 -2133630 -736531 1251881 2236472
9331B236472j451735m063865m189313r57013K281568J990119l29483p44282O39873
$$ 2236472 784737 -3279128 -7468441 -8425454 -6143886 -4153767 -4483250 -5227532 -4587659
9322d587659N40312j041646p43089J652993K390710M87371m03227J262789J952776
$$ -4587659 -4047347 -5088993 -5832082 -4179089 -1788379 -1301008 -1704235 -441446 1511330
9313A511330l67917k047134M0055K721004J637806j476512j840812M63125J084874
$$ 1511330 1143413 -903721 -863666 1857338 3495144 2018632 177820 640945 1725819
9304A725819j081376k217585P0386L006873K838331n4045k144341j465619L51784
$$ 1725819 644443 -1573142 -1502756 1504117 4342448 4288403 2144062 678443 1030227
9295A030227O03098r00422j620148M7783K055809J329505j496493k565429l91481
$$ 1030227 1633325 732903 -887245 -839462 1216347 2545852 1049359 -1516070 -1907551
9286a907551J910334J310950r12084j727825q83835k28661p0789P74344J924832
$$ -1907551 2783 1313733 401649 -1326176 -2210011 -2438672 -2509461 -1735117 189715
9277A89715J338980j323488l419300k381464J025767L406081K479434l58777j696059
$$ 189715 1528695 205207 -3214093 -5595557 -4569790 -1163709 1315725 956948 -739111
9268g39111l89911R48414j05516j757917n53648K642866K960043j243280n197890
$$ -739111 -1129022 -180608 -286124 -2044041 -2597689 45177 3005220 1761940 -3435950
9259c435950m099940L33276K742096J447320m81591l19433J384776K647230K279503
$$ -3435950 -7535890 -7202614 -4460518 -3013198 -3494789 -3814222 -2429446 217784 2497287
9250B497287L94289j473805j256285J002466K398323R57868j190868r25267R63176
$$ 2497287 2891576 1417771 161486 1163952 3562275 4520143 3329275 2404008 3367184
9241C367184J203838m93119j224961j30351J31822j879284l748655k995366n84536
$$ 3367184 4571022 4077903 2852942 2722591 2854413 975129 -2773526 -5768892 -6353428
9232f353428J255350K229757K912405K665053R83696p35296j101887j009265j691740
$$ -6353428 -5098078 -2868321 44084 2709137 3692833 2957537 1855650 846385 -845355
9223h45355j944748j31101K073403J381675j746969l007003m28703K624283K444242
$$ -845355 -2790103 -2921204 -847801 533874 -1213095 -4220098 -4648801 -2024518 419724
9214D19724J61530o71552L78045P36453n10604j423889p17773N21914J173995
$$ 419724 581254 -90298 287747 1024200 513596 -910293 -1628066 -1106152 67843
9205F7843J470390J308861j19318j928831j594686R62372K210703K15969j810322
$$ 67843 1538233 2847094 2727776 798945 -795741 166631 2377334 2593303 782981
9196G82981l19923K696582K702988k23437j903920r70325k72119j134618j265491
$$ 782981 463058 3159640 5862628 5639191 3735271 2764946 2492827 1358209 92718
9187I2718L25505J062533m22885j434399K49373K539433K530755P49968p64090
$$ 92718 418223 1480756 1057871 -376528 -127155 2412278 4943033 5693001 4928911
9178D928911j634760j795808k19537K104165J468660k723734n095909j672954
$$ 4928911 3294151 1498343 1278806 3382971 4851631 2127897 -2968012 -4640966
9170d640966L349075L572616J07411j086885O09497L59548k693043l641734o01570
$$ -4640966 -1291891 2280725 2388136 1301251 1910748 2270296 -422747 -4064481 -4666051
9161d666051J967017J064258k20558R75710K210842Q66440p10242L42323J948260
$$ -4666051 -2699034 -1634776 -1855334 -879624 1331218 2197658 1487416 1829739 3777999
9152C777999Q36236j532309j609191J00948K88818j432521k458603j751681n46681
$$ 3777999 4614235 3081926 1472735 1573683 1862501 429980 -2028623 -3780304 -4326985
9143d326985N93753J840144K101744M70315j152726l53515J585039J330436j166579
$$ -4326985 -3733232 -1893088 208656 678971 -473755 -827270 757769 2088205 921626
9134I21626k663724j775441m48763q8232J98999Q78087Q86197K08606N09685K046043
$$ 921626 -1742098 -3517539 -3966302 -4054534 -3855535 -2977448 -2091251 -1882645 -1372960 673083
9124F73083K684662J267677m87026p68756j66664k8125k76224k44083m0897J43957
$$ 673083 3357745 4625422 4138396 3369640 3202976 3174851 2898627 2654544 2613647 2757604
9114B757604O04858R55607M552k068544l001132j336526J189923J640869m26351
$$ 2757604 3362462 4318069 4322621 2254077 -747055 -2083581 -893658 747211 320860
9105C20860k451087j827842J200870L530733K335655j352212l205682r74153K141321
$$ 320860 -2130227 -3958069 -2757199 773534 3109189 1756977 -1448705 -2422858 -281537
9096b81537J871666p18332r78349J644304K520532m03558k849440j121874J696964
$$ -281537 1590129 871797 -106552 1537752 4058284 3654726 805286 -316588 1380376
9087A380376Q13540k343929k547827P17603K789939J516168n3812L77162P14666
$$ 1380376 2193916 -150013 -2697840 -1980237 809702 2325870 2272058 2649220 3363886
9078C363886r66085k310447m25298K869036L089550o74114m575833m911823j974967
$$ 3363886 2397801 87354 -337944 2531092 5620642 4946528 370695 -4541128 -6516095
9069f516095J178220K127283Q35924q48950r84377N71031J934615J397270l62398
$$ -6516095 -5337875 -3210592 -2374668 -3223618 -4207995 -3636964 -1702349 -305079 -667477
9060f67477j125178j14624J060408Q74604L8464L6579M26651n40734k645773l187387
$$ -667477 -1792655 -1907279 -846871 27733 66197 102776 529427 -11307 -2657080 -5844467
9050e844467q08578J957840J849152n61012j787094m36256J344771J688039J516801
$$ -5844467 -6653045 -4695205 -2846053 -3407065 -5194159 -5630415 -4285644 -2597605 -1080804
9041a080804K059177K254139O04889j909832k836221j399869Q93159K174446J574531
$$ -1080804 978373 3232512 3837401 1927569 -908652 -2308521 -1415362 759084 2333615
9032B333615m56710k106021j584355L73257R31474o12520j158874J412542M048174
$$ 2333615 1876905 -229116 -1813471 -1440214 -508740 -1121260 -2280134 -867592 3180582
9023C180582K574378j599413l158580q36867J022148l14145j887920m43385K102030
$$ 3180582 5754960 4155547 996967 160100 1182248 868103 -1019817 -1463202 638828
9014F38828J964480m56851j637000n53202M63744O0870l56007L50245J022899
$$ 638828 2603308 2146457 509457 -43745 419999 480869 124862 475107 1498006
9005A498006L71671p62412p34593L88889J043820N19163j49044O9627M66878m15776
$$ 1498006 1869677 1107265 372672 761561 1805381 2324544 2175500 2245127 2712005 2296229
8995B296229k271150k816343q04403J881257K491095J001298l19764m93475p23505
$$ 2296229 25079 -2791264 -3595667 -1714410 776685 1777983 1458219 964744 241239
8986B41239j514631j434023J36048J250665K21244j429375r67928J496418L089522
$$ 241239 -1273392 -2707415 -2571367 -1320702 -1099458 -2528833 -3496761 -2000343 1089179
8977A089179K059445k38798j476236j103528m20674o12282j332443j362300n17034
$$ 1089179 3148624 2909826 1433590 330062 -90612 -702894 -2035337 -3397637 -3914671
8968c914671j49955j003850j396248P00472M058887N003082K294580j160588k426494
$$ -3914671 -4064626 -5068476 -6464724 -5764252 -1705365 3297717 5592297 4431709 2005215
8959B005215j897608j168171j84297J310111J815972K87833j492406j526978r06709
$$ 2005215 107607 -1060564 -1244861 65250 1881222 2169055 676649 -850329 -1757038
8950a757038j495694k031376k19633K560636K853985P95205k60661L57812o1854
$$ -1757038 -3252732 -5284108 -5503741 -2943105 -89120 706085 445424 803236 741382
8941G41382j806094j446864J827577L654713J245984j775936j145256J212261
$$ 741382 -1064712 -2511576 -683999 2970714 4216698 2440762 1295506 2507767
8933B507767P88537j877566k511439n25586L86860j087452j867937j42615J565832
$$ 2507767 3296304 1418738 -1092701 -1618287 -1231427 -2318879 -4186816 -4329431 -2763599
8924b763599R15548m41758m2729J282215J244346r896o31332l46479l20830n83791
$$ -2763599 -1848051 -2289809 -2332538 -1050323 194023 184127 -447205 -793684 -1114514 -1698305
8914a698305k14897K67659o52812k421350k336187M41510K930020K073241r30231
$$ -1698305 -1913202 -1645543 -2298355 -4719705 -7055892 -6614382 -3684362 -1611121 -2541352
8905b541352k093061O7084K740674K669676J20063j919568j502675L97116J381750
$$ -2541352 -4634413 -4567329 -1826655 843021 963084 -956484 -2459159 -2062043 -680293
8896f80293J82028k174364l327022j931637P94313K411162K197004J645540J704387
$$ -680293 -498265 -2672629 -5999651 -7931288 -7136975 -4725813 -2528809 -883269 821118
8887H21118J282485k62223j088084L16219J777613K01244k994436l215388J13702
$$ 821118 2103603 1841380 753296 1069515 2847128 3048372 53936 -3161452 -3047750
8878c047750K125016P5734k099027j94066L112174K454482j263116k062982J422728
$$ -3047750 -922734 -847000 -2946027 -3140093 -27919 2426563 1163447 -899535 523193
8869E23193L601974Q05763k917925k107113K039837L985945J825432j269781k446012
$$ 523193 4125167 4930930 2013005 -94108 1945729 5931674 7757106 6487325 4041313
8860D041313k053734j225490p0463R47292O10391q68672j376745L5074J314275
$$ 4041313 1987579 762089 691626 1638918 2249309 1380637 3892 38966 1353241
8851A353241K55797k017302k348578Q9910K612674K576908O08146p31829n25107
$$ 1353241 1609038 -408264 -2756842 -2666932 -54258 2522650 3130796 2398967 1873860
8842A873860k23690r33809j670349j193282k72023m93892j441933j093248Q09912
$$ 1873860 1650170 716361 -953988 -2147270 -2419293 -2913185 -4355118 -5448366 -4638454
8833d638454J934708Q66713n37633l3339J346933R35105j087443j731699O4155
$$ -4638454 -2703746 -1837033 -2374666 -2408005 -1061072 -125967 -1213410 -2945109 -2880954
8824b880954J618196O75183j031065n12753J756464K506163N67384j501412j201257
$$ -2880954 -1262758 -587575 -1618640 -2131393 -374929 2131234 2698618 1197206 -4051
8815d051O23576J460801O10539n09118p16899j66267O47511J500097J871329J080760
$$ -4051 619525 2080326 2690865 2181747 1464848 1298581 1946092 3446189 5317518 6398278
8805F398278m55190j196755n37867L6965r59859k414695j748370J260703L505980
$$ 6398278 5943088 4746333 4208466 4245431 3285572 870877 -877493 383210 3889190
8796C889190K317529j052051l058382k256661m67938K60621Q6880J46528L79261
$$ 3889190 6206719 5154668 2096286 -160375 -628313 -367692 -280812 -134284 244977
8787B44977j06107j199500j707478j022871K21082J267847J978940K153859J179453
$$ 244977 138870 -1060630 -2768108 -3790979 -3569897 -2302050 -323110 1830749 3010202
8778C010202q49729k378277j837855K87170J746806J064014q16912j669581m09440
$$ 3010202 2160473 -217804 -2055659 -1768489 -21683 1042331 225419 -1444162 -1853602
8769a853602J808690K753564J412052p90727j467645k29498O70300m70292j969768
$$ -1853602 -44912 2708652 4120704 3329977 1862332 1632834 2303134 1832842 -136926
8760a36926r96472J841727K811621N52917j648278q40493J061916O45951j216200
$$ -136926 -1133398 708329 3519950 4072867 2424589 1584096 2646012 3291963 2075763
8751B075763r54365J291089J528514j251238k803100l06754K746704J702742k154344
$$ 2075763 1121398 2412487 3941001 2689763 -113337 -420091 2326613 4029355 1875011
8742A875011l665785j297096J535137K038412J086651M61285M39559Q62767J757229
$$ 1875011 -1790774 -3087870 -1552733 485679 1572330 2033615 2473174 3335941 5093170
8733E093170K063863L49825k377609l206005j645365n71520j440122j687562P08298
$$ 5093170 7157033 7506858 5129249 1923244 277879 -293641 -1733763 -3421325 -2713027
8724b713027K972847J398750k378141l166954J53684K951554J628959j544382
$$ -2713027 259820 1658570 -719571 -3886525 -3732841 -781287 847672 -696710
8716f96710k308976m03781R56714J07347j295464j227633J95185J567336K008474
$$ -696710 -3005686 -3409467 -2452753 -2345406 -3640870 -4868503 -4673318 -3105982 -1097508
8707a097508J491561L91951n76126n94967M06250J412660J311768P0585j349808
$$ -1097508 394053 786004 209878 -385089 21161 1433821 2745589 2816174 1466366
8698A466366j990487j482564M268J784960K721434J960078r3633j910902k231240
$$ 1466366 -524121 -2006685 -2002417 -217457 2503977 4464055 4370422 2459520 228280
8689B28280j154070K00622Q09893M70220k21267m82443j85001N7996n516L61006
$$ 228280 -925790 -725168 84725 554945 333678 -148765 -333766 -275770 -281286 79720
8679G9720J410185J470820r95508l913193l029538J872636N190867K643753k285874
$$ 79720 1489905 2960725 1965217 -1947976 -4977514 -3104878 2085989 4729742 2443868
8670B443868k972142Q53717L167393J039300j594015j159052J4076j158345k431699
$$ 2443868 -528274 325443 3492836 4532136 2938121 1779069 1793145 634800 -1796899
8661a796899l07750K932135K182382j875475l247866K1372K866065J312861j689671
$$ -1796899 -2104649 827486 3009868 1134393 -2113473 -2092101 773964 2086825 397154
8652C97154j622651O51767J285578j21130q55214k08271N6616l21077K04855J211659
$$ 397154 -1225497 -573730 711848 590718 -264496 -472767 -416151 -737228 -532373 679286
8642F79286K21596k666986l774589j252251J716957J628451q3338K41759K318755
$$ 679286 900882 -1766104 -5540693 -6792944 -5075987 -3447536 -3530874 -3289115 -970360
8633i70360K429130l24486k333729j069606J140510J015390o25205n60658J559596
$$ -970360 1458770 1134284 -1199445 -2269051 -1128541 -113151 -738356 -1299014 260582
8624B60582K775085J384178q45214j647979j226158j082779j428380j213632p4670
$$ 260582 3035667 4419845 3574631 1926652 700494 -382285 -1810665 -3024297 -3098967
8615c098967J022274J092783M16172K36188J190966K200544J516351p94456k324516
$$ -3098967 -2076693 -983910 -567738 -331550 859416 3059960 4576311 3781855 1457339
8606A457339j280070Q76947J315669j83254j217654p05079l74907j502946k491380
$$ 1457339 177269 1054216 2369885 2186631 968977 263898 -111009 -1613955 -4105335
8597d105335j330656J196578K620568K025463N18515o78886j000194j20627J553004
$$ -4105335 -5435991 -4239413 -1618845 406618 925133 246247 -753947 -874574 678430
8588F78430K395169J093281j482163l063180k383837P003K598261L601149J833347
$$ 678430 3073599 4166880 2684717 -378463 -2762300 -2755297 -157036 3444113 5277460
8579E277460j620667l562627k193591L55381Q94405l04331l17253J571834K762155
$$ 5277460 3656793 94166 -2099425 -1744044 -849639 -1153970 -1471223 100611 2862766
8570B862766J476137q15130k166477k827996l505763l066343k63849L379824M741396
$$ 2862766 4338903 3523773 1357296 -1470700 -4976463 -8042806 -8306655 -4926831 -185435
8561a85435K940607K49160r40591n49129J90346P82609J436328J675526M58647
$$ -185435 2755172 3004332 2063741 1514612 1704958 2487567 3923895 5599421 6058068
8552F058068j982046l605757k865824q08734M55889Q17406J713487K689539J212393
$$ 6058068 4076022 470265 -2395559 -3204293 -2748404 -1930998 -217511 2472028 3684421
8543C684421k799360n040574k139271K891363L970909J13242l315024k034874
$$ 3684421 885061 -4155513 -6294784 -3403421 567488 680730 -2634294 -4669168
8535d669168J741674L003091O54245j800992j331731J008161J896164P7812k089530
$$ -4669168 -2927494 75597 729842 -1071150 -2402881 -1394720 501444 579256 -1510274
8526a510274j731815O46602J837369N69554p19073N7814J212389L31563j295283
$$ -1510274 -3242089 -2595487 -758118 -188564 -907637 -849823 362566 694129 -601154
8517f01154p07719J534174K156915P20858R4384J032540P41275j795232l303132
$$ -601154 -1308873 225301 2382216 3103074 3197458 4229998 4971273 3176041 -127091
8508a27091j321454J731699K299262O28364p51596j000385o70668L11501J592775
$$ -127091 -1448545 283154 2582416 3210780 2459184 1458799 788131 1099632 2692407
8499B692407J396079o49213j801936k92239J192623k98233k499441j208188K374860
$$ 2692407 4088486 3439273 1637337 1345098 2537721 2239488 -259953 -1468141 906719
8490I06719K908208n58989k784847m78802K721139K141251j003664k220409o84237
$$ 906719 3814927 3255938 471091 -7711 2713428 4854679 3851015 1630606 946369
8481I46369M63823l54480j235023o47424R5659m35371r95502K74098K271471J983839
$$ 946369 1410192 1055712 -179311 -826735 -731076 -1166447 -2161949 -1887851 383620 2367459
8471B367459q72883k803006j387096R32220L37538k392077k765812N55736L523603
$$ 2367459 1494576 -1308430 -2695526 -1763306 -1425768 -3817845 -6583657 -6027921 -2504318
8462b504318K768478L69143j66833K96148j291576m012283l802575k14344K377482
$$ -2504318 264160 633303 466470 762618 -528958 -4541241 -8343816 -8558160 -6180678
8453f180678J433511k23493K89932J014341r68219l609746k429845K123364M605929
$$ -6180678 -4747167 -4970660 -4680728 -3666387 -4634606 -8244352 -10674197 -8550833 -3944904
8444c944904K464523l85925Q0248J800966M10102l099510l296183J186295M798205
$$ -3944904 -1480381 -1866306 -1786058 14908 425010 -2674500 -5970683 -4784388 13817
8435A3817K723220k268399l842178o53275K897224L327279J514692m79721k085037
$$ 13817 2737037 468638 -3373540 -4026815 -1129591 2197688 3712380 3232659 1147622
8426A147622k712046j134139J782473K633820J7484k820871k327293L57465J479013
$$ 1147622 -1564424 -2698563 -916090 1717730 1735214 -1085657 -3412950 -3055485 -1576472
8417a576472J88472j103617r67258l05261L62654J804220L609517L539159O91278
$$ -1576472 -1388000 -2491617 -3458875 -3764136 -3401482 -1597262 2012255 5551414 6242692
8408F242692k528361l102479r92541J236239J670009O85059m09326j104199j518140
$$ 6242692 3714331 611852 -380689 855550 2525559 3210618 2801292 1697093 178953
8399A78953j263209K76607K292489K470371k24516l471101l963466j528407R85828
$$ 178953 -1084256 -807649 1484840 3955211 3730695 259594 -3703872 -5232279 -4246451
8390d246451J810956J935256K278905J837029l1034j700225j487201j89255K55818
$$ -4246451 -2435495 -500239 1778666 3615695 3584661 1884436 397235 207980 463798
8381D63798n98457j747851k141602j047343J389243L120184J883214j133863k053977
$$ 463798 -134659 -1882510 -4024112 -5071455 -3682212 -562028 1321186 187323 -1866654
8372a866654m238J393162J95225l58082K101483L737149L38506m753901m797766
$$ -1866654 -1870892 -477730 -282505 -640587 1460896 5198045 5536551 782650 -4015116
8363d015116P0037L264925J882801k23152k8290M91344m86999j119671o7357O93879
$$ -4015116 -3945079 -680154 1202647 979495 951205 1442549 955550 -164121 -231478 462401
8353D62401j25765o26703K52741M45972q25425o86952K081992L548022M38555
$$ 462401 336636 -290067 -37326 408646 -416779 -1103731 978261 4526283 4964838
8344D964838m045089m638724j507384J107044J473333J048613L44115j135657
$$ 4964838 919749 -3718975 -5226359 -4119315 -2645982 -1597369 -1253254 -2388911
8336b388911j908268j55726K178271J513069j265498j550366J533089L220229
$$ -2388911 -4297179 -4452905 -2274634 -761565 -2027063 -3577429 -2044340 1175889
8328A175889M22514l316595l040169N73366K786227J599936m71294q43404j2171
$$ 1175889 1598403 -1718192 -4758361 -4184995 -1398768 201168 -270126 -1113530 -1125701
8319a125701K35086m74682j248893j465190j031688J50237J834790K815461J843608
$$ -1125701 -890615 -1365297 -2614190 -4079380 -5111068 -4960831 -3126041 -310580 1533028
8310A533028n60803k175697j542825L38339J423362R93543k17810j435077k112266
$$ 1533028 972225 -1203472 -2746297 -2407958 -984596 8947 -208863 -1643940 -3756206
8301c756206j484014N03350K177175J877381N39076M76252J581824J309432r10099
$$ -3756206 -5240220 -4736870 -2559695 -682314 -143238 333014 1914838 3224270 2314171
8292B314171k095336k16420K229879J639776j380952k957976j431470Q60996J300879
$$ 2314171 218835 2415 2232294 3872070 2491118 -466858 -1898328 -1037332 263547
8283B63547J24531p59053l81054O78609J326932J020990K73668J43330P66533
$$ 263547 388078 -370975 -752029 -73420 1253512 2274502 2548170 2691500 3458033
8274C458033Q39525n76385k258608k188392n23691M23057m77677j521385q38615
$$ 3458033 4297558 3721173 1462565 -725827 -1249518 -826461 -1304138 -2825523 -3664138
8265c664138O94000Q58805l62444p60433M46116J142595k91203j985192j127025
$$ -3664138 -2970138 -2111333 -2473777 -3234210 -2788094 -1645499 -1936702 -3921894 -5048919
8256e048919J578411K715596J220339l39258j73579J52779q49897j536881o3507
$$ -5048919 -3470508 -754912 465427 126169 -47410 105369 -744528 -2281409 -2344916
8247b344916J929956J677977k64985j175497n74825j43943j55514M05387P63947
$$ -2344916 -414960 1263017 998032 -177465 -752290 -896233 -1051747 -646360 117587
8238A17587o95541k566221j659727J475062K536848L7803k276645j246086J328304
$$ 117587 -577954 -3144175 -4803902 -3328840 -791992 -754189 -3030834 -4276920 -2948616
8229b948616K274245J604172J068885J034946J144262J579532J676563j22930
$$ -2948616 -674371 929801 1998686 3033632 4177894 5757426 7433989 7311059
8221G311059l101949l962303j642647P07567P09426K04082J119909J670136Q2253
$$ 7311059 4209110 246807 -1395840 -688273 21153 225235 1345144 3015280 3097533
8212C097533j444293n04571J002585M46959n50059M69132J375655q94440l701738
$$ 3097533 1653240 1148669 2151254 2598213 2048154 2517286 3892941 2998501 -703237
8203g03237k193138K013879K589872j315019l686925j428184J301313P39184o63165
$$ -703237 -2896375 -882496 1707376 392357 -3294568 -4722752 -3421439 -2682255 -3345420
8194c345420N60938K832728K592254j7909k098504k196751q13296J116130K114758
$$ -3345420 -2784482 48246 2640500 2622591 524087 -1672664 -2485960 -1369830 744928
8185G44928Q71267j143076m95390K869198M276825Q75342l580357l845520n70368
$$ 744928 1616195 473119 -22271 2846927 7123752 7999094 4418737 573217 2849
8176B849J316507m559j569375r07501P03572R35155k26269r25639j9111J527193
$$ 2849 1319356 1314797 -254578 -1162079 -458507 476648 250379 -675260 -694371 832822
8166H32822J611148m26879k379947j602189J064793J879739n46328l057244k514558
$$ 832822 2443970 2017091 -362856 -1965045 -900252 979487 433159 -2624085 -5138643
8157e138643o3054J360067J458884J621204J392986n49865k871211k669311j7308
$$ -5138643 -5201697 -3841630 -2382746 -761542 631444 81579 -2789632 -5458943 -5476251
8148e476251J873957J364920K14102L6812q3551j144002j920217r73428P48725
$$ -5476251 -3602294 -2237374 -2023272 -1986460 -2070011 -3214013 -5134230 -6107658 -5358933
8139e358933J249448M67146J93193J335657K610612K179163m3332k071290j976275
$$ -5358933 -4109485 -3642339 -3449146 -2113489 497123 2676286 2632954 561664 -1414611
8130a414611k50281O74055k90823j201642K6573K107432J976200m82337k010651
$$ -1414611 -1664892 -990837 -1281660 -2483302 -2456729 -349297 1626903 1144566 -866085
8121h66085q07044R72499Q97223q8664J35673J010991M38074j350990k023959
$$ -866085 -1673129 -700630 196593 107929 243602 1254593 1692667 341677 -1682282
8112a682282r11617K64292N53361R15749J609662J196235n90877j476222M652
$$ -1682282 -2593899 -2329607 -1776246 -860497 749165 1945400 1354523 -121699 -117047
8103a17047J809246J294211p35010j465281n35627j29630q74033o98633J452607
$$ -117047 1692199 2986410 2251400 786119 250492 120862 -753171 -1451804 803
8094H03L352927K444727n88431k771598k446570o57641N57446L12085n15555m51500
$$ 803 3353730 5798457 5210026 2438428 -8142 -665783 -108337 203748 -311807 -763307
8084g63307N95301Q76001q13391k837170k490953R7526K008844J814927J317481
$$ -763307 -168006 707995 -105396 -2942566 -5433519 -5335993 -3327149 -1512222 -194741
8075a94741K006987K436837R91769j030642j544691j069484j270893j568499k93369
$$ -194741 1812246 4249083 5240852 4210210 2665519 1596035 325142 -1243357 -1536726
8066a536726J695256J884366L10138m23051M48794P02396p96533j966760r24169
$$ -1536726 158530 2042896 2353034 1929983 2378777 3081173 2284640 317880 -606289
8057f06289J029845J632323R33979M90067O78980O09662j53624j166561j815349
$$ -606289 423556 2055879 2989858 3479925 4158905 4768567 4614943 3448382 1633033
8048A633033j592428l97815Q63029R54976K7277n53613l88196m09402o66153M1771
$$ 1633033 40605 -357210 505819 1460795 1488072 934459 546263 136861 -529292 -487521
8038d87521J398021J021315j569533k968122m99806L171246L361689J26857j925215
$$ -487521 910500 1931815 362282 -2605840 -3105646 65600 3427289 3554146 1628931
8029A628931l80072J968986J645937r04647k646792j867483O03653K722829K768702
$$ 1628931 1248859 3217845 4863782 3959135 1312343 -555140 48513 2771342 5540044
8020E540044O43538j703028k150903r14263J17918M17110J127527K101043J297716
$$ 5540044 6183582 4480554 2329651 1415388 1533306 1950416 3077943 5178986 6476702
8011F476702j633214l703538k506351J96235J110337N1422o59595k95744k73246
$$ 6476702 4843488 1139950 -1366401 -1170166 -59829 -8407 -668002 -963746 -1236992
8002a236992j004374j104822m7541Q82441Q99515Q32875J168666R36938m29347
$$ -1236992 -2241366 -3346188 -3393729 -2511288 -1611773 -778898 389768 1326706 897359
7993H97359j726629j582185k47799J080281J664933J261547j02908j641193k128466
$$ 897359 -829270 -2411455 -2659254 -1578973 85960 1347507 1244599 -396594 -2525060
7984b525060j349239k77646M69170J067647J212546K51317r22837l32233J739953
$$ -2525060 -3874299 -4151945 -3682775 -2615128 -1402582 -1151265 -2074102 -2406335 -666382
7975f66382K265149n6541k186085r08520K325786L475135J489346j026557j869243
$$ -666382 1598767 1542226 -643859 -1552379 773407 4248542 5737888 4711331 2842088
7966B842088j173269J67937J328863J109982p91004k320013j370833P59473R18942
$$ 2842088 1668819 1836756 3165619 4275601 3484597 1164584 -206249 553224 1472166
7957A472166j079226k181757q99466O63346M05883q41349j129897k9193J531422
$$ 1472166 392940 -1788817 -2688283 -2024937 -1619054 -2460403 -3590300 -3619493 -2088071
7948b088071K386935J656756j94320r64018N24318J864503K14789k626943k311587
$$ -2088071 298864 1955620 1761300 797282 1321600 3186103 3400892 773949 -1537638
7939a537638R17885K056486o12777k587669o53575J832123Q06459j874835k235430
$$ -1537638 -619753 1436733 823956 -1763713 -2417288 -585165 221294 -1653541 -3888971
7930c888971q76590o98944q66615J174077L581346K234555j702941k552590R49947
$$ -3888971 -4765561 -5464505 -6331120 -5157043 -1575697 658858 -1044083 -3596673 -2646726
7921b646726L387317J147973k074677j343113J971719K623801p18291l947635
$$ -2646726 740591 1888564 -186113 -1529226 442493 3066294 2348003 -1599632
7913a599632l288078K86845K893866K321067p6707j500255r34445K07476M33629
$$ -1599632 -4887710 -4600865 -1706999 614068 537361 -962894 -1897339 -1689863 -1256234
7904a256234R9598L89894J342820J919495J413188r2717j939322k779124j391933
$$ -1256234 -1156636 -766742 576078 2495573 3908761 3816044 1876722 -902402 -2294335
7895b294335J299200K397332P14758j170742n34441J241081P45854j961856l136151
$$ -2294335 -995135 1402197 2116955 946213 411772 1652853 2398707 436851 -2699300
7886b699300q46392K222074K594955N51479p05732N59543K447716J819372j602872
$$ -2699300 -3545692 -1323618 1271337 1822816 1117084 1676627 4124343 5943715 4340843
7877D340843m336249l217699K50103J654461j90130j726737l48205J674973J301955
$$ 4340843 4594 -3213105 -2963002 -1308541 -1498671 -3225408 -3573613 -1898640 -596685
7868e96685k85158k11764R01989L34086j625774k156408p36585N76011J269530
$$ -596685 -881843 -1093607 -191618 142468 -1483306 -3639714 -4376299 -3800288 -2530758
7859b530758K623016L836516K246524j797872m242683k864387j66714O82829j67348
$$ -2530758 92258 3928774 6175298 4377426 134743 -2729644 -2896358 -2213529 -2380877
7850b380877q93222j012427j028501r49929n64029J64119J567795L596876M528136
$$ -2380877 -3274099 -4286526 -5315027 -6264956 -6828985 -6664866 -5097071 -1500195 3027941
7841C027941K469132j487729l771997k540164M69739K510431K361024L38772k087577
$$ 3027941 5497073 4009344 237347 -2302817 -1833078 677353 3038377 3377149 1289572
7832A289572k739052r08127J142092R99228l23997k74725Q17386O49560n33768
$$ 1289572 -1449480 -2357607 -1215515 -216287 -540284 -815009 2377 651937 118169
7823A18169l96054Q69632P66881o27663o75608N88352K79382j468801r57579K129925
$$ 118169 -277885 591747 1358628 730965 55357 643709 923091 -545710 -1503289 626636
7813F26636K952353o16615l763841k061426J696033K268066k49844j946294j438080
$$ 626636 3578989 2962374 -801467 -2862893 -1166860 1101206 851362 -1094932 -2533012
7804b533012k83830P00709J511955J175968n55658j506630k62101R76060n0736
$$ -2533012 -2816842 -2116133 -604178 571790 16132 -1490498 -1752599 -776539 -827275
$$ [...]
##END NTUPLES=NMR SPECTRUM
##END=
