##TITLE=31Pdec_SR5_rmo
 CDCl3, 24 sc
 27.12.2019
##JCAMPDX= 6.0         $$ Bruker NMR JCAMP-DX V2.0
##DATA TYPE= NMR SPECTRUM
##DATA CLASS= NTUPLES
##ORIGIN= UXNMR, Bruker Analytische Messtechnik GmbH
##OWNER= root
$$ XWIN-NMR		Version 3.5
$$ Fri Dec 27 13:54:34 2019 Russian Standard Time (UT+4h)  she@DPX200
##.OBSERVE FREQUENCY= 81.013821
##.OBSERVE NUCLEUS= ^31P
##.ACQUISITION MODE= SIMULTANEOUS
##.ACQUISITION SCHEME= undefined
##.AVERAGES= 24
##.DIGITISER RES= 17
##SPECTROMETER/DATA SYSTEM= spect
##.PULSE SEQUENCE= zgpg30
##.SOLVENT NAME= DMSO
##.SHIFT REFERENCE= (INTERNAL, DMSO, 0, 182.463)
##AUDIT TRAIL= $$ (NUMBER, WHEN, WHO, WHERE, WHAT)
$$ ##TITLE= Audit trail, XWIN-NMR		Version 3.5
$$ ##JCAMPDX= 5.01
$$ ##ORIGIN= Bruker BioSpin GmbH
$$ ##OWNER= she
$$ F:/spectra/data/she/nmr/P31/1/pdata/1/auditp.txt
$$ ##AUDIT TRAIL=  $$ (NUMBER, WHEN, WHO, WHERE, WHAT)
(   1,<2019-12-27 13:52:44.65 +0400>,<she>,<DPX200>,
      <created by zg, POWCHK disabled, PULCHK disabled
       configuration hash MD5:
       00 E9 B6 7A A2 85 ED C7 34 08 36 98 17 FE 4E 26
       data hash MD5: 32K
       A6 80 61 AC 36 29 20 66 23 4D 12 59 6B 48 8F 72>)
(   2,<2019-12-27 13:52:57.87 +0400>,<she>,<DPX200>,
      <Start of raw data processing
       efp BC_mod = 2 LB = 1 FT_mod = 6 PKNL = 1 PHC0 = -1660.409 PHC1 = 69.80119 SI = 64K 
       data hash MD5: 64K
       5A 28 B1 AC 6F C2 8E DD D6 79 DF D6 40 6C 8E 47>)
(   3,<2019-12-27 13:53:11.98 +0400>,<she>,<DPX200>,
      <pk PHC0 = -0.638351 PHC1 = 0 
       data hash MD5: 64K
       26 97 98 08 25 55 41 D5 2D 25 5C 28 CF 7E D4 24>)
(   4,<2019-12-27 13:53:40.57 +0400>,<she>,<DPX200>,
      <pk PHC0 = 6.350129 PHC1 = -22.60001 
       data hash MD5: 64K
       49 B0 EC 64 20 B5 7C 56 EA 7C A9 E4 63 BF 97 77>)
(   5,<2019-12-27 13:54:06.07 +0400>,<she>,<DPX200>,
      <pk PHC0 = 6.120867 PHC1 = -12.6 
       data hash MD5: 64K
       83 77 7A 9B 8B BE EB FA 7B 48 0C 6D 38 D4 A6 4C>)
$$ ##END=
$$ 
$$ hash MD5
$$ D9 A2 54 45 F1 C2 D3 03 71 64 C5 12 17 49 A5 DC
##$RELAX= 
##$RELAX= 
##$RELAX= 
##$RELAX= 
##$RELAX= 
##$RELAX= 
##$RELAX= 
##$RELAX= 
$$ Bruker specific parameters
$$ --------------------------
##$DU= <F:/spectra>
##$EXPNO= 1
##$NAME= <P31>
##$PROCNO= 1
##$TYPE= <nmr>
##$USER= <she>
##$AMP= (0..31)
100 100 100 100 100 100 100 100 100 100 100 100 100 100 100 100 100 100 
100 100 100 100 100 100 100 100 100 100 100 100 100 100 
##$AQSEQ= 0
##$AQ_mod= 1
##$AUNM= <au_zg>
##$AUTOPOS= <>
##$BF1= 81.014009
##$BF2= 200.13
##$BF3= 200.13
##$BF4= 200.13
##$BF5= 200.13
##$BF6= 200.13
##$BF7= 200.13
##$BF8= 200.13
##$BYTORDA= 1
##$CFDGTYP= 0
##$CFRGTYP= 5
##$CHEMSTR= <none>
##$CNST= (0..31)
1 1 145 1 1 1 1 1 1 1 1 1 1 1 1 1 1 1 1 1 1 1 1 1 1 1 1 1 1 1 1 1 
##$CPDPRG= <waltz16>
##$CPDPRG1= <>
##$CPDPRG2= <waltz16>
##$CPDPRG3= <>
##$CPDPRG4= <mlev>
##$CPDPRG5= <mlev>
##$CPDPRG6= <mlev>
##$CPDPRG7= <mlev>
##$CPDPRG8= <mlev>
##$CPDPRGB= <>
##$CPDPRGT= <>
##$D= (0..31)
$$ [...]
##$SUBNAM2= <"">
##$SUBNAM3= <"">
##$SUBNAM4= <"">
##$SUBNAM5= <"">
##$SUBNAM6= <"">
##$SUBNAM7= <"">
##$SUBNAM8= <"">
##$SUBNAM9= <"">
##$SW= 369.568048894756
##$SWIBOX= (0..15)
0 1 3 0 0 0 0 0 0 0 0 0 0 0 0 0 
##$SW_h= 29940.119760479
##$TD= 32768
##$TD0= 1
##$TE= 0
##$TE2= 300
##$TE3= 300
##$TEG= 300
##$TL= (0..7)
0 120 53 12 22 120 120 120 
##$TP= (0..7)
150 150 150 150 150 150 150 150 
##$TP07= 0
##$TPNAME0= <>
##$TPNAME1= <>
##$TPNAME2= <>
##$TPNAME3= <>
##$TPNAME4= <>
##$TPNAME5= <>
##$TPNAME6= <>
##$TPNAME7= <>
##$TPOAL= (0..7)
0.5 0.5 0.5 0.5 0.5 0.5 0.5 0.5 
##$TPOFFS= (0..7)
0 0 0 0 0 0 0 0 
##$TUNHIN= 0
##$TUNHOUT= 0
##$TUNXOUT= 0
##$USERA1= <user>
##$USERA2= <user>
##$USERA3= <user>
##$USERA4= <user>
##$USERA5= <user>
##$V9= 5
##$VALIST= <valist>
##$VCLIST= <CCCCCCCCCCCCCCC>
##$VD= 0
##$VDLIST= <DDDDDDDDDDDDDDD>
##$VPLIST= <PPPPPPPPPPPPPPP>
##$VTLIST= <TTTTTTTTTTTTTTT>
##$WBST= 1024
##$WBSW= 4
##$XGAIN= (0..3)
0 0 0 0 
##$XL= 0
##$YL= 0
##$YMAX_a= 19417
##$YMIN_a= -16495
##$ZGOPTNS= <>
##$ZL1= 120
##$ZL2= 120
##$ZL3= 120
##$ZL4= 120
##$ABSF1= 0
##$ABSF2= 0
##$ABSG= 0
##$ABSL= 0
##$ALPHA= 0
##$AQORDER= 0
##$ASSFAC= 0
##$ASSFACI= 0
##$ASSFACX= 0
##$ASSWID= 0
##$AUNMP= <proc_1d>
##$AZFE= 0.1
##$AZFW= 0.5
##$BCFW= 0
##$BC_mod= 2
##$BYTORDP= 0
##$COROFFS= 0
##$CY= -3
##$DATMOD= 1
##$DC= 0
##$DFILT= <>
##$DTYPP= 0
##$F1P= 0
##$F2P= 0
##$FCOR= 1
##$FTSIZE= 65536
##$FT_mod= 6
##$GAMMA= 0
##$GB= 0
##$INTBC= 1
##$INTSCL= 5.30512e-09
##$ISEN= 30
##$LB= 1
##$LEV0= 0
##$LPBIN= 0
##$MAXI= 10000
##$MC2= 0
##$MEAN= 0
##$ME_mod= 0
##$MI= 50
##$NCOEF= 0
##$NC_proc= -7
##$NLEV= 6
##$NOISF1= 182.463
##$NOISF2= 159.3651
##$NSP= 0
##$NTH_PI= 0
##$NZP= 0
##$OFFSET= 182.463
##$PC= 4
##$PHC0= -1648.576
##$PHC1= 34.60118
##$PH_mod= 1
##$PKNL= yes
##$PPARMOD= 0
##$PSCAL= 0
##$PSIGN= 0
##$REVERSE= no
##$SF= 81.0140089999434
##$SI= 65536
##$SIGF1= 159.3651
##$SIGF2= -187.1042
##$SINO= 113.3802
##$SIOLD= 16384
##$SREGLST= <1H.CDCl3>
##$SSB= 0
##$STSI= 65536
##$STSR= 0
##$SW_p= 29940.119760479
##$SYMM= 0
##$S_DEV= 0
##$TDeff= 32768
##$TDoff= 0
##$TI= <>
##$TILT= no
##$TM1= 0
##$TM2= 0
##$TOPLEV= 0
##$USERP1= <user>
##$USERP2= <user>
##$USERP3= <user>
##$USERP4= <user>
##$USERP5= <user>
##$WDW= 1
##$XDIM= 65536
##$YMAX_p= 471300913
##$YMIN_p= -16743953
$$ End of Bruker specific parameters
$$ ---------------------------------
##NTUPLES= NMR SPECTRUM
##VAR_NAME=  FREQUENCY,     SPECTRUM/REAL,   SPECTRUM/IMAG
##SYMBOL=    X,             R,               I
##VAR_TYPE=  INDEPENDENT,   DEPENDENT,       DEPENDENT
##VAR_FORM=  AFFN,          ASDF,            ASDF
##VAR_DIM=   65536,         65536,           65536
##UNITS=     HZ,            ARBITRARY UNITS, ARBITRARY UNITS
##FACTOR=    0.456856943014862, 1,           1
##FIRST=     14782.0589164792, 0,            0
##LAST=      -15158.0608439998, 0,           0
##MIN=       -15158.0608439998, -16743953,   0
##MAX=       14782.0589164792, 471300913,    0
$$ Real data points
##PAGE= N=1
##DATA TABLE= (X++(R..R)), XYDATA
$$ [...]
47551 848288 2424790 3467887 3040529 1174467 -1865041 -5129026 -6371268 -3986314
47543 -3986314 302151 2707993 1890371 278177 110451 358215 -757257 -2117087 -1194213
47534 -1194213 1664284 3234357 1891011 -292784 -725640 326185 732272 -485267
47526 -485267 -2434757 -3758109 -3518871 -1383417 1774090 3862052 3495160 1799661 1089087
47517 1089087 1856118 2496258 2078664 1559802 1547727 877258 -937402 -1556438 1225765
47508 1225765 5222074 5859794 2815961 1151984 4080185 7778443 6595011 1314164
47500 1314164 -1877248 -32506 3302747 4273232 3966217 5167838 7116763 6840990 3908551
47491 3908551 441692 -2677099 -6213486 -9404187 -9832750 -7246625 -4471783 -3229026
47483 -3229026 -1877634 709865 1737565 -1781062 -7334542 -8781640 -4047823 2370110
47475 2370110 5481367 5266880 4369008 3297251 1055019 -1190164 -847292 1859066 3772010
47466 3772010 3489747 2995284 3470553 2779453 -618370 -4083511 -4403873 -3058735 -3946439
47457 -3946439 -6716663 -6763080 -2449689 1854225 1917933 -509523 -832473 1619424 3134483
47448 3134483 967044 -3678456 -7753979 -9117527 -7159738 -2879325 1073684 2039447
47440 2039447 -128783 -2961815 -4049907 -3038840 -1049709 627561 936886 -588016
47432 -588016 -3031894 -4389716 -3526942 -1576413 -719256 -1672369 -2979447 -2925564 -1582289
47423 -1582289 -353528 282948 1553448 4360748 7354305 8164898 6183503 2941356
47415 2941356 52045 -1821575 -2294407 -1543285 -1353983 -3512825 -6448952 -5995951 -872038
47406 -872038 4932399 6941570 5067696 1794282 -1701962 -4619848 -4421161 -8134
47398 -8134 4518650 4070256 -13906 -1632919 969386 3154198 2078036 1247928 4037390
47389 4037390 7575589 7253500 3814822 1482581 1442337 1670523 1605860 2439643 3479452
47380 3479452 2503060 -216174 -1895244 -1513146 -823743 -830469 -545337 169681 -170911
47371 -170911 -1514409 -1328578 1672452 5315691 6976787 6579803 5144132 2734810 -99995
47362 -99995 -943153 1735923 5554836 6525457 3913888 527438 -1600327 -3354279 -5814925
47353 -5814925 -7613971 -6639559 -3405747 -985625 -1382671 -3038618 -2608436 1233877 6416463
47344 6416463 9651829 9211139 5641079 924043 -2600653 -3648739 -3197549 -3292700 -3810794
47335 -3810794 -1912076 3661985 9286035 10118038 6321010 2566207 1470122 1067650
47327 1067650 -351063 -726958 1989642 5360448 5048880 612169 -4146745 -6025732
47319 -6025732 -5245120 -3734846 -2717589 -2128608 -1040720 1335177 4303689 6033791
47311 6033791 6001293 5714127 5890968 4905990 2042354 154176 1949924 5165855 5283617
47302 5283617 2310310 648507 2184051 3950580 3590359 2654745 2603253 1796492 -668107
47293 -668107 -1816816 855741 4663118 5251129 2814333 827763 204044 -905237 -2372929
47284 -2372929 -1860170 459773 1329550 -380121 -1732087 -548747 1197154 767595 -1428223
47275 -1428223 -3474573 -5009825 -6190558 -5662048 -2385327 1777444 3967240 4040090 3965029
47266 3965029 4141245 2905702 -288549 -3593703 -5283680 -5818061 -6676900 -8354580 -10120208
47257 -10120208 -10924552 -10210363 -8543479 -7495666 -8076665 -9352537 -9622901 -8884864 -8830808
47248 -8830808 -10178384 -11381231 -10655374 -8211637 -5685860 -4191067 -3747736 -3902973 -3909555
47239 -3909555 -2733338 33897 3258990 5019419 4332737 1610005 -2349428 -6721785
47231 -6721785 -9810442 -9319386 -4944877 -85426 1009931 -1703650 -3643272 -1444096
47223 -1444096 2366874 2622207 -1570286 -5941301 -7008803 -5806823 -4682367 -3438753
47215 -3438753 -887314 2004116 3279143 2991311 2478615 1798107 620892 622102 3599220
47206 3599220 7533013 8124827 4774344 1637620 1699977 3062696 2769061 1323808 1038545
47197 1038545 2071260 2659367 1966423 637035 -381998 7677 2648720 6208600 7309437
47188 7309437 4597296 1167797 725457 2785257 4147567 3652546 2407271 426493
47180 426493 -3153912 -6554670 -5904695 -628919 4541059 4730152 445636 -3449538 -3167754
47171 -3167754 618882 4027833 3905123 929852 -1182580 41724 3089316 4822273
47163 4822273 4323493 2783806 931031 -976899 -1576130 251830 2915623 3942665
47155 3942665 3813031 4660830 5647978 3899342 315018 -468644 2598131 4607005 2178374
47146 2178374 -1327422 -1610585 -295413 -1492720 -4659695 -5890933 -4309006 -2301444
47138 -2301444 -759022 1181060 2573738 1600637 -314031 150393 2839713 4483306
47130 4483306 4397094 5154047 7125258 7229204 4314982 1206370 -139655 -1020648 -1793003
47121 -1793003 -113200 4014000 6144034 3926615 1566397 3489693 7170038 7314019
47113 7314019 4438245 3529849 5629640 6718928 4955933 3387671 4215084 5184771 3791157
47104 3791157 1243887 -248352 -1176291 -2937393 -4408609 -3236743 299275 3081243
47096 3081243 2736152 -45766 -2808616 -3984348 -4094662 -4707835 -6349463 -7736536 -7416655
47087 -7416655 -5607629 -3611828 -2040016 -841122 -480864 -1357741 -2301500 -1589353 431308
47078 431308 1596436 932686 -600044 -2487393 -5219396 -7814816 -7645778 -4260218 -860542
47069 -860542 -28922 -272287 860534 2434607 1970374 35180 -583992 384254 453258
47060 453258 -944392 -1059940 1778051 5253125 6167721 4348647 1764541 -619391 -3261880
47051 -3261880 -6252075 -8692004 -9543093 -8271095 -5256318 -2201066 -1221965 -2642758
47043 -2642758 -4414165 -4516525 -3129211 -1571841 -95361 1905871 4071246 5079562
47035 5079562 4626578 4144477 4945093 6298203 6072790 3273192 -563540 -2945454 -3208102
47026 -3208102 -2841187 -2778629 -1803244 948490 3159738 1628589 -2728418 -5038095 -2529929
47017 -2529929 2135603 4923591 5227976 4673114 3650821 1948916 997922 2098015 3426845
47008 3426845 2254219 -388238 -824624 1491401 3051163 1835134 122204 343708
47000 343708 1498604 1749497 1690516 2484440 3010756 1646128 -722500 -2137905 -2738798
46991 -2738798 -3791112 -4580382 -3245730 -390857 1006854 -299040 -2110932 -1897644
46983 -1897644 108311 1724349 1542548 137449 -794420 -171357 1291988 1906043 1314701
46974 1314701 1091141 2308902 3746651 3790050 2844295 2072981 990333 -1236338 -2960340
46965 -2960340 -1622574 1828736 3204587 629520 -2856309 -3546762 -1663740 -143997
46957 -143997 -660753 -2568091 -4488353 -5328969 -4649574 -3347197 -3135938 -4222784 -4455004
46948 -4455004 -2014225 1870699 4177976 3460212 849444 -1718027 -3149335 -3465815
46940 -3465815 -3454853 -3898481 -4541072 -4155759 -2095346 703179 2631327 2742114 1013637
46931 1013637 -1699636 -3586288 -2939731 -47664 2884259 4214631 4197056 3461284 1848649
46922 1848649 -215900 -825194 1271499 4523582 6024519 4614970 1687730 -370702
46914 -370702 22160 2255641 3458565 1494246 -1394784 -303648 5791181 11973421
46906 11973421 13777361 12566741 11638939 10193941 5769632 548919 -438236 2885652
46898 2885652 5047842 3067400 183308 -6818 1413088 1808612 1276012 1024992 618768
46889 618768 -372550 -675930 -73668 -1279417 -5905579 -10742174 -11549424 -9008860 -7342823
46880 -7342823 -8017320 -8448282 -6712070 -4150916 -2764977 -2579055 -2279411 -702017 2534236
46871 2534236 6337122 8331111 7481782 6096567 7148923 10031287 11404848 10044345
46863 10044345 7953516 6385540 4054433 649011 -912387 1849475 6993429 10379940
46855 10379940 10655664 9530961 7954560 5007796 892830 -1823365 -1510186 -223351
46847 -223351 -1155013 -4221839 -6339688 -5914637 -4663917 -4157499 -2966489 589384 4491465
46838 4491465 4966037 2114419 345226 2310145 5360295 5719916 3611554 1842576
46830 1842576 1278021 601595 -602726 -1446521 -1869935 -2623264 -3564804 -4348328 -6027647
46821 -6027647 -9052808 -10372572 -6370012 1043278 5336204 3646231 326258 221151
46813 221151 2163502 2287330 723025 804950 3239432 5353759 5801687 6156273 7352944
46804 7352944 7976018 7296780 7187586 9132892 11221836 10253148 5989200 1456204 -804216
46795 -804216 -1194808 -1368309 -1392439 34514 2737648 4059077 1888148 -2091019 -3821693
46786 -3821693 -1479166 2925418 6607221 8659738 9071052 7489257 4582865 2699249
46778 2699249 3095338 3967522 3339170 2383585 3229583 4742062 3816634 445646 -1895652
46769 -1895652 -1215672 661280 1224920 -84218 -2809233 -5997703 -7189107 -4301403
46761 -4301403 423123 2032830 -38792 -570603 3347503 7193902 5850462 1636768
46753 1636768 296541 1845414 1660301 -820766 -1412928 610426 609793 -3202918 -6099930
46744 -6099930 -4732994 -2974721 -5194691 -8346893 -6720827 -1698513 -206783 -4207290
46736 -4207290 -7842238 -5940309 -285443 4389136 6488912 7104138 6586957 4735009
46728 4735009 2874352 2906332 4453454 4804054 2162435 -1720137 -2638573 1854181 9071279
46719 9071279 13029808 10717178 5421116 2208601 1602091 693452 -602264 1011557
46711 1011557 5795782 8794252 6684505 2974640 2838061 5723786 7243276 6256987
46703 6256987 5329245 5164334 3632711 648949 -689358 773564 1962539 391471
46695 391471 -1984963 -2027987 125459 2268797 3562150 4196061 3473413 1056944 -1097012
46686 -1097012 -831868 913077 1432407 285347 -578558 -327671 -53139 116873 1860499
46677 1860499 5636032 9103204 9952927 8732987 7557762 7199202 6666683 4854401 1725731
46668 1725731 -1396997 -2230841 606035 5411151 8346486 7545084 5101628 3965069
46660 3965069 4213342 3814858 1797732 -1100279 -3830606 -5071173 -2962799 2511324
46652 2511324 7407978 7185704 2518537 -1215264 -994681 462272 -172243 -1695454 -1174597
46643 -1174597 711075 905601 -698780 -1039595 1182384 3907166 5546354 7050579
46635 7050579 8939462 9285708 6696343 3188579 1822338 2711731 3457318 2830892 2151785
46626 2151785 3108184 5507057 7362118 6760770 3873106 1143707 702912 1684717 1539992
46617 1539992 56741 -82847 2530821 5751068 7175941 7269160 7158281 5884467 2892546
46608 2892546 1152411 3803077 8699169 10479312 7901330 5000997 4616150 5161021
46600 5161021 5067424 5878453 8286925 8932909 4898615 -1041242 -3559478 -1787959 570537
46591 570537 1463759 2851235 6146848 8719680 7117635 2215847 -1087288 560523
46583 560523 4966125 6900241 4370974 982111 1031168 3724839 4809731 3313754 2858239
46574 2858239 5190910 6510930 3255912 -1645762 -2562896 636513 2876636 1749913
46566 1749913 249765 991470 2298480 1905999 782038 698703 835756 -408061 -2261412
46557 -2261412 -2967572 -2826241 -3248362 -3934737 -3579537 -2558117 -2335139 -2677705 -1997098
46548 -1997098 -309717 604776 94516 -737281 -1543395 -3183939 -4900979 -3991218 -163094
46539 -163094 2270801 -606019 -6523210 -9347037 -6755565 -2481355 -559256 -587687 -265144
46530 -265144 240258 -599764 -1712345 -117311 4159877 6845228 4500883 -1025992 -4879532
46521 -4879532 -4747602 -2459090 -744271 -299398 -251115 -40337 -4061 -595559 -1569852
46512 -1569852 -1977202 -1157938 39911 -351859 -2909921 -5072007 -3386098 2063356 6898366
46503 6898366 7258793 4349696 2490296 3117244 3142979 123926 -3333135 -2816327 1334055
46494 1334055 3897301 1687506 -2348815 -3603032 -2013260 -1273205 -3260396 -6133070
46486 -6133070 -7517348 -6941234 -5111712 -3194559 -2905341 -4822025 -6365457 -4186311
46478 -4186311 860700 4029594 2934889 425845 -213920 388254 428067 777278 2824202
46469 2824202 4969391 5054463 4490914 5923940 7978901 6726104 2130483 -1221697 -446724
46460 -446724 2228858 3259381 1776430 -1102228 -3884905 -4569949 -1830877 2407799
46452 2407799 4214529 2582612 424192 -348895 -1416595 -3986663 -5587739 -3825879
46444 -3825879 -819993 -615525 -3708355 -7107533 -8688957 -8597318 -7091598 -3910667 216145
46435 216145 3634106 5454883 5670604 4070753 880619 -1935882 -2143131 -205514 897696
46426 897696 -841163 -4423306 -7383825 -8057010 -6167361 -2581288 894886 2390388
46418 2390388 1444214 -557847 -1692463 -1216128 -16486 588834 479436 760244 1821452
46409 1821452 2198788 580883 -1678542 -1980085 -384832 78736 -2429300 -6193186 -8535816
46400 -8535816 -8643240 -6807921 -3293474 409829 1506366 -728801 -3311559 -3499421
46392 -3499421 -2592165 -3268424 -4858688 -4474078 -1863383 215708 302844 -120163 359585
46383 359585 989431 488817 -1010702 -2259032 -2044292 -160251 1853392 1793596 -127824
46374 -127824 -727729 1669921 3889233 1985600 -2612383 -4739404 -2786824 -380456
46366 -380456 -423746 -1440909 -1102052 102516 518514 -94712 -1424095 -3680833 -6120077
46357 -6120077 -6656081 -4679177 -2334290 -1446996 -1205803 -542001 -582051 -2492452 -4712348
46348 -4712348 -4896522 -3392765 -2310438 -2075324 -1541054 -1069057 -2677765 -6540504 -9506536
46339 -9506536 -8343734 -3371988 2147179 5618387 7090104 7743795 7585950 5685709
46331 5685709 2368997 -388849 -1467029 -2105935 -3632235 -5002368 -4587967 -3394730
46323 -3394730 -3846276 -5671894 -5948393 -3696879 -1576399 -1895940 -3437159 -3706668 -2290824
46314 -2290824 -457362 811227 968094 -193880 -1378662 -283943 3171629 5796981
46306 5796981 5013000 2236195 570750 555923 182387 -1980577 -5505028 -8896614 -10020476
46297 -10020476 -7069221 -1098454 3558274 3524742 130190 -2902760 -4092110 -4092019 -2517533
46288 -2517533 1471569 5775063 6432161 3047733 -114633 -10143 1059288 -542123
46280 -542123 -3883969 -4763471 -2056538 644023 498774 -442902 1132962 3903856 3204364
46271 3204364 -1653314 -5167697 -3004652 1411782 1492190 -2897256 -5212162 -1893134
46263 -1893134 2700154 3128356 410362 -780276 499875 1109070 -560742 -2679112
46255 -2679112 -3475439 -3263290 -2644589 -1476977 -243752 -180234 -1249975 -1735128 -611283
46246 -611283 960209 1184306 -142264 -1342104 -397644 3008572 6621683 7511988 5412432
46237 5412432 3060905 2438638 2311441 1006401 -180350 1106614 4039714 5212801
46229 5212801 3332964 649012 -624063 -910917 -1554917 -2453590 -2523164 -1357445 454499
46220 454499 1996685 2529247 1812395 254861 -1294290 -1742051 -115207 3138975 5348509
46211 5348509 4029156 564172 -838110 1167474 3113980 2007649 -596924 -2301291
46203 -2301291 -4213439 -7667807 -9542771 -6191970 -524735 672636 -3583240 -7073427
46195 -7073427 -5561269 -2031431 -851761 -1523728 -1171280 366297 1117226 289500 -1571903
46186 -1571903 -3888596 -5609085 -5405927 -3927288 -3699077 -5194681 -5447785 -2523268 1127137
46177 1127137 2239133 1446190 1462025 2234505 1354786 -1308461 -2755266 -1192669 1409515
46168 1409515 2433756 2563063 4630425 8858057 11360006 8764488 3071333 -591498
46160 -591498 -885025 -1570571 -4645481 -6149263 -2345454 3055932 3060208 -2620063 -7296611
46151 -7296611 -6948308 -4561863 -3832564 -3999114 -3234731 -2527775 -3160389 -3821997 -3150030
46142 -3150030 -2374864 -2903241 -3695495 -3183040 -1560811 332346 1849817 1258053 -2888813
46133 -2888813 -7834432 -8306785 -4100241 -1450208 -4141342 -7951487 -7557804 -4360158
46125 -4360158 -2776448 -2770623 -1598586 -63470 -1182230 -4283547 -5782390 -4852146 -3688164
46116 -3688164 -3106504 -2290956 -1972958 -3465223 -5169379 -4138632 -600854 2716157 4878520
46107 4878520 6687408 7511076 6283020 4772418 5694738 8127063 8640670 6320134 3059778
46098 3059778 72493 -1963893 -866690 4184373 8952357 8457506 4207373 1923727
46090 1923727 2823708 2933204 780490 -561197 142298 -19166 -2491981 -4813973 -5436352
46081 -5436352 -5862987 -6354462 -4655457 -865755 1499366 1349072 1835079 4090767 4464440
46072 4464440 1019427 -2172744 -918378 3061975 5690719 6475311 7085758 7073044 4936351
46063 4936351 1485059 -932120 -1045936 1244231 5153460 8010398 6924855 2983040
46055 2983040 631381 1538919 2748103 2268840 2032396 3296720 3903068 2792229 2600342
46046 2600342 4772771 6695030 6732797 7165963 8762012 8001682 3941859 1983303 5396406
46037 5396406 8773807 6473154 2368335 3468061 8100469 9080479 5633059 3119356
46029 3119356 2700601 537244 -3272336 -4152684 -2097773 -2467839 -6136136 -7219228 -3227307
46020 -3227307 302785 -1190426 -4494220 -4763398 -2454167 54543 3299167 7448230
46012 7448230 8683029 3965995 -3584418 -8418807 -9207513 -8196514 -6617781 -4605044
46004 -4605044 -3534046 -4591797 -6298043 -6441560 -5185673 -3834417 -2272240 -177234
45996 -177234 1055383 349649 -729565 -405152 150659 -1119116 -3462936 -4714724 -5011839
45987 -5011839 -5719484 -5584769 -1898417 4234784 7420924 4248284 -2354098 -6650715
45979 -6650715 -6432982 -4212985 -3094555 -3411110 -3735695 -3680197 -4183372 -5238926 -5081453
45970 -5081453 -2625286 582285 2437489 3389884 5379529 8070986 8615565 5618478
45962 5618478 1244906 -1382409 -1227280 755103 3022798 4119418 3538662 2479532
45954 2479532 2319764 2294553 621944 -2127842 -3398199 -2698622 -2281918 -2973032 -2643576
45945 -2643576 -335864 1452558 799851 -456619 -298587 -358778 -2722696 -5272879 -4326127
45936 -4326127 -580491 1690770 898981 -264777 384974 1719260 1990444 1278431 166960
45927 166960 -1518872 -3445722 -4290666 -3755514 -3367167 -4041284 -4320151 -2460758 742988
45918 742988 2755037 2576395 1982744 3271633 6502275 9491301 10385382 9584026 8657869
45909 8657869 7993919 6733520 4889017 3769155 3693910 3163958 1669946 1545951 4728603
45900 4728603 8738367 8778888 3952959 -1282172 -2819533 -1846036 -2418276 -5588133 -8193097
45891 -8193097 -7266696 -3638034 -400342 819122 764128 466211 2978 -432309 157560
45882 157560 2199281 4546126 5893480 6238489 5865512 4214611 1524559 352780 2901090
45873 2901090 7401136 9862329 9145980 7399022 5682644 2969711 164329 783331
45865 783331 5394375 9058368 7462069 2882248 692109 2062716 3725217 3482974
45857 3482974 2177171 782808 -968345 -2930115 -4190146 -4638557 -4972000 -5302508 -5415906
45848 -5415906 -5749321 -6296919 -5457369 -2076290 2215425 4827808 5426425 5189485 4176718
45839 4176718 2077423 302848 287557 779743 11984 -654615 976404 3147813 2289301
45830 2289301 -494078 -284128 3710987 6409962 4685065 1831059 1615768 2490590 1267588
45821 1267588 -1134114 -1720517 -698514 -656317 -1893180 -2151286 -386209 1943359 3013174
45812 3013174 2225357 308945 -889032 127072 2206337 2482527 586184 -682533
45804 -682533 -379154 -1652282 -6077027 -9143198 -5830300 1501941 5848939 5238724 4435100
45795 4435100 6623276 8509240 5763420 -358399 -4588910 -3926836 -237617 2370343
45787 2370343 1429331 -1943648 -4338358 -3789899 -1933522 -1380919 -1777110 -561476 2707474
45778 2707474 5323544 5032052 2331272 -1242684 -4687840 -6669996 -5622811 -2053957
45770 -2053957 1244338 2577632 3116446 4100665 4350816 2285634 -1247018 -3983520 -4801408
45761 -4801408 -3721393 -924848 2283498 3013426 -174347 -4530659 -5895900 -3872106
45753 -3872106 -1795579 -1580094 -1250732 1439719 5044699 5772407 2025778 -3632200 -6922851
45744 -6922851 -5748597 -1803662 1434526 2259345 1996934 2664198 4292622 5407337 5342084
45735 5342084 4739845 4213622 3986873 4558236 5989232 6590659 4380476 324846 -2016754
45726 -2016754 -1118209 328211 -474462 -1998724 -619328 3686936 6756892 5576554
45718 5576554 1800923 -818492 -542688 1901533 5215276 8146980 9181087 7505721
45710 7505721 4293413 1733953 630215 -65314 -1186536 -1920410 -1026123 1287519 3589625
45701 3589625 5062198 6189309 7367189 7569709 5228730 455221 -4335419 -6593611
45693 -6593611 -6284983 -5855924 -7419889 -10364966 -12069416 -10749863 -7114502 -3193593
45685 -3193593 -221914 1717445 2447732 1467803 -508429 -1100674 1101451 3999888 4038786
45676 4038786 1028514 -1127773 488340 3934889 5304624 3898412 2162815 1502654
45668 1502654 1064230 597035 1547529 4392355 7239650 8310311 7991202 7369265 6592982
45659 6592982 5841427 5894395 6210467 4475919 82071 -3797603 -4068159 -2125249 -1582839
45650 -1582839 -2800238 -3022313 -1433746 -364074 -994951 -1362682 146290 2379522 4139292
45641 4139292 6483909 10046650 12418329 11090390 7492271 5025403 3939916 1557855
45633 1557855 -2304822 -3731817 -240898 4651008 5103448 187167 -5153475 -6352807
45625 -6352807 -4011212 -1545151 -243821 1194807 3218841 4174596 2979901 984279
45617 984279 -23079 -297520 -1238120 -2842376 -3505258 -2079347 943500 4160922 6421471
45608 6421471 7527447 8350765 9779761 11091595 10240878 6493647 1804008 -1320552
45600 -1320552 -2298324 -1977799 -1165849 -907042 -2407710 -4759382 -4607654 -712862 2901777
45591 2901777 1744726 -2556941 -4558402 -3084332 -2125161 -3417522 -3595304 -620581
45583 -620581 2031094 854709 -2051472 -2668575 -1263310 -795652 -1438602 -997436 641716
45574 641716 1652129 2045777 3364281 4963212 4475848 2204959 1437227 3586164 6139357
45565 6139357 6542577 5434541 4617259 3994432 2260617 -571371 -2674663 -1944705 2292111
45556 2292111 8209642 12014497 10818716 5472420 -263754 -3430809 -3906346 -3123062
45548 -3123062 -2329456 -2316850 -3354874 -4653418 -4681233 -2530736 1331428 5492508 8295417
45539 8295417 8672667 7115010 5284890 3886007 1831675 -1344075 -3468115 -2062319
45531 -2062319 1972812 5101288 5376381 4070361 3278657 3769541 5115011 6103250 5068084
45522 5068084 1624313 -2010428 -3233175 -2324873 -1480002 -1026562 710886 3804570 6015756
45513 6015756 6337999 6359130 7111536 7433729 6833915 7106561 9067570 10125721 7607571
45504 7607571 2790089 -821315 -1936538 -1826443 -1269428 278135 2783413 5125350
45496 5125350 6620835 7450689 7473627 6039414 3267835 486307 -948793 -777249 184956
45487 184956 794914 501938 -181423 -337393 310839 1604709 3831629 6987125 9139513
45478 9139513 7538193 2279554 -2919842 -4976210 -4866699 -5065113 -5064546 -2118226 3915177
45469 3915177 9136147 9864285 6671176 3176477 1968349 2856498 4464863 6010504
45461 6010504 7088131 6799847 4398975 829400 -1474586 -886738 1989958 5520649
45453 5520649 8537501 10011508 8837790 5535311 2889690 2866329 3853277 3216316 1528179
45444 1528179 1292155 2250768 1817212 274568 1146497 4983108 7048850 3905849 -1096517
45435 -1096517 -2260284 944597 4283513 5026346 4252445 3598999 2918219 1430858 -800268
45426 -800268 -2775567 -3041564 -1001216 1557509 1886518 319109 617206 4430214 7877757
45417 7877757 6501112 1697719 -1127121 313983 3163533 3887424 1843075 -1259314
45409 -1259314 -3024324 -1974868 563085 1325343 -199683 -85487 4121427 8328008
45401 8328008 7014790 1448099 -2435737 -3093392 -4260790 -6942378 -7244150 -3821528
45393 -3821528 -1159276 -2426090 -4467434 -3630867 -1906334 -2870335 -5267375 -5470456 -3618610
45384 -3618610 -2384966 -1526878 1270702 4974824 5555106 2073581 -1703567 -2671566 -1929283
45375 -1929283 -1744907 -1984524 -1430232 -560201 -766030 -1662685 -1205333 1275537 3523000
45366 3523000 2871636 -88509 -1762272 -52200 2825091 3589431 2730393 3419671 5997524
45357 5997524 6968468 4438206 1284663 993327 3057333 4873934 5790937 6392684 5783315
45348 5783315 3060079 320933 593032 3089688 3853761 1278591 -2098518 -3821648
45340 -3821648 -4549025 -5759493 -6999352 -7063470 -6151369 -5177587 -4100518 -2482788 -1007510
45331 -1007510 -964181 -2239897 -2733519 -171802 5432887 11075560 12946635 10038662 5442804
45322 5442804 3280552 4363628 5704206 4335171 548958 -3129071 -5219625 -6409337
45314 -6409337 -7523237 -7612911 -5121629 -659069 2850701 3560026 3015156 3674946 5153308
45305 5153308 5109363 3300968 1831397 1100503 -1077554 -4916186 -6679364 -3972427 -216472
45296 -216472 -237315 -3223165 -4115227 -1136521 2270203 3131189 2549642 2615055 3162725
45287 3162725 3198560 2825392 2093856 259775 -2140658 -2656393 -322090 2128889 1643872
45278 1643872 -883651 -1974228 -321702 2052446 3025797 2571974 1490243 -193239
45270 -193239 -2644980 -5041436 -5918335 -4536105 -1554137 1492005 3194465 2983525 1312906
45261 1312906 -552372 -1168991 5548 1944586 3015308 2830920 2349168 1799537 -113687
45252 -113687 -3751142 -6548124 -5534194 -1424696 1869264 1930814 198483 -642022 176029
45243 176029 1521040 2030014 1140832 -329518 -413189 1756759 3883249 2664033 -1671861
45234 -1671861 -5298219 -5979298 -5723644 -6892308 -8345240 -7767063 -5700052 -4391526 -3975816
45225 -3975816 -2815735 -976901 -387035 -1533776 -2641362 -2520179 -1942856 -1621205 -957240
45216 -957240 286364 894971 -29210 -1514715 -2112658 -1912991 -2080225 -3004652 -3912201
45207 -3912201 -4021730 -3365605 -2586004 -2322047 -2620521 -2710543 -1639823 595326 2728804
45198 2728804 3218691 1569443 -1144211 -2897507 -2292257 -79310 1226608 50486
45190 50486 -2092307 -2141547 670790 3574453 3407346 194397 -3234506 -4686115 -4597885
45181 -4597885 -4574833 -5035024 -5112392 -4409782 -3697552 -3540171 -3138688 -1352137 1623949
45172 1623949 4464894 6179219 6340139 4427127 725099 -2119558 -761585 4469316
45164 4469316 8708391 7746080 2768308 -1769808 -3613622 -3768671 -3185793 -1510267 700222
45155 700222 1443312 96899 -1342205 -1125352 -145661 -61589 -460783 398427 2812699
45146 2812699 5201732 6197638 5979227 5543731 5414003 5120485 3735049 1197882 -949755
45137 -949755 -1005445 624011 1812659 1721508 1766508 2615101 2078680 -1889886 -7119413
45128 -7119413 -8711552 -4780096 1285161 4801569 4426257 2158491 245418 -693964
45120 -693964 -1236355 -2059183 -3288632 -4464221 -5138254 -5439387 -5625843 -5228344 -3489989
45111 -3489989 -856486 887308 537363 -1086992 -2167915 -1844894 -635016 522982
45103 522982 904032 75487 -1722842 -3219659 -2870831 -348411 2982994 5254670 5627405
45094 5627405 4646475 3360462 2312779 1333479 48630 -1646366 -3522925 -5015244
45086 -5015244 -5192865 -3389838 -436312 1295802 136640 -2666785 -4079035 -2842075
45078 -2842075 -793277 -122372 -498961 18221 2000831 3903290 4129303 2801325 1354877
45069 1354877 1017939 1770172 2492346 2334004 2025636 3053349 5171753 6016834 4233565
45060 4233565 1640137 575089 357205 -1085564 -2901889 -2093867 1082682 2294504
45052 2294504 -587524 -3784443 -2950078 520542 2114159 1230826 1281165 3425931 4808530
45043 4808530 3791912 2736440 3627854 4395727 2335031 -1252623 -2917317 -2074048 -1111446
45034 -1111446 -1238368 -1177550 -18295 1201349 1344501 709632 148728 197643 1431989
45025 1431989 3962790 6013901 4869701 391227 -3899979 -4655961 -2514488 -623065
45017 -623065 -370783 -499430 47618 672279 935853 1762903 3583800 4683363 3113977
45008 3113977 -301843 -2539497 -2000535 -165147 790955 776624 1333512 3239042 5573370
44999 5573370 6781015 5829097 2722811 -1112705 -3210503 -2105537 686967 1750647
44991 1750647 -629391 -4583986 -6752661 -5628182 -2535101 -82744 -75338 -2093953 -3544347
44982 -3544347 -1979921 1856806 4220666 2633394 -889539 -2272386 -388536 2118037
44974 2118037 2797638 2154431 1905470 2255997 2076357 777749 -1056220 -2329174 -2046523
44965 -2046523 11904 2527185 3288718 1446120 -1457026 -3428739 -4297223 -5110418 -5986625
44956 -5986625 -5906529 -4461958 -2580824 -1307855 -669645 78113 1567085 3559218 4627004
44947 4627004 3094481 -866545 -4534301 -5137025 -2869617 -425764 158246 -947189
44939 -947189 -2461430 -2961153 -1019471 3448560 7608265 7722135 3731723 -118839 -335177
44930 -335177 2195514 4954934 7619276 10579406 11733330 8493539 2473554 -1339484
44922 -1339484 -541126 2364137 4066113 4019398 3017995 1111314 -1272858 -2255608 -575206
44913 -575206 2535782 4988385 6081215 5929716 4304703 1613265 -473053 -1106995 -1583236
44904 -1583236 -2792492 -2993358 -513303 2706812 3240885 1155922 -252674 404853 963681
44895 963681 -142363 -1095698 389954 3526632 5630427 5599030 4728569 4771196 6166812
44886 6166812 7686301 7333373 4204781 -388950 -4362166 -7040850 -8619476 -8108333
44878 -8108333 -4346188 670810 2413590 -686617 -4631219 -4683595 -1076432 2160699
44870 2160699 2566558 994675 -993362 -2656520 -3025629 -929732 2969197 5794653
44862 5794653 5287756 2352832 30228 287792 2372996 4206274 4766068 4479086 3460824
44853 3460824 846219 -2985116 -4899279 -2274295 2480397 3749909 25057 -3569451
44845 -3569451 -1970634 3190645 6392871 5720827 4144913 4144724 4581973 3386778 665722
44836 665722 -1854776 -2819030 -1958435 28650 1914731 3017800 3709004 4259173 4106653
44827 4106653 3365274 3748602 6174682 8604381 8463385 6180715 3812733 1259344 -2854184
44818 -2854184 -7098362 -7905227 -4766554 -1204859 304467 948583 1988168 2121935 281575
44809 281575 -2060583 -3440574 -4399695 -4834971 -2459668 3230637 8157740 8232322 4764639
44800 4764639 1987837 1027134 101047 -697363 770655 4298228 6869281 7201455 7293159
44791 7293159 8526534 9320785 7952801 5214262 2981261 2203090 3252547 5978178
44783 5978178 8246881 6899513 2010563 -1784852 -425488 4422223 7459971 6037954
44775 6037954 2198789 -894759 -2184728 -2223155 -1539541 -387886 1005151 2609577 4313012
44766 4313012 5264122 4481623 2511933 1422227 2391789 4152511 4769109 4297443 4445438
44757 4445438 5907720 7430364 7664379 6627815 4932639 2950188 1535212 2163558
44749 2163558 4913432 7246002 6493748 3187138 435870 333738 2396452 5012851
44741 5012851 6566655 5528388 1831214 -1701075 -1795216 888610 2382812 1136787
44733 1136787 78004 1498612 3169348 2188805 -88887 -497224 536707 90907 -1715926
44724 -1715926 -1588084 1314128 3530496 2267478 -916910 -2956171 -3366543 -3704516 -4581501
44715 -4581501 -4957917 -3704105 -927202 1794124 2440466 711851 -1164655 -1152137 -384740
44706 -384740 -1391073 -3710938 -4014846 -986419 2655329 3949472 3065186 1822346 1187395
44697 1187395 1372883 2079484 1528325 -2040283 -6489690 -6588040 -1032796 4335519 3544717
44688 3544717 -1696213 -4877606 -3532771 -1027110 -501687 -1409789 -2170011 -2321140 -1346251
44679 -1346251 1254323 3891294 4053319 2468504 2877114 6314622 8829287 6930314
44671 6930314 2551551 32741 251341 607914 -470677 -1928847 -2533827 -2377380 -1643161
44662 -1643161 293729 3851517 8112069 11012513 10589696 6674234 1703636 -1107249
44654 -1107249 -1009236 -145031 -320323 -1007202 -1439291 -2471308 -4370775 -4726713 -1462646
44645 -1462646 3241498 5248721 4095145 2852913 2454435 251037 -4506955 -7731295
44637 -7731295 -5842095 -1369629 90633 -2887538 -6448959 -6931929 -4669619 -2359187
44629 -2359187 -1960626 -3563623 -5638592 -6137889 -4603046 -3030231 -3349542 -4583022 -4317953
44620 -4317953 -2547878 -1668732 -2522404 -2999186 -1439674 815172 1562190 646757 -641332
44611 -641332 -1629319 -2344629 -2705857 -2797503 -2827538 -1979623 1002932 4954131 6215267
44602 6215267 3503815 810322 2456148 6659250 7658117 3800369 -456225 -1371885
44594 -1371885 -934215 -2942673 -6912747 -8788416 -6422831 -1784953 1838114 2829646
44586 2829646 1575502 -448084 -1566284 -998290 482865 1419136 1224826 565323 442812
44577 442812 1304845 2744742 3675997 3178105 1612316 496954 797468 1741125 1825332
44568 1825332 602169 -1041817 -1949834 -1487261 275043 2508154 4104835 4842230 5700015
44559 5700015 7372764 8964434 9125689 8160292 7763849 8565657 9163559 8135826 5986057
44550 5986057 4222003 3220090 2134735 637089 -520577 -884078 -1032752 -1296801 -894418
44541 -894418 419828 738881 -1976315 -6241843 -7584217 -3766747 2169659 5521245
44533 5521245 5270542 4090123 4028855 4390329 3670333 1654415 -585334 -1447494 92315
44524 92315 2633151 2504136 -1810341 -6134622 -4892174 1041413 4888104 3509120 1803284
44515 1803284 4758289 9413789 9416202 4734972 1209757 1528528 2450849 1453194 547224
44506 547224 1454613 1684831 -1366991 -5649329 -7183076 -5465736 -3090833 -1612151 -763057
44497 -763057 -482076 -625769 453664 3860100 7109322 6434278 2318868 -552043 312100
44488 312100 2076685 1444187 -319433 119803 2626703 3836420 2388625 912994 2158529
44479 2158529 5258054 6997962 5732880 3040240 1767414 2840905 4117833 2886393
44471 2886393 -356921 -1933337 161454 2996140 2558623 -262097 -907785 1684380
44463 1684380 3157714 480777 -3213591 -3439576 -934086 484904 521440 2106269 5125931
44454 5125931 5375978 834562 -4999852 -7758907 -7076499 -5060152 -2799551 -642293
44446 -642293 359645 -238739 -1050556 -971608 -955691 -1626482 -819449 3743493 10198205
44437 10198205 13664205 11594628 6126158 1303238 -325838 1382374 4803527 7785634
44429 7785634 9304033 9896572 10038084 9175553 7430601 6808537 8744207 11340452 11226986
44420 11226986 7811608 3794702 1797839 2282682 4307677 6188833 5638261 1629896
44412 1629896 -3469707 -5572628 -3213533 1192097 4489861 5520845 4697408 2896630
44404 2896630 1405945 1355504 2485206 3569118 4233463 5011303 5556789 4556955 1914093
44395 1914093 -514997 -1041127 83979 1424209 1919402 1494728 958738 1166379 1557320
44386 1557320 387226 -2334824 -3473293 -542860 4225647 6403530 5159996 3225168
44378 3225168 1637181 -1156487 -4377506 -3839722 1904500 8080770 9346316 6296035
44370 6296035 3474770 3134808 4024944 4771641 5302937 5533833 5052852 3863551 2035605
44361 2035605 -541049 -2914093 -3085474 -827029 1063272 129103 -2501782 -4002924
44353 -4002924 -3504399 -1990721 -91656 1861285 2863415 2463486 1836398 1778355 1108438
44344 1108438 -917297 -2372587 -1341871 843910 1847646 2171169 3572813 5116854
44336 5116854 4470980 2122667 427572 -829823 -3705197 -7165498 -7492302 -4292482
44328 -4292482 -1666893 -1976618 -2575536 -772721 1714083 1957209 467073 -333251 -32305
44319 -32305 359253 1220835 3421819 5499442 4689849 813257 -3003828 -3785687 -1497981
44310 -1497981 1688201 3692581 3874474 3035627 2560897 3288573 4924331 6295987 6101646
44301 6101646 4003242 1484236 823970 2291258 3309571 1827124 -579529 -1134078
44293 -1134078 -483919 -1858358 -5711497 -8654810 -8624625 -7763410 -8395755 -9041674 -6867653
44284 -6867653 -2064305 2607355 5117625 4970107 2331675 -1358635 -3271832 -2006806
44276 -2006806 529589 2017023 2912866 4261862 4140090 63375 -5756415 -7739342
44268 -7739342 -4169117 560169 2225853 1934228 2878229 4777019 4693340 2046392 -307089
44259 -307089 39510 2344146 4282493 4591644 3717656 3089137 4173500 7182332 10297054
44250 10297054 11199544 9810252 8385238 8288919 8045678 5835024 2692755 1288726 2123418
44241 2123418 3162806 3198764 3138158 3441778 2939950 1525909 1471523 3928458 6277514
44232 6277514 5670805 3467161 2891465 3555958 2202386 -1537018 -4376713 -4932755 -5738263
44223 -5738263 -8075144 -8797665 -5046922 970176 5126794 6989525 8774736 10236125
44215 10236125 8497284 2928422 -2893995 -4784878 -1738247 3949889 8683842 9781978
44207 9781978 7382530 4286148 2773663 2051424 225894 -2093522 -2478441 -738322
44199 -738322 322050 -1032992 -2768253 -1798140 1880730 5200983 5677831 3994614 2905906
44190 2905906 4063392 6243416 6947095 5571361 4095703 4243999 5177215 5176181 4628606
44181 4628606 5500268 8064049 10050470 9548414 7308592 5386788 4525237 3831399 2532076
44172 2532076 1061878 248778 476 -517512 -1239003 -583858 2396450 5643428 5639487
44163 5639487 1818438 -2372292 -3906478 -3902544 -5149708 -7452443 -8078138 -6326640 -4864931
44154 -4864931 -5873612 -7923801 -7809228 -4354401 477839 3605211 3392493 674214
44146 674214 -2345774 -4169480 -4725016 -4126537 -1900234 1815381 5466988 7676340 8641265
44137 8641265 8710160 6895115 2729579 -1549523 -3216701 -2879671 -3400079 -5201865 -5588364
44128 -5588364 -3123887 214847 2184853 2870020 2858330 1435926 -1551279 -4160472 -4797135
44119 -4797135 -4566353 -5050450 -5212422 -3062837 475946 2172164 986247 -478664 316602
44110 316602 2656801 4169577 4132624 3630256 3070721 1331196 -2090602 -5284537 -5664749
44101 -5664749 -3439417 -2009766 -4052662 -7963519 -9398277 -6198465 -669213 3222637
44093 3222637 3960413 3382417 4209264 7252019 10779004 12199249 10333985 6217662 2076404
44084 2076404 -66 1202988 5188086 9181402 9932246 7298241 4870660 5558740
44076 5558740 7622044 6986235 2745365 -1862167 -3713010 -2808163 -912644 587235
44068 587235 835602 -598009 -2936118 -4361537 -3609932 -799934 3104565 6638093 8172308
44059 8172308 7443852 6322617 6418294 6591903 4952045 2532886 2064622 3390666 3550310
44050 3550310 1841502 1187111 3295619 5955148 6936177 7355400 8807238 9977813 8998495
44041 8998495 7103743 6957546 8619283 9796246 9231373 7642701 6039472 4969353
44033 4969353 4733996 4801010 3789295 1368726 -703102 -543932 1798818 4875501 6932227
44024 6932227 6115955 1992443 -2310589 -2437534 1241071 3193823 273976 -3761220
44016 -3761220 -4125088 -1924242 -1351145 -2893362 -3925379 -3939879 -4267753 -3929730 -800766
44007 -800766 3597664 5182644 3182770 748746 -192373 -523277 -555550 381107 733447
43998 733447 -2126034 -6680796 -7841363 -4096978 297411 1932094 2617615 4807800
43990 4807800 6758658 5520125 1890065 -821544 -1163425 -231273 495273 157998 -1151561
43981 -1151561 -1771131 64661 3186827 4217995 2371000 765188 1472696 2193620 51474
43972 51474 -3788082 -5765427 -4406166 -1091759 2019889 3162702 1807135 -188759
43964 -188759 -171703 1444209 1471109 -621145 -919533 3028335 7817044 8760694 6126634
43955 6126634 3470871 2165037 1195577 420430 237589 -508021 -2664460 -4133153 -2641721
43946 -2641721 118679 806116 -310330 -341996 921239 993154 -431481 -967572 -116895
43937 -116895 -91626 -1284251 -931511 2257442 5444816 5324191 2048191 -1688643 -3391338
43928 -3391338 -1902699 1921099 5036088 4898015 2678555 1523136 1737567 822477 -1517328
43919 -1517328 -2198226 251325 3100181 3511916 2035070 196024 -2118038 -4555571
43911 -4555571 -4708659 -1599383 1719227 2164404 1115905 1576129 2687339 1079461 -3138853
43902 -3138853 -5858422 -4806518 -2333776 -1208669 -586902 1838933 5495102 7063816
43894 7063816 4614195 -53706 -3541475 -4341087 -3521272 -2529104 -1575524 -507770 116698
43885 116698 95888 722499 3040514 5536056 5744859 3939473 2644346 2309418 642003
43876 642003 -2611804 -3565184 660312 7135815 10424875 9107343 6149467 3994391
43868 3994391 2389231 602715 -1094485 -2280413 -2548775 -990879 2398208 5146117
43860 5146117 4516237 1253476 -1128489 -773499 1029980 2582869 3335725 2674376 226279
43851 226279 -1935989 -526236 4140104 7341270 5730283 1519373 -1037197 -1048145 -506088
43842 -506088 -314303 393363 1966675 3714489 5050061 5331269 3590106 368056 -1499692
43833 -1499692 -380610 1115472 -453047 -3862797 -4606453 -1379178 2562734 4661077
43825 4661077 5599198 5780145 3734588 78624 -1158305 1723688 4591333 3510441
43817 3510441 1230470 3012338 8206276 11384846 10857509 10261569 11314505 10853091 7098477
43808 7098477 3721543 4352673 6866981 6945179 4702734 3893648 6047075 8897240 9838307
43799 9838307 8097117 4226543 66212 -1497740 658796 3792452 4335606 2487102
43791 2487102 1401294 2423737 3803049 3870348 2852090 1523487 500822 828352 2811616
43782 2811616 4368060 3200630 586344 54073 2073456 3299150 1798669 -293018
43774 -293018 -555782 476554 1474828 2658153 3944639 3589829 1161077 -504627 966261
43765 966261 3712581 4386800 3115239 2822442 4663527 6902978 7746076 6925290 5004661
43756 5004661 3207550 3315865 5686805 7956416 7619740 5189383 2973386 1806550
43748 1806550 1223178 1722138 4004462 6540247 6826944 5015436 3703128 4166499 5278598
43739 5278598 6010862 6325052 5654102 3445089 1406931 2076662 4599527 5221424 2960626
43730 2960626 1325144 2662991 4170252 2245840 -1739675 -3310257 -1090413 2037631
43722 2037631 3461394 3691728 4412512 5818163 6710919 6171804 4504915 2851244 2003759
43713 2003759 1669987 1333573 1614497 3617997 6754701 8662608 8016266 6190618 5326293
43704 5326293 5850945 6672788 6659411 5178778 2516404 613868 1830568 5753260 8748300
43695 8748300 8144654 5413124 3569261 3055039 2484217 2104358 3434870 5788161 6293967
43686 6293967 4160716 2413800 4020802 7968310 10729020 10662154 9389478 8940285 8818880
43677 8818880 6746789 2166964 -1992047 -2185293 1232567 3884455 2518697 -1081613
43669 -1081613 -2629737 -685190 2245356 3327327 2204137 250475 -1182974 -1340257
43661 -1340257 -208533 1315900 2176973 2288447 2242181 2032800 1083296 -403405 -1134006
43652 -1134006 -111116 2206334 4222754 4453182 2934517 1788530 3448718 7503112
43644 7503112 10391463 9437693 5974674 2893653 589249 -2153653 -4412631 -3703151
43636 -3703151 -220257 2924384 4282370 5490134 7034460 6237469 1717761 -3130393
43628 -3130393 -4069858 -1445835 1161715 2093694 2426159 2806009 2684206 2303283 2538398
43619 2538398 2758952 1468169 -724165 -1253410 773117 3285362 4174289 3479400 2019372
43610 2019372 -47724 -2198191 -2862292 -1213881 1440129 3220984 3869330 4594557 6444538
43601 6444538 9231584 11179400 9611534 3656979 -3302781 -5989604 -3197563 532647
43593 532647 673828 -1966917 -3815168 -4196436 -4991717 -5891078 -4282059 -198800 2713355
43584 2713355 2635006 2360346 4442691 6854015 6689498 5592648 7336643 11404873 13574833
43575 13574833 12765392 12609217 15002630 16511939 13801052 9137601 6982633 7438231
43567 7438231 7029421 4786839 3427145 4446048 5816414 5648506 5134467 6198514 8317917
43558 8317917 9390454 8411740 5986990 3393488 2232093 3659001 6618598 8002919
43550 8002919 6075368 2873352 1707619 2967887 4046430 3112844 1330642 1053359
43542 1053359 2928904 5260395 5792622 3962084 1454783 298654 567205 837567 820641
43533 820641 1847354 4070164 5159427 3464842 928799 604180 2247988 2901026 1408527
43524 1408527 -295482 -518860 215654 1134150 2599983 4387938 4828858 3267848 1547284
43515 1547284 1253978 1106879 -670842 -2524904 -930880 4356157 8923771 8660851 4560915
43506 4560915 1270551 1667768 4271903 5911645 5545793 4527212 3798406 2457986 -263473
43497 -263473 -2884764 -3069145 -766915 1629139 2394029 2140472 1906113 1347898 98048
43488 98048 -462512 1376745 4975574 7716923 7961004 6264952 3708685 533023 -3069344
43479 -3069344 -6054238 -7349986 -7071536 -6259278 -5654163 -5102546 -3936397 -1708833 1137593
43470 1137593 3121629 2710715 -3969 -2848902 -3502875 -2107678 -1359432 -3431266 -7150490
43461 -7150490 -9115844 -7701688 -4942811 -3869709 -4906010 -5915955 -5085647 -2375876
43453 -2375876 1415235 5265687 7563068 7015070 4542075 2665574 2353184 2168175 1307634
43444 1307634 1255160 2787092 3533901 1197682 -2234957 -2716366 -70668 1679534 378664
43435 378664 -1104084 733216 4991988 7848270 7601349 6177564 6188016 8077844 10089649
43426 10089649 10146605 7882148 5114478 3780083 3361535 1557044 -2218910 -5734801
43418 -5734801 -7283765 -8258572 -10559729 -12837374 -11824297 -7015552 -1620482 1452232
43410 1452232 2533677 3458448 4649491 5112112 4333208 3093707 2787537 4438292 7833842
43401 7833842 11223855 12532757 11340268 9052461 6801200 4188923 893042 -1546211
43393 -1546211 -1093822 1876062 4628980 5473261 5838603 7994812 11481320 13152844 10865131
43384 10865131 6109032 2491271 2195938 4502319 7329473 9351240 10482688 11047425
43376 11047425 11134574 10777432 10387905 10620353 11550627 12179671 11407287 9726196 9074558
43367 9074558 10171683 10822089 8470474 4220562 2224622 4335961 7391997 7460354 5195987
43358 5195987 4503533 6546211 7993498 5854748 1568705 -1237998 -1350422 -386433 443147
43349 443147 1840940 4574790 7747402 9581162 9126764 6778360 3758742 1505272
43341 1505272 989286 2052141 3578991 4657651 5418693 6479586 7730941 8072116 6548866
43332 6548866 3690586 1460667 1514607 3435996 5198576 5759824 6513029 9031878 11683540
43323 11683540 10482199 4456124 -1470217 -1330763 4486558 9300201 8355623 4478933
43315 4478933 3626636 6817023 9571242 8626525 5622691 3391431 1988266 510063
43307 510063 189000 2460157 5250040 4732021 880535 -1815741 -103723 4105809 6904110
43298 6904110 7288646 7020780 7257801 7731387 8507169 10106807 11782499 11740729 9710401
43289 9710401 7715408 7443351 8043244 7570687 5837302 4683430 5624581 8049900 9826052
43280 9826052 9328248 7002827 5195182 6128076 9625295 13063380 13991626 12531635 10683609
43271 10683609 9624946 8619529 6627780 3928677 1565626 -8344 -854204 -663670
43263 -663670 893046 3075573 4592837 5442130 6835172 8577754 8104878 3890876 -1114705
43254 -1114705 -1940181 2262500 6845112 7442153 5017047 3486482 4263050 5819215 7480296
43245 7480296 10153510 13124902 13753093 11915414 11655484 15725791 20667931 20708467 15508459
43236 15508459 10438083 9165017 9598468 8284959 5561093 4204720 5298777 7880875
43228 7880875 11027284 13689068 13739347 10224499 6107121 5699523 9068217 11807904 11089464
43219 11089464 9082627 8939191 10062390 9777236 7833457 6260703 5541086 4078816
43211 4078816 1932839 2331305 7720104 15556696 19895758 17357102 10700908 6059757
43203 6059757 6841613 10852006 13609603 13633351 13114264 13681796 13882306 12141554 10176655
43194 10176655 10962766 14280075 17075392 18103346 19313535 21925562 23852694 22641416
43186 22641416 19087395 16177345 15684949 17244807 19521400 20781172 19615845 16942723
43178 16942723 16174273 19255057 23332876 23799585 20309732 17186433 17621563 20114299
43170 20114299 21584602 21544580 21405325 21367262 20252929 17851507 15557206 14568043 14597322
43161 14597322 14492025 13370532 11153339 8590024 6764053 6197755 6610477 7709490
43153 7709490 9523187 11436422 11833570 9920326 7426021 7033565 9066009 11115003
43145 11115003 11343958 10806735 11621978 13908656 15810003 16076408 15317118 14687769 14492627
43136 14492627 14427396 14247587 13607700 12013894 9826466 8897058 11102250 15981737 20548920
43127 20548920 21971959 20278523 18192214 18429161 21245604 24495589 26028958 26029328 26722082
43118 26722082 29603115 33540255 36327851 37621700 39135145 42119239 46253330 51340923
43110 51340923 58202514 66804813 75310202 82806315 91639365 104875670 122618461 143702089
43102 143702089 170198296 205724212 247192193 281293173 292837267 276911761 242013634
43095 242013634 202329375 168120007 141993112 121488316 103947033 89227470 78317273
43088 78317273 70599726 64304165 59435835 57650275 58424507 58317665 55937823 54765400
43080 54765400 58123172 63824190 67599825 69929587 74865988 83122511 91550946 99622885
43072 99622885 111073696 127805789 147181757 167509209 191866984 224426872 267307176
43065 267307176 322120335 386816701 445834766 471300913 445020651 378370890 302457588
43058 302457588 239144066 189189928 147108212 115246960 97762951 89822965 81668481
43051 81668481 69964202 58549109 50367753 44683839 40810120 38871466 37182027 33663339
43043 33663339 29862479 29242738 31320307 31735742 28762657 25600978 24863661 24479733 21145187
43034 21145187 15176920 9866518 7825286 9462919 13291666 16295567 15711870 12053261
43026 12053261 9123011 9767031 12810582 15220285 15796479 15384332 14796173 14170317 13610971
43017 13610971 13165507 12718558 12611205 13378029 14285701 13661235 11592273 10492489 11631181
43008 11631181 13084553 13032372 12942998 14607243 15800583 12905117 7302883 4748190 7485337
42999 7485337 11078331 11032793 8903178 8758094 10466614 10661563 8975551 8753247 11281009
42990 11281009 13468758 12865301 11599397 12775398 15314608 15578801 13055538 11241170
42982 11241170 12832218 16708194 20195065 21882955 21220193 17658581 12101771 7768909
42974 7768909 7462226 10359386 13053838 13573755 13187857 14477320 18680402 24693989 29784296
42965 29784296 31680929 30876361 30303294 31829013 34020988 34703414 34467375 35373591 36929602
42956 36929602 36247531 32378771 27688159 24140128 20859307 16706608 12948401 11500533
42948 11500533 12082471 12850075 12781332 12190141 12054078 13815973 18260345 23429863 25568060
42939 25568060 23741387 21586516 22470179 24906766 25395237 24002173 23713422 25209740
42931 25209740 25972924 24579493 22577389 21701635 22259312 24814245 30296258 37300297
42923 37300297 42237099 43850310 45113785 48772961 53286471 55601211 56261222 58932996
42915 58932996 65527709 74383361 83385305 92786274 104283408 118729320 135684565 154617439
42907 154617439 175716822 199211661 223627806 244593396 255997593 253498094 237761204
42900 237761204 214434764 190490494 169813270 151877708 134700545 118690486 106658673
42893 106658673 100064771 96854310 93892480 90061346 85687073 80659647 75388485 72323294
42885 72323294 73577346 77543766 80818790 83114945 86755918 91215529 92575588 90018489
42877 90018489 88616956 92733701 100128665 106422032 112759033 124392646 142867768 164337272
42869 164337272 185796605 208860434 236367051 268563122 303667180 338662437 367359582
42862 367359582 380556226 371720941 342533888 301493354 257757024 217266945 182969613
42855 182969613 155659262 133997537 115577327 99139106 85269523 74741688 67071601
42848 67071601 61113217 56147167 51631436 46602926 40406109 33764944 28129450 24036178
42840 24036178 21087015 19364289 19354300 20163396 19617845 17190069 15168668 15319908 15836845
42831 15836845 13761578 9397976 5762270 4196331 3319608 2265173 1956942 2629949
42823 2629949 3014902 3006440 4377049 7512384 10093984 10604165 10503310 11098385 11104891 9839385
42813 9839385 9989230 13564325 17042284 14866551 7316557 988969 945896 5478892 9455474
42804 9455474 10211042 8841805 7461282 6723018 5754457 4088434 3306217 5539820 9940696
42795 9940696 12735467 12320639 12051152 15418971 20496918 22710042 21804993 21869986 24713866
42786 24713866 27578546 28251127 28471861 30514703 33433974 34725573 33598652 30927149
42778 30927149 27647241 24543709 22199478 20230129 17941824 16182780 16742480 19431627
42770 19431627 21740218 22034106 21253437 21052557 22296669 25612304 30900427 35845310
42762 35845310 37674914 37142105 37921699 41248043 44374632 45583992 47171210 51321152
42754 51321152 56143977 58390686 57606554 55136101 51418603 46872527 43229272 41209573
42746 41209573 38732979 34026307 28671176 25023877 22575165 19642414 16770461 15409979
42738 15409979 14828117 13393777 11563261 10734483 10609323 10483838 11345325 13591363 14735262
42729 14735262 13056173 11404729 12901431 14698543 11462132 4166776 -494658 259777
42721 259777 2070526 975901 -1438966 -2466102 -2639865 -2827724 -1458820 1979564 4396286
42712 4396286 3565784 1984456 2657269 3909480 2511967 -194400 150113 4196811 7951306
42703 7951306 8589568 7656051 7842520 9354353 10407837 9511353 6641306 3451708 2366070
42694 2366070 4094378 6241420 5944066 3645993 2347793 3085142 3431717 1381511 -1289823
42685 -1289823 -1328350 1287972 2949547 1004223 -2726019 -4135740 -1945406 916941
42677 916941 1466496 611348 1298953 3580119 4092836 1090479 -2363512 -2046434 1880791
42668 1880791 5076561 4410027 1316474 -505811 602410 2893315 3471837 1405192
42660 1405192 -1266239 -1531743 1546348 6050946 9473922 11025484 11339232 10938976 10112489
42651 10112489 9651089 10268392 11422668 12104810 12833008 15233663 19124610 21822879 21745559
42642 21745559 21272083 23856603 28881780 31924821 30557379 27435843 26370816 27469041
42634 27469041 28140290 27212200 25454805 23118896 19968329 17336009 16905603 17256216 15047163
42625 15047163 10464673 7860514 9317484 11234854 9981580 7644164 8471025 12011650
42617 12011650 14015289 12812456 10659762 9404992 8817289 9073756 11051852 13772569
42609 13772569 14958724 14619131 14981665 16571985 17634647 17882071 19377823 22862545
42601 22862545 26394068 28493394 29602016 29860628 28895345 28425742 31088872 35576685
42593 35576685 37191036 34746080 32319977 32022483 30115981 23819430 17235781 15723032
42585 15723032 17885658 18288131 15533092 12428816 10046955 7018740 3754085 2198750
42577 2198750 1651386 -511434 -3897587 -5257244 -3864892 -2556639 -2757006 -2413898 48715
42568 48715 3134283 4800862 4735713 3248964 679564 -1330546 -792955 1480487 2289655
42559 2289655 426985 -1906522 -2755341 -2677522 -2447833 -1475733 -11075 -259340 -3351105
42550 -3351105 -7152095 -8905784 -8546249 -7821514 -7427663 -6520718 -4291028 -1046995 1733993
42541 1733993 2318552 682576 -724881 221575 2124872 1821023 -883262 -2911963 -2545682
42532 -2545682 -1336622 -715654 97444 1427001 1480094 -619859 -2722365 -2869961 -2475601
42523 -2475601 -3802978 -5997839 -6308297 -4233675 -1991457 -1314933 -1781884 -2158486 -1887485
42514 -1887485 -1173066 -381233 668840 2726181 5587084 6941607 4533893 -554109
42506 -554109 -5005964 -7744605 -10341144 -12405429 -10511887 -3885678 2450819 3594601
42498 3594601 1251238 626791 2783920 4222151 3092597 1601051 1959696 3355782
42490 3355782 3732443 2172381 -986721 -4400282 -5919471 -4522923 -2104286 -1437667
42482 -1437667 -2501360 -2856438 -1461000 210341 842195 678244 93365 -754925 -520850
42473 -520850 2391253 6664478 8458755 6267089 3081198 2111160 2423534 946509 -2626959
42464 -2626959 -5286955 -4532969 -883052 3267455 5781372 5756865 3690098 1103259 -626856
42455 -626856 -1357073 -1938801 -3129970 -5005126 -6937628 -7620530 -5687920 -1330138 2922064
42446 2922064 4269520 2842922 1680169 2763628 4255891 3197251 155218 -1206832
42438 -1206832 556170 2535611 2089184 858605 1336303 1602746 -2179592 -8614788 -11302415
42429 -11302415 -7424502 -1739112 223863 -960598 -1602905 -1240062 -1776669 -2662969 -1673538
42420 -1673538 507581 897535 -896274 -2473138 -3276118 -5196206 -7935790 -8025965 -4065705
42411 -4065705 627542 2572075 2326790 2059048 1700308 172637 -1578173 -1612011 -10316
42402 -10316 1434290 1865160 1864152 1905076 1915725 1982015 2259991 2565743 2822837 3185153
42392 3185153 3095189 1415687 -1617839 -3922964 -4166200 -3414267 -2863003 -1552401 1661047
42383 1661047 5182464 6290402 5134813 4607073 6156385 8000377 7961808 6118507 3903951
42374 3903951 2247142 1533963 2009049 3018240 2774278 150809 -3582490 -5699778 -4691413
42365 -4691413 -1658652 762498 745956 -1001748 -1767809 216717 3244440 3756763 1117049
42356 1117049 -827426 1336203 5351570 5843225 2050743 -465976 2466127 7347544
42348 7347544 7675987 2881731 -1665432 -2955206 -3765102 -6621828 -9062342 -7991145
42340 -7991145 -5341935 -5396352 -8315532 -10212806 -8763695 -5306946 -1950406 154542
42332 154542 126932 -1690654 -2377747 403951 3945724 3147798 -1862132 -5082207 -3008243
42323 -3008243 662530 1083399 -985061 -1898490 -1417730 -2006609 -3673276 -3886756 -2173190
42314 -2173190 -1029519 -1881971 -3057438 -2491300 -315453 1943727 3182501 3201446 2508896
42305 2508896 1960941 1864696 1589723 728160 36089 302302 999949 1180333 1038354 1441216
42295 1441216 2541610 3904436 5212885 5845339 4882326 2785961 1751179 2793131
42287 2793131 3857530 2762810 651240 176490 1515359 2932959 4229278 6291125
42279 6291125 7755879 5888288 1167941 -2533936 -3204834 -2696374 -2297899 -54684 5081515
42270 5081515 9574319 9260615 5328399 2928103 4408410 6961968 7141007 5036718
42262 5036718 2979634 1967741 988203 -712941 -2142601 -1942626 -741459 -1023552 -4018101
42253 -4018101 -7488977 -7946621 -4930875 -1636746 -948522 -2278657 -3038218 -1903266 476512
42244 476512 2979681 4809881 5234247 3841614 1233362 -1196392 -2309734 -1933033 -876367
42235 -876367 -452958 -1430188 -3092620 -3861967 -3186009 -2189895 -2012824 -2189945 -1394057
42226 -1394057 643973 2674022 3274555 2289975 1069567 1356717 3474577 5454400 4611593
42217 4611593 446519 -4382891 -6310570 -3942250 896263 4590785 4487651 1229491
42209 1229491 -1695437 -1821624 -898444 -2501109 -6436098 -8159436 -5076500 -828744
42201 -828744 -671857 -4289010 -6579063 -5010180 -2490174 -2221570 -3236441 -3090573 -2304844
42192 -2304844 -3138611 -5338195 -6297112 -5187931 -3936211 -3521510 -2150593 1362894 4722486
42183 4722486 5011675 3022190 2003212 2675918 2467126 90092 -2052354 -1476206 705386
42174 705386 1691744 804805 -911021 -3424629 -7047770 -9625763 -7806148 -1869772 3517598
42165 3517598 4787526 3498353 3208241 4274010 4152800 1825555 -712713 -1385671 -246471
42156 -246471 1803830 4558877 7471962 8418126 5510962 177575 -3272725 -2093293
42148 -2093293 1796869 4250168 3811802 2759201 3470629 5665616 7769408 8979353
42140 8979353 8659158 5633284 356319 -3518459 -2605496 1514027 3819249 2204596
42132 2204596 -483878 -1319323 -1172221 -2218680 -4173846 -5213142 -4920899 -4149485 -3197478
42123 -3197478 -2167702 -2062029 -3413747 -4629067 -3768760 -1373758 536147 1714509
42115 1714509 3623622 6348137 8078970 8026019 7477195 7196559 6046854 3512725 1580505
42106 1580505 2107387 3554782 2620268 -1168875 -4499675 -4235407 -793300 2948812 4702732
42097 4702732 3868135 930226 -2641018 -4497238 -3254097 -447408 834858 -302221
42089 -302221 -1620116 -1117891 393364 1275771 1857880 3198166 4282594 3046342 -186922
42080 -186922 -2782943 -3358630 -2893766 -2126733 -519227 1464251 1764322 -175877 -1991944
42071 -1991944 -1727903 -650729 -1009322 -2770557 -4486058 -5758386 -6686173 -6268059 -3831832
42062 -3831832 -1166887 -756801 -2267004 -3005848 -1765386 -210918 -304652 -1976969 -3618645
42053 -3618645 -3740789 -2129085 -263584 -279354 -2542134 -4693999 -4119783 -923016 2443079
42044 2443079 3946243 3593449 3002870 3971154 6451071 7595727 4601068 -868810 -3604313
42035 -3604313 -1511864 1588493 1951483 1369045 3184143 5842214 5261940 1930126 373334
42026 373334 2064416 3917151 4033432 4022831 4782779 4696288 3472549 3495313 5550600
42017 5550600 7032102 6258144 4970488 4613492 3730239 1364422 -279475 772839 2938124
42008 2938124 3660769 3037212 2733104 3469506 5246943 7582613 8168935 4491782 -1581176
41999 -1581176 -4514806 -2454767 260807 480670 1220675 5216639 8338967 5344842
41991 5344842 -1146198 -3977169 -1872296 -94970 -1605941 -3859318 -4430472 -3961444
41983 -3961444 -2890717 -707553 615425 -2188296 -7553668 -9219722 -4654388 1040824
41975 1040824 2041372 -1194689 -4235412 -4504353 -2260847 1158511 3449113 2281687
41967 2281687 -1436541 -3572198 -2128159 -33696 -350732 -1530977 -483120 1925106
41959 1925106 2009689 -1231528 -4935951 -6245428 -4915143 -2402061 -357495 209904 -258997
41950 -258997 -273678 604346 1091984 517284 175597 960751 1478787 490751 -445865 786505
41940 786505 3248989 4186312 3041119 1595944 649162 -721401 -2635939 -3757820 -3579301
41931 -3579301 -3173875 -3091535 -2410725 -627757 1087028 1368307 267615 -1266183 -2585115
41922 -2585115 -3465187 -3768267 -3449232 -2488532 -774633 1472541 3409386 4422330 4987563
41913 4987563 5758951 6025934 4263356 449635 -3099741 -3734923 -1025618 2753983 4458512
41904 4458512 2600916 -1525773 -5228299 -6834986 -6353988 -4118463 -186556 4456526
41896 4456526 7514333 7305960 4405966 830753 -1456013 -1024420 2164200 5492890
41888 5492890 5384658 1813775 -873366 421245 3188850 3161530 587185 -722655 642605
41879 642605 2442655 2992059 2879748 2510302 1578234 1221028 2943977 4926400 3492820
41870 3492820 -701689 -2334294 834242 4207380 3230540 41348 -660434 775421
41862 775421 260296 -2813393 -4516222 -2323737 1861246 4993409 6031665 5364502 3802382
41853 3802382 2679097 2758264 2732771 814662 -2156829 -3348646 -1729931 936371 2899978
41844 2899978 3851722 3464891 1258356 -1403637 -1793586 525356 2655772 2153464 -46268
41835 -46268 -1663140 -2220337 -2801468 -4066402 -5683399 -6655183 -5666310 -2575619 219691
41826 219691 151346 -1329267 106156 5158361 8960557 7812845 4299575 2318974 456587
41817 456587 -4546366 -9904169 -8956103 -1565819 3976252 1887381 -3405814 -4152562 61588
41808 61588 3205960 2079516 -412564 -933746 -90525 122125 -99908 589121 1988186
41799 1988186 2741851 2559431 2414238 2841465 3280783 3127880 2510101 1767755 820073
41790 820073 -463620 -1519719 -1305362 491662 2774326 4017437 3868304 3298543 3131632
41781 3131632 3058660 2436706 1414367 584059 -82604 -1069330 -2136265 -2247239 -1101787
41772 -1101787 -64728 -802027 -3172928 -5264372 -5742170 -5411452 -5684687 -5969574 -3967390
41763 -3967390 942524 5888582 7417837 5682417 4178772 5263226 7464226 7831823
41755 7831823 5591521 2391957 -138306 -1701173 -2494583 -2378074 -1308996 -27375
41747 -27375 264024 -847070 -2059368 -1258063 1987519 5257493 5717297 3462719 970687
41738 970687 -582182 -2202164 -3850629 -3300760 -90823 2050635 -187821 -4381001
41730 -4381001 -5251106 -2058236 692829 -99904 -2714327 -4649225 -6186139 -8056038
41722 -8056038 -8899189 -7655895 -6055921 -6060812 -6728198 -6207451 -5075319 -4802760 -4373304
41713 -4373304 -1683706 2534224 5465880 6481275 7354091 8246687 7023264 3396521
41705 3396521 482760 675316 2594557 3847928 4423816 5204111 5104627 2429933 -1832036
41696 -1832036 -4501597 -3784120 -679217 2737574 4738058 4122557 1057953 -2148037
41688 -2148037 -3050392 -2375241 -3579946 -8177838 -12984868 -13460317 -8976207 -3289337 -143941
41679 -143941 35882 -1032963 -2201155 -3242695 -3626083 -2767671 -1465356 -1369684 -2435422
41670 -2435422 -2464898 -351941 1603269 499684 -2809472 -4441211 -2557193 573550
41662 573550 2139133 2095779 1663888 608634 -1951730 -5256209 -7400266 -7395999 -5226927
41653 -5226927 -1045600 3692688 5632144 3008055 -889646 -1167138 1639169 1831886
41645 1831886 -2939530 -7465583 -6054790 -630925 2123344 -137128 -3350086 -3357908 -216060
41636 -216060 3900930 7104245 7261426 3024795 -2789473 -4384783 -157965 4274259
41628 4274259 3419686 -294209 -305940 4020368 6304782 2638833 -2729453 -3627192 -347312
41619 -347312 1655371 -358413 -3467578 -3827614 -1286446 1767271 4127389 6530488
41611 6530488 9268768 10782397 9458874 6084403 3185559 1825467 582714 -1368401
41603 -1368401 -1889053 1157468 5547262 6498723 3210280 359370 1586618 4402043
41595 4402043 3998152 -151985 -4510889 -6682803 -7010451 -5853593 -2995966 72762
41587 72762 741725 -953574 -2041242 -1144719 -520939 -2163174 -4550209 -5235286 -4380765
41578 -4380765 -3391236 -1941197 890513 3801484 4500142 3224865 2376100 2824801 3099239
41569 3099239 2293884 1216934 164078 -1910653 -4964341 -6855003 -6238959 -4648893
41561 -4648893 -3969293 -3435253 -1352158 1244397 1328612 -1683577 -4644119 -4623800 -2339607
41552 -2339607 -539423 -482464 -1587828 -3542523 -6624510 -9832860 -10596199 -7474777 -2347282
41543 -2347282 1185251 1478957 287968 481687 2792847 5170127 5312812 3379088 1520345
41534 1520345 820995 14268 -1870617 -3022881 -1248719 1693131 1234091 -3578132 -7725354
41525 -7725354 -6454747 -1611877 1174741 144209 -1240693 -115529 2223192 3231506
41517 3231506 2512525 1030340 -688407 -2194626 -2799397 -2736553 -2968638 -3080719 -1436229
41508 -1436229 1674203 3426951 2299588 68293 -1583542 -3713412 -7075489 -9066444
41500 -9066444 -6952972 -2439100 297340 42523 -1018684 -1280304 -942216 -20390 1598589
41491 1598589 2547608 1564053 253607 1018628 2714952 2127568 -364115 -816315 2027411
41482 2027411 4829865 5190625 4731630 4775747 3285797 -962303 -4844913 -5131399 -3479585
41473 -3479585 -3406488 -4373848 -2979486 991097 3568848 1746108 -3101906 -7129272 -7526795
41464 -7526795 -4381641 -582100 593536 -1122914 -3039061 -3721835 -4880428 -7367853
41456 -7367853 -8201843 -4764260 234952 1908702 -24221 -1674475 -1458086 -1845020 -4456795
41447 -4456795 -7329118 -7871261 -5497324 -898419 4225152 6473419 3338111 -2695529
41439 -2695529 -5928344 -4294786 -1339959 -584308 -1467292 -2177770 -2803806 -3563483 -3090730
41430 -3090730 -963728 537310 -489178 -2752916 -3862235 -3149910 -998752 2038595
41422 2038595 3919695 2050516 -2390569 -4362994 -1786518 893852 -897954 -5282314
41414 -5282314 -7610044 -7569238 -7861410 -8320244 -6835375 -4664734 -5144281 -7519802 -7437018
41405 -7437018 -3834590 -411973 322228 -190708 -387926 -520807 58024 2771050 5836133
41396 5836133 5310852 1632502 -25332 1989886 2720484 -998507 -4484638 -2300648
41388 -2300648 2979744 4763646 2197227 -2279 311230 727879 -54665 -208493 861411
41379 861411 816765 -1591293 -4398928 -5648632 -5789291 -5730894 -5151601 -3893529 -2815510
41370 -2815510 -2306634 -1932242 -2142958 -4110113 -7142557 -8512622 -6794916 -3437544 -351101
41361 -351101 1844504 2435770 216013 -3879409 -6036138 -3661402 1201255 4475566
41353 4475566 4859995 4139769 3749497 3209025 1684521 -690277 -3160815 -4865120 -5089798
41344 -5089798 -3996798 -2941831 -3206846 -4599708 -5986456 -6747251 -6850828 -6058029 -4323445
41335 -4323445 -2785282 -2923982 -4353398 -4631011 -2134209 1499696 2874917 838021
41327 838021 -1959426 -2179662 94533 1601803 332250 -1851116 -2087645 -683038 -399268
41318 -399268 -2044333 -3111112 -1398259 1956923 4175082 4123422 2658307 851393 -643199
41309 -643199 -1199842 -763017 -513794 -1629956 -3392642 -3759042 -2045464 86882 873833
41300 873833 723625 1198004 2150269 1454867 -1643726 -4246512 -2855928 1516047 3822217
41291 3822217 1598089 -1429517 -653482 2601498 3164019 -39576 -2440958 -816120
41283 -816120 2361254 3332278 2117282 502455 -1909253 -6114540 -10258313 -11503295
41275 -11503295 -10166474 -8481541 -6214381 -1486261 4257808 6468156 3857581 781654
41267 781654 1158657 3040096 2160706 -1057172 -1646377 2865297 8637509 10161820 7006563
41258 7006563 3869091 4223241 6128107 5573006 2349169 81497 762000 2231943 2075715
41249 2075715 1163215 1237678 1321450 -544769 -3411466 -4410975 -2976186 -1171956 -247411
41240 -247411 271023 364866 -533468 -1424155 -717910 534603 -217551 -2269366 -1874690
41231 -1874690 1721543 4498087 3855621 2735078 4669304 7976646 8437398 5480981
41223 5480981 2150270 534396 607878 2236438 4852619 6067893 4072714 944894
41215 944894 341753 2203668 2915232 587463 -3034130 -6014274 -8271706 -9706241 -9547701
41206 -9547701 -8460247 -8221594 -8209681 -5369306 655727 5336629 4544195 -244118 -4411930
41197 -4411930 -5890673 -5712710 -4580888 -2218825 423539 1489960 1128968 1627797 3967538
41188 3967538 6234699 6325776 4656689 3238782 3269438 4496929 5864600 5854226 3298006
41179 3298006 -813108 -3070804 -875805 4074944 7023143 5364819 1432224 -684445
41171 -684445 40921 1252334 994601 -106998 -710559 -900942 -1224633 -905363 1075663
41162 1075663 3520994 3674730 890978 -1968686 -1923314 405035 1860692 996002 -433261
41153 -433261 -469818 108508 -952844 -3860198 -5914281 -4472668 57086 4659056 6665990
41144 6665990 5847091 3980929 3004902 3527021 4636309 4962462 3996073 2327655 699684
41135 699684 -660251 -1611688 -1763798 -1130936 -455140 -130304 488703 1706832 2204596
41126 2204596 643240 -1940882 -3184839 -2721043 -2431152 -3170240 -3513007 -2581893 -1908132
41117 -1908132 -3078836 -5332169 -7000350 -7654772 -7155328 -4381610 749793 5313010
41109 5313010 6098019 3743783 1747744 1735354 2134548 1438935 301553 -7582 890324
41100 890324 2985258 5949425 8201995 7807574 5034872 2412566 1629522 1975571 2377395
41091 2377395 3044273 4045786 3998514 1705116 -1882092 -4563131 -5068231 -3558441 -915442
41082 -915442 1511051 2294385 1185113 -398676 -832961 124117 1573022 2667834 3131304
41073 3131304 3173889 3276414 3543763 3207778 1560020 -590167 -1436900 -370739 1355231
41064 1355231 2299633 2076914 895390 -724638 -1565693 -667184 866373 658504 -1698235
41055 -1698235 -3860210 -3932110 -2630643 -1267480 409435 2761037 4405094 3941514 2492498
41046 2492498 2507271 4588594 7102905 8347194 7641528 5035993 1629502 -432317 -117680
41037 -117680 681176 -658764 -3665074 -5168504 -3859618 -2427457 -3984549 -7654927
41029 -7654927 -9312331 -6501344 -1364093 1845225 1463619 -263685 -396431 1422791
41021 1422791 3474035 4438635 4032498 2176031 -574125 -2327049 -1720204 -194287 -94743
41012 -94743 -764485 522082 3529102 4513009 1836987 -1474269 -2725439 -3582509 -6358849
41003 -6358849 -9449523 -10035218 -8894361 -8569949 -8524752 -6360017 -2849244 -1449558 -2917924
40994 -2917924 -4293708 -3614510 -2200052 -1533965 -860925 1091033 4164437 7249159 9071570
40985 9071570 8487027 5673866 2659931 916361 -653535 -3203280 -4860725 -3208952
40977 -3208952 325892 2106502 1388074 3589 -1933130 -5223374 -7158560 -3796465
40969 -3796465 2673356 5032898 1473081 -1169669 2176114 6983319 6434804 1808731
40961 1808731 -414436 1130435 1622575 -1628608 -5467582 -6113982 -3851934 -1319611
40953 -1319611 -80282 -149213 -1061309 -2327028 -3528806 -4194614 -3532867 -1287333 904659
40944 904659 836475 -835482 -749709 2301155 5201625 5046038 3214515 2466129 2502385
40935 2502385 1565759 361867 779214 2105541 2118672 969967 459097 210121 -1704497
40926 -1704497 -4547842 -5027418 -2143327 1164182 2031280 901744 -39343 232201 906544
40917 906544 385254 -1990920 -4430400 -3972054 -572098 1805948 266557 -2742876 -3072233
40908 -3072233 -986806 -17770 -997699 -1451111 -506888 -191273 -1437310 -2487264 -1934404
40899 -1934404 -351910 1355213 2381212 1196998 -2316165 -4469508 -1599592 3953678
40891 3953678 6273251 4379479 3237248 5519977 7870244 7161255 5214539 4702881
40883 4702881 5033004 5081537 5641576 6320807 4485502 461694 -803009 2943191 6715017
40874 6715017 5456344 1598741 455210 1806514 1779614 131561 -470186 -357231 -1890256
40865 -1890256 -3962442 -3539124 -1784942 -2525904 -4994911 -4452856 -490641 1557150 -1144304
40856 -1144304 -5051175 -6534128 -6663127 -7152324 -6421155 -3046891 578619 1417229 -24524
40847 -24524 -1313688 -1474758 -578690 1467497 3556224 3381034 961248 -442823 885266
40838 885266 2252351 1005169 -1125362 -1385828 -1075782 -3286369 -7323107 -9597608 -9266375
40829 -9266375 -8938412 -9831764 -9964945 -7828028 -4751832 -2606593 -1582740 -1272438 -1819793
40820 -1819793 -2770176 -2461629 27526 3281721 4977210 4325199 2437125 921086 829591
40811 829591 2478257 5339875 7928434 8398526 5999225 2142971 -518856 -590510 946824
40802 946824 2588346 4239994 6016838 6346136 3819254 451184 -139360 1862063 2589429
40793 2589429 1202801 2067163 7353055 11734918 9339018 3086922 1082042 4789618
40785 4789618 7228831 3661383 -2031815 -3992087 -2201811 -212118 876614 1981214
40777 1981214 2353940 780604 -973530 -46345 2664740 3119987 -260021 -4629771 -6784027
40768 -6784027 -6585610 -5680653 -5078136 -4989571 -5333418 -5348833 -3935567 -1248225 976052
40759 976052 1323209 144213 -1305785 -2244748 -2418726 -1777532 -893121 -1037526 -2881939
40750 -2881939 -5194986 -5524308 -2545336 2339412 6061252 6840175 5842101 5323600 5485958
40741 5485958 4494168 1749182 -753501 -1434408 -1717646 -3711664 -6614447 -7806155 -6780454
40732 -6780454 -5445632 -4882099 -4557535 -4764988 -6688198 -9233842 -8961904 -4926444 -1053630
40723 -1053630 -1548451 -5822475 -10043012 -11895436 -11458860 -9081332 -5468126 -3053333
40715 -3053333 -4089155 -7188251 -8315023 -5693655 -1701563 504163 254857 -1330213
40707 -1330213 -3452578 -5989806 -8809250 -11414910 -12622309 -10734638 -5377510 846458
40699 846458 4205409 3736448 1769461 245040 -1513360 -4429482 -7094152 -7403987 -5665956
40690 -5665956 -4111314 -3649103 -2824339 -324643 2671854 3464152 968810 -2596770 -3701860
40681 -3701860 -1489775 762957 -835505 -5876236 -9436268 -7296534 -578717 5386933
40673 5386933 6319346 2764316 -896117 -915281 2082284 3975678 2051356 -1819458 -4002070
40664 -4002070 -4040698 -4468527 -5917988 -5458656 -1133441 4261530 6158106 3821159 988219
40655 988219 1298965 4391277 6333168 3377272 -4045498 -10867357 -12321500 -9666049
40647 -9666049 -8757362 -11935093 -14290816 -10558136 -3138902 740289 -1264163 -4233912
40639 -4233912 -3712270 -1465633 -1491054 -3559606 -3954201 -1205605 2066392 3178818 2944711
40630 2944711 4118891 7404473 10348966 10220341 6999209 2938175 -129528 -1925090
40622 -1925090 -2525476 -1716572 -83141 740587 -53367 -1317986 -1555567 -621687 899935
40613 899935 2623707 3695774 2882713 715732 -226435 1054270 1973764 307192 -1837091
40604 -1837091 -1137557 1404730 1916821 -128336 -1311032 85679 1983754 2721768 3237562
40595 3237562 3753315 2270389 -1616454 -4892090 -5441209 -5069576 -5661109 -5352691 -1772594
40586 -1772594 3273175 5918087 5518423 4460850 3835330 2705493 1054256 9249
40578 9249 -953495 -3843785 -8385884 -10991053 -8877307 -3647145 576201 1788700 1750746
40569 1750746 3050603 5316544 5303316 1199975 -4266681 -6787371 -6003157 -5460059 -6688068
40560 -6688068 -6562666 -2316765 3710424 7058316 6796319 5203286 3421057 819030
40552 819030 -2142949 -3821335 -4135431 -4590636 -5418214 -5172193 -3413594 -1650058 -1389011
40543 -1389011 -2936821 -5736614 -8007627 -6924201 -1847143 3155000 3085938 -1695112
40535 -1695112 -5964405 -6465801 -4983764 -4238905 -4377239 -4745661 -5769873 -7285564 -7784011
40526 -7784011 -7043767 -6915526 -7881209 -7709482 -5527514 -4202324 -5926521 -8103234 -6959662
40517 -6959662 -3218503 -559804 91663 878320 2397089 2755878 1364329 73390 -137017
40508 -137017 -428097 -1122084 -509380 1832143 3152709 1091227 -2594480 -3940966 -1400305
40499 -1400305 3121078 6903009 8392698 7253248 4260645 1063084 -1254112 -3191609
40491 -3191609 -5345734 -6506487 -4983701 -1629591 589413 582663 647287 2829879 5611363
40482 5611363 6012541 3665945 656569 -1747163 -3676679 -4444668 -2748598 414619
40474 414619 1932635 875471 -12355 1277425 2759547 1985307 458241 1231342 3606130
40465 3606130 4004579 1680790 -158927 638351 2399307 2810010 1874587 321891 -2257436
40456 -2257436 -5782682 -8193882 -7677146 -5232523 -3387049 -3155966 -3439603 -2618614 123123
40447 123123 4155000 7418031 8134325 6947700 6044296 5884653 4742362 2048689 -226591
40438 -226591 -761249 -987132 -2185776 -2798594 -1096767 1323552 1614234 83104 -384381
40429 -384381 1304585 3428656 4545508 4894181 4475357 2260609 -1739289 -5278862 -5795234
40420 -5795234 -2887789 1379426 4215236 4480187 3838789 4799857 7135777 7766317 5267447
40411 5267447 2480234 2506978 3850929 2478198 -2260161 -6865351 -8425417 -7125001
40403 -7125001 -4269254 -999389 812460 -379293 -3093321 -4038813 -2781608 -2295570
40395 -2295570 -4018193 -5616834 -5188710 -4465081 -5510780 -6862327 -5741149 -2325882
40387 -2325882 860557 2547601 3233294 3128063 2004688 499030 -532939 -1479921 -2989612
40378 -2989612 -4150642 -3599551 -1965728 -1202884 -1677683 -1866199 -1047383 -521902 -1701677
40369 -1701677 -4267416 -6653732 -7515611 -6588907 -4841084 -3715829 -3613870 -3490242 -2619982
40360 -2619982 -1996914 -2824849 -4303951 -4477563 -3037619 -1744672 -1953003 -3002280 -3257593
40351 -3257593 -1688993 1680997 5840605 9055852 9878561 8157290 4834541 1264313
40343 1264313 -870910 -234504 2224554 3122147 412244 -3372717 -3948137 -1036709 1317223
40334 1317223 471240 -1539146 -1529466 428841 1793424 1084676 -970515 -2655184 -2392116
40325 -2392116 126092 2829796 2681258 -592397 -3649341 -3758815 -2192578 -1628467 -1906901
40316 -1906901 -880857 1629220 3465100 3269188 1607931 -653751 -2768341 -3328532
40308 -3328532 -1632291 440020 579279 -227521 742273 2827609 2407571 -817277 -2396218
40299 -2396218 23704 2693871 1752860 -568818 40807 2644635 2738547 -430573 -3474438
40290 -3474438 -5071308 -7106028 -9225675 -7791837 -2137691 2861459 3219166 1122190
40282 1122190 828774 2466830 3277637 2551319 1714365 1192229 663364 1202469 3733750
40273 3733750 6198287 5723396 3172888 2040217 2856632 2427194 -601868 -3067512 -1978308
40264 -1978308 1013748 2197981 864694 -753121 -1346006 -1704779 -2425687 -2873314 -2843550
40255 -2843550 -3328092 -4657866 -5198312 -3193823 679554 3856626 4828589 4354405 3639509
40246 3639509 2740417 1455177 333029 -521798 -2348368 -5551060 -7774578 -6777319 -4482336
40237 -4482336 -4742428 -7074196 -6786715 -2542448 748567 -746999 -3880519 -3990466 -2562559
40228 -2562559 -3999569 -7259375 -7118840 -2898591 658044 1647108 3483193 7299029
40220 7299029 8404540 3934684 -1406297 -1971617 509113 449162 -2610443 -4160552 -2539477
40211 -2539477 -1125877 -2475587 -4719111 -4949151 -3075094 -1119495 -770566 -2323013
40203 -2323013 -4383391 -4442313 -1422921 2385162 3700613 2378509 1199080 1684684 2412856
40194 2412856 1752755 -57727 -2307097 -5094624 -7910844 -8617427 -5678475 -857456
40186 -857456 1803084 7073 -4317836 -6842360 -5099842 -775337 2396584 2592739
40178 2592739 1031576 -399798 -1042266 -756528 757345 2936675 4313126 4640272 5346848
40169 5346848 6637302 6391509 3927187 2378460 4214463 6421814 4256625 -1248908
40161 -1248908 -4117201 -1811030 1884447 3474975 4656933 8116651 12117248 12752233
40153 12752233 9590651 6000068 4957860 6861444 10352188 13017754 12191038 7355234
40145 7355234 1356855 -2473206 -3732139 -3905279 -3172549 -785628 2031455 2621879 805155
40136 805155 -409999 941695 3117697 3648926 2855867 2270972 1270774 -1656550 -4897458
40127 -4897458 -4607203 -651396 1665357 -1702429 -7500296 -9250965 -6039093 -3083314
40119 -3083314 -3550058 -4359214 -1904055 2087694 3541452 2003382 7270 -1484262
40111 -1484262 -3065474 -3615181 -1290690 2500854 4074997 2605490 637321 -675327
40103 -675327 -2688595 -4889877 -4029246 321378 3501536 2003273 -1413636 -2184910 -585325
40094 -585325 46376 -474747 665112 3745729 5599837 4655825 3238543 3793280 5621878
40085 5621878 6591384 5949120 4311332 2591458 1917735 3020565 4710405 4447040 1544957
40076 1544957 -1459090 -1816794 190076 2297957 3396242 3804986 3192035 684415 -2572357
40067 -2572357 -3330508 -139852 4312917 6528673 6505195 6459298 6461069 4789533 2522412
40058 2522412 3541242 8378768 12133422 11480599 10100729 12804043 17178805 16892383
40050 16892383 12022167 9570671 12943457 17053555 16183336 11535687 7904001 7112643
40042 7112643 8131849 10061639 11479464 10009302 6074198 4040571 5990327 7597922
40034 7597922 4577008 130166 508650 5273177 8045517 6107339 3196242 2538032
40026 2538032 2914147 2832836 3257741 4176597 3084167 -543100 -2991915 -1239207 2777437
40017 2777437 5236110 5141972 3590740 842247 -3047894 -6362421 -7162833 -5740572 -3855324
40008 -3855324 -2557799 -2205605 -3237089 -5143891 -5806411 -3745192 -426691 1162907
40000 1162907 -230826 -3397585 -6479101 -8269512 -8104311 -5676723 -1355462 3384645
39992 3384645 5981148 4252135 -960637 -5390182 -5485405 -2672387 -1404239 -3129578
39984 -3129578 -4775534 -3564265 -496783 1990551 3204035 3588869 3296978 3016279 4157582
39975 4157582 6446389 7159217 4575319 632675 -1490601 -917111 1228706 3781903
39967 3781903 5471009 4805972 2154903 378485 1317783 3100787 2965066 1204358 83116
39958 83116 313627 1015461 1842566 2664290 2336133 284117 -1850772 -2579386 -3114177
39949 -3114177 -4797269 -5720172 -3545229 -353318 -314128 -3048641 -4003781 -1793968 -343664
39940 -343664 -2272344 -4622420 -3633261 -210815 2183086 2353762 1290410 -437999 -2282738
39931 -2282738 -2485121 -214701 2206847 1881938 -730535 -2842928 -3354841 -3233021 -2589814
39922 -2589814 -375143 2871261 4621740 3404541 248789 -3397142 -7077394 -9911905
39914 -9911905 -10068389 -7304098 -4430259 -4217248 -5669772 -5396051 -2410621 456299 351961
39905 351961 -2161394 -4427931 -5083852 -4676640 -3739669 -2132096 -427107 -280603 -2489734
39896 -2489734 -5590275 -7335181 -7092500 -5970841 -4931398 -3725430 -1818539 300686
39888 300686 1210538 16236 -2400772 -4023610 -4012143 -3896723 -5488856 -7923902 -8406436
39879 -8406436 -6199197 -3919425 -3712945 -3970626 -1839671 2245809 5032500 5022397 4084831
39870 4084831 4230233 5035171 5108893 4317937 3397522 2551990 1562796 618169 272699 987643
39860 987643 2893407 5299811 6471638 5043064 1854886 -846496 -2265800 -3597308
39852 -3597308 -5229930 -5283429 -2276593 2096409 4579098 4175547 2949889 3255532 5269438
39843 5269438 7202286 7211923 5196623 3036901 2653542 3683381 4009266 2885273 2061175
39834 2061175 2888835 3938920 3217874 1523441 1307729 2716740 3177240 1122567 -2023238
39825 -2023238 -4150232 -4833351 -4580006 -3497386 -1946242 -1153747 -1773894 -2752839 -2838173
39816 -2838173 -2305195 -1898274 -1083194 808041 2328603 1157557 -2120436 -3718009 -1304623
39807 -1304623 2667064 3920607 1654129 -992346 -1458894 -734023 -1123003 -2611480 -2942250
39798 -2942250 -832612 2319976 4234867 4202940 3059958 1470306 -554748 -2495793
39790 -2495793 -3029995 -1634895 420410 1674750 2333996 3237005 3614861 1885515 -1238218
39781 -1238218 -2697811 -1031757 1743055 3542974 5246473 8019713 9604770 6734813
39773 6734813 495188 -4378656 -5745061 -6041074 -7202460 -7308028 -4303059 -24613
39765 -24613 2227261 2109824 1594941 1514779 1413145 1607422 2684726 3708772 3354299
39756 3354299 2106375 1035008 -630575 -3924263 -6931717 -6474773 -2964812 -293413
39748 -293413 -373268 -914335 428629 2686680 3790408 3520230 2464660 308729 -2639714
39739 -2639714 -3862635 -1052249 4418067 8270857 7556580 3243478 -1049757 -2322475
39731 -2322475 -766174 493140 -1172465 -4716105 -6712569 -5630548 -3118661 -1036507
39723 -1036507 496021 1515959 1283092 246163 488168 2352427 2863095 -107509 -3942326
39714 -3942326 -4373389 -1270288 1587956 1877637 936374 664854 968370 849617 -57648
39705 -57648 -1647838 -3333532 -3513748 -886675 3090963 4796181 2474672 -1571165 -3740743
39696 -3740743 -3023885 -1190094 -4820 484941 1089165 1927798 2228015 1521665 653000
39687 653000 1047674 2766038 3881436 2450343 -1214823 -4927395 -7056248 -7798655 -8068476
39678 -8068476 -7970663 -6849994 -4551985 -2151602 -1121592 -1761394 -2894272 -3484026 -3960948
39669 -3960948 -5114611 -6275054 -6009965 -4368389 -2734133 -1480478 201405 1908971
39661 1908971 1961472 558795 308672 2114869 3269487 1758785 -268849 -248048 120532
39652 120532 -2201839 -5792796 -6472097 -4045068 -2531886 -3424765 -3594934 -1284088 418648
39643 418648 -1372534 -4482482 -5024902 -2984288 -1168315 -413201 775267 2645914 3340135
39634 3340135 1638317 -1579681 -4705513 -6669953 -6998492 -6050683 -5079555 -4890200 -4801762
39625 -4801762 -4052664 -3477255 -4121225 -4756182 -2972602 1048572 4006273 3622853 1546299
39616 1546299 718416 1215544 717043 -1436800 -3024084 -2405930 -1159093 -1652711 -3353182
39607 -3353182 -3724451 -2203811 -721425 -68825 1430206 4418848 6336820 4927906
39599 4927906 1928633 663161 1428207 2081815 1992523 2081416 1650116 -1043245 -4889611
39590 -4889611 -6369289 -4707314 -3031141 -3181253 -3030430 -913443 795530 -595617
39582 -595617 -3535326 -4643340 -3725092 -3054400 -3039985 -2047386 53978 1324763 799269
39573 799269 -334370 -673080 219343 2300195 4735399 5481223 3369630 424829 -85618
39564 -85618 2181843 4631980 5751363 6512522 7390599 6851705 4179412 1521943 1190918
39555 1190918 2295181 1957748 -805849 -4047923 -5478743 -4791528 -3350799 -2594227 -3105521
39546 -3105521 -4627622 -6420557 -7749786 -8501313 -9368396 -10841815 -11733135 -9717466 -4583554
39537 -4583554 -214941 -1211130 -7285497 -13150413 -14694250 -13026863 -11268252 -10037827
39529 -10037827 -8418592 -7000449 -6650391 -5734548 -2257196 1872787 2497777 -737178
39521 -737178 -3581463 -3069996 -821227 554478 976277 1220433 719212 -974077 -2946870
39512 -2946870 -4966691 -8237209 -12104785 -12771502 -8149235 -1756195 1489729 1614097
39504 1614097 2169369 3870284 3910207 1417144 -699129 -400108 511735 -278823 -2082900
39495 -2082900 -2950260 -2838697 -3027333 -3783378 -4406207 -4581340 -4221594 -2923752 -989079
39486 -989079 -105218 -1542995 -4232535 -5849947 -5352217 -3546665 -1868441 -1443819 -2376635
39477 -2376635 -3019216 -1281394 2068251 3107649 -195929 -4276356 -4173405 -304989
39469 -304989 2451294 1890028 574254 475611 181885 -817479 325227 4724955 7996380
39460 7996380 5891213 1089102 -437923 1716142 2254082 -1510324 -6184356 -7815492
39452 -7815492 -6455919 -3958258 -1154023 1069038 1238344 -316641 -1343333 -1327389 -2222161
39443 -2222161 -4141270 -3975922 -509604 2653664 2163949 -226768 -1109405 -759190 -1335329
39434 -1335329 -2337584 -2015896 -1257883 -1718672 -1816498 654338 3206475 1254583 -4306028
39425 -4306028 -7463433 -5590137 -2444398 -1403806 -703521 2196541 5618759 6105666
39417 6105666 3186713 -796676 -3568007 -3769975 -1069801 2846086 5252445 5624805
39409 5624805 5894544 6752152 6607784 5346316 5566541 7983532 9016128 5860366 1117635
39400 1117635 -910793 -254077 -191291 -1984412 -4175532 -5759700 -6597288 -5619926 -1978381
39391 -1978381 2525803 5057987 5282693 4713061 3557633 1343369 -168874 1594609
39383 1594609 5684191 8188375 7540953 6022442 5368379 4282759 1716882 -337861
39375 -337861 524414 3450512 5165640 3644342 -86892 -3064077 -2852947 176736 2930775
39366 2930775 2999253 1610294 1546626 2698645 2332146 -97611 -1551510 -75012 1933065
39357 1933065 1162895 -1924550 -4168492 -4152493 -3273448 -3008787 -3173577 -2856845 -1640373
39348 -1640373 194980 1726716 1747152 -143623 -2879964 -4876860 -5418537 -4831974 -3863742
39339 -3863742 -3356310 -3957283 -5563050 -7400745 -8921124 -10066803 -10561232 -9890464 -8370306
39330 -8370306 -7218366 -6970621 -6727621 -5563016 -3741943 -1932707 -283447 962285
39322 962285 1127807 395221 181143 834415 162354 -3784376 -9152933 -11739470 -9929184
39313 -9929184 -6083704 -2839236 -446828 1311888 1161076 -1444177 -3736183 -2257967
39305 -2257967 2173042 4959884 3845442 1843338 2418111 4117785 2943472 -1074143
39297 -1074143 -3240475 -658047 3787821 5481617 3764593 1466712 458823 203913
39289 203913 -108080 -550597 -1540190 -3737006 -6411409 -7509668 -5902177 -2581890 459077
39280 459077 1603661 226460 -2635188 -4387583 -3186654 -167676 1981174 2430670
39272 2430670 2541706 3068676 3196111 2594951 2297297 2966117 4158565 5651704 7393829
39263 7393829 7868324 5233715 900479 -1049343 501825 1717422 -370968 -3092260
39255 -3092260 -2365660 776167 2004058 749736 1005137 4909899 9468341 10826787
39247 10826787 8812982 5702378 2804629 141777 -1880155 -2305239 -840512 1604482
39239 1604482 3441554 3457562 2030936 1282386 3123019 7015902 10374342 11100235 9072107
39230 9072107 5630082 2718631 2081596 3788506 5608739 5228724 3066794 1536769
39222 1536769 1671991 2138479 1662133 616892 -213442 -754005 -976219 -758030 -1008265
39213 -1008265 -3150633 -6535490 -8067962 -5763072 -1367769 1915328 3135876 3538115
39205 3538115 3912803 3987491 3999078 4797595 6027525 5857936 3409322 415910 -663440
39196 -663440 179350 382266 -1807516 -4790833 -5438359 -3021230 43055 1481549 1551964
39187 1551964 1370447 671549 -1051770 -2580786 -2473896 -1717772 -2286868 -3467667 -2565461
39178 -2565461 541667 2724228 2402018 1933387 3575670 5833191 6056598 4475414 3190577
39169 3190577 2884575 3013461 3777934 5273820 5898361 4398001 2644386 3486211 6318297
39160 6318297 7706687 6339118 4443212 3872479 3533015 1725231 -1051552 -2839389
39152 -2839389 -2503233 -583663 1183472 1151647 -337484 -782905 1247544 3517311 2977769
39143 2977769 447271 -649101 54648 -719441 -4066286 -6517960 -5395208 -2914754
39135 -2914754 -2256442 -2621836 -1534112 387325 788038 125799 831737 2614462 2513715
39126 2513715 -228501 -2848228 -3246210 -2452135 -2011409 -1705592 -1196728 -1582659 -3586538
39117 -3586538 -5738695 -5932512 -3879674 -1010963 1171671 1896626 1234072 68626 -903728
39108 -903728 -2427816 -5599936 -9103980 -9372186 -4834190 1289684 4086026 2294574
39100 2294574 -732361 -1097305 1685722 4678555 4682278 1438184 -1943457 -1965294 1642719
39091 1642719 5716092 7183598 6096730 4843644 5107287 6130836 5598778 2090007
39083 2090007 -2868868 -5509160 -3671148 301149 2122251 981605 190510 1845326
39075 1845326 3499389 1877835 -2326303 -5798254 -7144236 -7326825 -6628232 -4358714
39067 -4358714 -1501697 -649241 -2555274 -5028813 -6093615 -6299515 -6993501 -8114340 -8889994
39058 -8889994 -9280778 -9449156 -8878107 -7285676 -5660495 -5201052 -5675457 -5841419 -5253452
39049 -5253452 -4807159 -5468335 -6992571 -8131958 -8120580 -7814999 -8733062 -10538222 -10423393
39040 -10423393 -6365940 -570001 2155704 -140886 -4190814 -5245465 -2008008 2736420
39032 2736420 5168584 3382408 -1456637 -5848501 -6779365 -4827129 -3706343 -5873316
39024 -5873316 -9535549 -11128757 -9788126 -7743005 -6735100 -5910136 -3710926 -517374
39016 -517374 1574164 1176972 -943289 -2967626 -4122863 -5144638 -6606675 -7593136 -6802478
39007 -6802478 -4454393 -2001392 -192089 1349701 2800328 3925311 5189002 7204022
38999 7204022 8765987 7691188 4521870 2961106 4905509 7281699 6285726 3046449
38991 3046449 2035273 4742113 8071812 8831261 6846064 3467225 32574 -1495637
38983 -1495637 502632 4106136 4328895 -778008 -6302082 -5621302 1213902 6940465
38975 6940465 5406837 -1565419 -6811031 -6179405 -2635180 -1849076 -5094863 -8087570
38967 -8087570 -6827888 -2650290 37105 -280442 -1077056 -490632 -183177 -1996452 -4070731
38958 -4070731 -2965194 1244226 4735856 5038347 3926751 4111623 4970971 3639826 -407426
38949 -407426 -4137017 -4732361 -2737518 -360483 1717427 3801376 4403918 1063002 -5245659
38940 -5245659 -9258594 -7228025 -2009469 290434 -1941185 -4312153 -2915966 559567
38932 559567 1699538 -720962 -3806505 -4573728 -2846946 -233175 2017402 3451053
38924 3451053 3772638 2867772 1431991 786152 1429375 1995325 569753 -2608494 -4777858
38915 -4777858 -3934764 -1621170 -918164 -2131961 -2489488 -417115 1935497 1552837 -1563245
38906 -1563245 -4734669 -5821307 -4736808 -2507777 -287514 977546 1134441 1075211 1619180
38897 1619180 2357718 2328481 1462996 542005 112640 350637 1505846 3264267 3961236
38888 3961236 1921440 -2181591 -5535413 -6114364 -4356791 -1764275 678971 2060365
38880 2060365 1245365 -1383482 -3027100 -1384572 1892341 2799183 239149 -2547062
38872 -2547062 -2666133 -1389805 -1479204 -2633411 -2429659 -840481 -460263 -1979718 -2720190
38863 -2720190 -961686 1112606 773916 -1231709 -2343896 -1941875 -734565 1929012
38855 1929012 6678750 10827086 10242808 4968618 -213389 -1645890 -377476 1063715
38847 1063715 2425510 4410111 6014176 5574276 3206128 427161 -1571597 -1916414
38839 -1916414 246267 4267205 7295927 6887670 3704557 300423 -1910453 -3100282
38831 -3100282 -3498821 -3223463 -3057844 -3726372 -4696218 -5011435 -4810844 -4656727 -3965335
38822 -3965335 -1773518 1200532 2916882 2544555 1327078 751497 938310 1117732 942953
38813 942953 998697 2115334 3972222 4619555 2532461 -660734 -1164125 2369462 6822263
38804 6822263 8470586 7212475 5313452 3717279 2055651 1081026 2139731 4537899
38796 4537899 6054520 6101729 6023812 6187658 5257880 2893642 899694 725295 1463544
38787 1463544 1237135 -604935 -3219858 -5143297 -5169755 -3430979 -1686585 -1513211 -2409068
38778 -2409068 -2840298 -2622000 -2684619 -3046026 -2978755 -2779085 -3167530 -3218013 -1381447 1438337
38768 1438337 2507794 1271890 22550 45430 12833 -804229 -681084 1527242 3888914
38759 3888914 3852790 1571510 -691034 -1060566 890815 3761516 4304116 164257 -6357920
38750 -6357920 -9836500 -8216090 -5038301 -3866939 -3840023 -2889797 -1881213 -2366460 -3087263
38741 -3087263 -2247945 -876176 -345323 972235 4420843 6774847 4291689 -521644
38733 -521644 -1789888 777369 1774205 -792851 -2597973 -884792 840915 -807512
38725 -807512 -3230276 -2637233 -755852 -1816159 -5302662 -6671578 -4242655 -1061758
38717 -1061758 -150470 -1459997 -3542229 -5106428 -4724636 -1833737 1551626 2534845 1030407
38708 1030407 -520305 -1142707 -2225045 -3957972 -4073641 -1636343 684092 303075 -1450065
38699 -1450065 -1699872 -570755 -393987 -1257020 -668676 2039249 4004139 2833217 103684
38690 103684 -911664 353411 1525935 879877 -566242 -680892 1162393 3536059 4676538
38681 4676538 4539839 4866202 6666596 8046205 6070355 1172791 -2220195 -832833
38673 -832833 3320213 5857997 5679822 5062416 5060330 4287143 2620805 2611130 5524443 8640843
38663 8640843 8717238 6379962 4831259 5392421 6538609 6612166 5343186 2933864 -403642
38654 -403642 -3710211 -5500753 -5310331 -4443032 -4860397 -7216781 -9609585 -8683293 -3343735
38645 -3343735 2683633 4111733 549599 -2795222 -2250320 -610287 -2247135 -5895519
38637 -5895519 -6459173 -2826525 672696 810865 -836550 -1908747 -3010922 -5167440
38629 -5167440 -6542451 -4641417 -164435 3868785 5879471 6560704 6748712 6475998 5834515
38620 5834515 5133787 4233543 2889780 1658562 1473598 2395273 3509329 3928523 3396506
38611 3396506 2305031 1691098 2699157 5247152 7550958 7788748 6129956 4410435
38603 4410435 3750642 3131802 769332 -3242100 -6242018 -5616353 -1989720 1274649 2234617
38594 2234617 2645146 4769426 7268402 6695237 2692545 -1050933 -1597804 -40902 1024747
38585 1024747 927895 266684 -993327 -2552905 -2472977 590202 4604533 6087471 4612190
38576 4612190 3150131 3780808 5248489 5497095 4742584 4651319 5500440 5648564 3703960
38567 3703960 195090 -3177091 -5273569 -5917510 -4928605 -1936964 2155425 4479047
38559 4479047 2546191 -2680004 -7492515 -9546030 -9849469 -10188266 -10341844 -9175830 -7123305
38550 -7123305 -5788723 -5720229 -6127370 -6374456 -6312486 -5507524 -3672664 -1744085 -1084713
38541 -1084713 -1572149 -1769570 -1050748 -263179 -146397 -396103 -569531 -658300 -396947 717741
38531 717741 2175552 2481827 1225991 -20647 85655 508039 -775268 -3770803 -6326572
38522 -6326572 -6885509 -5945580 -4478050 -2325414 904640 4377663 6762616 7914516
38514 7914516 8444187 7859010 4931817 430985 -2339458 -1146536 2145562 3692545
38506 3692545 1989971 -1505047 -5088821 -7793826 -8129845 -4905056 -83496 1971348
38498 1971348 -260999 -3134004 -2622851 506548 2663013 2941327 3575320 5473287 6564571
38489 6564571 5270459 3052658 2172749 2597760 2599917 1494607 412970 556260 1519931
38480 1519931 1505376 -900710 -4996337 -8106101 -7899345 -4670628 -1083833 274922 -1041093
38471 -1041093 -3300494 -4259049 -3302953 -2270525 -3509678 -6762105 -9031256 -8313411 -6162875
38462 -6162875 -5137932 -4949817 -3396025 -516209 959536 -197705 -1626429 -860344
38454 -860344 949156 644596 -2559261 -6081952 -7129580 -5527525 -3400496 -3048134 -5265053
38445 -5265053 -8847325 -11275570 -10421228 -6278050 -1083432 2642495 4305102 5144050
38437 5144050 5841285 5115005 1733571 -2667766 -4668906 -3412744 -2014731 -3383863
38429 -3383863 -6144623 -6540504 -3463628 489794 2688361 3182721 3455595 4027744 3976352
38420 3976352 2144624 -1287639 -4061006 -3434424 505645 4137809 4401241 2527207
38412 2527207 1645162 1825687 606390 -1959695 -2635209 -359476 1334608 -660797 -4481642
38403 -4481642 -6417290 -6399452 -7244275 -9606540 -10847933 -8836989 -4477865 -289546 1685705
38394 1685705 539746 -3032901 -6529557 -7434139 -5765632 -3828885 -3295923 -3730393 -4145761
38385 -4145761 -4504592 -4946873 -4796718 -3510151 -1934391 -1404675 -1789072 -1587045 -178522
38376 -178522 1100434 792007 -631033 -1628220 -1910579 -2307273 -2439083 -702399 2497316
38367 2497316 3657306 352724 -4915657 -7477732 -6273494 -4311480 -3880223 -4251350
38359 -4251350 -4202245 -3674313 -2225694 1012200 4532822 4649084 451963 -3965898 -4420200
38350 -4420200 -1553508 1333819 2989984 3974971 3840096 1947922 -225797 -948525 -1355405
38341 -1355405 -3337561 -5289264 -3937033 -95567 1714086 8766 -1501682 96534
38333 96534 2784127 3735315 4038298 6076682 8692038 8623806 5563786 2416297 938545
38324 938545 99077 -1088198 -1770028 -1091387 146051 727416 677638 731339 988320 937782
38314 937782 352674 -490820 -1286314 -2020312 -2946885 -4392230 -6420874 -8608740 -10261938
38305 -10261938 -10828132 -10019959 -7850206 -4943800 -2567871 -1684598 -1866385 -1713343 -591466
38296 -591466 568519 636084 -5273 121852 1446529 2399347 1136811 -2063141 -4662455
38287 -4662455 -4229885 -794639 3134240 4802551 3575187 1152970 -664449 -2172296
38279 -2172296 -4974613 -8919602 -11097141 -9035192 -4159340 -542731 -347629 -1966460
38271 -1966460 -2775822 -2098338 -823570 393003 1376197 1757496 1194261 -105271 -1750961
38262 -1750961 -3638392 -5548746 -6795449 -6755628 -5400500 -3224599 -1257291 -890722 -2457554
38253 -2457554 -4058682 -3458779 -1321949 -562609 -2030977 -3320830 -2914467 -2685420 -4278262
38244 -4278262 -5724392 -4693661 -3087479 -4709576 -9358553 -12899829 -12944446 -11050943
38236 -11050943 -9235345 -7745226 -6894389 -7729662 -9501114 -9168364 -5076278 768679
38228 768679 5319094 7596171 8132449 7236375 5228453 2993714 1082218 -647152 -1822988
38219 -1822988 -1483887 69739 999032 439982 -267938 174120 1135581 1491932 1429055
38210 1429055 1611203 1872181 1873030 1839220 1669653 684250 -698595 -497182 2317844 5995723
38200 5995723 7844847 6908496 4093230 1045748 -347246 863936 2916317 2568819
38192 2568819 -644912 -3401612 -3301959 -2267350 -3025715 -4429729 -3374424 -7033 2344979
38183 2344979 2006641 654951 68436 -146253 -1020408 -2502557 -3941825 -4801456 -4486006
38174 -4486006 -2712845 -268361 1712411 3241530 5196409 7620482 9274307 8754355
38166 8754355 5427588 -62149 -5390064 -7697815 -6410197 -3965710 -2522009 -1277478
38158 -1277478 1278031 4034071 4653732 3204948 1683069 653121 -766891 -2095466
38150 -2095466 -1813006 -392006 261209 598653 3065384 7026928 7800227 2863318 -3847313
38141 -3847313 -6420140 -3814777 175753 2240018 2241965 1493111 901579 916700 1544881
38132 1544881 2054531 1611433 260278 -1352718 -2918189 -4328184 -4826199 -3227229 616338
$$ [...]
##END NTUPLES=NMR SPECTRUM
##END=
