##TITLE=31Pdec_SR5_rm2
 , 24 sc
 26.12.2019
##JCAMPDX= 6.0         $$ Bruker NMR JCAMP-DX V2.0
##DATA TYPE= NMR SPECTRUM
##DATA CLASS= NTUPLES
##ORIGIN= UXNMR, Bruker Analytische Messtechnik GmbH
##OWNER= root
$$ XWIN-NMR		Version 3.5
$$ Thu Dec 26 14:17:21 2019 Russian Standard Time (UT+4h)  she@DPX200
##.OBSERVE FREQUENCY= 81.013821
##.OBSERVE NUCLEUS= ^31P
##.ACQUISITION MODE= SIMULTANEOUS
##.ACQUISITION SCHEME= undefined
##.AVERAGES= 24
##.DIGITISER RES= 17
##SPECTROMETER/DATA SYSTEM= spect
##.PULSE SEQUENCE= zgpg30
##.SOLVENT NAME= CDCl3
##.SHIFT REFERENCE= (INTERNAL, CDCl3, 0, 182.463)
##AUDIT TRAIL= $$ (NUMBER, WHEN, WHO, WHERE, WHAT)
$$ ##TITLE= Audit trail, XWIN-NMR		Version 3.5
$$ ##JCAMPDX= 5.01
$$ ##ORIGIN= Bruker BioSpin GmbH
$$ ##OWNER= she
$$ F:/spectra/data/she/nmr/P31/1/pdata/1/auditp.txt
$$ ##AUDIT TRAIL=  $$ (NUMBER, WHEN, WHO, WHERE, WHAT)
(   1,<2019-12-26 14:16:02.06 +0400>,<she>,<DPX200>,
      <created by zg, POWCHK disabled, PULCHK disabled
       configuration hash MD5:
       00 E9 B6 7A A2 85 ED C7 34 08 36 98 17 FE 4E 26
       data hash MD5: 32K
       95 D5 58 19 5F B6 99 EB 31 01 80 D8 08 D1 EA 7C>)
(   2,<2019-12-26 14:16:23.93 +0400>,<she>,<DPX200>,
      <Start of raw data processing
       efp BC_mod = 2 LB = 1 FT_mod = 6 PKNL = 1 PHC0 = -1680.972 PHC1 = 53.60119 SI = 64K 
       data hash MD5: 64K
       F0 D1 A6 AF A9 41 2B 91 4B 75 0A 4E D9 CF 45 B8>)
(   3,<2019-12-26 14:16:47.04 +0400>,<she>,<DPX200>,
      <pk PHC0 = 16.35044 PHC1 = 16.2 
       data hash MD5: 64K
       DE A4 D6 15 CC A9 32 37 5D BB D3 1C 01 6C 90 AF>)
$$ ##END=
$$ 
$$ hash MD5
$$ 37 49 F6 D6 31 98 16 A7 23 85 1B 55 69 31 3E D1
##$RELAX= 
##$RELAX= 
##$RELAX= 
##$RELAX= 
##$RELAX= 
##$RELAX= 
##$RELAX= 
##$RELAX= 
$$ Bruker specific parameters
$$ --------------------------
##$DU= <F:/spectra>
##$EXPNO= 1
##$NAME= <P31>
##$PROCNO= 1
##$TYPE= <nmr>
##$USER= <she>
##$AMP= (0..31)
100 100 100 100 100 100 100 100 100 100 100 100 100 100 100 100 100 100 
100 100 100 100 100 100 100 100 100 100 100 100 100 100 
##$AQSEQ= 0
##$AQ_mod= 1
##$AUNM= <au_zg>
##$AUTOPOS= <>
##$BF1= 81.014009
##$BF2= 200.13
##$BF3= 200.13
##$BF4= 200.13
##$BF5= 200.13
##$BF6= 200.13
##$BF7= 200.13
##$BF8= 200.13
##$BYTORDA= 1
##$CFDGTYP= 0
##$CFRGTYP= 5
##$CHEMSTR= <none>
##$CNST= (0..31)
1 1 145 1 1 1 1 1 1 1 1 1 1 1 1 1 1 1 1 1 1 1 1 1 1 1 1 1 1 1 1 1 
##$CPDPRG= <waltz16>
##$CPDPRG1= <>
##$CPDPRG2= <waltz16>
##$CPDPRG3= <>
##$CPDPRG4= <mlev>
##$CPDPRG5= <mlev>
##$CPDPRG6= <mlev>
##$CPDPRG7= <mlev>
##$CPDPRG8= <mlev>
##$CPDPRGB= <>
##$CPDPRGT= <>
##$D= (0..31)
0 1 0 0 0 0 0 0 0 0 0 0.03 2e-05 3e-06 0 0 0 0 0 0 0 0 0 0 0 0 0 0 0 0 
0 0 
##$DATE= 1577355361
##$DBL= (0..7)
120 120 120 11 120 120 24 19 
##$DBP= (0..7)
150 150 150 150 150 150 150 150 
##$DBP07= 0
##$DBPNAM0= <>
##$DBPNAM1= <>
##$DBPNAM2= <>
##$DBPNAM3= <>
##$DBPNAM4= <>
##$DBPNAM5= <>
##$DBPNAM6= <>
##$DBPNAM7= <>
##$DBPOAL= (0..7)
0.5 0.5 0.5 0.5 0.5 0.5 0.5 0.5 
##$DBPOFFS= (0..7)
0 0 0 0 0 0 0 0 
$$ [...]
##$SUBNAM2= <"">
##$SUBNAM3= <"">
##$SUBNAM4= <"">
##$SUBNAM5= <"">
##$SUBNAM6= <"">
##$SUBNAM7= <"">
##$SUBNAM8= <"">
##$SUBNAM9= <"">
##$SW= 369.568048894756
##$SWIBOX= (0..15)
0 1 3 0 0 0 0 0 0 0 0 0 0 0 0 0 
##$SW_h= 29940.119760479
##$TD= 32768
##$TD0= 1
##$TE= 0
##$TE2= 300
##$TE3= 300
##$TEG= 300
##$TL= (0..7)
0 120 53 12 22 120 120 120 
##$TP= (0..7)
150 150 150 150 150 150 150 150 
##$TP07= 0
##$TPNAME0= <>
##$TPNAME1= <>
##$TPNAME2= <>
##$TPNAME3= <>
##$TPNAME4= <>
##$TPNAME5= <>
##$TPNAME6= <>
##$TPNAME7= <>
##$TPOAL= (0..7)
0.5 0.5 0.5 0.5 0.5 0.5 0.5 0.5 
##$TPOFFS= (0..7)
0 0 0 0 0 0 0 0 
##$TUNHIN= 0
##$TUNHOUT= 0
##$TUNXOUT= 0
##$USERA1= <user>
##$USERA2= <user>
##$USERA3= <user>
##$USERA4= <user>
##$USERA5= <user>
##$V9= 5
##$VALIST= <valist>
##$VCLIST= <CCCCCCCCCCCCCCC>
##$VD= 0
##$VDLIST= <DDDDDDDDDDDDDDD>
##$VPLIST= <PPPPPPPPPPPPPPP>
##$VTLIST= <TTTTTTTTTTTTTTT>
##$WBST= 1024
##$WBSW= 4
##$XGAIN= (0..3)
0 0 0 0 
##$XL= 0
##$YL= 0
##$YMAX_a= 179324
##$YMIN_a= -144562
##$ZGOPTNS= <>
##$ZL1= 120
##$ZL2= 120
##$ZL3= 120
##$ZL4= 120
##$ABSF1= 0
##$ABSF2= 0
##$ABSG= 0
##$ABSL= 0
##$ALPHA= 0
##$AQORDER= 0
##$ASSFAC= 0
##$ASSFACI= 0
##$ASSFACX= 0
##$ASSWID= 0
##$AUNMP= <proc_1d>
##$AZFE= 0.1
##$AZFW= 0.5
##$BCFW= 0
##$BC_mod= 2
##$BYTORDP= 0
##$COROFFS= 0
##$CY= -3
##$DATMOD= 1
##$DC= 0
##$DFILT= <>
##$DTYPP= 0
##$F1P= 0
##$F2P= 0
##$FCOR= 1
##$FTSIZE= 65536
##$FT_mod= 6
##$GAMMA= 0
##$GB= 0
##$INTBC= 1
##$INTSCL= 5.30512e-09
##$ISEN= 30
##$LB= 1
##$LEV0= 0
##$LPBIN= 0
##$MAXI= 10000
##$MC2= 0
##$MEAN= 0
##$ME_mod= 0
##$MI= 50
##$NCOEF= 0
##$NC_proc= -3
##$NLEV= 6
##$NOISF1= 182.463
##$NOISF2= 159.3651
##$NSP= 0
##$NTH_PI= 0
##$NZP= 0
##$OFFSET= 182.463
##$PC= 4
##$PHC0= -1664.622
##$PHC1= 69.80119
##$PH_mod= 1
##$PKNL= yes
##$PPARMOD= 0
##$PSCAL= 0
##$PSIGN= 0
##$REVERSE= no
##$SF= 81.0140089999434
##$SI= 65536
##$SIGF1= 159.3651
##$SIGF2= -187.1042
##$SINO= 113.3802
##$SIOLD= 16384
##$SREGLST= <1H.CDCl3>
##$SSB= 0
##$STSI= 65536
##$STSR= 0
##$SW_p= 29940.119760479
##$SYMM= 0
##$S_DEV= 0
##$TDeff= 32768
##$TDoff= 0
##$TI= <>
##$TILT= no
##$TM1= 0
##$TM2= 0
##$TOPLEV= 0
##$USERP1= <user>
##$USERP2= <user>
##$USERP3= <user>
##$USERP4= <user>
##$USERP5= <user>
##$WDW= 1
##$XDIM= 65536
##$YMAX_p= 324701562
##$YMIN_p= -2715490
$$ End of Bruker specific parameters
$$ ---------------------------------
##NTUPLES= NMR SPECTRUM
##VAR_NAME=  FREQUENCY,     SPECTRUM/REAL,   SPECTRUM/IMAG
##SYMBOL=    X,             R,               I
##VAR_TYPE=  INDEPENDENT,   DEPENDENT,       DEPENDENT
##VAR_FORM=  AFFN,          ASDF,            ASDF
##VAR_DIM=   65536,         65536,           65536
##UNITS=     HZ,            ARBITRARY UNITS, ARBITRARY UNITS
##FACTOR=    0.456856943014862, 1,           1
##FIRST=     14782.0589164792, 0,            0
##LAST=      -15158.0608439998, 0,           0
##MIN=       -15158.0608439998, -2715490,    0
##MAX=       14782.0589164792, 324701562,    0
$$ Real data points
##PAGE= N=1
##DATA TABLE= (X++(R..R)), XYDATA
$$ [...]
47135C22970M8992L6902n4483j21934q7441R588P2494N1945m0379j61686k26992
47124a50024j34662J05841L17112L28859J76572J7670r8168k15375k69929j32663
47114e4767J08738J68506j4922j23083P7167L35986K75269j8132j16426Q4160
47104G22496K19646N6962j42336o5161J44567J25921j19774k27594j7957K51323
47094I48093K60072M1000j09927k3890J68363K23303O2084j49085j77127J9841
47084A262727K31694K25549J4690j54646p5276K20475N26970O66278O20965N38237
47074D077663O15398R12412J269359J495394J646845J975410K514606K847213
47066A7354300K449144J234643l53997j745854k591902k794667k454368j874701
$$ plain form
47135 322970 371962 408864 354381 232447 145006 154594 227088 279033 238654 76968 -150024
47124 -150024 -284686 -178845 138267 467126 643698 661368 563200 347825 77896 -54767
47114 -54767 53971 222477 207555 84472 161639 497625 772894 754762 638336 722496
47104 722496 942142 999104 856768 791607 936174 1062095 942321 714727 696770 948093
47094 948093 1208165 1249165 1139238 1115348 1283711 1507014 1569098 1420013 1242886 1262727
47084 1262727 1494421 1719970 1734660 1580014 1504738 1725213 2252183 2918461 3539426 4077663
47074 4077663 4693061 5605473 6874832 8370226 10017071 11992481 14507087 17354300
47066 17354300 19803444 21038087 20684090 18938236 16346334 13551667 11097299 9222598
47058I222598j423049j225903j094085q46289n78814m80823n11908m65076k89119
47049B307532j41017j26383j76509k01122j90593j38140l0578M3562m8177k56829
47039A041746l60260k73223j64669j62751j45072J2890J65503J04156q3377j15846
47029A9097O8604K42518K28224R1066l0119r2976j07794q4755o9145r6620r9700
47018F8400k824R8866M4597j03630j11000M4773J04324m4355j46481R972K16915
47007A79557J62402o2588j18585K2593N7691j01878j56048P7248L19171K33574
46997F13137o1096j75332k0519J05815m731j83386j61056N5845K22502J73090
46987E64269k4047j92236k25778j40167j6548O8986Q5516M7765r219n2009n7524
$$ plain form
47058 9222598 7799549 6573646 5479561 4633272 4054458 3573635 3061727 2596651 2307532
47049 2307532 2166515 2040132 1863623 1662501 1471908 1333768 1303190 1346752 1298575 1041746
47039 1041746 681486 408263 243594 80843 -64229 -51339 114164 218320 134943 19097
47029 19097 87701 330219 558443 649509 619390 526414 418620 333865 264720 168100 68400
47018 68400 65576 164442 209039 105409 -5591 39182 143506 99151 -47330 -37358 179557
47007 179557 341959 279371 160786 183379 241070 139192 -16856 60392 379563 613137
46997 613137 552041 376709 356190 462005 457274 273888 112832 168677 391179 564269
46987 564269 540222 347986 122208 -17959 -34507 34479 119995 167760 158541 106532 49008
46976D9008k2507L1493P7149J03151J00726M6558n5673j26490p9172L8457N9643
46965B22343p4829j89055r0723J34367K10088N6816r5040n2944O0035L0897q3107
46954A28848m9063J43472K34597Q4994j18014j58527j01802j29277j98593j01074
46944b64439J68564L25272J55908j77289l15844j27472J60979K51209J07087m8591
46934B35384l1367R1117J17585j0105j35552r9420N9561J63490J05317n2562j59876
46923B83572j15444N0176J90672J71378J4697j17881j19038m9793r117K7736J31852
46912D58810K36765J85183k6185j89170j35910N2707J69178J35844M8197Q659
46902I44078K1887N3797R8936J46346J42142N7693k5138J9697J82779K84690J98394
$$ plain form
46976 49008 26501 57994 135143 238294 339020 385578 329905 203415 124243 162700 222343
46965 222343 147514 -41541 -132264 2103 212191 269007 173967 121023 181058 211955 128848
46954 128848 79785 223257 457854 542848 424834 266307 164505 35228 -163365 -264439
46944 -264439 -95875 229397 385305 208016 -107828 -235300 -74321 176888 283975 235384
46934 235384 204017 295134 412719 402614 267062 167642 227203 390693 496010 443448 283572
46923 283572 168128 218304 408976 580354 595051 477170 358132 308339 299222 326958 458810
46912 458810 695575 880758 854573 665403 529493 582200 751378 887222 935419 944078
46902 944078 965965 1019762 1118698 1265044 1407186 1464879 1439741 1459438 1642217 1926907 2125301
46891B125301M9029O7934K64092M02448L51688K72191L41421M67535M74110M39777
46881E255526N93587R32369J230974J438853J764003K297712K869225L386611
46873A9768860L946851M342442L824074J858982r68621l282307m209953m031427
46865B1248901l518024l056175k609891k155293j765527j414272j026135o84089
46857E019495n38378n33459m60548k90679k24939l52216m68125l58467j06235
46848A686449M4343L3401J2789N6506L5363j54553l79713m07685j95822P2714
46838H03792K13163J90249O2553q9013j50815l2515J94405L25773K72831J71833
46828A962256J58963J72410J12671N5824J06043J49673Q841k26411l00991k02573
$$ plain form
46891 2125301 2174330 2242264 2506356 2908804 3260492 3532683 3874104 4341639 4815749 5255526
46881 5255526 5849113 6781482 8012456 9451309 11215312 13513024 16382249 19768860
46873 19768860 23715711 28058153 31882227 33741209 32772588 29490281 25280328 21248901
46865 21248901 17730877 14674702 12064811 9909518 8143991 6729719 5703584 5019495
46857 5019495 4481117 3947658 3487110 3196431 2971492 2619276 2151151 1792684 1686449
46848 1686449 1730792 1764193 1776982 1833488 1868851 1714298 1334585 926900 731078 803792
46838 803792 1016955 1207204 1269757 1180744 1029929 997414 1191819 1517592 1790423 1962256
46828 1962256 2121219 2293629 2406300 2462124 2568167 2717840 2726681 2500270 2199279 1996706
46818A996706j55829j96665j11004J10283J41841j49371m04231k88796j0650L5262
46808I67546j07142r9850P8516J27547j5286n9803J32639L19067K69193P8590
46798A691017m3423m8867j457L4490k2784j94637l10450j90297K7460L7867j25448
46787H53471j06563J61704K84778L9371k39755k03095l6427q2105k27895j41281
46777C02203R9362J16061j17991k33164p8345P0869O995j00904m4314R4197J28202
46766B43171N6611n623k7007m8203p6462q4444m4419N9010J71506J63710Q877
46755D16727j02033n206J44189O6051j96364l08537j43682N1521O6272N018K4372
46744A8328O0440P020m5459L6157J72559J70408J244j69718j90089o1572Q2523
$$ plain form
46818 1996706 1840877 1644212 1533208 1643491 1785332 1635961 1231730 942934 932284 967546
46808 967546 860404 760554 839070 966617 951331 891528 1024167 1343234 1612427 1691017
46798 1691017 1647594 1598727 1597270 1631760 1608976 1414339 1103889 913592 941052 978919 853471
46787 853471 746908 908612 1193390 1232761 993006 789911 753484 671379 443484 302203
46777 302203 401565 517626 399635 166471 88126 158995 165990 65086 20772 114969 243171
46766 243171 299782 294159 267152 218949 142487 58043 13624 72634 244140 407850 416727
46755 416727 314694 309488 453677 519728 323364 14827 -128855 -77334 -11062 -6044 18328
46744 18328 78768 85788 40329 76486 249045 419453 420697 250979 60890 -682 81841
46733H1841R6199k6140j18310n3075O2966N6697j5884K4728J22975M5870j77796
46722A00071k26321N696K17865J81690O1351N0386L8225q4153j18361Q5850K45467
46711E57766K9074l65568m51818j60367J15382J29034L3732J7437N1407O1854
46701A7933N7172K2703p6102j59387j12531J2580Q2060J08390J63623J58231q296
46690B66376j72456j18484K1363l3825j83948p9060K31031L00529K5855j61371
46680I6010k0937J15140k8700j73606q922K23823J41291j20784j61220J1632P1166
46669A44893j8575L989J70218K31263J29515Q0863J56512J85963J25214J34807
46659A344662K23164J96148O2424J04824L95234O04197M99538L00494K80305L13556
$$ plain form
46733 81841 178040 151900 33590 -19485 43481 100178 84294 109022 231997 277867 100071
46722 100071 -126250 -120554 97311 279001 340352 390738 428963 344810 226449 312299 557766
46711 557766 586840 221272 -230546 -390913 -275531 -146497 -112765 -95328 -43921 17933
46701 17933 75105 97808 21706 -137681 -250212 -237632 -155572 -47182 116441 274672 266376
46690 266376 93920 -24564 -3201 -37026 -220974 -300034 -69003 231526 257381 96010
46680 96010 75073 190213 161513 -12093 -21015 202808 344099 223315 62095 73727 144893
46669 144893 126318 130307 300525 531788 661303 742166 898678 1084641 1209855 1344662
46659 1344662 1567826 1763974 1826398 1931222 2326456 2930653 3430191 3730685 4010990 4324546
46649D324546J35919j71228l12422k61382k56822l68873m13319l22266k81913
46640B072240l95151m68291l04100k9704O4942p6138k29357k16644j01212k0937
46630B95648K6805J27995K57570K78980J45944q672m7747j8936p4927k33910l28994
46619D19756k27775j8908Q9630K1516r2128q9737K9663J26240R6082k0337j02717
46608B31285p7405L6779J63316K10050J16136p8976k30483k24256j17350o7106
46598c8010j14467j34946m0004Q0118R4039K2927j1904J9779M0716K0543K2122
46587c9087P4907J06948M9387o0314j26303j04110l1257K0688P009m7290n9352
46576b08774J9198J18932J14218j1962j17340n9299J22743K37112J59405j9622
$$ plain form
46649 4324546 4460465 4289237 3976815 3715433 3458611 3089738 2676419 2354153 2072240
46640 2072240 1677089 1208798 904698 874994 939936 863798 634441 417797 316585 295648
46630 295648 322453 450448 708018 986998 1132942 1124270 1076523 1057587 982660 748750 419756
46619 419756 191981 173073 262703 284219 192091 102354 132017 258257 354339 334002 231285
46608 231285 153880 190659 353975 564025 680161 601185 370702 146446 29096 -38010
46598 -38010 -152477 -287423 -327427 -247309 -153270 -130343 -142247 -122468 -81752 -61209 -39087
46587 -39087 35820 142768 192155 131841 5538 -98572 -129829 -109141 -102132 -149422 -208774
46576 -208774 -189576 -70644 43574 31612 -85728 -145027 -22284 214828 374233 354611
46566C54611j05812m6505R377n9763j39543l1015K09961K72728J6797k76194k53219
46555d8577J9119J49805j7875k03096j18711J24980K12518O8421r2091r2795J7261
46544A8959J10134J47428J49632J11975K4944q0757j63994k08504j95223r0842
46534a76248Q5782K25745K25347J11529J5964J5863M8497P736j08533j84050j12044
46523A55588Q1549K43597K24799K6276j79632k07900n9611P3608L5251j09601
46513B83924j70669p7281O0898J24738J09666N6470k7608j13186j12979j888R5953
46502B28038N6847m9597n1235N6683Q7370m9841j88457j39113K3228O1584p1998
46491c6491j57866k2609K10795K88561J52490k7984j08612j09425r0010l4381
$$ plain form
46566 354611 248799 202294 211671 151908 12365 -18650 191311 464039 480836 204642 -48577
46555 -48577 -29458 120347 102472 -100624 -219335 -94355 118163 186584 94493 1698 18959
46544 18959 129093 276521 426153 538128 563072 482315 318321 109817 -85406 -176248
46534 -176248 -90466 135279 360626 472155 488119 503982 552479 560215 451682 267632 155588
46523 155588 237137 480734 705533 731809 552177 344277 284666 358274 393525 283924
46513 283924 113255 35974 96872 221610 331276 387746 360138 246952 133973 132085 228038
46502 228038 284885 235288 184053 240736 328106 278265 89808 -49305 -26077 35507 -36491
46491 -36491 -194357 -216966 -6171 282390 434880 406896 298284 188859 98849 64468
46481F4468O6519J31183Q9939j631m8648m9903m4372k154R7888J50253N1742r4685
46469D10599r8195J7663N3633j5075N518J46700J43967j38788m11874l43540m9986
46458b79378R4818J0613n5063J2005M3099n9855j31544k4705J48331J96355J03773
46447E8449k2443j20853j64934r7364R1096K76114K96269J16631j37282k69888
46437B5795j50866J49491L67346L03896P1656n8827m3032q3845k38080k71706
46427G1828n1824J67085R3339j38097j50277J05732K80108J44717j05893j81845
46417B34873r0860l1362n2264l0485P7354J64144J63721J43509J50158J05962
46407H34750m0985j72752j44696q230O2993L4934K2701M1235l2529j83478j85979
$$ plain form
46481 64468 130987 262170 352109 350478 301830 251927 207555 205401 303289 453542 505284 410599
46469 410599 312404 330067 383700 368625 374143 520843 664810 526022 114148 -229392 -279378
46458 -279378 -184560 -173947 -229010 -217005 -173906 -233761 -365305 -390010 -241679 -45324 58449
46447 58449 36006 -84847 -249781 -347145 -256049 20065 316334 432965 295683 25795
46437 25795 -125071 24420 391766 695662 767318 708491 665459 581614 343534 71828
46427 71828 20004 187089 280428 142331 -7946 97786 377894 522611 416718 234873
46417 234873 144013 112651 60387 29902 107256 271400 435121 578630 728788 834750
46407 834750 793765 621013 476317 468087 531080 566014 588715 629950 597421 413943 227964
46396B27964L8089K10153P5603j83464k09142j8472N5438p1922j16507O8964K40879
46385C17583J69722j4916q5170n9438n9637m5019N7535J26677J6610j56300j47992
46374A19655N6461K35081K31111Q3686r0298j83704j29297J2796P4410J1567q655
46363D12813J00593J46200l3258k35963j75260M5364Q2043j02776k13933j21357
46353i5534m740K6494P3666J34705L7970j79386k09002K4939J68169p336j95389
46342b25444l1800L07964L79621J45124l8005l96P5729N7395L9835O7578J0925
46331G88526j68445k92901k31796q1749J6545N0341L6040m9667j36331o4815J40636
46320F384K11382K1401j57603k0453L01010M09623K01600m5919j26692j27196
$$ plain form
46396 227964 266053 476206 551809 368345 159203 140731 196169 124247 7740 76704 317583
46385 317583 487305 472389 387219 327781 268144 223125 280660 407337 423947 267647 119655
46374 119655 176116 411197 642308 725994 635696 451992 322695 335491 409901 421468 412813
46363 412813 513406 659606 626348 390385 215125 260489 342532 239756 25823 -95534
46353 -95534 -100274 -73780 -114 134591 172561 -6825 -215827 -190888 -22719 -30055 -225444
46342 -225444 -257244 50720 430341 575465 537460 537064 612793 670188 710023 777601 788526
46331 788526 620081 327180 95384 13635 30180 80521 116561 66894 -69437 -134252 6384
46320 6384 217766 239167 81564 61111 362121 771744 973344 927425 800733 673537
46310F73537j34843m4964J69682K61363L6411k84588l20808o5788J18427L2811
46300D41240j16821p9720R2362K00273K06916K05496J95721Q7380j10447k61085
46290H61315k66303j60126l9066K5909K0498n705J8700Q9838J13312L5243p0462
46279F23153j09158r0897o9429l2063M3939R2343M2436m4096n2387L943J7505
46268D25289k0464j1503O6453J15984Q7260N4115P7599J03767N2487o8525j79560
46257G02902k05762j25091J0529J07471J27104J18252J14700Q0786K5104M8399
46247A004394J61858J95804O0550m6180P3441K57701K18169L0561J4061J55785
46237B126144R5985k41744m58597k96511k7569K3446l5349K8800J14745J8166
$$ plain form
46310 673537 538694 493730 663412 924775 961186 676598 355790 290002 408429 441240
46300 441240 324419 244699 337061 537334 744250 949746 1145467 1232847 1122400 861315
46290 861315 595012 434886 395820 421729 442227 436522 455222 545060 658372 693615 623153
46279 623153 513995 423098 353669 321606 365545 457888 500324 456228 403841 407784 425289
46268 425289 404825 393322 459775 575759 663019 717134 794733 898500 950987 882462 702902
46257 702902 497140 372049 382578 490049 617153 735405 850105 930891 955995 1004394
46247 1004394 1166252 1362056 1422606 1376426 1449867 1707568 1925737 1956298 1970359 2126144
46237 2126144 2222129 1980385 1521788 1225277 1197708 1221154 1185805 1214605 1329350 1347516
46227A347516j38310j13315M498l3721j62582j20928M9596O0085j04817j55900
46217F32122j8493L7236j19816k50254j47219N0764J22094P2404J2833m3077r2049
46206B56545m6086J10974K29571J94113P4706k3289r9512j47455q3141Q8294J98040
46195G52760J36953P404o2238r4631j34618j18911k4006K0887o1749j28984l4448
46184B58419J19309J39562M2042j1509J2513J0585m9622r7030r5324o0124J2907
46173B81728J00771J08511J4943l3253O2545J55866P6367o7842o2945L1632j1369
46162F56954j46098p7377K25348L96787K03200j07943j88993p0051r961n8685
46152H23181m9270O8545J52060J10363K2773o203L0884Q1336R1701L7294k9975
$$ plain form
46227 1347516 1209206 1095891 1100389 1066668 904086 783158 832754 892839 788022 632122
46217 632122 613629 650865 531049 280795 133576 184340 306434 378838 391671 348594 256545
46206 256545 210459 321433 551004 745117 819823 796534 697022 549567 466426 554720 752760
46195 752760 889713 897117 834879 740248 605630 486719 462713 483600 421851 292867 258419
46184 258419 377728 517290 559332 547823 560336 570921 521299 424269 328945 268821 281728
46173 281728 382499 491010 505953 472700 535245 691111 767478 699636 636691 668323 656954
46162 656954 510856 433479 658827 1055614 1258814 1150871 961878 891827 881866 823181
46152 823181 773911 842456 994516 1104879 1127652 1121449 1152333 1233669 1325370 1362664 1332689
46141A332689j136J41173K54727K20995J28292J41891K50315K97019K31310J59545
46131C156820J51882J68697K00957L15592N08819O64454P29388Q03447R80353
46122G680409J213091J410413J553320J628243J543307J205625O16819j52076
46114A6699151r70794j593303j769712j540299j263593j196196j191967j002014
46106F171273p05085n62920n62735m52187k13812j36730l26528m82205l35377
46097B393694l9209Q9592j209j48681k62804l22428k36294K3939K47750K03628
46087A947978k1637j38615o2793L5097N5197Q7483J89956K87233L34732L76641
46077C091272L97378L11544J42750K0594l2015j03901j67177r6325K9445o2599
$$ plain form
46141 1332689 1331553 1472726 1727453 1948448 2076740 2218631 2468946 2765965 2997275 3156820
46131 3156820 3308702 3477399 3678356 3993948 4502767 5167221 5896609 6700056 7680409
46122 7680409 8893500 10303913 11857233 13485476 15028783 16234408 16851227 16699151
46114 16699151 15728357 14135054 12365342 10825043 9561450 8365254 7173287 6171273
46106 6171273 5466188 4903268 4340533 3888346 3674534 3537804 3211276 2729071 2393694
46097 2393694 2354485 2444077 2442868 2294187 2031383 1708955 1472661 1496600 1744350 1947978
46087 1947978 1926341 1787726 1724933 1760030 1815227 1902710 2092666 2379899 2714631 3091272
46077 3091272 3488650 3800194 3942944 3963538 3931523 3827622 3660445 3564120 3593565 3530966
46067C530966l91629n74956l38769N9988J80973p155j64543r8129M7224P9175
46057B323145j1847j24032j56319m2374J73822L11039K47020J13434J38964L25709
46047C298561M48695L67176J77892O0466J11680L18475N55336O39297N40179M92002
46037G009759P19254J108181J372860J502587J759070K216205K621967K804498
46029B1114381K880585K872800K426919J226567m62025j952998k792636l035931
46021B2277662k952891k714666k378064j971067j526265j124342q94767q72724
46013G842876q99609q00523o25119n59905o25463o39797n00922l26954k49678
46004B614906k22965j41513m1239m9761j73739k49523j37156Q5111J73472r255
$$ plain form
46067 3530966 3139337 2564381 2225612 2285600 2466573 2459418 2294875 2196746 2243970 2323145
46057 2323145 2311298 2187266 2030947 1988573 2162395 2473434 2720454 2833888 2972852 3298561
46047 3298561 3747256 4114432 4292324 4352790 4464470 4782945 5338281 5977578 6517757 7009759
46037 7009759 7729013 8837194 10210054 11712641 13471711 15687916 18309883 21114381
46029 21114381 23994966 26867766 29294685 30521252 30059227 28106229 25313593 22277662
46021 22277662 19324771 16610105 14232041 12260974 10734709 9610367 8715600 7842876
46013 7842876 6943267 6142744 5517625 4957720 4332257 3692460 3191538 2864584 2614906
46004 2614906 2391941 2250428 2209189 2159428 1985689 1736166 1599010 1684121 1857593 1848338
45994A848338l03534m10434k50916o1381o5620j74375j52468R373R6123K0080
45984E55186n4047P494R7933N5769q8385j80797j57155o4888M3206J21401J11282
45973D46999K7698j071R8291J96035J17937r2003k20679j80291r3629p3487q0217
45962A45583n0116j5677j1764J5475R8757J43983N8764p6537r9834k11P5404N1678
45950C35505K4258Q1373J45719R1852m6976j05150r498J18196J13214l8028j93911
45939E16554k14377r1295N5981R2758l989j14463r5081N8629K02439K12608J13515
45928G33279M188p2362j13388p6457O1665J91400J61867Q553n8124M5489J30667
45917A016777L348k42688l49094k33582m6505P0060J10537J01750M2262k1626
$$ plain form
45994 1848338 1544804 1134370 883454 822073 756453 582078 429610 438983 535106 555186
45984 555186 501139 508633 606566 662335 573950 393153 235998 171110 214316 335717 446999
45973 446999 474697 473626 571917 767952 885889 793886 573207 392916 299287 225800 145583
45962 145583 95467 79790 68026 83501 182258 326241 385005 308468 208634 208423 283827 335505
45950 335505 359763 441136 586855 678707 631731 526581 517083 635279 748493 710465 516554
45939 516554 302177 210882 266863 359621 355632 241169 146088 204717 407156 619764 733279
45928 733279 737467 665105 551717 475260 536925 728325 890192 898745 840621 886110 1016777
45917 1016777 1020125 777437 428343 194761 148256 218316 328853 430603 472865 451239
45907D51239q566N8194N2353o2251j65435j64605j13270p3412J88J32047K13157
45896C19639J55592N8099O3244J27942J01619k3965j19657j39691j51149j51745
45886B39928o0018P8905Q0519j00267k51671j85743J899Q8352L0520l3474j3371
45875a24421N9822J46633K28268K34378R6965r8033j53779j6312J29020R4278
45865E96819o9383j66695j29387o5747n8550n2308J4812Q5350Q2633N6870J04683
45854C99097J77907J22581p0371k05226j47050j0926L1552J2844O4828J38640
45844E13876N5795j66616k76399j41191O2223J22661P2844M5651K1783p5710j57206
45833G7711p9701P1513O6875r8342j70448l5100R3430J0932j54440j49610J5074
$$ plain form
45907 451239 442673 500867 553220 490969 325534 160929 47659 -25753 -25565 106482 319639
45896 319639 475231 533330 596574 724516 826135 802170 682513 542822 391673 239928
45886 239928 179910 258815 339334 239067 -12604 -198347 -196448 -108096 -77576 -111050 -124421
45875 -124421 -64599 82034 310302 544680 641645 543612 389833 373521 502541 596819
45865 596819 527436 360741 231354 165607 107057 54749 69561 154911 237544 294414 399097
45854 399097 577004 699585 629214 423988 276938 266012 297564 310408 375236 513876
45844 513876 569671 403055 126656 -14535 47688 170349 243193 288844 310627 234917 77711
45833 77711 -1990 69523 136398 38056 -132392 -167492 -74062 -63130 -217570 -367180 -352106
45822c52106J09917N2656J722P3671J69361J47087J6475j20517j98604j74467
45812b74805m250K45088L57349J90288j09646k61099j88864n8976R278P2103J61369
45801A37835J66978M3675l7888P3012K39423K11988L179j36193r3810j6082j7041
45790E75076l62J21221K21531J35786p8740k15255j86057q5737k6526k5113l5110
45779D00714o790P3075J49072J37419L7062n5296p9283p9915r2647o2840L6194
45768D56765J05524N2235o1767j16788j04739q0763k6799Q8954J79210J28902
45758F20734j2762q7655n5738j6158j8747j1689K4032L9996K9432L3098L5632
45747E80175n035l5687K7889J24365J12294J2193j7155L5701j009j69711k65481
$$ plain form
45822 -352106 -242189 -189533 -187811 -114140 55221 202308 218783 98266 -100338 -274805
45812 -274805 -279055 -33967 323382 513670 404024 142925 -45939 -104915 -95637 -23534 137835
45801 137835 304813 348488 310600 383612 623035 835023 838202 702009 608199 592117 575076
45790 575076 574714 695935 917466 1053252 974512 759257 573200 487463 460937 435824 400714
45779 400714 393924 466999 616071 753490 790552 735256 655973 576058 483411 420571 456765
45768 456765 562289 614524 552757 435969 331230 250467 223668 312622 491832 620734
45758 620734 607972 520317 464579 448421 429674 417985 442017 482013 511445 544543 580175
45747 580175 575140 539453 567342 691707 804001 816194 799039 834740 833731 664020 398539
45736C98539j44254N3092J23483P6119L8070L9127M4801P0009J06900O3478p3179
45725G96185j37193j3036J52695J48098l46j10810j35211j52456j48525m0451
45715C58950J09413J34258K5538n3165l3649k2526p7674j05169m6530Q213j9026
45704B78633o8097o2915l2276k0777M606O5501R1147K7014n3516m3455M6704J14971
45692C47540J02375L5176k7388l3892K7590R2686O5873n1511j34515q7244L5740
45681C72430J18243J28995J03925M3986o1021j37254q2527O3281J19783J712j35017
45670E36536q3102J24484K37511J21293n4505m2662J49861K84097K14439M7548
45660A535500n3258q1983j18441j45947p3779Q9516K04501J64328K2967o4789
$$ plain form
45736 398539 254285 307377 430860 506979 545049 584176 628977 698986 805886 869364 796185
45725 796185 658992 645956 798651 946749 946403 835593 700382 547926 399401 358950
45715 358950 468363 602621 628159 574994 541345 518819 441145 335976 289446 297659 278633
45704 278633 210536 147621 115345 94568 99174 164675 255822 282836 229320 185865 232569 347540
45692 347540 449915 485091 457703 423811 451401 544087 609960 558449 423934 336690 372430
45681 372430 490673 619668 723593 767579 706558 569304 486777 550058 669841 671553 536536
45670 536536 453434 577918 815429 936722 882217 839555 989416 1273513 1487952 1535500
45660 1535500 1482242 1400259 1281818 1135871 1062092 1151608 1356109 1520437 1543404 1478615
45650A478615l750J47348K33686J68112K7609m9083l0608K0895R9788K48154L91815
45639B732581L75719K27864J77836K90714L10793P1208j63156o2343K19628K35897
45629D416741p5227l02326j90320K5343L9292j07354k16123k56357k82649k44144
45619B806876r8859M2332P7994P5693J04611Q2239k7031m8226J35586L15949K31623
45608C698787j7410j22221m2786j2527r5264p7680J32206L01712K10089k9204
45598C945702j47680q6380k2950r6244k29434k38623p3494Q7062L4933j72722
45588C000170k49396q1724P3762l6266k55946k54240n9646j9354k28159l63125
45578A526076j96911N3551Q5100m7512q9248m085K5651p5101j83972j87705j03798
$$ plain form
45650 1478615 1474865 1622213 1855899 2024011 2051620 2002537 1971929 1992824 2092612 2340766 2732581
45639 2732581 3108300 3336164 3514000 3804714 4115507 4186715 4023559 3961216 4180844 4416741
45629 4416741 4341514 4039188 3848868 3874211 3913503 3806149 3590026 3333669 3051020 2806876
45619 2806876 2708017 2750349 2828343 2904036 3008647 3090886 3063855 3015629 3151215 3467164 3698787
45608 3698787 3681377 3559156 3516370 3503843 3408579 3330899 3463105 3764817 3974906 3945702
45598 3945702 3798022 3711642 3688692 3592448 3363014 3124391 3050897 3137959 3172892 3000170
45588 3000170 2750774 2669050 2742812 2706546 2450600 2196360 2136714 2117360 1889201 1526076
45578 1526076 1329165 1382716 1467816 1420304 1331056 1326971 1352622 1277521 1093549 905844 802046
45567H02046o297M5439K1000m8248q2777o1702n0812p2650n2907L4877R7575Q4347
45555G09891P8807J22453J09427m624p3120k1836l9573k49393l85759j54234K20023
45544C12062K35508j22098l21683p6651K59622K77898P9481k1931j5381n8196
45534E48631r0669K5276J58587R1784o4480l1718J33586J10684j21268k20431
45524E39982n8337O6510m2500j32599N2376L00047K44388n7031k20882j07407
45514E84547N1243O6898K4230M0507N5986k1373j30974j40240k2735J26556K05701
45503H40346J91148J37156J02884P4820M765o4011j5515J32621J82408M5218o4373
45492A567467P2942L01390K78490P9j64152j087K66177L33068J97154M6575j8399
$$ plain form
45567 802046 795749 841188 862188 813940 731163 669461 618649 545999 493092 527969 625544 709891
45555 709891 788698 911151 1020578 1015954 942834 920998 881425 632032 246273 92039 312062
45544 312062 547570 425472 103789 27138 286760 564658 644139 622208 606827 548631
45534 548631 457962 483238 641825 733609 669129 637411 770997 881681 760413 539982
45524 539982 481645 548155 505655 373056 425432 725479 969867 912836 691954 584547
45514 584547 635790 702688 726918 767425 823411 802038 671064 530824 508089 634645 840346
45503 840346 1031494 1168650 1271534 1346354 1351119 1287108 1271593 1404214 1586622 1631840 1567467
45492 1567467 1640409 1941799 2220289 2220368 2056216 2055129 2321306 2654374 2851528 2898103 2879704
45481B879704J4403J68708L98935N41595N07536M09822L76767L89682M46009O90004
45471F823165J162457J581138J637923J411993J214826J098109Q13442K41944
45463A5984997m32191j003876j421958j628255j511892j147435q32976p32721
45455G273693o76336m71298k27934j74642k91435l56578k87836k17084k36739
45446D333811k70633k41634k10028k56307l25244k98388j88522j46689k38200
45437B158166l06101j66887R4704J80772k7630k88818l16256j35319K9174R3698
45427A315503J30034J27558O163j53421j64870n3936n3372k11593k75850q2713
45417E83503J85417K81996K05723O8426j13404k98021l12301j07191O8247N647
$$ plain form
45481 2879704 2894107 3062815 3461750 4003345 4510881 4920703 5297470 5687152 6133161 6823165
45471 6823165 7985622 9566760 11204683 12616676 13831502 14929611 15743053 15984997
45463 15984997 15552806 14548930 13126972 11498717 9986825 8839390 8006414 7273693
45455 7273693 6597357 6126059 5898125 5723483 5432048 5075470 4787634 4570550 4333811
45446 4333811 4063178 3821544 3611516 3355209 3029965 2731577 2543055 2396366 2158166
45437 2158166 1852065 1685178 1779882 1960654 1933024 1644206 1327950 1192631 1221805 1315503
45427 1315503 1445537 1573095 1579258 1425837 1260967 1207031 1153659 942066 666216 583503
45417 583503 768920 1050916 1256639 1325065 1211661 913640 601339 494148 562395 568042
45407E68042j20715l4814J74291K00043K7247p2421j5898o408j20567j51482L0483
45396D77801K53042L04752J86221n161k09598l21411k11613L8900J55899N4491
45386G23323l0380N1502R5422r2506l00129j99324J17438K43141N3230j41963
45376E19754q5126Q7630J17504N760n2832Q923O2626J2103n4489N597J67942K32417
45364A027809P3046j56840j76523M9080K20354Q3026k12424k95643p4618J50532
45354F87799J15538n3221n0851J52550K71026J22429j00240r7043J17960K55007
45344A420954J83698J03640J93847L09801K29108M0098M415J06829P4215j32249
45334B534356j97074M2018K91549K31317k7025j91878k69941m38505n98230m69940
$$ plain form
45407 568042 447327 412513 586804 786847 814094 741673 725775 719367 598800 447318 477801
45396 477801 730843 1035595 1221816 1216655 1007057 685646 474033 512933 668832 723323
45386 723323 692943 744445 839867 747361 447232 247908 365346 608487 661717 519754
45376 519754 434628 522258 639762 645522 592690 601613 664239 676342 621853 627450 795392 1027809
45364 1027809 1100855 944015 767492 816572 1036926 1119952 907528 611885 537267 687799
45354 687799 803337 750116 699265 851815 1122841 1245270 1145030 1047987 1165947 1420954
45344 1420954 1604652 1708292 1902139 2211940 2441048 2481146 2485561 2592390 2666605 2534356
45334 2534356 2337282 2379300 2670849 2902166 2875141 2683263 2413322 1974817 1376587 906647
45324I06647j04922J04237j3074j81938j34717K5754P4625R834m4357o9792r2970
45313D79327n5816O3422J37091P2690j5955N081N9124L897j07112j19058m6435
45302D76256l1233q6319r6099l9506j838J2781O3984Q2219o6129k92031l10795
45291b88710l9793K51581L00495J59882K2880n9804j12082o2068J25879K61609
45281E59869J29317j61426k71036r4191R6521L7156j91727l20767k30515q026
45271d54825K18878L56940L25853J16260j36329k51277j92124p9757j8541O117
45261a08805M6021R1966R6892M4756l4876q5094m6928P9667J90058J60799J1289
45250D45745r3096m7665N2043M6641p0578j61631j28649N608J76648L27340L77068
$$ plain form
45324 906647 801725 905962 892888 710950 576233 601987 676612 686446 642089 572297 479327
45313 479327 423511 486933 624024 696714 680759 685840 744964 748861 641749 522691 476256
45302 476256 445023 358704 262605 223099 221261 234042 298026 380245 314116 22085 -288710
45291 -288710 -328503 -76922 223573 383455 406335 346531 234449 172381 298260 559869
45281 559869 689186 527760 256724 162533 259054 296210 104483 -216284 -446799 -454825
45271 -454825 -235947 120993 446846 563106 426777 175500 -16624 -96381 -114922 -108805
45261 -108805 -62784 29182 126074 170830 135954 50860 3932 83599 273657 434456 445745
45250 445745 352649 304984 357027 403668 333090 171459 42810 48418 225066 552406 929474
45239I29474K58216K5599j56567j86242j21617p7823r6891j52416j98968j67915
45229E4850m098K21180L18824J97951L110o8088j5303K4228K0113N6597J17753
45218I27117P4781o2664q9673P9770K18470Q8247j83131k53139n1990J18799K0534
45207H87121k01770k51809q1248J06645J69315J63756J82806K10338J92033J46781
45197A523968J35879J72763K18467K37353K19780J72815J15154O3942K0586o44
45187B880063N6771K20043L78104L45497Q9353k00646l44884l77878m09634l90436
45177B246353k02225O3818J50446p672j80161j79095j00266r3510q0996Q8292
45167A704984L26682L93204K47528R0124M6226K8971l5430n4104N8193K12040
$$ plain form
45239 929474 1187690 1213289 1056722 870480 748863 671040 574149 421733 222765 54850
45229 54850 50752 271932 590756 788707 791817 723729 708426 732654 752767 809364 927117
45218 927117 1001898 939234 849561 929331 1147801 1236048 1052917 799778 747788 866587 887121
45207 887121 685351 433542 352294 458939 628254 792010 974816 1185154 1377187 1523968
45197 1523968 1659847 1832610 2051077 2288430 2508210 2681025 2796179 2860121 2880707 2880063
45187 2880063 2936834 3156877 3534981 3880478 3969831 3769185 3424301 3046423 2636789 2246353
45177 2246353 2044128 2107946 2258392 2250720 2070559 1891464 1791198 1697688 1616692 1704984
45167 1704984 2031666 2424870 2672398 2762522 2808748 2837719 2802289 2748185 2806378 3018418
45157C018418K75970K60504K45056K15833J16790K653o739Q9422J66149J66500
45147D550556J85294L06046M39060M09214J86086m7047q5688O4681J94751J31326
45137F334279p8626k56930l16509l17232l20552k98168k27232j84727k56921l90220
45127C687162m22372k76109o5160K4402o3256k00087k27913j39684o9742j07596
45117B139645j86576j96219j37480q6409n6607j1463J3865n7222j78505j93767
45107A049262o3590N8303M8132k2162l8702l1865p3661j03366k7782Q0058P3228
45096I47855j3508L87J42284K21556J19220l2835n2295N6805J72158K34094K32424
45085B028145J15224j30334l56374l75920k06316n3508l6505o4362l0786J2997
$$ plain form
45157 3018418 3294388 3554892 3799948 4015781 4132571 4135224 4128485 4217907 4384056 4550556
45147 4550556 4735850 5041896 5480956 5890170 6076256 6029209 5943521 6008202 6202953 6334279
45137 6334279 6255653 5998723 5682214 5364982 5044430 4746262 4519030 4334303 4077382 3687162
45127 3687162 3264790 2988681 2923521 2947923 2884667 2684580 2456667 2316983 2247241 2139645
45117 2139645 1953069 1756850 1619370 1532961 1476354 1464891 1478756 1421534 1243029 1049262
45107 1049262 985672 1043975 1092107 1069945 1031243 999378 925717 822351 794569 874627 947855
45096 947855 934347 934734 1077018 1298574 1417794 1384959 1332664 1389469 1561627 1795721 2028145
45085 2028145 2143369 2013035 1656661 1280741 1074425 1020917 984412 920050 889264 902261
45075I02261k1730q5875q0702m7691r7597j76271r9825J37567K90016J95526N120
45064I20799p2291q5553j87953l00753k13510K8054J38524K7091p5727o158J01614
45053B74137J02766Q7265J52582J76860N1429o7249l648J05516J7032k01886k65154
45042D29650j04029Q1823J64311J89734J68678N7770m5292K4098K02472K49711
45032A418926J21071J0999K574j6987m4128Q8650L38405L83681J10087j59831
45022B253447j45960k4374r3527k83878l17545j74096p0591q4790r4582l2931
45012I31173M6960J15594J67840J38513Q463q0603j0156J00838O7403o1889r1643
45001A332493J2792J27268K06664K88151L18061K19709R3528J07259K15115K27070
$$ plain form
45075 902261 880531 794656 713954 666263 568666 392395 292570 430137 720153 915679 920799
45064 920799 848508 762955 575002 274249 60739 88793 227317 254408 178681 172523 274137
45053 274137 376903 464168 616750 793610 845039 777790 774142 879658 896690 694804 429650
45042 429650 325621 407444 571755 761489 930167 987937 942645 966743 1169215 1418926
45032 1418926 1539997 1550996 1553570 1536583 1492455 1581105 1919510 2303191 2413278 2253447
45022 2253447 2107487 2083113 1989586 1705708 1388163 1214067 1143476 1058686 964104 931173
45012 931173 978133 1093727 1261567 1400080 1408543 1327940 1317784 1418622 1486025 1424136 1332493
45001 1332493 1345285 1472553 1679217 1967368 2285429 2505138 2598666 2705925 2921040 3148110
44991C148110J32258R6827J43009R6635j08218l14976l90632l73448l23174k25863
44981A880528j06683n7512r4995j37580j44447j35331r3267j3732k181j20079
44971I74721j97407m8719J83102J95493k989j27518j00896j12693j73818n6512
44961E32764K17198K85054K6962k00186j43334l3338r3908j11533J18677L18648
44951I17004J68642j06103j09121L5636n8023k83637j89875J83682K84134o0034
44941G82305l44184j88189J17170J55979J7511J3905J14844P2198j01681j66444
44931D73414o3290L2970L1834K7323P6426R5188J8116q9985j34439j11686q3039
44920B72832p0282j7439J25356K81355K73664M0861k25908k69178o0498J99973
$$ plain form
44991 3148110 3280368 3377195 3520204 3616839 3508621 3193645 2803013 2429565 2106391 1880528
44981 1880528 1773845 1716333 1621338 1483758 1339311 1203980 1110713 1096981 1094800 974721
44971 974721 777314 728595 911697 1107190 1104201 976683 875787 763094 589276 532764
44961 532764 749962 1035016 1061978 861792 718458 685120 591212 479679 598356 917004
44951 917004 1085646 979543 870422 906058 848035 564398 374523 558205 842339 782305
44941 782305 438121 249932 367102 523081 540592 554497 669341 741539 639858 473414
44931 473414 410124 443094 474928 502251 578677 673865 691981 601996 467557 355871 272832
44920 272832 202550 185111 310467 591822 865486 906347 680439 411261 350763 550736
44910E50736L38553L25221J81988l8834j94163j66905n8052o4361j55666j11292
44900F07225Q8794J88419O3612q0282o9394l8008j35450k14541q3275J34233J86673
44889F48006R7961P5835J26217P6181p4031j32431m2092M9876N8684M5051K7942
44878I57199l3141o4946M1977J68883P7868j71585k39840l7097J04907l8746k17916
44867E47563j22728J16816J74305O5574P1475K25599K55686L8798k09244k62030
44857I01814j44242N686J13124J28379P517j74253k46718j57677k2378P8331J70189
44846F59772K08476N6917k40231l86019k08282O8962J32461N271o3510o868L4426
44835B61375K3498O9673J57349J17026o7242j70519n1890J40352K06829J58425
$$ plain form
44910 550736 889289 1214510 1396498 1357664 1163501 996596 938544 874183 718517 607225
44900 607225 696019 884438 948050 867768 798374 760366 624916 410375 327100 461333 648006
44889 648006 745967 821802 948019 1024200 950169 817738 775646 825522 884206 929257 957199
44878 957199 924058 859112 901089 1069972 1147840 976255 736415 699318 804225 765479 547563
44867 547563 424835 541651 715956 781530 853005 1078604 1334290 1373088 1163844 901814
44857 901814 757572 763258 876382 1004761 1012278 838025 591307 433630 411252 489583 659772
44846 659772 868248 925165 684934 298915 90633 159595 292056 297327 233817 226949 261375
44835 261375 284873 354546 511895 628921 561679 391160 339270 479622 686451 844876
44825H44876J07722O2523j6739q0097o7570l1575l7007k9414N2095J19837O0988
44814I85639n1847m9426P6306J78034J91672J86697J77887P7727j15466k47370
44804A409853k03784n4817O8579J34712J73162J72252J03355j1631j26674k17553
44794A447454k51911j76737m012J38383J20831l2230j56264j23473K2752J20806
44784A105599P1457n1518r8544m0223Q987j0076J0103J53634K78237J77189r1204
44773A513641k37950j39627n350n6485k06259k01698J7723K53169K98103J45551
44763A380818l8206p6908N3761J88476J49802j2040o2870P4650J69000N519k58746
44752A573256k76298k95K38357J87309o528n2826O6261J22282J7270o9828L9620
$$ plain form
44825 844876 952598 1015121 998382 918285 850715 819140 782133 752719 804814 924651 985639
44814 985639 933792 884366 960672 1138706 1330378 1517075 1694962 1772689 1657223 1409853
44804 1409853 1206069 1151252 1219831 1354543 1527705 1699957 1803312 1791681 1665007 1447454
44794 1447454 1195543 1018806 1014794 1153177 1274008 1241778 1085514 962041 984793 1105599
44784 1105599 1177056 1125538 1026994 986771 995758 985682 995785 1149419 1427656 1604845 1513641
44773 1513641 1275691 1136064 1130714 1074229 867970 666272 683995 937164 1235267 1380818
44763 1380818 1342612 1265704 1319465 1507941 1657743 1645703 1582833 1657483 1826483 1832002 1573256
44752 1573256 1296958 1296663 1535020 1722329 1715801 1662975 1729236 1851518 1868788 1798960 1838580
44741A838580K53306L32565K12864N9623J3259K5124L711j0806N8689J45789J14429
44730C047133k0779j12824j20442j53569k43958k53294j02201O7076Q3148k2018
44720B168272j05972j30412j30763o7759J03451K66050K40048N1797o8412Q198
44710B334498J52542J73614M1943j43044k96760l80244l65237k54549j07287O402
44700A161878N7274N1152J4023n217K7462P0686M2478n8118j25434q3934N768
44689A158018L5146N19o491N0092Q6876J8499j14075j86509j42717m4743L1835
44678H86450Q4068J27951J27676N5674k1583k0093J5802l6944j67923j99460k9201
44667H22417K00419K70355J53277J4771j3605L3496M3310k7399j12625j23067
$$ plain form
44741 1838580 2091886 2424451 2637315 2696938 2710197 2735321 2739032 2728226 2786915 2932704 3047133
44730 3047133 3026354 2913530 2793088 2639519 2395561 2142267 2040066 2107142 2190290 2168272
44720 2168272 2062300 1931888 1801125 1733366 1836817 2102867 2342915 2394712 2326300 2334498
44710 2334498 2487040 2660654 2702597 2559553 2262793 1882549 1517312 1262763 1155476 1161878
44700 1161878 1219152 1270304 1284327 1279110 1306572 1377258 1419736 1361618 1236184 1152250 1158018
44689 1158018 1193164 1193683 1187192 1237284 1324160 1342659 1228584 1042075 899358 854615 886450
44678 886450 970518 1098469 1226145 1281819 1260236 1240143 1255945 1219001 1051078 851618 822417
44667 822417 1022836 1293191 1446468 1461239 1447634 1481130 1524440 1497041 1384416 1261349
44657A261349o3090l9122j17376k10878j87020n7799M7816Q0537R7983J03469
44647I15869L5949n8186m6459M7148M6814n2255k9130J66904K58353Q0815j11308
44636A254514n9437N7653m4060k23326j56473O3669P4721r6505o4057K15420L23909
44625A346028Q3798j47528q8676M3609p154r3337o480J08869M7448o0089j1848
44614A214640P6221K4697j9130J40009K95509J30090j95627k36427K7481J69102
44604A626565J3093j27926j3760J65975J69107P0893M1267L7893m7877j45676
44594A789554j24021j4830N3824M4648J800m5459o5963j0497J01209J67407J39475
44583B037147P5585K2685m0449j11592j43127j34305j11796k7025J45114K25538
$$ plain form
44657 1261349 1198259 1159137 1041761 830883 643863 586064 633880 714417 812400 915869
44647 915869 951818 893632 847173 894321 941135 888880 859750 1026654 1285007 1365822 1254514
44636 1254514 1195077 1252730 1208670 985344 828871 892540 967261 870756 806699 1022119 1346028
44625 1346028 1429826 1282298 1193622 1237231 1230077 1136740 1130260 1239129 1286577 1226488 1214640
44614 1214640 1290861 1315558 1296428 1436437 1731946 1862036 1666409 1429982 1457463 1626565
44604 1626565 1639658 1511732 1497972 1663947 1833054 1903947 1945214 1983107 1935230 1789554
44594 1789554 1665533 1650703 1704527 1749175 1750975 1705516 1639553 1629056 1730265 1897672 2037147
44583 2037147 2112732 2135417 2094968 1983376 1840249 1705944 1594148 1567123 1712237 1937775
44573A937775J4211l14996l29200L2618K91274J13160j73279q8688K44811L15937
44563B043623M0607j46239k4465R0159p5666k86109k02321M9978Q1281j49466
44553A421382k84186j02185K01191L37369K87466K17563J88255J09001o8717k44071
44543B063068k79587j65049l0783J159m6576n6644o9J0085r4440j79434p0407
44532A151323J55880K14382l061k47548k32042k705J65064J53351R0785Q5302
44522A530731P8767J2754m2998k0798J9586k016n0772m2621L0713J16411J61236
44511A790993J03054q3575k62875k11310N9826K16313K9121k47149j90686J63932
44501A367644L38313Q5049k62113k61580N4577K87437K15070J100r2590r108J10250
$$ plain form
44573 1937775 1951986 1636990 1307790 1340408 1631682 1744842 1571563 1482875 1727686 2043623
44563 2043623 2084230 1937991 1913526 2003685 1928019 1641910 1439589 1489567 1570848 1421382
44553 1421382 1137196 1035011 1236202 1573571 1861037 2078600 2266855 2375856 2307139 2063068
44543 2063068 1783481 1618432 1587649 1588808 1542232 1485588 1485519 1495604 1401164 1221730 1151323
44532 1151323 1307203 1521585 1518524 1270976 1038934 1036229 1201293 1354644 1445429 1530731
44522 1530731 1609498 1622252 1579254 1558456 1578042 1576026 1525254 1482633 1513346 1629757 1790993
44511 1790993 1894047 1810472 1547597 1336287 1396113 1612426 1641547 1394398 1203712 1367644
44501 1367644 1705957 1791006 1528893 1267313 1321890 1609327 1824397 1825497 1732907 1723799 1834049
44490A834049J18351R591q2213l4614J02973J55641N7827m9322k5485N8066L2365
44479B177229j06781j93434j35636k7246J1934o242N595P7125J63188K07892J75773
44468B349397O1633q1033j55323j16565l0163J5151K7981Q2025J70407J77691
44458B501201L5724j58521k44589j81436o4446J3644M4548N7488P0013R6970J41993
44447B312589J68689J40128Q4188M7220K09j00860j76254j02877M5696L8401j51654
44436B305475k40558m7099J88695J37015j18956j99515K2646K84987L39454K14196
44426B886340L7575j33395k36386j92086n8248R636J9697J39174L50686L78639
44416C201632J05003j89587j99946r126R2308L1978l8728m2619l5448l3914O92
$$ plain form
44490 1834049 1952400 1961991 1879778 1845164 1948137 2103778 2161605 2112283 2086798 2144864 2177229
44479 2177229 2070448 1877014 1741378 1714132 1726066 1719824 1725419 1802544 1965732 2173624 2349397
44468 2349397 2411030 2329997 2174674 2058109 2027946 2043097 2071078 2153103 2323510 2501201
44458 2501201 2536925 2378404 2133815 1952379 1887933 1901577 1946125 2003613 2073626 2170596 2312589
44447 2312589 2481278 2621406 2705594 2752814 2753023 2652163 2475909 2373032 2418728 2457129 2305475
44436 2305475 2064917 2017818 2206513 2343528 2224572 2025057 2047703 2332690 2672144 2886340
44426 2886340 2923915 2790520 2554134 2362048 2303800 2313436 2333133 2472307 2822993 3201632
44416 3201632 3306635 3117048 2917102 2907976 3000284 3032262 2993534 2950915 2915467 2881553 2882245
44405B882245M5622N5596P1771J39531J79961R5940n8601j60321j87487j65661
44395B898596n1510J52599K79878K04651P1344R3467K11704J98767L0118j16989
44385C972625j74039k02749j55205O1147K90300K52958L575r7931N2915J52063
44375D155659K4101q6545K3181J44080M6668q8258m272J29990j0480l07587l37241
44364C689296m6727J65014Q4849k8530O6716J97118R5592j46492k19703m1394
44354C815739J85717K90219K96104K80965K44050J64723Q8228P9765J19629R9696
44344E664835m6524k28758k75535j50262k1359m9309j66533j72160p557J82192
44334D729030K47993J77080L6707r1992j10303K8013K03832K25873R2672K2597
$$ plain form
44405 2882245 2927867 2983463 3055234 3194765 3374726 3470666 3412065 3251744 3064257 2898596
44395 2898596 2847086 2999685 3279563 3484214 3555558 3649025 3860729 4059496 4089614 3972625
44385 3972625 3798586 3595837 3440632 3501779 3792079 4045037 4048612 3950681 4003596 4155659
44375 4155659 4179760 4093215 4116396 4260476 4307144 4218886 4214614 4344604 4334124 4026537 3689296
44364 3689296 3642569 3807583 3892432 3863902 3930618 4127736 4223328 4076836 3857133 3815739
44354 3815739 4001456 4291675 4587779 4868744 5112794 5277517 5365745 5445510 5565139 5664835
44344 5664835 5618311 5389553 5114018 4963756 4942397 4893088 4726555 4554395 4546838 4729030
44334 4729030 4977023 5154103 5190810 5098818 4988515 5016528 5220360 5446233 5538905 5561502
44324E561502J41679K83091K24858J6199r4075L927J78212K79632L17223L68622
44314G280870M26320M07093K77290J22187Q4659K25186M38094N44807M93899M19541
44304A0719946M64211O05957P25663P84604Q40998R27893J021780J125408J282924
44295A8499384J499876J728040J946435K193988K511845K909185L390889L974853
44287C8654495M694266N620378O837422Q338749J0018008J1843908J3933070J6279886
44279A16220182J8466333J9792954J9606121J7307382J2277707M400548n107167
44272B02964060j3823316j9554937k1671718k0999850j8763004j5910961j3106443
44265G9133831j0729869q793415p165534n900489n090202m491926l718641k818737
$$ plain form
44324 5561502 5703181 5986272 6211130 6227329 6133254 6137181 6315393 6595025 6912248 7280870
44314 7280870 7707190 8114283 8391573 8513760 8598419 8823605 9261699 9806506 10300405 10719946
44304 10719946 11184157 11790114 12515777 13300381 14141379 15069272 16091052 17216460 18499384
44295 18499384 19999260 21727300 23673735 25867723 28379568 31288753 34679642 38654495
44287 38654495 43348761 48969139 55806561 64145310 74163318 86007226 99940296 116220182
44279 116220182 134686515 154479469 174085590 191392972 203670679 208071227 202964060
44272 202964060 189140744 169585807 147914089 126914239 108151235 92240274 79133831
44265 79133831 68403962 59610547 52445013 46544524 41454322 36962396 33243755 30425018
44257C0425018k247970k169896k191881j954377j586146j345261j178552r44686
44249A6806249p63274p75709p88173n41362j80795o5108j94710k23306j9400J59882
44239A3414294J10926k6648l1039J02122K39901L06524K97757K38224J83630J46829
44229A4982520J3266l22642p40876r89484r97327r07707q05484o41959m61158
44220I129149m36490n77863o38311m59102k12590j37813k00057j97170p9784K7727
44210F217696N3150M7749O0496P4443N7432p423j10175j73327q9836J21547K72461
44199F524213K12081K1030r5036n4354N4329J31941J72523K17571K86909L59378
44189G830585L83085L24356K35994K33617L60285N15919N69729N07838M23252
$$ plain form
44257 30425018 28177048 26007152 23815271 21860894 20274748 18929487 17750935 16806249
44249 16806249 16042975 15267266 14479093 13937731 13756936 13691828 13497118 13273812 13254412 13414294
44239 13414294 13525220 13498572 13467533 13569655 13809556 14116080 14413837 14652061 14835691 14982520
44229 14982520 14995786 14673144 13932268 12942784 11945457 11037750 10232266 9590307 9129149
44220 9129149 8692659 8114796 7476485 7017383 6804793 6666980 6466923 6269753 6189969 6217696
44210 6217696 6270846 6318595 6379091 6453534 6510966 6503543 6393368 6220041 6130205 6251752 6524213
44199 6524213 6736294 6757324 6662288 6607934 6662263 6794204 6966727 7184298 7471207 7830585
44189 7830585 8213670 8538026 8774020 9007637 9367922 9883841 10453570 10961408 11384660
44180A1384660L91421M06244M26143M43081M91722N87576O69764O60091O01758
44171A6062460O53615Q71903J086945J119529J046640J097456J342369J667172
44163B4948089K011447K410706K811282L095760L339626L796032M540573N365127
44155E2318642O134655P025365Q276628R924419J1943024J4448650J7551938K1118487
44147A48741808K4802921K8157970L0539019L1006680K8467588K1948091J1037485
44140C24701562l297303j8131134k9512609l4841342l4500854l0972757k6554568
44133A46890995k2208021j8146980j4619434j1851700r765406q136046o852181
44126E5311227n863009n069781m404068l868100l434278l048107k734348k524934
$$ plain form
44180 11384660 11776081 12182325 12608468 13051549 13543271 14130847 14800611 15460702 16062460
44171 16062460 16716075 17587978 18674923 19794452 20841092 21938548 23280917 24948089
44163 24948089 26959536 29370242 32181524 35277284 38616910 42412942 46953515 52318642
44155 52318642 58453297 65478662 73755290 83679709 95622733 110071383 127623321 148741808
44147 148741808 173544729 201702699 232241718 263248398 291715986 313664077 324701562
44140 324701562 321404259 303273125 273760516 238919174 204418320 173445563 146890995
44133 146890995 124682974 106535994 91916560 80064860 70299454 62163408 55311227
44126 55311227 49448218 44378437 39974369 36106269 32671991 29623884 26889536 24364602
44118B4364602k306517j948840j544192j274793j096024q48470o30337o78279
44110A4037150q71636p89944l65599m2472r7951k22680m3636L02380M56800M12496
44100A2774908M20942N13648M82418K37017j23419n17566q88380j075824r55072
44091A0868672o72315n13950n61259o63454p06707p08929o80329n90834m75028
44082E295867m04824l58482k52415q9422M4577J03563R2435L726j41166k41553
44072D052306k27806j69473j60939j65192r2953L0886J13201J48991K02101K73181
44062D004303K98073K35938Q1873j31978k82426k29631l5997M8432n7279j09762
44052C821546Q4509L42648L96611L27991L97739N67934N56844L35287K08149L53038
$$ plain form
44118 24364602 22058085 20109245 18565053 17290260 16194236 15345766 14715429 14037150
44110 14037150 13165514 12375570 12009971 11967499 11869548 11646868 11603232 11905612 12362412 12774908
44100 12774908 13195850 13709498 14191916 14428933 14305514 13787948 12899568 11823744 10868672
44091 10868672 10196357 9682407 9121148 8457694 7750987 7042058 6361729 5770895 5295867
44082 5295867 4891043 4532561 4280146 4190724 4235301 4338864 4431299 4435025 4293859 4052306
44072 4052306 3824500 3655027 3494088 3328896 3235943 3266829 3380030 3529021 3731122 4004303
44062 4004303 4302376 4538314 4620187 4488209 4205783 3976152 3940155 3988587 3931308 3821546
44052 3821546 3906055 4248703 4645314 4973305 5371044 5938978 6495822 6831109 7039258 7392296
44042G392296N83655O50684N15143K37176j58880n86599q55708q51420o38255
44033F288092l36929l1471J83310K26305J33739l149j90067m47317o22938n37129
44023D662446l02915k16256k98909k71430o1003K0810k12205m61547l64186k7963
44013B466842J53917N6698j10062j84909k03326j98713j22064J1353R1362O7659
44003B028757j195o5235j26378j58993j05630K3082J25625J08505k8290j86631
43993A613617k25110p4297J59577K69999J76587P795p8881o1463R623J13139K09318
43982B119904K08639R4042k4806p0641r1337r5876L9870L42466N70109M95228
43972C587598K55707J80423L22842M23766L24545J55970P4078N1775K5551M4556
$$ plain form
44042 7392296 7975951 8626635 9141778 9378954 9220074 8633475 7777767 6926347 6288092
44033 6288092 5951163 5919692 6103002 6329307 6463046 6459897 6269830 5822513 5199575 4662446
44023 4662446 4359531 4143275 3844366 3572936 3511933 3532743 3320538 2858991 2494805 2466842
44013 2466842 2620759 2677457 2567395 2382486 2179160 1980447 1858383 1869736 1961098 2028757
44003 2028757 2027562 1962327 1835949 1676956 1571326 1594408 1720033 1828538 1800248 1613617
43993 1613617 1388507 1314210 1473787 1743786 1920373 1928168 1849287 1787824 1797447 1910586 2119904
43982 2119904 2328543 2422585 2397779 2327138 2235801 2139925 2179795 2522261 3092370 3587598
43972 3587598 3843305 4023728 4346570 4770336 5094881 5250851 5324929 5376704 5402255 5446811
43962E446811J48871K52997K78801K86747L47402L73155K16147j03793l82250
43953F864888m41300k92369r1733J8631J9178j3238j6900l42K2064Q8066K22870
43942F379815L67845M55045N07670N69861N93309N37015N37560P77212J162701
43933A1888033J366012J288112J264102J620841K193306K521828K441476K209279
43925B6792989K057100J889492J504196Q83654J35569o71587j445331j984859
43917B9161223k164506k124567k086996k041238j824933j477073j248631j223352
43909A4969927j187311r74584o97505m92074k85612k9885P2836j20594l38026
43900A0917172k20081Q7992R1228k99338o00527m67040j54229m7010q9190l601
$$ plain form
43962 5446811 5595682 5848679 6127480 6414227 6761629 7134784 7350931 7247138 6864888
43953 6864888 6423588 6131219 6039486 6058117 6077295 6064057 6047157 6046815 6068879 6156945 6379815
43942 6379815 6747660 7202705 7710375 8280236 8873545 9410560 9948120 10725332 11888033
43933 11888033 13254045 14542157 15806259 17427100 19620406 22142234 24583710 26792989
43925 26792989 28850089 30739581 32243777 33127431 33263000 32591413 31146082 29161223
43917 29161223 26996717 24872150 22785154 20743916 18918983 17441910 16193279 14969927
43909 14969927 13782616 12808032 12110527 11618453 11332841 11302956 11375792 11255198 10917172
43900 10917172 10697091 10785083 10876311 10576973 9976446 9509406 9355177 9308167 9218977 9215376
43890I215376J87919K43558J50853J26973K28543K92771K62698K72891L74146
43881A1355728M34952L87651L54030M35173N43792N33744L75662J46376n1704
43872A4515404j30527q2672k1784m5138n9848J14530M61389P39448P77429O57198
43862A6925429N57391N48075O05820P24861R37478J276316J740285K251313K674834
43853B8241802K964944L237992L583134L853804L793075L307566K445953J196093
43845E2624363m24147k096473l338258l980971m243231m268614l925308l211458
43837B7135903k509622k160114k028481j794861j473924j310459j291246j136712
43829A3430484p66721m46783m02569n31835n84390m51662k06027N383M2146j40779
$$ plain form
43890 9215376 9403295 9646853 9797706 9924679 10153222 10445993 10708691 10981582 11355728
43881 11355728 11790680 12178331 12532361 12967534 13511326 14045070 14420732 14567108 14515404
43872 14515404 14384877 14302205 14280421 14235283 14175435 14289965 14751354 15490802 16268231 16925429
43862 16925429 17482820 18030895 18636715 19361576 20299054 21575370 23315655 25566968 28241802
43853 28241802 31206746 34444738 38027872 41881676 45674751 48982317 51428270 52624363
43845 52624363 52200216 50103743 46765485 42784514 38541283 34272669 30347361 27135903
43837 27135903 24626281 22466167 20437686 18642825 17168901 15858442 14567196 13430484
43829 13430484 12663763 12216980 11814411 11282576 10698186 10246524 10040497 10045880 10088026 9947247
43819I947247m26037o23776o50329n67027m68350m08999m09382m43953m46692
43810E502702l95893l45536l12140k23096o7205K2244l2984r6229k5374P7620
43800D104109L5589r4534j32035j03809j68536k59701j48851J12739J76820p3441
43790C448350l15505k70927q9709l9847q6165m3200O4642Q7202M8960Q2557J59147
43779C045505J50675Q9919J09897J73125J19518l6622j10053m9896J950j7879
43769C476139q160N7097M3171r3158j78907q0509R1269J68912J69587K01260K52969
43758D099670K36162J42006J0063j74401l97501n10621l90819j67713r9270k18847
43748B528729k91593j63536K2933N4074n3794j05431r28J66258K54743K16589
$$ plain form
43819 9947247 9521210 8897434 8247105 7680078 7211728 6802729 6393347 5949394 5502702
43810 5502702 5106809 4761273 4449133 4226037 4158832 4181076 4148092 4051863 4026489 4104109
43800 4104109 4139698 4045164 3913129 3809320 3640784 3381083 3232232 3344971 3521791 3448350
43790 3448350 3132845 2861918 2772209 2732362 2646197 2602997 2667639 2754841 2803801 2886358 3045505
43779 3045505 3196180 3286099 3395996 3569121 3688639 3652017 3541964 3492068 3494018 3476139
43769 3476139 3467979 3525076 3568247 3475089 3296182 3215673 3306942 3475854 3645441 3846701 4099670
43758 4099670 4335832 4477838 4487901 4313500 3915999 3405378 3014559 2846846 2747576 2528729
43748 2528729 2237136 2073600 2096533 2150607 2096813 1991382 1990454 2156712 2411455 2628044
43738B628044J02307R939L6416K05868M14760M91515L51416R0756q8985o5800
43728D176236P8409J25347n5196l43919m77013l29518m7197J31240J25600L7902
43718C421891j3895N260Q8825K23874L61980M25740L73189K15718k2363k95538
43708D784681m90939m87829l07230j29498j06956k07365k87489k69950j92578
43699B304847j21931p8488l8654J9280O6496L2088r8677k16938k02543r1512j9218
43688A554750j137O7704J64488J08491j03844j65067J19581M60607M39203J18087
43678B762863o4321J8322J1471k94087n69116m35218m6823J50597O1152k2654
43668A572186N6428J23915M3208l5506O0678K29129K36927N4460j16089j09239
$$ plain form
43738 2628044 2730351 2740290 2776706 2982574 3397334 3888849 4240265 4331021 4242036 4176236
43728 4176236 4254645 4379992 4324796 3980877 3503864 3174346 3127149 3258389 3383989 3421891
43718 3421891 3407996 3413256 3502081 3725955 4087935 4513675 4886864 5102582 5080219 4784681
43708 4784681 4293742 3805913 3498683 3369185 3262229 3054864 2767375 2497425 2304847
43699 2304847 2182916 2104428 2065774 2085054 2151550 2183638 2084961 1868023 1665480 1573968 1554750
43688 1554750 1553613 1621317 1785805 1894296 1790452 1625385 1744966 2205573 2644776 2762863
43678 2762863 2698542 2716864 2728335 2434248 1865132 1429914 1383091 1533688 1594840 1572186
43668 1572186 1628614 1752529 1795737 1760231 1820909 2050038 2286965 2341425 2225336 2116097
43658B116097K2943J03326L5330j08214j84478j45929p3315l7947O49J00375K03982
43647B032819K04134J07702J7783l4261j06169j87272j77306p1205r576n3938
43637A722711n9732Q9284K47858K02839K5990O734K33038M66480M98828M17716
43627C851746L89476L67351K14647p710j14762j06235j57100k94022l29109j82995
43617C631287l7089m3416j01418q9305j09373k72402m10817l01127o4159j3554
43607B188627j51498j76661j9194K3853j84121l34664j50178J69571K69863J60028
43597A795626Q2772O6807k0269j12029l7566R1265j299k48759k71270J7924K42753
43586A605955J44928m8019m5501O1429N3593o591N6166J63762J29249K4584O6601
$$ plain form
43658 2116097 2139040 2242366 2277696 2169482 1985004 1839075 1765760 1727813 1728462 1828837 2032819
43647 2032819 2236953 2344655 2362438 2328177 2222008 2034736 1857430 1786225 1776649 1722711
43637 1722711 1662979 1752263 2000121 2202960 2228950 2235684 2468722 2935202 3434030 3851746
43627 3851746 4241222 4608573 4823220 4815510 4700748 4594513 4437413 4143391 3814282 3631287
43617 3631287 3594198 3550782 3449364 3360059 3250686 2978284 2567467 2266340 2202181 2188627
43607 2188627 2037129 1860468 1841274 1865127 1681006 1346342 1196164 1365735 1635598 1795626
43597 1795626 1878398 1945205 1924936 1812907 1775341 1866606 1865307 1616548 1345278 1363202 1605955
43586 1605955 1750883 1702864 1657363 1718792 1772385 1765794 1821960 1985722 2114971 2139555 2206156
43575B206156K26348K78660J87870J24602J23346M9866p4646m9139J35119K10551
43565C418733M1421j65916k10466j88650k44006k61619o8186K18686L06958J22397
43555B969352j33438k64068k28534o9276J16117J72383M5185q9324l6240J20018
43545B602175J39085O949o4546k4304o4957k32911k66125j0718K60275K07286
43535B552209p6119k16282j04659J6514k1247j07713j16721j04212j42854j72591
43525A506325j37802j06223j29466j27212l5268N2695K0227r3109j66413j58365
43515F25389q1119P9209K74253L22390J04426k16839l44812k04213Q99P6908L8926
43504F75417J697Q227J9361j917k8652K9973K20007L97159L14352k3486k30250
$$ plain form
43575 2206156 2432504 2711164 2899034 3023636 3146982 3196848 3122202 3073063 3208182 3418733
43565 3418733 3460154 3294238 3083772 2895122 2651116 2389497 2321311 2539997 2846955 2969352
43555 2969352 2835914 2571846 2343312 2274036 2390153 2562536 2607721 2518397 2482157 2602175
43545 2602175 2741260 2748209 2683663 2659359 2594402 2361491 2095366 2084648 2344923 2552209
43535 2552209 2476090 2259808 2155149 2171663 2150416 2042703 1925982 1821770 1678916 1506325
43525 1506325 1368523 1262300 1132834 1005622 970354 1023049 1043276 950167 783754 625389
43515 625389 544270 623479 897732 1220122 1324548 1107709 762897 558684 559583 636491 675417
43504 675417 677114 685341 704702 702785 674133 704106 924113 1321272 1635624 1612138 1381888
43493A381888K1589N23695P60931N79476L23766K87674L69920L89849M06794M98912
43483E544494M89516J82412k90037o22170p26697p28582o74557n17138l29261
43474B327980k64416l02680k65150r8202N3647P4913M18j01402j94701k17767
43464A012640j28149j6523j5094r5188j20884q0643o7768n5025O4964K05706J35455
43453H39491j32223k82053j54496J2981k5499j47757j05931N8879J16759L5030
43443B15181r264N8446J29986J28337R5936O4734M681q5981j63240k04561j97575
43432C6680j05423N3407J56469J26923N4365L6641L492j30189k39812j46336P1155
43421h2628J70009J19209J09351J83194J51263n3906k23335j97110r4019n9449
$$ plain form
43493 1381888 1403477 1927172 2688103 3267579 3591345 3879019 4248939 4638788 5045582 5544494
43483 5544494 6034010 6216422 5926385 5304215 4577518 3848936 3174379 2657241 2327980
43474 2327980 2063564 1760884 1495734 1397532 1451179 1526092 1526510 1425108 1230407 1012640
43464 1012640 884491 867968 852874 757686 636802 556159 488391 433366 498330 704036 839491
43453 839491 707268 425215 270719 283700 258201 110444 4513 63392 180151 215181
43443 215181 205917 264363 394349 522686 618622 683356 688037 602056 438816 234255 36680
43432 36680 -68743 -15336 141133 268056 322421 359062 362554 232365 -7447 -153783 -82628
43421 -82628 87381 206590 315941 499135 650398 596492 373157 176047 82028 22579
43411B2579j1428J64667L52445L60106K16845J03033P3245M2867k0381p2952j02158
43400A128868r2572L3313K57407L39096P9946l35271n17329l80044k00820j55377
43390A57217j00486P4655J87258O2500j33264j20240P8022K03599J56838O3887
43380F29986Q330l9669l9544R9752K72683K18879q2937l03046j95669O0103J47529
43369G76397O9032O9937K06565K66972J26085n8352p9553N0359J54002J14221
43359A695665j9232r4753r595J63287K30553J23311R723M5431J10800k2j97281
43348B057887j85774M7960J51274p9358l88237m44052k80015j29169m6409L4181
43338G38288M6023r6173k46064j96014j7628O5566O5630J57343K75937J77401
$$ plain form
43411 22579 11151 175818 528263 888369 1105214 1208247 1281492 1324359 1303978 1231026 1128868
43400 1128868 1036296 1069609 1327016 1666112 1746058 1410787 893458 513414 312594 157217
43390 157217 56731 131386 318644 381144 247880 127640 205662 409261 566099 629986
43380 629986 638316 598647 559103 658855 931538 1150417 1067480 764434 568765 628868 776397
43369 776397 845429 915366 1121931 1388903 1514988 1456636 1377083 1427442 1581444 1695665
43359 1695665 1676433 1581680 1572085 1735372 1965925 2089236 2098959 2144390 2255190 2255168 2057887
43348 2057887 1872113 1920073 2071347 1991989 1603752 1159700 879685 750516 704107 738288
43338 738288 784311 688138 442074 246060 228432 293998 359628 516971 792908 970309
43328I70309q3878j49816O8977K17664O9316j08501j4220J95120J99599M5977
43318A410547O628P7700J4839j94482k71747r4507J06967R1560p8393j69690q1668
43307H17754O6483P9229j03423k93990k24840R4722L14027J79782j02716j66903
43297F60125j4221N3013m5545p1933Q2369K16605J93504J53866J98426J72794
43287A599003r138j12728O1800K98356K70350O9041O2196K96935M19673K21775
43277C177263p5994j92868j58160j49177j76428j33583l4357k840p5749j61520
43267B016587j77983j27592n6154k1825p9342k09498k85117k00036l0822K3056
43257H51274j10695k61330k04071O9984L26744L32505R4787j51590j87943k4546
$$ plain form
43328 970309 886431 736615 805592 1023256 1092572 984071 969851 1164971 1364570 1410547
43318 1410547 1417175 1494875 1509714 1315232 1043485 948978 1055945 1147505 1069112 899422 817754
43307 817754 884237 963466 860043 566053 341213 435935 749962 929744 827028 660125
43297 660125 645904 698917 653372 581439 663808 880413 1073917 1227783 1426209 1599003
43287 1599003 1589865 1477137 1538937 1837293 2107643 2176684 2238880 2535815 2955488 3177263
43277 3177263 3101269 2908401 2750241 2601064 2424636 2291053 2256696 2253856 2178107 2016587
43267 2016587 1838604 1711012 1654858 1633033 1553691 1344193 1059076 859040 828218 851274
43257 851274 740579 479249 275178 345162 671906 1004411 1099198 947608 759665 735119
43247G35119J38441J45351L8520l9085m3507o1275j47033k16106j55091Q028J22235
43236E25597R7843K649m7170l1103j1835j8578j0446M2311R5581P9231j4139j12172
43224E97769j29773m4380Q7109J76646J75789J08817L5953j7682q3881j83615
43214G22752k47335j55711R6517L16111K83252K5019j80960j38143K7219O3800
43204H12521m5720r0566L0517J78063K19728K09380K20494J90735Q6940N6820
43194A868912K02708L26017J57709k08162l85003k13574M8702J19083J7829j03589
43184A830632k19911l41682l60203k02386k0151r538j16872j30367j2283P0451
43174D87690K8350m6262p3211q4674q4759M184J74259K73556K15797J07160N3099
$$ plain form
43247 735119 873560 1018911 1057431 1018346 974839 913564 766531 550425 395334 403362 525597
43236 525597 623440 626089 578919 547816 535981 517403 506957 549268 644849 724080 709941 597769
43224 597769 467996 423616 510725 687371 863160 971977 1007930 990248 906367 722752
43214 722752 475417 319706 416223 732334 1015586 1040605 859645 721502 748721 812521
43204 812521 766801 676235 706752 884815 1104543 1313923 1534417 1725152 1812092 1868912
43194 1868912 2071620 2397637 2555346 2347184 1962181 1748607 1797309 1916392 1934221 1830632
43184 1830632 1610721 1269039 908836 706450 686299 676761 559889 429522 417239 487690
43174 487690 516040 469778 396567 311893 227134 231318 405577 679133 894930 1002090 1055189
43163A055189j6501j73749k71532j18134J75429K65961L7835k22658k14053L15
43153E18102J48474J40234R8237Q1910J8972q5223r9413J386N0473n3872j70966
43142F48314j33716l246N1103J3055j2938n94J9064R2257K41117K98021R7158
43131A309595j98757k49608l6440R4036m2646k13364j82367o7491n7918n4456
43121C00584J10076K99743K64007O8237p133P3742Q6971k6406o6614M7436J27373
43110A278016M2415p8141r3075n8427n2509j5246P9213R2781m4711j44026j5127
43099I91163K02137K01896m3207k23023r4671K21319M03022K80923k3544k55137
43089A660878k71711j39025j308R1221J68636K02999J16004n7902j55432r3452
$$ plain form
43163 1055189 1038688 864939 593407 475273 650702 916663 954498 731840 517787 518102
43153 518102 666576 806810 905047 986957 1005929 920706 821293 822679 873152 819280 648314
43142 648314 514598 511352 562455 575510 562572 561978 581042 673299 914416 1212437 1309595
43131 1309595 1110838 861230 824790 918826 876180 662816 480449 412958 355040 300584
43121 300584 410660 710403 974410 1042647 1035514 1109256 1196227 1169821 1103207 1150643 1278016
43110 1278016 1320431 1242290 1149215 1090788 1038279 1023033 1102246 1195027 1150316 1006290 991163
43099 991163 1193300 1395196 1351989 1128966 1034295 1255614 1658636 1939559 1916015 1660878
43089 1660878 1389167 1250142 1248834 1340055 1508691 1711690 1827694 1769792 1614360 1520908
43079A520908K3253O6561L3635l6128j40013k05866q1012K07803L45112J08620
43069A842873k52822k99313r516J90860L8518k32637k82771j25705k871R324K6731
43058I02671R0618J10286N8749L1056O9274P1845n7602k54121l44475k25321L1458
43047D84438K29828K17086L5360j12425q4442M7273J15528P3909M762l9827p2947
43036H98543o4535M1536J69510J40183n7373j83091p0591J05568P5314j14788
43026I40276j71837q107J35342O9668p2347o9306O7221J57466J20068K7937k4341
43015A172040M771Q7231R9492p7182l36512l74184p8295K57125K99773J20851
43005A175110K9176Q3323P6918l9747o8085O2965J49102N1037q7688j02698n7455
$$ plain form
43079 1520908 1544161 1610722 1644357 1608229 1468216 1262350 1181338 1389141 1734253 1842873
43069 1842873 1590051 1290738 1281222 1472082 1510600 1277963 995192 869487 866616 875940 902671
43058 902671 993289 1103575 1162324 1193380 1262654 1334499 1276897 1022776 678301 452980 484438
43047 484438 714266 931352 966712 854287 769845 817118 932646 1006555 1011317 971490 898543
43036 898543 834008 875544 1045054 1185237 1127864 944773 874182 979750 1055064 940276
43026 940276 768439 760332 895674 965342 892995 823689 890910 1048376 1168444 1196381 1172040
43015 1172040 1176811 1264042 1363534 1286352 949840 575656 497361 754486 1054259 1175110
43005 1175110 1204286 1287609 1364527 1324780 1256695 1319660 1468762 1519799 1432111 1329413 1271958
42994A271958p8048j35753j43054r6602k488J56498K67387J28275k08575l80858
42984G78740j99141O1059Q7399o939L9441J37783L5619j60360j14649J39041K06125
42973A004118k0809j80475l6330J69372J54259K2717l47L5241l5527j56299j59100
42962G96820o0092O549K6040M9465L0227o0039q1757N9121J71433L9632j70997
42951H06402j10387J77525K46527q6909m17167l01219J12078K87849K6837l01979
42941D39557k68002R6943L84633L10589L283j97077j33640L7340Q3496k6730j31966
42930E98426j05505R673Q9670Q2299M4035N6674J25227J57646P0378p6296j11625
42919I40602K4265J63938J19446m7747j10898k1688J1261j49184l34543l01696
$$ plain form
42994 1271958 1193910 1058157 915103 818501 816013 972511 1239898 1368173 1159598 778740
42984 778740 579599 640658 728057 721118 760559 898342 933961 773601 658952 797993 1004118
42973 1004118 983309 802834 766504 935876 1090135 1112852 1112505 1147746 1112219 955920 796820
42962 796820 736728 743277 769317 818782 849009 788970 707213 766334 937767 977399 806402
42951 806402 696015 873540 1120067 1033158 615991 314772 426850 714699 741536 439557
42941 439557 171555 268498 653131 963720 967003 769926 636286 673626 757122 730392 598426
42930 598426 492921 502594 592264 674563 718598 775272 900499 1058145 1128523 1052227 940602
42919 940602 964867 1128805 1248251 1200504 1089606 1067918 1079179 929995 595452 293756
42909B93756p6476J06655J38551J14799J01095L5858p6529q1111Q4701K19107
42899H60406J08957j40706k35627j09696Q606l4930j15373q4638k1777o2778j36076
42888C6368p8331P2009J19353K5271l5890L6869J22975Q7242k4124q5047o2334
42877B14361N954R8670J79820J68061M2167q9065j15609o4017k0351J1442O6851
42866D98284J03342N9957l713K5872J15939J03757n2551j79390j21640L5798Q7952
42855F73607j0187j04151p1711J8625K5203o7268j41728j13604k2891M6492O8768
42844C01155O3993M3293J9932K9645P4543Q1491p028j23684j42903m6339O4101
42833C58199J09490R3344K6752q1809j47457o3314J13065J68493J5208j64962
$$ plain form
42909 293756 217280 323935 462486 577285 678380 714238 637709 556598 641299 860406
42899 860406 969363 828657 593030 483334 491940 457010 341637 256999 235222 172444 36368
42888 36368 -41963 30046 149399 174670 138780 175649 298624 385866 361742 276695 214361
42877 214361 220315 318985 498805 666866 709033 619968 504359 440342 419991 431433 498284
42866 498284 601626 661583 657870 683742 799681 903438 850887 671497 549857 585655 673607
42855 673607 663420 559269 487558 506183 531386 464118 322390 208786 185895 232387 301155
42844 301155 365148 408441 428373 458018 532561 614052 607024 483340 340437 294098 358199
42833 358199 467689 561033 587785 505976 358519 295205 408270 576763 591971 427009
42823D27009j67812m3406J3309m0021o8953L905R6727J02811R921j19590j96145
42812A7755j41897K3703J49643R8861q0503k13489k05487r9066M0881J74338K30681
42801d580J45087k0145j02732k8783J08372J78720J41984L1407r4530j59146j11887
42790H3767M114R2354J15908J02428N6392l5261j26133j54634j50924j67186j25373
42779c04548P9156L14721K90886j4630k42025j21886J43634J89516J4296p9322
42769B69798J7445R4911J9039m5071P2476K47741K37447K9821j52844j48665p513
42758F34585J32999J92932J54593L0667j15774j80425j12693J2267O0320j9796
42748G89675j48165k12427j88979j45867j39291j41181q6803K2412R6995N8818
$$ plain form
42823 427009 259197 215791 229100 189079 120126 124031 220758 323569 333490 213900 17755
42812 17755 -124142 -100439 49204 148065 67562 -145927 -351414 -450480 -409599 -235261 -4580
42801 -4580 140507 120362 17630 -11153 97219 275939 417923 449330 354800 195654 83767
42790 83767 87881 180235 296143 398571 454963 419702 293569 138935 -11989 -179175 -304548
42779 -304548 -225392 89329 380215 365585 123560 1674 145308 334824 349120 269798
42769 269798 287243 382154 401193 356122 428598 676339 913786 943607 790763 642098 634585
42758 634585 767584 960516 1115109 1145776 1030002 849577 736884 749151 809471 789675
42748 789675 641510 429083 240104 94237 -45054 -186235 -273038 -250626 -153631 -94813
42738i4813n2451j07168l2698R9115J63700J35703R3499Q3691O1030j1434q0834
42727B57340q0534k9806R916L3333P1909J11815J10644P0747J8974n6482j58872
42716C58984k04092j07788N5293J11083K9249k8207M2550J19916M3113j31296
42706B88805j97467r1776J9526k2617j42604j25209Q4289K72564K15975j0912
42696B90574j11910L2485J98225J41329o0445j56397r9486m8016n0566K972J03204
42685B41969P4255j07288k03902o7768J23278J49231O7325M9304P4246J8385p5538
42674C43497o5937K6524N3559j8102j04630j82829k53194j95135P8961L57260
42664C9974L08590l7276k70504j45225J15948J81007L5105j11698j42262o7164
$$ plain form
42738 -94813 -147264 -254432 -287130 -188015 -24315 111388 204887 288578 349608 338174 257340
42727 257340 176806 147000 156916 190249 262158 373973 484617 555364 574338 517856 358984
42716 358984 154892 47104 102397 213480 242729 214522 257072 376988 420101 288805
42706 288805 91338 -438 19088 -3529 -146133 -271342 -187053 85511 301486 290574
42696 290574 178664 211149 409374 550703 490258 333861 234375 186359 135793 138765 241969
42685 241969 316224 208936 5034 -62734 60544 209775 277100 326404 400650 419035 343497
42674 343497 277560 304084 357643 339541 234911 52082 -201112 -396247 -317286 39974
42664 39974 348564 311288 40784 -104441 11507 192514 227619 115921 -26341 -93505
42654i3505J01071K95762L24383P4157k52970l20087q0799J51791J06121j27766
42644A78158k62061j81985k5322O6473J27024K32837K99822J63804j33559l00128
42634A65063j38377J69796K70588Q1351j36090j44383q321N2247m3041j76547
42624I2286j97877p6176Q0592J31942N9573o346K3172L8254j04964l03841k94804
42613e58189m5416J59123J13748l5304o6325k7858q4274j64935n8512J90031K77645
42602c00266R2853r5263k5948J84715K49757J41030P7021J33988J30411l4012
42592E54286j56747k8829J96820J85488p3710k25160p8803R6094l719k29807k13231
42581B2682N6281K29476J46427K7985N0552P3852m4373j57864q9045M6044L3953
$$ plain form
42654 -93505 7566 303328 627711 701868 448898 128811 48012 199803 305924 178158
42644 178158 -83903 -265888 -291210 -224737 -97713 135124 434946 598750 465191 165063
42634 165063 26686 196482 467070 548421 412331 267948 259627 311874 268833 92286
42624 92286 -105591 -181767 -101175 30767 90340 83994 107166 145420 40456 -263385 -558189
42613 -558189 -603605 -444482 -330734 -366038 -432363 -460221 -544495 -709430 -767942 -577911 -300266
42602 -300266 -207413 -302676 -328624 -143909 105848 246878 323899 457887 588298 554286
42592 554286 397539 368710 565530 751018 677308 452148 373345 469439 465720 235913 22682
42581 22682 78963 308439 454866 482851 533403 607255 562882 405018 315973 362017 395970
42570C95970p1686n9009O3045P4262q9391k23425j46409P2092K19209J62484m5951
42559C51191k09562j60675L9796J50879O8672m1183l8016m2091j75750k60881
42549c17620p3900K29403K94684J07296k2051J2553L043j10442j04489O7559J09987
42538A96023r9433k25133n342K78163K30326l1912j01656N9488J26458j9082j52321
42527B55579j29373o4046m3435n679M0174j8052j35411j07492Q5193K05846J33915
42516B17219M0047O7136R7682k683j38428j58203q8322k4286M2545J29260J51006
42505C32973O1755m2371r1842j41756j74893l7342K45662L41835O3619k74879
42495B82761k69592p175J25415N5399L1971J16812J25360N6604J07819K15993
$$ plain form
42570 395970 324284 265275 328320 402582 313191 89766 -56643 15449 234658 397142 351191
42559 351191 141629 -19046 20750 171629 240301 199118 161102 119011 -56739 -317620
42549 -317620 -391520 -162117 132567 239863 217812 230365 233408 122966 18477 86036 196023
42538 196023 96590 -128543 -133885 144278 374604 342692 241036 300524 426982 407900 255579
42527 255579 126206 62160 18725 13046 53220 35168 -100243 -207735 -122542 83304 217219
42516 217219 257266 324402 422084 419401 280973 122770 34448 10162 52707 181967 332973
42505 332973 394728 352357 260515 118759 -56134 -93476 152186 494021 557640 282761
42495 282761 13169 5994 131409 186808 218779 335591 460951 517555 625374 841367
42485H41367P7085k60366l34989k2073J70430j04863m16134j98089L43937N31182
42475F27487J97444j90163k98388k58213k21908j18843L7745N5646o7377o6450
42465c03020J34981K55368J24660k8081J6995J02418J0970j30177q1771Q6209
42455A88552J35915O5732M5478O7435j236q9840P443K41582L12121J10723j24543
42444I59362j80966j39505j50980j67948p1079Q5365J39030O7124J7421R6931
42434F54755K30424K56924J23164n3016j17365n3170K1813K2452j7312m0132m3667
42423I84870j5846R1318K45240L12606K57291K24699K99384L34321K08467R7922
42413C040272K28204M71326N08655L42069K85371M22556M50216J80645j43152
$$ plain form
42485 841367 918452 658086 323097 301024 471454 366591 -49543 -247632 96305 627487
42475 627487 824931 634768 336380 78167 -143741 -262584 -224839 -169193 -236570 -303020
42465 -303020 -168039 87329 211989 183908 200903 303321 314291 184114 102343 188552
42455 188552 324467 390199 435677 503112 501876 412036 419479 661061 973182 1083905 959362
42444 959362 778396 638891 487911 319963 248884 334249 473279 540403 557824 654755
42434 654755 885179 1142103 1265267 1212251 1094886 1041716 1063529 1085981 1068669 1028537 984870
42423 984870 969024 1060342 1305582 1618188 1875479 2100178 2399562 2733883 2942350 3040272
42413 3040272 3268476 3739802 4248457 4590526 4875897 5298453 5748669 5929314 5786162
42404E786162k31000j55589j40874j76276j17421o903j0389j25306k06817k25419
42394D390168k66941l12402k40650n1520J02005J24258P5471N4629J05260K22061
42384D202339L35633L32143K19567K09977M55704P50605P23753L42965j6371p9077
42374G477238j2149j14351l63932n00088m48602m09301n09713n99015m95284k85910
42364C738893k15379l30185m12645k99961j13354o4912j47085j72349p7684j1517
42354A893822r0383k25784k65930j93440j01443o2216r0643j57952j83943j03668
42344D18420J0393N637j16140j64239m1982R9069J10229P6133J18972J42097R792
42333F68381j46584r4469R1248R9568j27039k82483j55664P5808J41957M4095
$$ plain form
42404 5786162 5555162 5399573 5258699 5082423 4965002 4958099 4947710 4822404 4615587 4390168
42394 4390168 4123227 3810825 3570175 3518655 3620660 3744918 3820389 3875018 3980278 4202339
42384 4202339 4537972 4870115 5089682 5299659 5755363 6505968 7229721 7572686 7556315 7477238
42374 7477238 7465089 7350738 6986806 6486718 6038116 5628815 5119102 4520087 4024803 3738893
42364 3738893 3523514 3193329 2780684 2480723 2367369 2302457 2155372 1983023 1905339 1893822
42354 1893822 1803439 1577655 1311725 1118285 1016842 954626 863983 706031 522088 418420
42344 418420 428813 434450 318310 154071 112089 211158 321387 397520 516492 658589 668381
42333 668381 521797 427328 518576 618144 491105 208622 52958 128766 270723 314818
42323C14818m1225m9521l9636k7023K2338P7126N0427p8813k19348k43245j05945
42312c40047P9376J25147k266j02460j2475J21434M5028j79615k22512J1571K21371
42301b55448J61955j3100l6939P4276J24676O0493l3644j22484j91126j48842
42291c80183K6238J56207R2396k9161R591J49651J59636K9832k7759M4382O8720
42280B99550l2093r7934j9672P7817O4457J3447L5490O8404k338j23676j43217
42269A40235m3873L6568J3168l5903m654O3839J3981j91916l52482k43789N6990
42258e47836K23934J15694l1543J6443J16731J286k40934k68625l2706J41167
42248e06389O6916m9151K398J06477P8122j7668l2274j3018o9826j23672m1212
$$ plain form
42323 314818 273593 224072 184436 157413 179751 256877 307304 228491 9143 -234102 -340047
42312 -340047 -260671 -135524 -137790 -240250 -252725 -131291 -86263 -265878 -488390 -476819 -255448
42301 -255448 -93493 -106593 -143532 -69256 55420 115913 82269 -40215 -231341 -380183
42291 -380183 -353945 -197738 -105342 -134503 -124912 24739 184375 214207 186448 230830 299550
42280 299550 267457 169523 149851 227668 292125 305572 341062 409466 407128 283452 140235
42269 140235 96362 132930 146098 110195 105541 169380 183361 -8555 -361037 -604826 -547836
42258 -547836 -323902 -208208 -239751 -223308 -106577 -105291 -346225 -614850 -647556 -506389
42248 -506389 -439473 -488624 -486226 -379749 -301627 -319295 -351569 -364587 -434413 -558085 -599297
42237e99297J00837J38000J11835J83785L13973K90308P2023j37426j90608j60471
42227A22959j56147j57315j04022j5179N1983P1108M2302o016j3417L2952M7452
42216h3340k2754o9560K9812J86634J99153N2681p5674j07005j33937j77864j19396
42205c21250M0722Q7460r4017k97985k63824k3710J80783K19127J50943P5504
42195b46247N1974R9864J55554J04578l9992j01428L159J09244O0789l6154j9982
42184A41359K1037p6895j92120p0201K05141K64526K1465j79189j04198K6996
42174E7921n4076k29607k37806j12677o7887j02140m6623Q6164J23218O5487R2307
42163d25719K17856K37378P8988n9066k7365N0219O624j02805j20647l7607K7002
$$ plain form
42237 -599297 -498460 -360460 -248625 -64840 249133 539441 611464 474038 283430 122959
42227 122959 -33188 -190503 -294525 -309704 -257721 -186613 -144311 -150327 -163744 -130792 -83340
42216 -83340 -106094 -175654 -145842 40792 239945 292626 216952 109947 -23990 -201854 -321250
42205 -321250 -280528 -193068 -287085 -585070 -848894 -872604 -691821 -472694 -321751 -246247
42195 -246247 -194273 -94409 61145 165723 125731 24303 27462 136706 197495 161341 141359
42184 141359 162396 85501 -106619 -176820 28321 292847 314312 135123 30925 57921
42174 57921 3845 -225762 -463568 -576245 -644132 -746272 -792895 -706731 -583513 -518026 -425719
42163 -425719 -207863 29515 108503 49437 22072 72291 78915 -23890 -144537 -182144 -155142
42152a55142M672p8812j61400j59987j9256J74087K29493Q9996p8124j18452p8003
42141c50928o3218m8000K9000J06011J04073P5370P3986J1588j47054j90887M1395
42130c58664K78258J06081l59728n06787n8285N00068N57830J47584k19093k67140
42120a79876j63839j09080o9082M2058J68531J98836J12540k1345j14246j08163
42110b43666k0874O1015P7932N2663J9152k4897n0818p16P5563L2188j24326j77299
42098c24083l8809N9531o2144j80988j2388K69416K65023J4842n0278J56030K08716
42087C04868j01243l73455k29571Q5127J24814n6003q0032Q6558J32105k1835
42077a28667j05268J4280J33823Q8782j1710l8304m5430q8000p4858M3462J31085
$$ plain form
42152 -155142 -150470 -229282 -390682 -550669 -569925 -395838 -166345 -76349 -154473 -272925 -350928
42141 -350928 -414146 -462146 -433146 -327135 -223062 -147692 -73706 -62118 -209172 -400059 -358664
42130 -358664 -80406 25675 -334053 -840840 -899125 -399057 158773 306357 87264 -179876
42120 -179876 -343715 -452795 -521877 -479819 -311288 -112452 88 -21257 -135503 -243666
42110 -243666 -264540 -203525 -125593 -72930 -53778 -78675 -129493 -130209 -54646 -22458 -146784 -324083
42098 -324083 -362892 -303361 -365505 -546493 -558881 -289465 -24442 -9600 -59878 96152 304868
42087 304868 203625 -169830 -399401 -314274 -189460 -245463 -325495 -238937 -106832 -128667
42077 -128667 -233935 -219655 -85832 2950 -8760 -47064 -92494 -180494 -255352 -211890 -80805
42066h0805O4603o6841r7701j5934O2753P1575M4642M2226Q5866J33332J07348
42055C51064j445r0230q4700o6579j32738j95184j07154N9605R4167j1371n9076
42044b43641l836k2196j50680j66528K9692K07643J72079N9255M4743K4110j32527
42033a81886k47338j00686J44211J53369n1141j49821m6219N2656N9079J15975
42023b51801K36894K11449j6092k03886j87281j01053p9059k3400J39578K40897
42013c3754J35087l3412o7902l9135j18794k45127k17082k1419J74718K75285
42003a91535K76814J33874j43075l25384j83784J45107K80110J05507r8253q4119
41993h4738N6186J13031N7701j5661o9679j01910p5822P62M0866K2045L8586J12529
$$ plain form
42066 -80805 -16202 -83043 -180744 -196678 -133925 -62350 -17708 24518 110384 243716 351064
42055 351064 349619 259389 174689 108110 -24628 -219812 -326966 -267361 -173194 -184565 -243641
42044 -243641 -247477 -269673 -420353 -586881 -557189 -349546 -177467 -118212 -73469 -49359 -181886
42033 -181886 -429224 -529910 -385699 -232330 -283471 -433292 -479511 -426855 -367776 -251801
42023 -251801 -14907 196542 180450 -23436 -210717 -311770 -390829 -414229 -274651 -33754
42013 -33754 101333 67921 19 -39116 -157910 -403037 -620119 -641538 -466820 -191535
42003 -191535 85279 219153 76078 -249306 -433090 -287983 -7873 97634 -619 -84738
41993 -84738 -28552 84479 142180 126519 56840 -45070 -120892 -120130 -79264 -57219 -18633 93896
41981I3896J07336l6452j40937m9824R3314N4653j06037j30996L445M8696r0399
41970a53305j84391m5400J82527K57559J70879O9897R675l3688l1619K0159J92
41959B62485j61352k95348k00801L5809J64773J57412J93858K90534K51305M0732
41949G39407j03546m7381L0995l7528j39237j12764k8460k2223n3157m4969p0132
41938A11005j57494j25710J09721K68833R1062j87392j42871J71752L21209J81562
41928F41677M7494L7499p3492l09934l22992O32K43849Q9575j83056j99924r1847
41917a20519j48127k13253K7892L83138L57029n4586l27504j91721N0991Q3083
41907a53577j3219n0522m9205n9311L734J40281J57514k0825j77440j29016n470
$$ plain form
41981 93896 201232 164780 23843 -25981 67333 121986 15949 -115047 -111602 -62906 -153305
41970 -153305 -337696 -383096 -200569 56990 227869 297766 307441 273753 242134 262293 262485
41959 262485 101133 -194215 -395016 -359207 -194434 -37022 156836 447370 698675 739407
41949 739407 635861 588480 619475 581947 442710 329946 301486 279263 226106 181137 111005
41938 111005 -46489 -172199 -62478 206355 297417 110025 -32846 138906 460115 641677
41928 641677 689171 726670 653178 343244 20252 20884 264733 354308 171252 -28672 -120519
41917 -120519 -268646 -481899 -454007 -70869 286160 231574 -95930 -287651 -236660 -153577
41907 -153577 -166796 -217318 -266523 -325834 -322100 -181819 -24305 -45130 -222570 -351586 -357056
41896c57056m42n6249k3539N0090L8982K499P1185J71447J25781k6151o2617O8172
41884B102J66082R0655m7650q7570m8571n1145j07959j19341m3499L5177K9712
41873a82007k5100k7304L7408O9027L670q2954q6404k8665p244k5340J0838J27147
41861b16928K26080K16279J06396m1938j64473j95015j17068k1407j2696o3983
41851b84753p1177k4674J2402N7422J50870J78272J017k25107j69510J47672K81389
41840E3823l550l37664k61897J17550L26758K01091K087m5936K1262J16434K01795
41829C91753J75131m2989k84797k82777o8821O0415O824j9722P6903R8738n7473
41818E3185j68835o6250M9844m6494j92877j03118J29614J67961j5484j01067
$$ plain form
41896 -357056 -357498 -413747 -437286 -387196 -348214 -345715 -274530 -103083 22698 -3453 -66070 2102
41884 2102 168184 258839 211189 123619 75048 23903 -84056 -203397 -246896 -211719 -182007
41873 -182007 -207107 -234411 -197003 -127976 -124306 -207260 -293664 -322329 -329573 -354913 -344075 -216928
41861 -216928 9152 225431 331827 289889 125416 -69599 -186667 -208074 -220770 -284753
41851 -284753 -355930 -380604 -368202 -310780 -159910 18362 19379 -205728 -375238 -227566 53823
41840 53823 50273 -287391 -549288 -431738 -104980 96111 98198 52262 73524 189958 391753
41829 391753 566884 523895 239098 -43679 -112500 -52085 -45261 -64983 11920 110658 53185
41818 53185 -115650 -181900 -132056 -178550 -371427 -474545 -344931 -176970 -192454 -293521
41808b93521N2059K03016J42740o192n6365n5985j16338j43665N282K18986K40571
41797A90588M2016j42252j61775j17086j33551j64291j14104p021Q3539J52795
41787c71142J97621J42292l1289j68592j15002N5446J42791J05107O3201N1979
41777G2412k3021j58839j98731q0651M2959M0197o177L2046J01871O5964o3791
41766a75761j41528r0917K5796J11681J19774O4839J0375K547q377r7750k02516
41755c81837j66753K979J00936K8443n1636K425O8764j5076j62366j90556j17834
41744h82511o9928k3660R6419J84261J06304n055O8018K19517J46474j27359k34499
41733e22019l2240J81322J50167K2744M1717J51434J47022J8905p6804o7627m882
$$ plain form
41808 -293521 -241462 -38446 104294 98102 41737 -14248 -130586 -274251 -268969 -49983 190588
41797 190588 232604 90352 -71423 -188509 -322060 -486351 -600455 -607476 -523937 -371142
41787 -371142 -173521 -31229 -62518 -231110 -346112 -290666 -147875 -42768 20433 72412
41777 72412 49391 -109448 -308179 -388830 -345871 -305674 -311851 -279805 -177934 -111970 -175761
41766 -175761 -317289 -408206 -382410 -270729 -150955 -86116 -75741 -73194 -81571 -179321 -381837
41755 -381837 -548590 -545611 -444675 -416232 -467868 -465443 -396679 -411755 -574121 -764677 -882511
41744 -882511 -952439 -976099 -879680 -695419 -589115 -594170 -526152 -306635 -160161 -287520 -522019
41733 -522019 -554259 -372937 -222770 -200026 -158309 -6875 140147 159052 82248 14621 9739
41722I739N3384O7914J2916o2904o6775j4561k8565j28088j70477o8304Q1579
41711c14142J49311J07696k2735j93193k59805j05087J27955J55184l3880j36812
41701e25508M105J87299K11291J49247J06000O601j64395k02893j1711J70978
41691f8986J24140k2445o4078o5055j33351j24193Q0904K48505J42834j7576J07201
41680B07900L65994L21854l7709k95484k68849j84435j75815j01877M8554L7524
41670h2343j85296l27143k04210m455O3784O5184J14378J56793J40200J37191
41660a25917J45545L0562j89284k69836j10240O7982O9561p978j9918j6549n2160
41649d78232j6849J25376J75912J4493j46823p0226J38078K14052J26084L2115
$$ plain form
41722 9739 63123 131037 143953 81049 14274 -287 -28852 -156940 -327417 -395721 -314142
41711 -314142 -164831 -57135 -79870 -273063 -532868 -637955 -510000 -354816 -388696 -525508
41701 -525508 -521403 -334104 -122813 26434 132434 139035 -25360 -228253 -239964 -68986
41691 -68986 55154 32709 -31369 -96424 -229775 -353968 -273064 -24559 118275 100699 207900
41680 207900 573894 895748 858039 562555 293706 109271 -66544 -168421 -119867 -82343
41670 -82343 -267639 -594782 -798992 -803447 -739663 -674479 -560101 -403308 -263108 -125917
41660 -125917 19628 50190 -139094 -408930 -519170 -451188 -381627 -389605 -409523 -426072 -478232
41649 -478232 -495081 -369705 -193793 -179300 -326123 -396349 -258271 -44219 81865 113980
41639A13980j0908n3670q5163p0521n2144l9433N7169K06672J66399j54859m32369
41628c54847l15929O2436K85790K41991J70741J86373J30113o8103k19058j71340
41618e1833k4319O2559O6285J4470r8879k04597j46598Q3861K41785J14800j64483
41607a06949k51925k4166K57774K66799N707k13657j71401N354O0989k6909o3178
41596b61562L7640J40853J30432O1096M787p0721j72587j96389q1433Q0893J81894
41585a45097K00635J21029o1210j83905k8272K94316L53256j0526l90860l65612
41575b16246o4441J18861J16413J10224R1914n4531j78935m8164J76437J24489
41565A76021j52280k32762l5873M7699j49122k62853j7154L06228L17083P6312
$$ plain form
41639 113980 103072 49402 -35761 -106282 -158426 -197859 -140690 65982 232381 77522 -354847
41628 -354847 -670776 -608340 -322550 -80559 90182 276555 406668 338565 119507 -51833
41618 -51833 -76152 -13593 52692 67162 -31717 -236314 -382912 -299051 -57266 57534 -106949
41607 -106949 -358874 -383040 -125266 141533 147240 -66417 -237818 -232464 -171475 -198384 -261562
41596 -261562 -223922 -83069 47363 108459 113246 42525 -130062 -326451 -407884 -326991 -145097
41585 -145097 55538 176567 115357 -68548 -96820 197496 550752 540226 149366 -216246
41575 -216246 -280687 -161826 -45413 64811 156725 102194 -76741 -124905 51532 176021
41565 176021 23741 -209021 -244894 -197195 -346317 -609170 -626324 -320096 -3013 73299
41555G3299j14868j87332k28497j74861N7089K81719K29594m4633k21156j46303
41545d75949K9115J21171J15663Q8621P8486O7539J5894p9254j33797n6284J00686
41534a28109J82853J58176J46288J78275J21712o2307j98042j73941j37633k23531
41524a36259k75387q6291K20882L27737J69067j5167n8314m8791r9713j55570
41514a57806j19003k5201J1134m6931j19477r6592N6540K51750L32115K05721
41504B92250o2000k86835k97344p7019J74700J88855o1914k64826j37298J62971
41494c68460K27282j8837k11687j02786R6228R3946l6562m6792O3076R8674K3367
41483a82551k1377K0640P3935R9307J04685M4933r2542j62805k9050J89859K34832
$$ plain form
41555 73299 -41569 -228901 -457398 -632259 -575170 -293451 -63857 -108490 -329646 -475949
41545 -475949 -446834 -325663 -210000 -121379 -42893 24646 40540 -38714 -172511 -228795 -128109
41534 -128109 54744 212920 359208 537483 659195 596888 398846 224905 87272 -136259
41524 -136259 -411646 -497937 -277055 50682 219749 204582 146268 97477 -2236 -157806
41514 -157806 -276809 -302010 -290876 -337807 -457284 -553876 -497336 -245586 86529 292250
41504 292250 230250 -56585 -353929 -430948 -256248 -67393 -129307 -394133 -531431 -368460
41494 -368460 -141178 -160015 -371702 -474488 -378260 -284314 -320876 -367668 -304592 -205918 -182551
41483 -182551 -203928 -183288 -109353 -10046 94639 139572 47030 -115775 -144825 45034 279866
41472B79866M4841j89407k77288j84482O274J41747Q1220j14491j78709O851J87394
41461a96184Q4810j64611k03474J4394J99992J87763R4603K6851n3510j36401
41451a45767j28547n7267m7300p0215R144J27459Q2325p3386n7961J36067J54030
41440g1418j42420l84235k27826J35968K93982J82291M1998m049j7611j2981M9034
41429a57267J00364L7624r1593j59495j48093j04058r44J69952K66528J56255
41419F9273n8228j63434j22811n8748j7300M5429Q7785P740j54564k20990j07364
41408f93212Q0439J90874J61515K7439j00881r7132M3046J62011J28404M439o9106
41397a62164o8906n4440l3860k848k1571j00803j13558P153R5260j1029j63696
$$ plain form
41472 279866 324707 135300 -141988 -326470 -320196 -178449 -97229 -211720 -390429 -383578 -196184
41461 -196184 -111374 -275985 -479459 -465065 -265073 -77310 17293 44144 -9366 -145767
41451 -145767 -274314 -331581 -378881 -449096 -439952 -312493 -230168 -303554 -361515 -225448 -71418
41440 -71418 -213838 -598073 -825899 -689931 -395949 -213658 -171660 -175709 -193320 -206301 -157267
41429 -157267 -56903 -19279 -110872 -270367 -418460 -522518 -523462 -353510 -86982 69273
41419 69273 11045 -152389 -275200 -333948 -351248 -305819 -218034 -210294 -364858 -585848 -693212
41408 -693212 -612773 -421899 -260384 -232945 -333826 -430958 -387912 -225901 -97497 -93058 -162164
41397 -162164 -231070 -285510 -319370 -322218 -343789 -444592 -558150 -550997 -455737 -466766 -630462
41386f30462r8591J32525K20116P5668n5878j0867O7451K9859k1427N4401J69248
41375f7957J42260k3186j66458j95968j56482j18178r0651k2920J36696L32993
41365b29851L86503K01501l8316o0290J08140J59094l7255k37992k08925o4424
41355b1815m0600j21408j22008j7254N5613N7899Q7232J68284J93893R2313p8699
41344B53450k09514k14932o8532J34403K00287M6685j60099k03044r1575L872
41334c08999K8149O3358J09593O2827o3302j00075K0987J46166J22217K002o8405
41323A4518n4580k5027k0709k8008l1720k7322j4099o361j0685N443N5363O7324
41311g5863j5543r3723k4139J25102J24663o5979k06527j28893K2827M4850k5629
$$ plain form
41386 -630462 -729053 -596528 -376412 -300744 -356622 -367489 -300038 -270179 -291606 -237205 -67957
41375 -67957 74303 51117 -115341 -311309 -467791 -585969 -676620 -699540 -562844 -229851
41365 -229851 156652 358153 319837 259547 367687 526781 489526 251534 42609 -21815
41355 -21815 -62415 -183823 -305831 -323085 -267472 -209573 -122341 45943 239836 332149 253450
41344 253450 43936 -170996 -239528 -105125 95162 141847 -18252 -221296 -312871 -308999
41334 -308999 -280850 -217492 -107899 -45072 -108374 -208449 -187462 -41296 80921 82923 14518
41323 14518 -40062 -65089 -85798 -113806 -145526 -172848 -186947 -193308 -203993 -198550 -143187 -75863
41311 -75863 -91406 -185129 -209268 -84166 40497 -25482 -232009 -360902 -338075 -293225 -318854
41300c18854m1946j2123j9306j4835P7013J55089Q6309l2591j7407P1191K7403
41289d0057j08696q5573J15158K04139M1491j44889j32108r800M6624M7868M9440
41278a6403j5169j45029j45012O2162K02487J9538k84192k96160J3150K68467
41268c36161K21902L583j62613k13020j69387m7392R1027J60829J62385J37816
41258a51031N9758p2251j06046O0668K25180J17829j43016j71479R3244K81536
41248A94392J68060k0506l6834j087j14141k68593k34918m0787J03876J16627
41238a33911N1136n8828j49386p3872J73583L30873K03240j9588m1318Q5605Q4471
41227D52005o7050j18129K1854J48719R5574o3335j84708k09476j13708Q2189
$$ plain form
41300 -318854 -360800 -372923 -392229 -407064 -330051 -174962 -88653 -121244 -138651 -67460 -40057
41289 -40057 -148753 -234326 -119168 84971 126462 -18427 -150535 -160335 -113711 -65843 -16403
41278 -16403 -31572 -176601 -321613 -259451 -56964 -37426 -321618 -617778 -604628 -336161
41268 -336161 -114259 -110676 -273289 -486309 -655696 -703088 -612061 -451232 -288847 -151031
41258 -151031 -91273 -163524 -269570 -208902 16278 134107 -8909 -180388 -87144 194392
41248 194392 362452 341946 305112 304025 189884 -78709 -313627 -354414 -250538 -133911
41238 -133911 -82775 -141603 -290989 -364861 -191278 139595 342835 323247 281929 367534 452005
41227 452005 384955 266826 288680 437399 532973 469638 284930 75454 -38254 43935
41217D3935K28568J74261J932o0316L1488J09002R4280Q3227R7684K4971j16276
41206G12756j15314R8384K94418K63569R8727o350m9980j24014j78815j09136
41196H84245J4270J3298j23448k09800j18196N5433J12651k4119k25520k79369
41186I9445j20307Q0949J23219L8992K3432J06806R1984j08136k73389j78993
41176a15998N2771J16381l2234j18971M5106K92323L15460M9465k58869l28888
41166A6546j30558J09725J56004l792j71556j65033j856J40672J19939l3497j65705
41155a29111j77953j27746j17026j18785j8862J67099K63686J85305O6362L7947
41145C0916K8638o5748j69666j76721j58678j88470j09139K07935M97271L83189
$$ plain form
41217 43935 272503 446764 448696 388380 419868 528870 623150 706377 804061 829032 712756
41206 712756 597442 695826 990244 1253813 1352540 1346190 1296210 1172196 993381 884245
41196 884245 898515 911813 788365 578565 460369 515802 628453 604334 378814 99445
41186 99445 -20862 60087 183306 222298 245730 352536 444520 336384 62995 -115998
41176 -115998 -63227 53154 20920 -98051 -52945 239378 554838 604303 345434 16546
41166 16546 -114012 -4287 151717 147925 -23631 -188664 -190520 -49848 70091 36594 -129111
41155 -129111 -307064 -434810 -551836 -670621 -689483 -522384 -258698 -73393 -7031 30916
41145 30916 59554 -6194 -175860 -352581 -511259 -699729 -808868 -600933 -103662 279527
41135B79527j7533k07046m7011P1699r0302k50216j36950M9743L3983n6433K0950
41124c49589J56251J11367k6469k8017L0684o8050k13284j05458K02512L37271
41114D7218J69328n0451j34580j61097j88066j27683J3225Q3703N7557O0327P7210
$$ plain form
41135 279527 261994 54948 7937 79636 -10666 -260882 -397832 -348089 -314106 -370539 -349589
41124 -349589 -193338 -81971 -108440 -136457 -105773 -173823 -387107 -492565 -290053 47218
41114 47218 216546 166095 31515 -129582 -317648 -445331 -432106 -348403 -290846 -230519 -153309
$$ [...]
##END NTUPLES=NMR SPECTRUM
##END=
