##TITLE=31Pdec_SR5_rm
 , 24 sc
 26.12.2019
##JCAMPDX= 6.0         $$ Bruker NMR JCAMP-DX V2.0
##DATA TYPE= NMR SPECTRUM
##DATA CLASS= NTUPLES
##ORIGIN= UXNMR, Bruker Analytische Messtechnik GmbH
##OWNER= root
$$ XWIN-NMR		Version 3.5
$$ Thu Dec 26 14:24:14 2019 Russian Standard Time (UT+4h)  she@DPX200
##.OBSERVE FREQUENCY= 81.013821
##.OBSERVE NUCLEUS= ^31P
##.ACQUISITION MODE= SIMULTANEOUS
##.ACQUISITION SCHEME= undefined
##.AVERAGES= 24
##.DIGITISER RES= 17
##SPECTROMETER/DATA SYSTEM= spect
##.PULSE SEQUENCE= zgpg30
##.SOLVENT NAME= CDCl3
##.SHIFT REFERENCE= (INTERNAL, CDCl3, 0, 182.463)
##AUDIT TRAIL= $$ (NUMBER, WHEN, WHO, WHERE, WHAT)
$$ ##TITLE= Audit trail, XWIN-NMR		Version 3.5
$$ ##JCAMPDX= 5.01
$$ ##ORIGIN= Bruker BioSpin GmbH
$$ ##OWNER= she
$$ F:/spectra/data/she/nmr/P31/1/pdata/1/auditp.txt
$$ ##AUDIT TRAIL=  $$ (NUMBER, WHEN, WHO, WHERE, WHAT)
(   1,<2019-12-26 14:22:47.70 +0400>,<she>,<DPX200>,
      <created by zg, POWCHK disabled, PULCHK disabled
       configuration hash MD5:
       00 E9 B6 7A A2 85 ED C7 34 08 36 98 17 FE 4E 26
       data hash MD5: 32K
       84 D5 6C 16 D3 DE 9E F4 35 13 EE 9C 05 BB F7 7E>)
(   2,<2019-12-26 14:22:50.62 +0400>,<she>,<DPX200>,
      <Start of raw data processing
       efp BC_mod = 2 LB = 1 FT_mod = 6 PKNL = 1 PHC0 = -1664.622 PHC1 = 69.80119 SI = 64K 
       data hash MD5: 64K
       3A 21 A9 5D 4E 02 3B FF A9 D4 66 E2 C4 ED 2D C3>)
(   3,<2019-12-26 14:23:03.90 +0400>,<she>,<DPX200>,
      <pk PHC0 = 4.212563 PHC1 = 0 
       data hash MD5: 64K
       5D 27 89 1E FD AF 19 00 5A D0 E7 44 11 B5 1F F9>)
(   4,<2019-12-26 14:23:08.18 +0400>,<she>,<DPX200>,
      <abs ABSG = 5 
       data hash MD5: 64K
       C7 70 2C 32 03 BC B9 40 79 4C BD 0A 4A 67 D5 3A>)
$$ ##END=
$$ 
$$ hash MD5
$$ 64 86 89 63 9E 1A E0 F0 8C EE 68 93 7E 5E D1 B8
##$RELAX= 
##$RELAX= 
##$RELAX= 
##$RELAX= 
##$RELAX= 
##$RELAX= 
##$RELAX= 
##$RELAX= 
$$ Bruker specific parameters
$$ --------------------------
##$DU= <F:/spectra>
##$EXPNO= 1
##$NAME= <P31>
##$PROCNO= 1
##$TYPE= <nmr>
##$USER= <she>
##$AMP= (0..31)
100 100 100 100 100 100 100 100 100 100 100 100 100 100 100 100 100 100 
100 100 100 100 100 100 100 100 100 100 100 100 100 100 
##$AQSEQ= 0
##$AQ_mod= 1
##$AUNM= <au_zg>
##$AUTOPOS= <>
##$BF1= 81.014009
##$BF2= 200.13
##$BF3= 200.13
##$BF4= 200.13
##$BF5= 200.13
##$BF6= 200.13
##$BF7= 200.13
##$BF8= 200.13
##$BYTORDA= 1
##$CFDGTYP= 0
##$CFRGTYP= 5
##$CHEMSTR= <none>
##$CNST= (0..31)
1 1 145 1 1 1 1 1 1 1 1 1 1 1 1 1 1 1 1 1 1 1 1 1 1 1 1 1 1 1 1 1 
##$CPDPRG= <waltz16>
##$CPDPRG1= <>
##$CPDPRG2= <waltz16>
##$CPDPRG3= <>
##$CPDPRG4= <mlev>
##$CPDPRG5= <mlev>
##$CPDPRG6= <mlev>
##$CPDPRG7= <mlev>
##$CPDPRG8= <mlev>
##$CPDPRGB= <>
##$CPDPRGT= <>
##$D= (0..31)
0 1 0 0 0 0 0 0 0 0 0 0.03 2e-05 3e-06 0 0 0 0 0 0 0 0 0 0 0 0 0 0 0 0 
0 0 
##$DATE= 1577355767
##$DBL= (0..7)
120 120 120 11 120 120 24 19 
##$DBP= (0..7)
150 150 150 150 150 150 150 150 
##$DBP07= 0
##$DBPNAM0= <>
##$DBPNAM1= <>
##$DBPNAM2= <>
$$ [...]
##$SUBNAM3= <"">
##$SUBNAM4= <"">
##$SUBNAM5= <"">
##$SUBNAM6= <"">
##$SUBNAM7= <"">
##$SUBNAM8= <"">
##$SUBNAM9= <"">
##$SW= 369.568048894756
##$SWIBOX= (0..15)
0 1 3 0 0 0 0 0 0 0 0 0 0 0 0 0 
##$SW_h= 29940.119760479
##$TD= 32768
##$TD0= 1
##$TE= 0
##$TE2= 300
##$TE3= 300
##$TEG= 300
##$TL= (0..7)
0 120 53 12 22 120 120 120 
##$TP= (0..7)
150 150 150 150 150 150 150 150 
##$TP07= 0
##$TPNAME0= <>
##$TPNAME1= <>
##$TPNAME2= <>
##$TPNAME3= <>
##$TPNAME4= <>
##$TPNAME5= <>
##$TPNAME6= <>
##$TPNAME7= <>
##$TPOAL= (0..7)
0.5 0.5 0.5 0.5 0.5 0.5 0.5 0.5 
##$TPOFFS= (0..7)
0 0 0 0 0 0 0 0 
##$TUNHIN= 0
##$TUNHOUT= 0
##$TUNXOUT= 0
##$USERA1= <user>
##$USERA2= <user>
##$USERA3= <user>
##$USERA4= <user>
##$USERA5= <user>
##$V9= 5
##$VALIST= <valist>
##$VCLIST= <CCCCCCCCCCCCCCC>
##$VD= 0
##$VDLIST= <DDDDDDDDDDDDDDD>
##$VPLIST= <PPPPPPPPPPPPPPP>
##$VTLIST= <TTTTTTTTTTTTTTT>
##$WBST= 1024
##$WBSW= 4
##$XGAIN= (0..3)
0 0 0 0 
##$XL= 0
##$YL= 0
##$YMAX_a= 95736
##$YMIN_a= -56052
##$ZGOPTNS= <>
##$ZL1= 120
##$ZL2= 120
##$ZL3= 120
##$ZL4= 120
##$ABSF1= 182.463
##$ABSF2= -187.1042
##$ABSG= 5
##$ABSL= 3
##$ALPHA= 0
##$AQORDER= 0
##$ASSFAC= 0
##$ASSFACI= 0
##$ASSFACX= 0
##$ASSWID= 0
##$AUNMP= <proc_1d>
##$AZFE= 0.1
##$AZFW= 0.5
##$BCFW= 0
##$BC_mod= 2
##$BYTORDP= 0
##$COROFFS= 0
##$CY= -3
##$DATMOD= 1
##$DC= 0
##$DFILT= <>
##$DTYPP= 0
##$F1P= 0
##$F2P= 0
##$FCOR= 1
##$FTSIZE= 65536
##$FT_mod= 6
##$GAMMA= 0
##$GB= 0
##$INTBC= 1
##$INTSCL= 5.30512e-09
##$ISEN= 30
##$LB= 1
##$LEV0= 0
##$LPBIN= 0
##$MAXI= 10000
##$MC2= 0
##$MEAN= 0
##$ME_mod= 0
##$MI= 50
##$NCOEF= 0
##$NC_proc= -7
##$NLEV= 6
##$NOISF1= 182.463
##$NOISF2= 159.3651
##$NSP= 0
##$NTH_PI= 0
##$NZP= 0
##$OFFSET= 182.463
##$PC= 4
##$PHC0= -1660.409
##$PHC1= 69.80119
##$PH_mod= 1
##$PKNL= yes
##$PPARMOD= 0
##$PSCAL= 0
##$PSIGN= 0
##$REVERSE= no
##$SF= 81.0140089999434
##$SI= 65536
##$SIGF1= 159.3651
##$SIGF2= -187.1042
##$SINO= 113.3802
##$SIOLD= 16384
##$SREGLST= <1H.CDCl3>
##$SSB= 0
##$STSI= 65536
##$STSR= 0
##$SW_p= 29940.119760479
##$SYMM= 0
##$S_DEV= 0
##$TDeff= 32768
##$TDoff= 0
##$TI= <>
##$TILT= no
##$TM1= 0
##$TM2= 0
##$TOPLEV= 0
##$USERP1= <user>
##$USERP2= <user>
##$USERP3= <user>
##$USERP4= <user>
##$USERP5= <user>
##$WDW= 1
##$XDIM= 65536
##$YMAX_p= 359055995
##$YMIN_p= -41933183
$$ End of Bruker specific parameters
$$ ---------------------------------
##NTUPLES= NMR SPECTRUM
##VAR_NAME=  FREQUENCY,     SPECTRUM/REAL,   SPECTRUM/IMAG
##SYMBOL=    X,             R,               I
##VAR_TYPE=  INDEPENDENT,   DEPENDENT,       DEPENDENT
##VAR_FORM=  AFFN,          ASDF,            ASDF
##VAR_DIM=   65536,         65536,           65536
##UNITS=     HZ,            ARBITRARY UNITS, ARBITRARY UNITS
##FACTOR=    0.456856943014862, 1,           1
##FIRST=     14782.0589164792, 0,            0
##LAST=      -15158.0608439998, 0,           0
##MIN=       -15158.0608439998, -41933183,   0
##MAX=       14782.0589164792, 359055995,    0
$$ Real data points
##PAGE= N=1
##DATA TABLE= (X++(R..R)), XYDATA
$$ [...]
40452B30541p06721Q9151p72387k361511k360571K8894K616385K717208N32257
40443A3246j166863m59341J723628K966723J942434l03706j254607L64769K580448
40434F406731K163500q64261k722412j140060J290478J335074K00789Q01640J903684
40425I375163r7969m098178m422434P32705N888285N684641J712784r79845r77613
40416A2817539o34177j288991j934932j826547j568238j636755j532656m87913
40408A907330J557240L281064K590640o91011l327771k264236P58802J472551
40400E284609l00604o95239J073916J108221j771720k922123K97147L251091J579380
40391F904678j026125J025962N231760M650408p06680l996181k436754m67342
$$ y = [230541, -476180, -387029, -1159416, -3520927, -5881498, -5852604, -3236219, -519011, 13246, -1153617, -1612958, 110670, 3077393, 5019827, 4716121, 3461514, 3826283, 6406731, 8570231, 7705970, 4983558, 3843498, 5133976, 6469050, 6669839, 7471479, 9375163, 9277194, 5179016, 756582, 1489287, 7377572, 13062213, 14774997, 13795152, 12817539, 12183362, 10894371, 8959439, 7132892, 5564654, 3927899, 2395243, 1907330, 3464570, 6745634, 9336274, 8645263, 5317492, 3053256, 3812058, 5284609, 4984005, 4288766, 5362682, 6470903, 4699183, 1777060, 2074207, 5325298, 6904678, 5878553, 6904515, 12136275, 16786683, 16080003, 12083822, 9647068, 9179726]
40383I179726j245829k078497m18519J545855J120015o21325j420954j140008
40375D920464m70599M28535O26290q79026k189066j87256L728863M156292l13496
40366I821001m317286l436858j04922J371206J295502K021491K600698Q12666
40358A0063498j873056k126992k04147O23146p75987k456816k940946k339617
40350b030917n28806K529436M957173M528542K032715L60858L05084m4130j594368
40341A0515587k652216j692818M30817J880860J872376O62390j235872l188222
40333F592902m496370m567592k807379Q97466M871134O066584L368004m24129
40325I500620j759307p38882j28347n30014M06663L314819M777297J875698k912902
$$ y = [9179726, 7933897, 5855400, 5436881, 6982736, 8102751, 7481426, 6060472, 4920464, 4449865, 4878400, 5504690, 4625664, 2436598, 2249342, 5978205, 10134497, 9821001, 5503715, 2066857, 1961935, 3333141, 4628643, 6650134, 9250832, 10063498, 8190442, 6063450, 5859303, 6482449, 5706462, 3249646, 308700, -2030917, -2559723, -30287, 4926886, 9455428, 11488143, 11849001, 12154085, 12109955, 10515587, 7863371, 6170553, 6601370, 8482230, 10354606, 11016996, 9781124, 6592902, 2096532, -2471060, -5278439, -4380973, 490161, 6556745, 9924749, 9500620, 7741313, 7002431, 6874084, 6344070, 6750733, 10065552, 14842849, 16718547, 13805645]
40316A3805645m383597j661419N43722j292067m268204l145348J884344N062339
40308F545415K901754j370271k813456j123149P08083J613797K707889L679614
40300A2849676K827441L62908j732322k902064l725439k994040P39143M771649
40292A0196952M291011l16943l187573j547713O68911J19168o50863J006766K090928
40283A2670644o25841l593109j346651M151249N733152J599722k723828l209336
40275A2656002k113869k474191k938365q10372L012122M924387L054170p40517
40267A4569367k703803q25246K670892L333082R9213k792044j528329J698753
40259A4521885K020933r01513l067863k667134j963057k490176k623856j002103
$$ y = [13805645, 9422048, 7760629, 8304351, 7012284, 2744080, -401268, 1483076, 6545415, 9447169, 8076898, 5263442, 4140293, 4848376, 6462173, 9170062, 12849676, 15677117, 16040025, 14307703, 11405639, 7680200, 4686160, 5425303, 10196952, 14487963, 14171020, 10983447, 9435734, 10104645, 10223813, 9572950, 10579716, 12670644, 12044803, 8451694, 7105043, 11256292, 16989444, 18589166, 15865338, 12656002, 10542133, 8067942, 5129577, 4319205, 7331327, 12255714, 15309884, 14569367, 11865564, 11040318, 13711210, 17044292, 17143505, 14351461, 12823132, 14521885, 16542818, 15641305, 12573442, 9906308, 7943251, 5453075, 2829219, 1827116]
40251A827116J077849J948630J635928Q23794J00048N05036K316031L355151J453720
40242A5043303j523405j586850J262242K667532M42074k370387k288677K11185
40234A1857017K613037L533449K503820l59220k950350k450127M25457J432517
40226A6605600j312442m500488m519512k100035J09527J665445L341110M340074
40218A3629279L324406Q54418j253620j879383q29160J139470J809497m68044
40210A6326863l419280k710712J586058M124428J865938j437314j270861R17562
40202A5982682R28200j253951k162397n80867J602032K984424L367429K012831
40194B2880383j239065l998306l770310j571597j65676J48683Q56632J650340
$$ y = [1827116, 2904965, 4853595, 6489523, 7313317, 7413365, 7918401, 10234432, 13589583, 15043303, 13519898, 11933048, 13195290, 15862822, 16304896, 13934509, 11645832, 11857017, 14470054, 18003503, 20507323, 20148103, 17197753, 14747626, 15173083, 16605600, 15293158, 10792670, 6273158, 4173123, 4282650, 5948095, 9289205, 13629279, 16953685, 17808103, 16554483, 14675100, 13845940, 14985410, 16794907, 16326863, 12907583, 10196871, 11782929, 15907357, 17773295, 16335981, 15065120, 15982682, 16910882, 15656931, 13494534, 12913667, 14515699, 17500123, 20867552, 22880383, 21641318, 17643012, 13872702, 12301105, 12135429, 12284112, 13140744, 14791084]
40186A4791084J129067J11292N06442J508045O99575j376315j630584M54221J851728
40177A8044555P38336j116900j528488n77803O90485J724223J929873R39464j59090
40168B0684655J9822P54454L36722o31644O300J883369K127214R3887j271750
40159B4003029n9555J655782J196361q59427k059761j462182L0681J250251J325448
40150B5020627l2346j715252j892638l09553J309868J677080J291321R10243L83124
40141B6642474l19356n86099m13064n76606r08280j07109J951020L403594K805781
40132C1892355Q85375q30700j681287j611110q69503m58020j090537j356761P85009
40123B5664821M109948M603858J237635j671527k18346L406321M054904R04384
$$ y = [14791084, 15920151, 16031443, 16537885, 18045930, 18745505, 17369190, 15738606, 16192827, 18044555, 18782891, 17665991, 16137503, 15559700, 16250185, 17974408, 19904281, 20843745, 20684655, 20704477, 21458931, 21795653, 21164009, 21170309, 23053678, 25180892, 25274779, 24003029, 23943474, 25599256, 26795617, 25936190, 23876429, 22414247, 22444928, 23695179, 25020627, 24988281, 23273029, 21380391, 21070838, 22380706, 24057786, 25349107, 26259350, 26642474, 26323118, 25737019, 25323955, 24747349, 23839069, 23731960, 25682980, 29086574, 31892355, 32777730, 31947030, 30265743, 28654633, 27785130, 27327110, 26236573, 24879812, 25664821, 29774769, 34378627, 35616262, 33944735, 33726389, 37132710, 41187614, 42091998]
40115D2091998j782169p53275K431687M133826K798663m05792l320924m133570
40107D1060444k231522R94890K662956Q83073k938832m936706k654455K021530
40099C4861378M661071L280064M61348k33358J320298K516481K130686J460300
40091E0458268J557708J702828J200944P00546P83158P62340j25665j410446k020276
40082E3609405j431140J23932J730626K120906J046229J22075R59638K819233
40074F1100904L735772L392545K756800J534476j107490l539308k858184M48571
40066F5464086K554812J922825J257777K528133L883001L523164K823224K950679
40058H6907701K052693q52365k572023m39788K420106J242000k749059l823654
$$ y = [42091998, 40309829, 39556554, 41988241, 46122067, 48920730, 48514938, 45194014, 41060444, 38828922, 39823812, 42486768, 43369841, 40431009, 35494303, 32839848, 34861378, 39522449, 42802513, 43263861, 43030503, 44350801, 46867282, 48997968, 50458268, 52015976, 53718804, 54919748, 55620294, 56403452, 57165792, 57040127, 55629681, 53609405, 52178265, 52302197, 54032823, 56153729, 57199958, 57322033, 58281671, 61100904, 64836676, 68229221, 70986021, 72520497, 71413007, 67873699, 65015515, 65464086, 68018898, 69941723, 71199500, 73727633, 77610634, 81133798, 83957022, 86907701, 88960394, 88108029, 85536006, 85096218, 87516324, 88758324, 86009265, 82185611]
40050H2185611k03604L694938L810099J200287o67401k36703J665524L437935
40042I4886686L853178K967810K072466J796442J174708p1611k5608K392772M590733
40033A13637576L468002Q3283k010465j803790p13621J179306M453132O762539
40025A25055962M878915M35469j243604J222472L585307L017289J860261K419969
40017A41232040K908171J487460J68927J180981K754086K119056J36261m66138
40009A51520844O72597K201894L853548N401263M884021J458063j544665k59931
40001A68187634L792188N138488J654668k823489l731687j008599J895892K561882
39993A75666977J949631K481599M271957M261212M42646l992160l799460Q51712
$$ y = [82185611, 81982007, 85676945, 89487044, 90687331, 90019930, 89783227, 91448751, 94886686, 98739864, 101707674, 103780140, 105576582, 106751290, 106679679, 106654071, 109046843, 113637576, 117105578, 117188861, 115178396, 113374606, 112660985, 113840291, 118293423, 125055962, 129934877, 130370346, 129126742, 130349214, 133934521, 136951810, 138812071, 141232040, 144140211, 145627671, 145796598, 146977579, 149731665, 151850721, 151986982, 151520844, 152193441, 154395335, 158248883, 163650146, 168534167, 169992230, 168447565, 168187634, 171979822, 177118310, 178772978, 175949489, 172217802, 171209203, 173105095, 175666977, 177616608, 180098207, 184370164, 188631376, 189074022, 185081862, 181282402, 182134114]
39985A82134114M000760K375950j82076M46390K021333O96378j496201k3292L672473
39976A93645829L892823J09626k196581p10985L69881j937937m443515l596354
39968A85132787j160392l85045n97103M05217J747700J360739J63524M41309J609069
39959A88717805J183463j047236k945900l335471k710577j469855M2488N68722
39951A79003439m86488j280823J33592K324618J953426j456986m592486m329530
39943A71268762r07394K750192L442688M7246m881545o675419l601176N54037
39935A61997391J085488j499297k752175r84856P28680m24527l215149m787250
39927A50148305m320920k814910j085148M50752J074027J28245k183965m614340
$$ y = [182134114, 186134874, 188510824, 188328748, 188775138, 190796471, 191492849, 189996648, 189973356, 193645829, 197538652, 197648278, 195451697, 194740712, 195110593, 193172656, 188729141, 185132787, 183972395, 183587350, 182990247, 183395464, 185143164, 186503903, 186667427, 187108736, 188717805, 189901268, 188854032, 185908132, 182572661, 179862084, 178392229, 178434717, 179003439, 178516951, 177236128, 177369720, 179694338, 181647764, 180190778, 175598292, 171268762, 170361368, 173111560, 176554248, 176601494, 171719949, 165044530, 161443354, 161997391, 163082879, 161583582, 158831407, 157846551, 158575231, 158150704, 154935555, 150148305, 145827385, 143012475, 141927327, 142378079, 143452106, 143580351, 141396386, 136782046]
39919A36782046n250925k911168Q55017K371495J91317k464308k034352N1736
39911A27590858j49433k325973k276571P15720J996410j173322n099383n303372
39903A13974934k852781j628544k331045k900843k625925k227569j609429p80107
39895I7018691j269414l423781m220135j338109K447330K879720M89730j110288
39887I1473744j482693k630553l209674P1253M974666M606060k028166o806247
39879H4968390l659625K524103L271918j325377l947114j350456J960775J348877
39871H3791491k005040m143438l506360j303762O53430Q44668j321875m221480
39863F8787634m742372j779298J847321K303161p83143l900738l829626j292757
$$ y = [136782046, 131531121, 128619953, 129474970, 131846465, 132037782, 129573474, 127539122, 127590858, 127441425, 125115452, 122838881, 123554601, 125551011, 124377689, 119278306, 113974934, 111122153, 109493609, 107162564, 104261721, 101635796, 99408227, 97798798, 97018691, 95749277, 92325496, 88105361, 86767252, 89214582, 92094302, 92584032, 91473744, 89991051, 87360498, 84150824, 84222077, 89196743, 93802803, 91774637, 84968390, 81308765, 83832868, 87104786, 85779409, 81832295, 80481839, 82442614, 83791491, 81786451, 77643013, 74136653, 72832891, 73486321, 74330989, 73009114, 68787634, 64045262, 62265964, 64113285, 66416446, 65633303, 61732565, 57902939, 56610182]
39855E6610182L14984n65689j793053q22567J523883K385939J200874J93829M29977
39846E9478359K48539j270693k097092n46008J526915J444049r7456m39571O54066
39837E8901108J131988M23803j64868n40161j931205l657139l199695m09394J564482
39828E2118919Q99046l89584l36299l92213k273149m020195k728401K73795Q17934
39819D3969853j812835l629457j736461J695151K790002J036293r26009j150828
39811D0235709l6538J179857J768093J414190J94660j063620j305085m57799M21493
39802D2350960M21195j90884l57798N06890J615555J253843j226826l696923k801332
39793C7874680J633699M934524K527361l767250p104399m069815R41028J699888
$$ y = [56610182, 56925166, 56359477, 54566424, 53743857, 55267740, 57653679, 58854553, 59048382, 59478359, 59726898, 58456205, 56359113, 55813105, 57340020, 58784069, 58686613, 58247042, 58901108, 60033096, 60456899, 60292031, 59751870, 57820665, 54163526, 50963831, 50554437, 52118919, 53017965, 52628381, 52292082, 51899869, 49626720, 45606525, 42878124, 43151919, 43969853, 42157018, 38527561, 36791100, 38486251, 41276253, 42312546, 41386537, 40235709, 40199171, 41379028, 43147121, 44561311, 44755971, 43692351, 42387266, 41929467, 42350960, 42772155, 42581271, 42223473, 42730363, 44345918, 45599761, 44372935, 40676012, 37874680, 39508379, 44442903, 46970264, 43203014, 36098615, 32028800, 32969828, 34669716]
39785C4669716j746828l908915j672940K098718L083599P58978j980424k523358
39777B8778546o80944J566619J624595j252185m512128m660154j515076J506775
39769B0856048J936309J075888J190957J994329J796777N79814k58466k74175
39761B8897481r9372Q3082L32553o3031j439033k221542o99086K039640L203259
39752C0033951K236317J264505J341402Q77058j092324k422353o93053K709294
39744C4254797L558238j34961n478803p699670n120868n48395K140759K039097
39736B3010194J261610J526567K122782J664512M01227l27189Q8929J401209L149920
39727C4299761M126099K466346j739343m951955l825061R0311J988770J81881
$$ y = [34669716, 32922888, 29013973, 27341033, 29439751, 32523350, 33282328, 31301904, 28778546, 28097602, 29664221, 31288816, 30036631, 25524503, 20864349, 19349273, 20856048, 22792357, 23868245, 25059202, 27053531, 28850308, 29430122, 29171656, 28897481, 28798109, 28881191, 29213744, 29150713, 27711680, 25490138, 24791052, 26830692, 30033951, 32270268, 33534773, 34876175, 35753233, 34660909, 32238556, 31545503, 34254797, 37813035, 37678074, 32199271, 24499601, 19378733, 18830338, 20971097, 23010194, 24271804, 25798371, 27921153, 29585665, 29986892, 29659703, 29748632, 31149841, 34299761, 38425860, 40892206, 39152863, 34200908, 30375847, 30466158, 32454928, 32636809]
39719C2636809k065315j647818M62359J812874K191287K525335K195916K59882
39711C8371329j746606j082592K182750M717232L956564R58374j327082j355826
39703D4674143J43670J659744K319317K130042J580321J220424J342764J764517
39695E6834942J918760J426194O78473N25963J177916J831800J752929J255113
39687F7402090J132144J649875K679378M122384N373224N198543L393252J793513
39679I2744403K060703L115940K758379J360402J381196L007331L137085j12708
39671A09452731m342571o067398n092605l707342k976686k177245j243131j477445
39663H2368308l561182o263241p508202o116401k675428O86483J737094N1847
$$ y = [32636809, 30571494, 28923676, 29386035, 31198909, 33390196, 35915531, 38111447, 38371329, 36624723, 35542131, 37724881, 42442113, 46398677, 47357051, 46029969, 44674143, 44817813, 46477557, 48796874, 50926916, 52507237, 53727661, 55070425, 56834942, 58753702, 60179896, 60858369, 61384332, 62562248, 64394048, 66146977, 67402090, 68534234, 70184109, 72863487, 76985871, 82359095, 87557638, 90950890, 92744403, 94805106, 97921046, 100679425, 102039827, 103421023, 106428354, 109565439, 109452731, 105110160, 99042762, 93950157, 90242815, 87266129, 85088884, 83845753, 82368308, 78807126, 72543885, 65035683, 58919282, 56243854, 56930337, 58667431, 58719278]
39655E8719278k638433m219203l838944j893510M05247J198433o16490l322598
39647D3793780l458858k98146K413459J048184k989032n251658m131771k004565
39639B9121393q98135q3187J390727K480002J910453K95832r89788j683183k013308
39630B9530806j515463p4586Q80992Q5976j302416j141202L11354O96587n38492
39621B6933556j042723N49121K025342Q94144j613700k490713j616383j293767
39613B2344877j746588q04733J534387K137269k24677k492693k132669r28597
39605A7686576j190482j453874L86965K464328J814096k84294n85179K22643q47136
39596A8213643k762609j742691J497180K142483m28615j339686J138188K330599
$$ y = [58719278, 56080845, 51861642, 48022698, 46129188, 46534435, 47732868, 47116378, 43793780, 40334922, 40036776, 42450235, 43498419, 40509387, 35257729, 31125958, 29121393, 28223258, 28140071, 29530798, 32010800, 33921253, 34217085, 33227297, 31544114, 29530806, 28015343, 27940757, 28821749, 28907725, 27605309, 26464107, 26775461, 27472048, 26933556, 25890833, 26439954, 28465296, 29359440, 27745740, 25255027, 23638644, 22344877, 20598289, 19793556, 21327943, 23465212, 23240535, 20747842, 18615173, 17686576, 16496094, 15042220, 15429185, 17893513, 19707609, 19423315, 18838136, 19060779, 18213643, 15451034, 13708343, 15205523, 17348006, 16919391, 15579705, 16717893, 19048492]
39588A9048492n92992l529287k546247k41036k31616n58129J818428M357256K991778
39579B0516647n06651j494206j81919j46353j234872m30343J578709J152983j590411
39570A7663584k867222j710029o57401l32802Q61293J961439M85861j827180q21025
39561A2756518K285839J924832k133091l684376n82426J568722n81722k260607
39553I293689N91658L811599K391136p25783k23452J989562L81974m233841n971481
39544G305061l285394m8577J651104L017929L474821R23031k646069k396954J381512
39535I376464K760667n89940l579672j791078J987413K915537J322286N31664
39527A2933341Q22121J37581j294422j505715p84037j011618j591929j16897K712623
$$ y = [19048492, 18455500, 14926213, 12379966, 12138930, 11907314, 11349185, 13167613, 17524869, 20516647, 20009996, 18515790, 18333871, 18187518, 16952646, 16522303, 18101012, 19253995, 17663584, 14796362, 13086333, 12428932, 12096130, 12957423, 14918862, 15404723, 13577543, 12756518, 15042357, 16967189, 14834098, 11149722, 10567296, 12136018, 11554296, 9293689, 9885347, 13696946, 16088082, 15362299, 15138847, 17128409, 17510383, 13276542, 7305061, 4019667, 3971090, 5622194, 8640123, 12114944, 13037975, 10391906, 7994952, 9376464, 12137131, 11547191, 7967519, 6176441, 8163854, 11079391, 12401677, 12933341, 13755462, 13893043, 12598621, 11092906, 10308869, 9297251, 7705322, 7588425, 10301048]
39518A0301048K899831p65276l930689k397801J818712L168953J29043l086499
39510H137322k482913Q27375K835846J759561p08482k176677j878356n80746M58816
39501F191746M35361k29549j82295J098318K221583J465468q76684k663874k251820
39492E208254R593K234219K387553J6333k671097k594488L31093K645368K077572
39483I644400P97309J575790K874659J432166j753208k613105p19892J73918j183069
39474A0228968j520259P02794K127322K81911j994324j367040N75173N75050q02004
39465H807591j024588l38689m40918n03860J206482L339509L252084J523880O52976
39456A6474467M33039j125422l131570k582870L39142J980731O14339j564294
$$ y = [10301048, 13200879, 12435603, 8504914, 6107113, 7925825, 11094778, 11223821, 8137322, 5654409, 6481784, 9317630, 11077191, 10368709, 8192032, 6313676, 5732930, 6191746, 6627107, 6397558, 6215263, 7313581, 9535164, 11000632, 10123948, 7460074, 5208254, 5217847, 7452066, 9839619, 9855952, 7184855, 4590367, 4921460, 7566828, 9644400, 10441709, 12017499, 14892158, 16324324, 14571116, 11958011, 11238119, 11412037, 10228968, 8708709, 9411503, 11538825, 11820736, 9826412, 8459372, 9034545, 9609595, 8807591, 7783003, 7444314, 7003396, 6499536, 7706018, 11045527, 14297611, 15821491, 16474467, 16907506, 15782084, 12650514, 10067644, 10406786, 12387517, 13001856, 11437562]
39448A1437562k296483j759157p38530N81741J523689J342559R38647J606267
39440A2636295K443980J840025P81317J250867K133449Q06712j767397k232127
39432A7893121r19419j443141l754677l454730M71040L236954K142169R84297
39424A5155614K917485M438298J483986k981319l373768m02777N58995j728889
39416A6067625l216322j686782M63989J051138R70705J151269O07566q88304j301125
39407A3219759O26314K868941K407588r68153m264398m388067j394106J359188
39399I467066R40497j313349j421409J337474K950495Q16613j779958o04230K688579
39390A3081778L073254Q3236j755080k88637J375990M31779j469932j496228K31089
$$ y = [11437562, 9141079, 7381922, 6643392, 7225133, 8748822, 10091381, 11030028, 12636295, 15080275, 16920300, 17701617, 18952484, 21085933, 21892645, 20125248, 17893121, 16973702, 15530561, 11775884, 8321154, 8792194, 12029148, 14171317, 15155614, 18073099, 22511397, 23995383, 21014064, 17640296, 17237519, 17796514, 16067625, 12851303, 11164521, 11628510, 12679648, 13650353, 14801622, 15409188, 14520884, 13219759, 13846073, 16715014, 19122602, 18154449, 13890051, 9501984, 8107878, 9467066, 10407563, 9094214, 7672805, 9010279, 11960774, 12777387, 10997429, 10393199, 13081778, 16155032, 16238268, 14483188, 14194551, 15570541, 16002320, 14532388, 13036160, 13267249]
39381A3267249J740943J941896P00102j486049k695433j015046K056010K468220
39373A6977892o75554l347578k415356j0198N29103l3379Q82039K475646J853725
39364A6236340p24684j970873n88626J406399K351098K587963K264520P45715
39356B2307852j168200j420535O2222R95644M19020j2304N52375L88607j486712
39347B0637969k925635j819151M63398J258639N91063L96019R73247R33680P8845
39338B0588074k55172L58785Q73614P73379P11966R19508O97771j86960j116313
39329B3364652j849927k642015k915968j516644J099628K453430Q49867k304219
39321A6538804l912346k518930K72897J513470k2183k347284k359897K64676K452437
$$ y = [13267249, 15008192, 16950088, 17650190, 16164141, 13468708, 12453662, 14509672, 16977892, 16302338, 12954760, 10539404, 10529206, 11058309, 11024930, 11906969, 14382615, 16236340, 15511656, 13540783, 12952157, 14358556, 16709654, 19297617, 21562137, 22307852, 21139652, 19719117, 19781339, 20776983, 21196003, 21183699, 21736074, 22124681, 20637969, 17712334, 15893183, 16356581, 17615220, 18206283, 18602302, 19575549, 20509229, 20588074, 20332902, 20691687, 21565301, 22338680, 23050646, 23970154, 24667925, 24480965, 23364652, 21514725, 18872710, 15956742, 14440098, 15539726, 17993156, 18843023, 16538804, 12626458, 10107528, 10380425, 11893895, 11871712, 9524428, 7164531, 7429207, 9881644]
39312I881644J942625M79282P67993J799988N06618k552114l218736j92176K592101
39303A2007225J928669K8998L77420J939592J280559j437747k674131j034088
39295A2416497J187483K028732K016878J756353N25261j541523k516970j535427
39287A4337284n33630j330175k540342j523224J482310L451305K778751J268880
39279A7391159J131122J783746J306882o1895l04984O21874K54143k061593l159763
39270A6900691p08921K554246K591539K22371o79624P5707p55489l037492k684828
39261A4478200P27577J932043j597143m967032l595140k42637N93572K74932J945320
39252I549692L276690N40326l328528k686806Q91643J023624k202454k247166
$$ y = [9881644, 11824269, 12303551, 13071544, 14871532, 15378150, 12826036, 9607300, 9415124, 12007225, 13935894, 13964892, 14342312, 16281904, 17562463, 16124716, 13450585, 12416497, 13603980, 15632712, 17649590, 19405943, 19931204, 18389681, 15872711, 14337284, 13803654, 12473479, 9933137, 8409913, 9892223, 13343528, 16122279, 17391159, 18522281, 20306027, 21612909, 21551014, 21246030, 21867904, 22122047, 20060454, 16900691, 16191770, 18746016, 21337555, 21559926, 20880302, 20956009, 20200520, 17163028, 14478200, 15205777, 17137820, 15540677, 10573645, 6978505, 6735868, 7329440, 7604372, 9549692, 12826382, 13366708, 10038180, 7351374, 8243017, 9266641, 7064187, 4817021]
39244D817021K212844M662941J744852j637625j338397k71291j642736k909311
39236E638298j275534P57052K77705p83953k5032P50220j20613j40822K087116
39227G164437K757769m22545k628288M18186M032884J571423m062576m641155
39219D190135R7852K578994K9498k104262k44913K218062K093526J327366J806982
39210A1993240J427127j222510l258904k062925N22230J593315J337281J018226
39202A1347080K0747k193136l685333k365242Q70287L205361K866578J91393k626707
39193G631028k648089P42570L922332K944790q32103k479044p35760P90380J77396
39184I513500K4J930270L334253J897326m57707j202520j142891j746111j930964
$$ y = [4817021, 7029865, 11692806, 13437658, 11800033, 10461636, 10190345, 8547609, 5638298, 4362764, 5119816, 5397521, 4613568, 4588536, 5338756, 5218143, 5077321, 7164437, 9922206, 9499661, 6871373, 7289559, 11322443, 12893866, 8831290, 4190135, 4287987, 6866981, 6896479, 4792217, 4547304, 6765366, 8858892, 10186258, 11993240, 13420367, 12197857, 8938953, 6876028, 7398258, 8991573, 10328854, 11347080, 11367827, 9174691, 5489358, 3124116, 3994403, 7199764, 10066342, 10257735, 7631028, 4982939, 5725509, 9647841, 12592631, 11760528, 9281484, 8545724, 9336104, 9513500, 9513524, 11443794, 14778047, 16675373, 16217666, 15015146, 13872255, 12126144, 10195180]
39175A0195180p01909J48056p37794j298832L05535J978012J283869m2819O73760
39166A1803058J893749O49047j569539j016680J397080J084603k325063l763848
39158H152407p95637K190378N73923l562095m639856j555509J198441m1495l451191
39149a930634m414214j365261K554409L649095K098388R64360J482804J627320
39141D666267m6922j541082k44559K968562M689593L217716m3958k794569l693498
39132G177550k591765n70085O82552P52503R02938J509526Q36036j732206l254582
39123C712467j057888K492858K759889l59354k458575j489016k49584r45500j520560
39114H84737L06067K813933L070295J482559M33622R8271j085208k655554k146937
$$ y = [10195180, 9493271, 9641327, 8903533, 7604701, 7910236, 9888248, 11172117, 11129298, 11803058, 13696807, 14345854, 12776315, 11759635, 13156715, 14241318, 11916255, 8152407, 7356770, 9547148, 10121071, 6558976, 1919120, 363611, 1562052, 1520557, -1930634, -6344848, -7710109, -5155700, -1506605, 591783, 1556143, 3038947, 4666267, 4619345, 3078263, 2833704, 5802266, 10491859, 13709575, 13665617, 10871048, 7177550, 4585785, 4015700, 4698252, 5450755, 6353693, 7863219, 8699255, 6967049, 3712467, 2654579, 5147437, 7907326, 7547972, 5089397, 3600381, 3350797, 2405297, 884737, 1190804, 4004737, 7075032, 8557591, 8991213, 9089484, 8004276, 5348722, 3201785]
39105C201785R25861L729665L593047J096085j155945j619140p87111J60579P12488
39096I857314J004855R52829n9263k211478m199872m054920j449603J468225K213741
39087C521828O13750j206446j253761L46307J693235J263557k18109m10201J550466
39078E900626L153377J247793l275993n579956k740878K254940M156161J795334
39070F911404j404731k463342j716369o04847O63522K101559K619423J326245
39062G432864r37246k604942l065164k454308r60543N16011K96255j818623l210082
39053f805778j397395K189921L630378J739743m09055P8384K020016K162554k15184
39044B993584k505069k318314l77739O97785j36998j051714K8657K235985K756515
$$ y = [3201785, 4127646, 7857311, 11450358, 12546443, 11390498, 9771358, 8984247, 9144826, 9857314, 10862169, 11814998, 11755735, 9544257, 5344385, 1289465, -160138, 1308087, 3521828, 4135578, 2929132, 1675371, 2021678, 3714913, 4978470, 4760361, 4350160, 5900626, 9054003, 10301796, 7025803, 1445847, -1295031, 959909, 5116070, 6911404, 5506673, 3043331, 1326962, 722115, 1385637, 3487196, 6106619, 7432864, 6495618, 3890676, 825512, -1628796, -2589339, -2073328, -1777073, -3595696, -6805778, -8203173, -6013252, -2382874, -643131, -1052186, -973802, 1046214, 3208768, 2993584, 488515, -1829799, -2207538, -1509753, -1646751, -2698465, -2669808, -433823, 2322692]
39035B322692J130536L22859K125373L792968J965954j780453k974931r67207
39027E937791O35128K02350L113R30034M09528k185612l038186k30759K002551
39018D665938j48993l236608j773945K750087M257695J583458p95689n62697L36347
39009G075593J102676K952091M051430M88962o010383q076646l211280J911455
39001B83898J334833j709843r04697L363986N809513M545500K135418L85934j052586
38992A4191956k161531k618463l191606l833885k273844J989954M567148J443348
38984H113077m356491o192151k870754O69452J310659J120216K029896K201699
38976B025603j18031k863088l018779r79035M84112M19325O59538K606131M478475
$$ y = [2322692, 3453228, 3776087, 5901460, 9694428, 11660382, 9879929, 6904998, 5937791, 6572919, 6775269, 6778382, 7708416, 8117944, 5932332, 2894146, 2663387, 4665938, 4516945, 1280337, -493608, 2256479, 6514174, 8097632, 7301943, 6739246, 7075593, 8178269, 11130360, 15181790, 15670752, 9660369, 1583723, -1627557, 283898, 1618731, -91112, -995809, 2368177, 8177690, 12723190, 14858608, 15244542, 14191956, 12030425, 9411962, 6220356, 2386471, 112627, 2102581, 6669729, 8113077, 3756586, -2435565, -5306319, -4636867, -3326208, -2205992, -176096, 2025603, 1907572, -955516, -3974295, -4953330, -4469218, -4049893, -3390355, -784224, 3694251]
38967C694251K930947k250096o274660m262057K172841O207135M518662J200134
38959G937157R82728K380461J217691k127669l753404k672753j357319p89679
38951A817213L01127J628960J331399j30641k77378R22098R46427n88663j250572
38942D699970l58929j22255j328844j849079n47523R80870J650093K274044K752825
38933H151172J600595o56029j447018o60472j113024l215111l627523j142931
38925b110341O82255n81742k069924o14726K013083K613651J950731K511631L488718
38916G883336K230646r97980l435707l739822k478531k40724J912189J905094
38908C038501m42526j799273K42374K988521K361807r48501k887019k211029j179593
$$ y = [3694251, 6625198, 4375102, -1899558, -6161615, -3988774, 2218361, 6737023, 7937157, 8919885, 11300346, 12518037, 10390368, 6636964, 3964211, 2606892, 1817213, 2118340, 3747300, 5078699, 4948058, 4670680, 5592778, 6539205, 5950542, 4699970, 4341041, 4218786, 2889942, 1040863, 493340, 1474210, 3124303, 5398347, 8151172, 9751767, 9095738, 7648720, 6988248, 5875224, 2660113, -967410, -2110341, -1428086, -2009828, -4079752, -4694478, -2681395, -67744, 1882987, 4394618, 7883336, 10113982, 9116002, 5680295, 1940473, -538058, -778782, 1133407, 3038501, 2595975, 796702, 1039076, 4027597, 6389404, 5440903, 2553884, 342855, -836738]
38899h36738q95809j11380J455643K343967K067196J444506L33916j760756l087713
38890I52832j274255K312736L562430J542470k68614L85118J423533N72317q56699
38881H351868o60533N12414P07142o1988o15554j128613k290450l048805j786527
38872b1046P52754K098777J541711Q25460J097236J250716J64479j140623j016108
38863E553356J60691M86268o12802j567545r76159N70875J613026J756116J624235
38854H608061J583611J426162Q91226j59978j518248k077404o15753K038244L152652
38845A3328573J889116J182898L391044N694147L488543k273832n425533k955025
38837A8319931J090215J754697m74894j910807j172186N14762K280096L831784
$$ y = [-836738, -1732547, -1843927, -388284, 1955683, 4022879, 5467385, 5801301, 4040545, 952832, -321423, 1991313, 5553743, 7096213, 6827599, 7212717, 8636250, 9208567, 8351868, 7691335, 8203749, 8910891, 8848903, 8233349, 7104736, 4814286, 1765481, -21046, 731708, 2830485, 4372196, 5197656, 6294892, 7545608, 7710087, 6569464, 5553356, 5714047, 6200315, 5587513, 4019968, 3043809, 3614684, 5227710, 6983826, 8608061, 10191672, 11617834, 12509060, 12349082, 10830834, 8753430, 8137677, 10175921, 13328573, 15217689, 16400587, 19791631, 25485778, 28974321, 26700489, 21274956, 18319931, 19410146, 21164843, 20689949, 18779142, 17606956, 18121718, 20401814, 24233598]
38829B4233598M201555K992599J809520K167039L040823K571992J055682J51306
38821D2224114K17165M81862Q47428J561302K070275K006415K263511L410738
38813E5082810M252504L608135K126449P59630p49219k053978j134735K456082
38805F4347678N339587M223602L98570k526393l598755m119618m106098k819318
38797E7139255j427417j376568j303497N22024J863622q26861n921048p612004
38789D1057506l968539L26026M93712k604542m659690l197442M84768K892685
38781C0824484J578217j823495k847994k62213J518628p59811l052842j4654N253158
38772C0413478M635900k306206o897263m082413Q75782J490727q70488j366070
$$ y = [24233598, 28435153, 31427752, 33237272, 35404311, 38445134, 41017126, 42072808, 42224114, 42441279, 42923141, 43770569, 45331871, 47402146, 49408561, 51672072, 55082810, 59335314, 62943449, 65069898, 65829528, 65080309, 63026331, 61891596, 64347678, 69687265, 73910867, 74309437, 71783044, 68184289, 64064671, 59958573, 57139255, 55711838, 54335270, 53031773, 53553797, 55417419, 54590558, 48669510, 41057506, 37088967, 37414993, 37908705, 35304163, 30644473, 27447031, 27931799, 30824484, 32402701, 30579206, 27731212, 27468999, 28987627, 28227816, 25174974, 25160320, 30413478, 35049378, 32743172, 25845909, 21763496, 22639278, 24130005, 23259517, 21893447]
38764B1893447K07972O99616n84017j787770j770553k91499K463350M236847K022242
38755B7089635k735789m554569k164376j115102m362080o141131j124771N509668
38747A0401485M947808j676338n140217k139789J318263R43648O780J646328K827510
38738A3135478K59084l197494k967398O2131J594733P43790J39244M94452l25068
38729I938952k588832l056681K70624M350508M435768J74938l922898m153281
38721E449098j628969K96233O47698P90065R95696K8271j778403k013918J54316
38712B940087K307515K222917Q28612M7791k32065r55508j427439m83212J024059
38703F272757J285731M13367J39929J006564J619177O55388j466135k761393j317697
$$ y = [21893447, 22101419, 22801035, 22217018, 20429248, 18658695, 18367196, 20830546, 25067393, 27089635, 24353846, 19799277, 17634901, 16519799, 12157719, 6016588, 4891817, 10401485, 15349293, 13672955, 8532738, 6392949, 7711212, 8654860, 8661640, 10307968, 13135478, 13394562, 10197068, 7229670, 7291801, 8886534, 9630324, 9769568, 10264020, 9938952, 7350120, 4293439, 4564063, 8914571, 13350339, 13525277, 9602379, 5449098, 3820129, 4116362, 4764060, 5554125, 6549821, 6578092, 4799689, 2785771, 2940087, 5247602, 7470519, 8299131, 8346922, 8114857, 7159349, 5731910, 5248698, 6272757, 7558488, 7971855, 8111784, 9118348, 10737525, 11392913, 9926778, 7165385, 5847688]
38694E847688K210624L868155M45392n302449o632319j487042M185973M247289
38686G383311J91499k286910j647169r03529j411166j167809Q77935K938851L303808
38677G278821K153208K79392j517305k018254r52718j55087r86766j701903j25238
38668B254150K403756L039135K045767J677945J672729J14667k093273k257533
38660H857343r25388j080707k525688k196297j78793K17029r37104L44880M227005
38651E802280N123960M66578m477626m439374j551556l52103j67992J925934M284927
38642F615028L216571J72508R44K695952K940052j416125n655570m874612n47899
38633C146849J974783K23518l366742n080521l779044j153261Q85197K178284
$$ y = [5847688, 8058312, 11926467, 12371859, 7069410, 437091, -1049951, 3136022, 7383311, 7574810, 5287900, 3640731, 2737202, 1326036, 158227, 1036162, 3975013, 7278821, 9432029, 9711421, 8194116, 6175862, 5223144, 5068057, 4081291, 2379388, 2254150, 4657906, 7697041, 9742808, 11420753, 13093482, 13208149, 11114876, 8857343, 7931955, 6851248, 4325560, 2129263, 1950470, 2167499, 1230395, 1575275, 5802280, 10926240, 11392818, 6915192, 2475818, 924262, 572159, 404167, 2330101, 6615028, 9831599, 10004107, 10005051, 12701003, 15641055, 14224930, 8569360, 3694748, 3146849, 5121632, 5345150, 1978408, -3102113, -6881157, -8034418, -7149221, -4970937]
38625d970937L301943L594692K006800l66280j058369N5259N91286J2710P40309
38616C907413L210433L671265M0038l512474k181883J824691K399257j155896
38608H202844l527531j957650K62498J43823l83325J145874K883674J802191r43903
38599G628495j536785P87635K817458K023956m12251j771848j254021l03100k52806
38590G726733o57878k58120Q43958R08929j034051l324957l340059p05593K283481
38581B442443L326971K148796Q0952j125153k06877K389812M021772K111442k589571
38572A2600587o306603o362821l755091j094416N04506J440720J904888J750921
38564F82691J460962J715551K127035J606898L8967j405188j719507r45892M78372
$$ y = [-4970937, -1668994, 1925698, 3932498, 3566218, 2507849, 2563108, 3154394, 3167104, 3907413, 7117846, 10789111, 10829149, 7316675, 5134792, 6959483, 9358740, 8202844, 4675313, 2717663, 2980161, 3123984, 2740659, 3886533, 6770207, 8572398, 7628495, 6091710, 6879345, 9696803, 11720759, 11308508, 9536660, 8282639, 7979539, 7726733, 7068855, 6810735, 7654693, 8563622, 7529571, 4204614, 864555, 158962, 2442443, 5769414, 7918210, 7999162, 6874009, 6667132, 9056944, 13078716, 15190158, 12600587, 6293984, -68837, -3823928, -4918344, -4413838, -2973118, -1068230, 682691, 2143653, 3859204, 5986239, 7593137, 7632104, 6226916, 4507409, 3561517, 4039889]
38555D039889K207447L434449K936493N85495j860332k544224j700778r13085
38547F185354n36147M45890J798563J431716j270181l392589k060742J032407
38539C634271J535965j237659k983290m47617L883170N151930K406465q78969
38531A1064266j699210n53277M35439L96272j31325p57497j791410l226055l838896
38522a01693k098336J628520M462929L806915O57888j267316r3527J959813J718105
38513A0673298q04780k672201j777518Q88702K614908J836923n09680k294474
38505G955178k638980k454265k331813j325476Q55588K055003O17613j054651
38497A678197N52948L995288M090453j22746l417388k247347K22618L4721j192765
$$ y = [4039889, 6247336, 9681785, 12618278, 13203773, 11343441, 8799217, 7098439, 6185354, 5649207, 6095097, 7893660, 9325376, 8055195, 4662606, 2601864, 3634271, 5170236, 3932577, 949287, 501670, 4384840, 9536770, 11943235, 11064266, 9365056, 8811779, 9247218, 9643490, 9512165, 8754668, 6963258, 3737203, -101693, -2200029, -571509, 3891420, 7698335, 8356223, 7088907, 6995380, 8955193, 10673298, 9868518, 7196317, 5418799, 6307501, 8922409, 10759332, 10249652, 7955178, 5316198, 2861933, 530120, -795356, 60232, 2115235, 2732848, 1678197, 2231145, 6226433, 10316886, 10194140, 6776752, 4529405, 4752023, 4786744, 3593979]
38488C593979j62270J703111J121858n86958J77016K291027J482062j811794k565238
38479E242793M11124K396890O16458j581402p94547J217058J400656L16929q0075
38470I145884j44726p57754p03147R50286K219181J091820q59572o73003J667371
38461A1936340L539614L019366J32179l438291m413612l78070N825151P406752
38453B3629429K264885l073650k114805K240273K368582k341478n070747k457509
38445A5444980J015830J086216j72405N04975J545674J01621k085075j469589
38437A5972227P98308M17525k718057l848878p90541K565107K245990n9078l29416
38428A4253187J430277K044941R55895P92767K126613K048473n15590k066444
$$ y = [3593979, 3431709, 5134820, 6256678, 5669720, 5846736, 8137763, 9619825, 7808031, 5242793, 5653917, 8050807, 8667265, 7085863, 6291316, 7508374, 8909030, 9225959, 9145884, 9001158, 8243404, 7540257, 8490543, 10709724, 11801544, 10941972, 10268969, 11936340, 15475954, 18495320, 18627499, 15189208, 10775596, 10397526, 16222677, 23629429, 25894314, 22820664, 20705859, 22946132, 25314714, 22973236, 17902489, 15444980, 16460810, 17547026, 17374621, 17879596, 19425270, 19526891, 17441816, 15972227, 16770535, 17188060, 14470003, 10621125, 9830584, 12395691, 14641681, 14582603, 14253187, 15683464, 17728405, 18684300, 19477067, 21603680, 23652153, 23136563, 21070119]
38420B1070119R1954K940801J989826j760426l462214j780752J70148Q83914K146122
38411B2289492L793773K391954k301462m652577r42065M183271L957230o66371
38403B8053245k932002m54578K394324K208501R58973J186584J605751J59757
38395C3180555j972456k407788j377030o96531l73073R96527L006769L185995
38387C3542968M80080k671183k875046P8499K687020J773036j680165l836577
38379B7498632k830481n56161O55781R29359J214987J070179J50786p4590J248563
38370B9307055J956354P5396k056299p89864K598201L173875j04976k792808j882676
38361B9484258K29156M76740m09657n90138n22690q82562l67637J425685J962621
$$ y = [21070119, 21162073, 24102874, 26092700, 24332274, 20870060, 19089308, 19259456, 20143370, 22289492, 26083265, 28475219, 26173757, 21521180, 20579115, 24762386, 28719616, 28053245, 25121243, 24666665, 27060989, 29269490, 30228463, 31415047, 33020798, 33180555, 31208099, 28800311, 27423281, 26726750, 26353677, 27350204, 30356973, 33542968, 34023048, 31351865, 28476819, 28555318, 31242338, 33015374, 31335209, 27498632, 24668151, 24111990, 24767771, 25697130, 26912117, 27982296, 28133082, 28058492, 29307055, 31263409, 31338805, 29282506, 28492642, 31090843, 34264718, 34159742, 31366934, 29484258, 29713414, 30190154, 29780497, 29190359, 28667669, 27785107, 27417470, 28843155, 30805776]
38352C0805776j70905k011358o00221J947201J749386o05105j464422j66804Q21188
38343C0304736P45053R32619R36024r53163l391278k974900n7668J176765m98275
38334B6219913j269142J223036L870964L197319N15366j071751j475167k064231
38326B9146307k143600o55189P46456J0658j520346j217405K69523K59538j076764
38317B3819178r92682R23666J923809O17364j069137j249166m44968K88990Q94868
38308B4711922J032765m8181j296799k93695K692916L944890J589347j103341
38300C1229824m93516J703329J132172k131012l487123q97321K039201J573934
38292C0669488r48920j766885l07785Q68833N68636K08240N57852K58144j270591
$$ y = [30805776, 30634871, 28623513, 28023292, 29970493, 31719879, 31114774, 29650352, 29483548, 30304736, 31049789, 31982408, 32918432, 31965269, 28573991, 25599091, 25541423, 26718188, 26219913, 24950771, 26173807, 30044771, 33242090, 33757456, 32685705, 31210538, 29146307, 27002707, 26347518, 27093974, 27104632, 25584286, 24366881, 24636404, 24895942, 23819178, 22826496, 23750162, 25673971, 26291335, 25222198, 23973032, 23528064, 23817054, 24711922, 25744687, 25696506, 24399707, 24106012, 26798928, 30743818, 32333165, 31229824, 30736308, 32439637, 33571809, 31440797, 27953674, 27056353, 29095554, 30669488, 29720568, 27953683, 27645898, 28514731, 29083367, 29291607, 29849459, 30107603, 28837012]
38283B8837012j885697K26200L007467K606602j270799m492000l586017K22307
38275B3665075L083312L008900R10400j467968k732709j727602J550573M804460
38267C1094441N037208J868020j980042l839786l539261k437931j479339q46516
38259B3876794l78781L39211J386950J725988K75417j965013k580456j138008
38251B1542102K9117n80399j423848q38679Q4489j79241m54640R68474K606524
38242B1753899J745567p72323j522979M8726J105428M86772K1123M1306j643433
38233B1264086m510293m050283J049509N028479K880794j699737j814124J933415
38225B0081846K922197m00600k283001M34859L225939J720218j284720j127972
$$ y = [28837012, 26951315, 27177515, 30184982, 32791584, 31520785, 27028785, 23442768, 23665075, 26748387, 29757287, 30667687, 29199719, 26467010, 24739408, 26289981, 31094441, 36131649, 37999669, 36019627, 32179841, 28640580, 26202649, 24723310, 23876794, 23498013, 23837224, 25224174, 26950162, 27225579, 25260566, 22680110, 21542102, 21571219, 20990820, 19566972, 18728293, 18812782, 18633541, 18178901, 19147375, 21753899, 23499466, 22727143, 21204164, 21252890, 22358318, 22845090, 22866213, 22907519, 21264086, 16753793, 12703510, 13753019, 18781498, 21662292, 19962555, 18148431, 20081846, 23004043, 22603443, 20320442, 20755301, 23981240, 25701458, 24416738, 23288766]
38217B3288766Q38272K7214l425298m999851l015799m49330N28193J307050L089536
38208A7188753M121781K542408m54322k182951j802139p37959o59815j834405
38200A6181351k858292j887594J034304L236959K405387j35243j099700J9320
38192A6896492M90436r54814j924023l84404J693483J106881j762890l478482
38184A1682679k223757K80231J442709O53248p24793j017883L29726K323039L373670
38175A6118869K904575J592169N7237j584974k706722k316222q66586j90629p65634
38166A2242083j008995l67059n71299k023959j847238J499551M359827K731497
38158A5014408j052837j498523J309968J908047j431698l948209k477669k80568
$$ y = [23288766, 24127038, 24154252, 20728954, 15729103, 12713304, 12263974, 12792167, 14099217, 17188753, 21310534, 23852942, 23398620, 21215669, 19413530, 18675571, 18015756, 16181351, 13323059, 11435465, 12469769, 15706728, 18112115, 17976872, 16877172, 16896492, 17386928, 16432114, 14508091, 14123687, 15817170, 16924051, 15161161, 11682679, 9458922, 9739153, 11181862, 11835110, 11110317, 10092434, 10422160, 12745199, 16118869, 19023444, 20615613, 20672850, 19087876, 16381154, 14064932, 13198346, 13007717, 12242083, 11233088, 10866029, 10294730, 8270771, 6423533, 7923084, 12282911, 15014408, 13961571, 12463048, 13773016, 15681063, 14249365, 10301156, 7823487, 7542919]
38150G542919o02460r01968J852316M565893K526347k321303l878107j318708
38142G464929L40310q79423q75541K835812O001880L798606j701611m418822k570137
38133I996003k2817j4108j247957j014165N69150J202528N2952j025895O0555
38124H556246L032943N462285N138864K030272j577826k722521m81194K391545
38116B1830614J826504k325069m960233j987373L381924M283767j68516l593383
38108A8288235j908308R55109M9190k636166k226770M98584Q16522j512608k167274
38099A0156514l55150k73377l178357m319476n96040M056142M701783K641222
38091A2833261K239652L498454K605724j350925m545531l543227N72738L813828
$$ y = [7542919, 6940459, 6038491, 7890807, 12456700, 14983047, 12661744, 8783637, 7464929, 7805239, 6925816, 6050275, 8886087, 14887967, 18686573, 16984962, 12566140, 9996003, 9973186, 9959078, 8711121, 7696956, 8266106, 9468634, 9521586, 8495691, 8556246, 11589189, 17051474, 22190338, 24220610, 22642784, 19920263, 19439069, 21830614, 23657118, 21332049, 16371816, 14384443, 17766367, 22050134, 21881618, 18288235, 16379927, 17335036, 17384226, 14748060, 12521290, 13019874, 13836396, 12323788, 10156514, 9801364, 9527987, 6349630, 2030154, 1434114, 5490256, 10192039, 12833261, 15072913, 18571367, 21177091, 19826166, 15280635, 11737408, 12310146, 16123974]
38083A6123974L498959N58566j698104j239973M24866O65274k37830J27712J675646
38074A9899090J457737j121093k502544m50950K177251J955656O4289m49260R6812
38065B1126988m95747j552640o02911J799552K535119R99078j2576J186089K896242
38056B7879194K826112P63045j901342l438950k669323k42996J504909J508787
38048B6229436J471794K538603K590704j04847k687793j402347J915988K062054
38040C2613592j316855l186484j412218J09634j392672k620527P6932M106092
38032B6977494M106759k59340m065144l669825k61529K746853L292100J644943
38024C0512311l29213p47788M20191J292903N46941p68879p54528P18348J943442
$$ y = [16123974, 19622933, 20181499, 18483395, 17243422, 17668288, 18333562, 18095732, 18223444, 19899090, 21356827, 20235734, 17733190, 17282240, 19459491, 21415147, 21479436, 21030176, 21126988, 20631241, 19078601, 18475690, 20275242, 22810361, 23809439, 23796863, 24982952, 27879194, 30705306, 31468351, 29567009, 26128059, 23458736, 23215740, 24720649, 26229436, 27701230, 30239833, 32830537, 32725690, 30037897, 28635550, 30551538, 32613592, 31296737, 28110253, 26698035, 26807669, 25414997, 22794470, 22871402, 26977494, 31084253, 30824913, 26759769, 23089944, 22828415, 25575268, 28867368, 30512311, 30183098, 29435310, 29855501, 31148404, 31695345, 30926466, 30171938, 30890286, 32833728]
38015C2833728J632041M14752q690R99591J998887J186707q76830j637610k35336
38006C6307240J118230Q40771P15813K455704L887067K249348n16614l77386J940030
37997D8620203J961772q03150j864942N73554K775393K273614J783307L338505
37989E8658256L992428J437879q68540Q85032M152092M058504J250439J62982
37981G3729072J469557J952168R07065J130871L415650M930945L918695K057188
37973I3511211J156146P96762L79064Q16853K894423N676156P471549P406012
37965A20108176N905813M425679M307474N296008O073244O520552P596457Q677098
37957A68910501Q035515O853461Q728228J3250945J4783655J0923250P263191
$$ y = [32833728, 34465769, 34880521, 34871831, 35871422, 37870309, 39057016, 38180186, 36542576, 36307240, 37425470, 38266241, 38982054, 41437758, 45324825, 47574173, 47057559, 46680173, 48620203, 50581975, 49778825, 47913883, 48487437, 51262830, 53536444, 55319751, 58658256, 62650684, 64088563, 63220023, 64105055, 68257147, 72315651, 73566090, 73729072, 75198629, 77150797, 78057862, 79188733, 82604383, 87535328, 91454023, 93511211, 94667357, 95464119, 95843183, 96660036, 99554459, 105230615, 112702164, 120108176, 126013989, 130439668, 134747142, 140043150, 146116394, 152636946, 160233403, 168910501, 176946016, 183799477, 192527705, 205778650, 220562305, 231485555, 238748746]
37950B38748746R037963J2847875J2859629J0831231J2129765J5040164J3257643
37943C24753016P557288N207193P486877P632364L021055l38332J168472K568062
37935C59055995o2683k385455m16743J237690k800678q690111r249702n368930
37927C31319383l502638n098492o501064o990174q850591j0713972q706165m086159
37919B76870128k513813n205461p481384o948183o614738q387361r668737q676743
37911B21373708p658217q210590q290443o637802n653375o832027p504829n536662
37903A65049763l528456m511898o595155o089540l637972k912194m686656o360189
37895A26727703o549565o218923n552082l556012j147924j032419l389218m749663
$$ y = [238748746, 247786709, 260634584, 273494213, 284325444, 296455209, 311495373, 324753016, 332310304, 337517497, 345004374, 352636738, 355657793, 355319461, 356487933, 359055995, 358993312, 356607857, 356191114, 357428804, 354628126, 345938015, 336688313, 331319383, 327816745, 322718253, 316217189, 309227015, 300376424, 289662452, 280956287, 276870128, 274356315, 269150854, 261669470, 254721287, 248106549, 239719188, 230050451, 221373708, 213715491, 205504901, 197214458, 190576656, 184923281, 178091254, 170586425, 165049763, 161521307, 157009409, 150414254, 144324714, 140686742, 137774548, 133087892, 126727703, 120178138, 113959215, 108407133, 104851121, 103703197, 102670778, 99281560, 94531897]
37887I4531897k846099j52344m59824l557084n701747m669599k011626j73844
37879G4959730N23086J012961J059281n59876l681306o081794n751813l062349
37871E8417920j51987J221003P03690j066897l016185m059651l772110k606749
37863D5669034j124562M81082J594116Q77631j923400m490456m044298j016927
37855C6022220J185793O37122o62754Q3461K415684L474645K115319J16270p79983
37846D4607777j116201k127125l298830l033982j263680J79364R8701m56073L4092
37837C3624043J123928J086099l46762j499772j310586q47188j376996k179464
37829B8273302j714561k28795N28382P7081n1562J126007K255518J531684n55502
$$ y = [94531897, 91685798, 91533454, 91073630, 87516546, 81814799, 77145200, 75133574, 74959730, 75482816, 76495777, 77555058, 76995182, 73313876, 67232082, 61480269, 58417920, 58265933, 59486936, 60190626, 59123729, 56107544, 52047893, 48275783, 45669034, 44544472, 45025554, 46619670, 47497301, 45573901, 41083445, 37039147, 36022220, 37208013, 37845135, 37182381, 37265842, 39681526, 43156171, 45271490, 45387760, 44607777, 43491576, 41364451, 38065621, 35031639, 33767959, 33947323, 34046024, 33589951, 33624043, 34747971, 35834070, 35487308, 33987536, 32676950, 31829762, 30452766, 28273302, 26558741, 26329946, 26858328, 26935409, 26883847, 28009854, 30265372, 31797056, 31241554]
37820C1241554j728011q89932O78308J259414P13484m957m30044p02612o01391
37811B9535813K77968J276043Q36384j429921l728186l981846k186242q3864R12300
37802B1428449N41535r20954k764399l573779k277168L59133K350149K680400
37794A7823366J883101O19003r51922k336990k716103k056138r52504O37977K885969
37785A4835759M342491K971356m16507k082567k5700L187067L771299J316682
37777B7899880j515748k516455j628858k56362j05915j608488k749067j200537
37769A6318450J703057J776346j888741m812874l496989n50697q535p18331Q09100
37760I130786L311681K454693j239141k387837N89469K745434N41349k805922
$$ y = [31241554, 29513543, 28623611, 29301919, 30561333, 31274817, 31269860, 30839816, 30137204, 29535813, 29813781, 31089824, 31926208, 30496287, 26768101, 22786255, 20600013, 20516149, 21428449, 21969984, 21049030, 18284631, 14710852, 12433684, 12792817, 15142966, 17823366, 19706467, 20325470, 19373548, 17036558, 14320455, 12264317, 11311813, 11949790, 14835759, 19178250, 22149606, 21733099, 19650532, 19624832, 22811899, 26583198, 27899880, 26384132, 23867677, 22238819, 21982457, 21876542, 20268054, 17518987, 16318450, 18021507, 19797853, 17909112, 13096238, 9599249, 9048552, 9040017, 8321686, 9130786, 12442467, 14897160, 13658019, 11270182, 11859651, 14605085, 15146434, 12340512]
37752A2340512k965542j030386n13693j094020J89143L213636M496171K380554
37744A7016375p51040j948386j193495o39452j499628k563590j931952N0318P69870
37735G309020q07145j857886L37956L483046L068014l05867j205328J971325L864685
37726A5857820N83378l574952k480449K230717L616504j53733l662773k643195
37718I773317O49252J900166N70017q95210j037311l43135L84580R16780J368607
37709A3287063J843395K032313J302824k38995j417638j689150k178535l491766
37701I449511l661755o85555L544401M782783K103221q65906j218926m95665j477823
37692A1474286l565116l828901j581694O52262Q21201r775L61875J853973K197988
$$ y = [12340512, 9374970, 8344584, 7830891, 6736871, 6926014, 10139650, 14635821, 17016375, 16265335, 14316949, 13123454, 12484002, 10984374, 8420784, 6488832, 6539150, 7309020, 6501875, 4643989, 4981945, 8464991, 11533005, 11227138, 10021810, 11993135, 15857820, 16441198, 12866246, 10385797, 12616514, 16233018, 16079285, 12416512, 9773317, 10422569, 12322735, 12892752, 11997542, 10960231, 10617096, 11001676, 11918456, 13287063, 15130458, 17162771, 18465595, 18226600, 16808962, 15119812, 12941277, 9449511, 5787756, 5102201, 8646602, 13429385, 15532606, 14666700, 13447774, 12952109, 11474286, 7909170, 4080269, 2498575, 3150837, 3972038, 3962263, 4324138, 6178111, 8376099]
37683H376099M11335j443380j156837M6362r98197m331413n895264k899166K043279
37674e847182M251417K878845R39471M42019M85904J76791M92217K146243L638282
37665I604007K951923K60154k231730k825864k003694j466127j744061j362605
37657A182003Q64278L257524K837504k85777k412722j242609J036373J380306
37649F616880J58808o36292j065007j898941j616530J331556M533680M086319
37641A1510473M36859k325922k582764k284898k178176p38008J632795K223911
37633E694270R37046Q55070K545292K732673M63409o70910R07917J344888j844624
37624A2965031m637598k902261M56385L14756k175707k062251Q35742K269942
$$ y = [8376099, 8787434, 7344054, 6187217, 6233579, 5235382, 903969, -4991295, -7890461, -5847182, -1595765, 1283080, 2222551, 2664570, 3150474, 3327265, 3819482, 5965725, 9604007, 12555930, 12816084, 10584354, 7758490, 5754796, 4288669, 2544608, 1182003, 2046281, 5303805, 8141309, 7855532, 5442810, 4200201, 5236574, 6616880, 6775688, 6139396, 5074389, 3175448, 1558918, 2890474, 7424154, 11510473, 11947332, 9621410, 7038646, 4753748, 2575572, 1837564, 3470359, 5694270, 6631316, 7486386, 10031678, 12764351, 13227760, 12556850, 13464767, 14809655, 12965031, 8327433, 5425172, 5881557, 6196313, 4020606, 1958355, 2794097, 5064039]
37616E064039J220365P56185J384844j80986m447898o791722l824892J893149
37608d926916N530490N256379K302589j285697l313784k304374P01217K872925
37600D832829K887186J830218P71149k70482q73173l74503K69519n13458j871958
37591F687327j483037K45766M25540j207459j275823J709226M460570L628468
37583A3190578L11605k308456l099712k661695j543971q65711k023051l710095
37575b710508k275697K488134N322589K647898j538769j349571K044448K619997
37567G248521p02508k575272o5787K737514J261691k767036m298508j992293J016887
37558a36791K003886J337809N75690K53806K10599O79295J898632K894311J789055
$$ y = [5064039, 6284404, 7040589, 8425433, 8244447, 3796549, -2995173, -6820065, -4926916, 603574, 5859953, 8162542, 6876845, 3563061, 1258687, 1959904, 4832829, 7720015, 9550233, 10321382, 10050900, 9177727, 8803224, 9072743, 8559285, 6687327, 5204290, 5450056, 5875596, 4668137, 3392314, 5101540, 9562110, 13190578, 13502183, 11193727, 8094015, 5432320, 3888349, 3022638, 999587, -2710508, -4986205, -2498071, 2824518, 5472416, 3933647, 2584076, 4628524, 7248521, 6546013, 3970741, 3904954, 6642468, 7904159, 5137123, 838615, -1153678, -136791, 1867095, 3204904, 3780594, 4034400, 4244999, 4924294, 6822926, 9717237, 11506292]
37549A1506292j792755n154165m926036j360459J528216J110055m41261K97957
37541G67844K704077L169747P45132j423797p33601J456847K124382L82481k178366
37532G014746l599173l039489j205295L9379n13712j596169p19333K276738M434835
37523C092527L330563J56702k020864j978221q64094J93663J188624J930899J436722
37514F466521l61187j408414K66814L227686L460410l73331m263990l655663K64194
37505C623040K332733J160392P78885L210071M213067O2495n356690n478909p55645
37496C789439K412715J401677j78794N4162k07206k212379k949956o62021J576801
37487C024438J255037P29934K222097L006337M19741k271960p13176K863861L048937
$$ y = [11506292, 9713537, 4559372, -366664, -1727123, -198907, 911148, 469887, 767844, 3471921, 6641668, 7386800, 5963003, 5229402, 6686249, 8810631, 9193112, 7014746, 3415573, 376084, -829211, -789832, -1303544, -2899713, -3619046, -1342308, 3092527, 6423090, 6579792, 4558928, 2580707, 1716613, 1910276, 3098900, 5029799, 6466521, 6105334, 4696920, 4963734, 8191420, 11651830, 11278499, 7014509, 3358846, 3623040, 5955773, 7116165, 7895050, 11105121, 15318188, 15380683, 10023993, 4545084, 3789439, 6202154, 7603831, 7425037, 7479199, 7271993, 5059614, 2109658, 1447637, 3024438, 4279475, 5009409, 7231506, 10237843, 10657584, 8385624, 7672448, 10536309, 13585246]
37478A3585246K21575o32324J030229O60535k693116m317558k199853n49458j895144
37469C210132k052865K465614P282864O142735N13046k910204k207927j466401
37461A0976994k619707k413403J077034M227115L107620o01546k296527r51443
37453A0506137M31493K38n50315P59145K997277L815873K830636J836080J968568
37444B4595132K226872J300533l42845j262769j283633j574701k487036k603051
37436A8568502o27181K432250L770967J618199k528708m729127k361497K578899
37428A8722304M904912J947248l079308m928860k691630n6242L89494N8557P77539
37419A6044014J435716L47249j327128j281579J02794M27883p75750j440481l57713
$$ y = [13585246, 13806821, 13174497, 14204726, 14865261, 12172145, 7854587, 5654734, 5105276, 3210132, 1157267, 3622881, 10905745, 17048480, 17561526, 14651322, 12443395, 10976994, 8357287, 5943884, 7020918, 11248033, 14355653, 13754107, 11457580, 10506137, 10937630, 10937868, 10387553, 11146698, 14143975, 17959848, 20790484, 22626564, 24595132, 26822004, 28122537, 27779692, 26516923, 25233290, 23658589, 21171553, 18568502, 17941321, 20373571, 24144538, 25762737, 23234029, 18504902, 16143405, 18722304, 23627216, 25574464, 22495156, 17566296, 14874666, 14818424, 15207918, 15266475, 16044014, 17479730, 17826979, 16499851, 15218272, 15321066, 15748949, 14973199, 13532718, 13175005]
37410A3175005J161214J476466N19651j071779k906344m099642l265673n46653
37402D442245J516939O96076j842239k638081k05506L089376M052471K584032
37394A1695313J281668J426361J247935q19163k895439k026899R18413J797025
37386A2625214p68904l032996j621119J386467J774214l66475j167856Q65548
37378I694093L082717L307117K590874K238042J333514q56709k556558j881444
37370A6951646R6164R02019J30418o73440p05552m69539k19104K50422M92490
37361A6755524k09953j373183j632629n78638Q26897J513506R79622p91395k776220
37352A2713531k878842k74421K559995K380330j81108j105083J122723K989436
$$ y = [13175005, 14336219, 15812685, 16332336, 15260557, 12354213, 8254571, 4988898, 4442245, 5959184, 6655260, 4813021, 2174940, 1969434, 5058810, 9111281, 11695313, 12976981, 14403342, 15651277, 14832114, 11936675, 9909776, 10828189, 12625214, 11856310, 8823314, 7202195, 8588662, 10362876, 9996401, 8828545, 9694093, 12776810, 16083927, 18674801, 20912843, 22246357, 21389648, 18833090, 16951646, 17047810, 17949829, 18080247, 17406807, 16701255, 16231716, 16012612, 16263034, 16755524, 16545571, 15172388, 13539759, 12961121, 13788018, 15301524, 16281146, 15489751, 12713531, 9834689, 9560268, 12120263, 14500593, 14319485, 13214402, 14337125, 17326561]
37344A7326561J206653k112289k594810k86096O65254j326469l027286j869810
37336G981708J40978L60948J10015J811856L750015K159066k162289m101842j870571
37327H179884K18342j274519l393610j856261J605724J891330j031005j829442
37319B510443J591126M378119J950316l026157m382576r11313K629925K231318
37311F971201r27786l072777k345198K10154K484823K996905J640826k65686j003933
37302F688529j08311J127908J064035n26934k263106k552031j054253J087841
37294C463678K260637J612304m41442k545691l201206j773387Q24462K743017
37286B942372K954440K113062J241432K12704j474102k931112k425728J88917
$$ y = [17326561, 18533214, 16420925, 13826115, 13540019, 14205273, 12878804, 9851518, 7981708, 8122686, 8483634, 8593649, 10405505, 14155520, 16314586, 14152297, 10050455, 8179884, 8398226, 7123707, 3730097, 1873836, 3479560, 5370890, 4339885, 2510443, 4101569, 8479688, 10430004, 7403847, 3021271, 2109958, 4739883, 6971201, 6043415, 2970638, 625440, 835594, 3320417, 6317322, 7958148, 7692462, 6688529, 6580218, 7708126, 8772161, 8245227, 5982121, 3430090, 2375837, 3463678, 5724315, 7336619, 6895177, 4349486, 1148280, -625107, 199355, 2942372, 5896812, 8009874, 9251306, 9464010, 7989908, 5058796, 2633068, 2821985]
37278B821985K984286M236993L868643K264831o19621l984007n595243m103880
37270A873987j089338O87814M66055m17083q98686r96007o18227N62141J869003
37261A439659J934338Q04782L13214J499364K786790J897992r92885l240513k880427
37252C562314q42960M09543j74167j421912j880632j517064r43171P6804K001266
37243g29979L730135L174766J77439k526512k268347N25223L164499L692892K060209
37234A1000325p59986l370526m171256k607775l46271N7896j885395l740852k684571
37225h508411J406117N577410O461062L471509o43309k705230k188743o63603
37217B206802J007931K843171L386112M97250m181063n062292Q7496N536462M485105
$$ y = [2821985, 5806271, 10043264, 13911907, 16176738, 15557117, 11573110, 5977867, 1873987, 784649, 1472463, 1938518, 1521435, 622749, -373258, -991485, -429344, 1439659, 3373997, 4178779, 4491993, 5991357, 8778147, 10676139, 9683254, 6442741, 3562314, 2719354, 3128897, 2954730, 1532818, -347814, -1864878, -2808049, -2731245, -729979, 3000156, 6174922, 6352361, 3825849, 1557502, 2082725, 5247224, 8940116, 11000325, 10240339, 6869813, 2698557, 90782, -255489, -197593, -2082988, -5823840, -8508411, -7102294, -1524884, 4936178, 8407687, 7764378, 5059148, 2870405, 2206802, 3214733, 6057904, 9444016, 9941266, 5760203, 697911, 785407, 6321869, 10806974]
37208A0806974j266022l706915j96881L132348R85607l561251m428063j274018
37200D91779J431056J507963O94944K85918o16501k341382l444240k918121j319046
37191f227630O49689K628886L579223K515676O10725L08832J730558K220911M42612
37182H459482j391006r97233K82575l45995k502013l035373r20813J132423R33490
37173A615537J24383J155168K737296J449707k494760m624259k571981J98152
37165b410757l14066k260581r90735K827822L454078o91823l499823j22771M942923
37156I34267L851530k955021p088245l972832J554598L090780J058453j2115J111973
37147b426612J972770J507038J147134J255772L60170j463487j764521L86368
$$ y = [10806974, 9540952, 5834037, 5637156, 8769504, 9755111, 6193860, 1765797, 491779, 1922835, 3430798, 4125742, 4411660, 3795159, 1453777, -1990463, -4908584, -6227630, -5577941, -2949055, 630168, 3145844, 3756569, 4065401, 5795959, 8016870, 8459482, 7068476, 6071243, 6353818, 6007823, 3505810, 470437, -450376, 682047, 1615537, 1739920, 2895088, 5632384, 7082091, 4587331, -36928, -2608909, -2410757, -2724823, -4985404, -5976139, -3148317, 305761, -386062, -3885885, -4008656, 934267, 4785797, 1830776, -5257469, -9230301, -7675703, -4584923, -3526470, -3538585, -2426612, -453842, 1053196, 2200330, 3456102, 3816272, 2352785, 588264, 974632]
37139I74632K315745J375548j292504k637973j895403o46707L06596J485503K364156
37130B349593J272057j528058l089257j633439O85510P78387j000829j780515
37122c946551o82960K23746m64293j483436j325206n10822j62645L550P03273
37113g645344J336128R08736l7253l8404J096531K083759J998677J174891L69223
37104A246944k0561L1481K69989M66455R87957K268798L236632J758281k031566
37095H214410m442233k529723J396410K415194k83039k539043j447432R76247
37087A760791J694983J042518R53350J309779Q61757P3870J12792J50729j294196
37078F666373l020031k312857O52092K705745K336803J329855R39245l03586l248750
$$ y = [974632, 3290377, 4665925, 3373421, 735448, -1159955, -1806662, -1500066, -14563, 2349593, 3621650, 2093592, -995665, -2629104, -1943594, -1165207, -2166036, -3946551, -4629511, -4405765, -4870058, -6353494, -7678700, -8189522, -8352167, -8348617, -7645344, -6309216, -5400480, -5437733, -5476137, -4379606, -2295847, -297170, 877721, 1246944, 1226383, 1257864, 1527853, 1994308, 2982265, 5251063, 8487695, 10245976, 8214410, 3772177, 1242454, 2638864, 5054058, 4771019, 2231976, 784544, 1760791, 3455774, 4498292, 5451642, 6761421, 7623178, 7697048, 7809840, 7960569, 6666373, 3646342, 1333485, 1985577, 4691322, 7028125, 8357980, 9297225, 8993639, 5744889]
37069E744889n524177m779690k361363r72118l64920J482597M021119M481081
37061A727418K332208J743j131463k066561k820913j505916J529557K362697p22939
37052b94169l216892k29051N599415O854017J599083l964884m094973l92606K031556
37043C891496J628878N29383O8529k15623k35674O79841J623080O01211k449763
37034F121358n117288n313506l110007J91346L111014M093022K484451j55934
37026B304456j425927j143571j190943j853912q27507K613114M844757K133378
37018E453845l503656n912868k514566K483025L748707J318425o01519K74439
37010G45832K115054K519523J566646N12238m20861j428754j726198o11071P91017
$$ y = [5744889, 220712, -4558978, -6920341, -7892459, -8257379, -6774782, -2753663, 1727418, 4059626, 4061369, 2929906, 863345, -1957568, -3463484, -1933927, 428770, -294169, -3511061, -3740112, 1859303, 8713320, 10312403, 6347519, 2252546, 1859940, 3891496, 5520374, 6049757, 6118286, 5902663, 5666989, 6346830, 7969910, 8571121, 6121358, 1004070, -4309436, -7419443, -7228097, -4117083, -24061, 2460390, 2304456, 878529, -265042, -1455985, -3309897, -4137404, -1524290, 3320467, 5453845, 1950189, -3962679, -6477245, -3994220, -245513, 1072912, 471393, 745832, 2860886, 5380409, 6947055, 7459293, 7038432, 5609678, 3883480, 3272409, 4063426]
37001D063426O81180p66108j622683j033825p8934L73748P61776J158602M37473
36992C974655j696965l403323k905635q46836R96736K243908L463248M104153
36984E929941K908437J26920k473384l830271m286085m067165k671502j47024
36976h510133K283159L341399K665756O77632j561643k517258j453349L88153
36968d686284J066933M68835K67836J202342J850598P58039j335879k243352q04378
36959c455310J826853L128761J589131j409419k596960n50756K259742K452370
36951C244412Q3153j775290j406760k07558O8595m24264p62286o99539j86697
36942b066234Q30977J455624M98347j220789j329758L74803R79321j225593l631774
$$ y = [4063426, 4744606, 3978498, 2355815, 1321990, 1243056, 1616804, 2378580, 3537182, 3974655, 2277690, -1125633, -4031268, -4878104, -3881368, -1637460, 1825788, 5929941, 8838378, 8965298, 6491914, 2661643, -1624442, -5691607, -8363109, -8510133, -6226974, -2885575, -219819, 457813, -1103830, -3621088, -5074437, -4686284, -3619351, -3150516, -2882680, -1680338, 170260, 928299, -407580, -2650932, -3455310, -1628457, 1500304, 3089435, 1680016, -916944, -1467700, 792042, 3244412, 3327565, 1552275, 145515, -62043, 6552, -417712, -1179998, -1879537, -2066234, -1235257, 220367, 718714, -502075, -1831833, -1457030, -477709, -1703302, -5335076]
36933e335076k635015J476602N073320N473521K832701r86470l429547k425181
36925D4855J097618K891031J61931m093118m381922l3252L877772L319532k5064
36916B859383k062032j593389l66319L56785R09176J551758J716817J105427K79186
36907D756792k27541o50848j436803k305951k354324j197452K65184O63285j97008
36898b684666r78526m15072J156112K304992K193485J222109K68547j29958L8807
36889B975830L63319L13499j87895n83171l95661J7628j45790r71902j442262
36880e6405n39114J256606K019857N46461j712391k004164P9011J743120Q15963
36871B148944j103664j142417N05271J256224L59359n33565p78768j498828k618049
$$ y = [-5335076, -7970091, -6493489, -1420169, 4053352, 6886053, 5899583, 2470036, 44855, 1142473, 4033504, 4195435, 102317, -4279605, -4312857, -435085, 2884447, 2859383, 797351, -796038, -1162357, -805572, 103604, 1655362, 3372179, 4477606, 4756792, 4529251, 3878403, 2441600, 135649, -2218675, -3416127, -3150943, -2487658, -2684666, -3663192, -4078264, -2922152, -617160, 1576325, 2798434, 3066981, 2937023, 2975830, 3339149, 3652648, 3464753, 2881582, 2485921, 2503549, 2357759, 1385857, -56405, -595519, 661087, 2680944, 3227405, 1515014, -489150, -410139, 1332981, 2148944, 1045280, -97137, 408134, 1664358, 2023717, 1490152, 711384, -787444, -3405493]
36862c405493k441384r56878k76768p86176k99833J666790K539969J338216O58547
36853a963010J680547J468967j520403l514187j210367K338599K551841O72795
36845E04782P59428K179477J324676j210635j675827r5725L63732j2980J617765
36836C754693L775506K076964k344075l650131j357395j230528m328320m174801
36828g478087J592344N709765K820192j592030n94699K904254K276318j068956
36820D569101j021659J899604J741295k229571m607786k995736m62697J081569
36812b025880K929746M589527L331321l57606k654441k525669k500763k858925
36804b072690r93541K460024L028283k71187k804551j790131l33056j206048j938736
$$ y = [-3405493, -5846877, -6803755, -7080523, -7866699, -8166532, -6499742, -3959773, -2621557, -1963010, -282463, 1186504, -333899, -3848086, -5058453, -2719854, -168013, 504782, 1264210, 3443687, 4768363, 3557728, 1881901, 1786176, 2149908, 2136928, 3754693, 7530199, 9607163, 7263088, 3612957, 2255562, 1025034, -3303286, -7478087, -5885743, -175978, 2644214, 1052184, 457485, 3361739, 5638057, 4569101, 3547442, 5447046, 7188341, 4958770, 350984, -2644752, -3107449, -2025880, 903866, 5493393, 8824714, 8467108, 5812667, 3286998, 786235, -2072690, -3066231, -606207, 2422076, 2150889, -653662, -2443793, -2776849, -3982897, -5921633]
36795e921633K42203L112426L219196J433295O54291P63136j30417j501513j323203
36786E47781J20540O02207o30845k253748k960005k397026r52298J61402k8120
36777g790112k85470J581679M619497M899002J415523j585924p52274J232344
36769C334265J62368k831869l297046n80715J643998J309595Q4095n49890j354769
36760b079968k541032k255260M48782L243970K891241q21332m490215m403733
36752a0007547m91961L138274K599233q48938k222789L23629K955884K120301
36744b433914k14988l16115J201947J176412k24719k25876J070743J023441j7652
36735A039279J151622M247141M598260L34860m271849n005684l080709j715493
$$ y = [-5921633, -5679430, -2567004, 652192, 2085487, 2739778, 3502914, 3372497, 1870984, 547781, 668321, 1270528, 639683, -1614065, -4574070, -6971096, -7923394, -7761992, -7790112, -8075582, -6493903, -1874406, 3024596, 4440119, 2854195, 2101921, 3334265, 3496633, 664764, -2632282, -3212997, -1568999, -259404, -175309, -725199, -2079968, -4621000, -6876260, -6427478, -3183508, -292267, -1113599, -5603814, -10007547, -10499508, -7361234, -4762001, -5610939, -7833728, -7510099, -4554215, -2433914, -2648902, -2965017, -1763070, -586658, -811377, -1037253, 33490, 1056931, 1039279, 2190901, 6438042, 11036302, 11371162, 7099313, 2093629, -987080, -2702573]
36727b702573j231742o24281n34284j227956n74222K413633M649153L224407J32961
36718C525096j057131p57103j253356j497257O69165K840184Q34606l394469l354136
36709c444401J619648M397726Q73962l685270l026538R24714K470203J368840
36701A498884J494287K968235K206396j040135k793615j463685q8202p71916j456573
36692E53676l6481K032546K300799O98700j360850k848615k850580r63184R99873
36683a474116N18736j419975j012102K128835L509125Q36341j833033o83892J265512
36674A835431o93270m394898l772170J079662L636222J070608j881519j012508
36666d132442J282974J170509k24062K57506J853370J434997q08903j593029O4464
$$ y = [-2702573, -3934315, -4558596, -5092880, -6320836, -6895058, -4481425, 167728, 3392135, 3525096, 2467965, 1710862, 457506, -1039751, -370586, 2469598, 3304204, -90265, -3444401, -1824753, 2572973, 3446935, -238335, -3264873, -2340159, 130044, 1498884, 2993171, 5961406, 8167802, 7127667, 4334052, 2870367, 2782165, 2010249, 553676, 517195, 2549741, 4850540, 5549240, 4188390, 1339775, -1510805, -2473989, -1474116, -955380, -2375355, -3387457, -1258622, 2250503, 3086844, 1253811, 569919, 1835431, 1142161, -3252737, -7024907, -5945245, -2309023, -1238415, -3119934, -4132442, -2849468, -1678959, -1903021, -1645515, 207855, 1642852, 833949, -759080, -694616]
36657f94616J344791N358k432839k871078m98923K414459L040834R45467j445891
36648a92438j574754K50719J442020N55883j278913k490005k841630k522974j313847
36639i965939M00963J493894J953974L075785M712366M486802J414628j730794
36631E841679j880392J03590J035540m5352j451083k004473j973865j365979J13851
36622a626484J456477J035489q65348k150609j806762r93900r24832j123330k65820
36613g265119K109146M822229N534609K771308j741131l991277k283174M25995
36605C82586N84585j053506j194183M53687Q01433j432158l452510k364714R94113
36596f280667L475325L266805J128430q53853j114148n0311L31658r27229k079409
$$ y = [-694616, 650175, 655533, -1777306, -4648384, -5147307, -2732848, 307986, 1253453, -192438, -1767192, -1516473, -74453, 481430, -797483, -3287488, -6129118, -8652092, -9965939, -9564976, -8071082, -6117108, -3041323, 1671043, 6157845, 7572473, 5841679, 3961287, 4064877, 5100417, 5055065, 3603982, 1599509, -374356, -1740335, -1626484, -170007, 865482, 134, -2150475, -3957237, -4951137, -5875969, -6999299, -7265119, -5155973, -333744, 5200865, 7972173, 6231042, 2239765, -43409, 382586, 967171, -86335, -1280518, -826831, -25398, -1457556, -4910066, -7274780, -6280667, -2805342, 461463, 1589893, 736040, -378108, -428419, -96761, -1023990, -3103399]
36587c103399j116138R61752J452353J7563j004799k26041J304056K302027K545440
36578C132814J857691K40512q71614m7303J354784O05272k062094l619696l009782
36569b419416k254371k208214j090746J475479K865673J750216L68116M68251
36561a045012N94073l45888o22291N21846O19235j189877j214554K677253N967769
36552E962554L795239r71662k108359L6320m2048l017703l776312p22552J458524
36543F14001R0877j393832m49681o4381k495915m033920j012291L372791L782621
36534a589730J044521L620J290664J240147r61195k025981p74689q4881j312006
36525c169530j712169L24108J747523k86647l296011k990284J48102J847069P65872
$$ y = [-3103399, -4219537, -3257785, -1805432, -1787869, -2792668, -3018709, -1714653, 587374, 3132814, 4990505, 5231017, 4359403, 4312100, 5666884, 6272156, 4210062, 590366, -2419416, -4673787, -6882001, -7972747, -6497268, -3631595, -1881379, -1513263, -1045012, -450939, -796827, -1419118, -897272, -278037, -1467914, -2682468, -5215, 5962554, 9757793, 8786131, 6677772, 6714092, 6672044, 3654341, -121971, -844523, 614001, 704878, -688954, -1138635, -1203016, -3698931, -7732851, -8745142, -5372351, -1589730, -545209, -541589, 749075, 1989222, 1028027, -997954, -1772643, -1857524, -3169530, -4881699, -4557591, -2810068, -3096715, -6392726, -9383010, -9234908, -7387839, -6621967]
36516f621967J53339K233432M498403L452795k75020k875852k272552O1647J762022
36507A16247K031870J225865k66340j834017k411470j477253J10195R93389Q20050
36498f91464L75573M02696P24490N36500n61580j789425j695643R4596J941790
36489f62467J901384K72924p67673k49847M20262M2882l57249M24348J138788
36480B163352k80600l016417l711845r41891K578859L231872P23236j991412k387320
36471c632166r62886p5994p19288j108744R19411M412943N662740K780376j513898
36462E762494l145664j620212K16649N23814Q7485k24871q49429j657558j277104
36453b184396L54523R37283q82552k907703k282459K49846J458152L72239p43782
$$ y = [-6621967, -6468628, -4235196, 263207, 3716002, 3440982, 565130, -1707422, -1645775, 116247, 2148117, 3373982, 3107642, 1273625, -1137845, -2615098, -2504903, -1511514, -691464, -315891, 86805, 811295, 1347795, 786215, -1003210, -2698853, -2604257, -662467, 1238917, 1511841, 744168, 494321, 914583, 957465, 600216, 1024564, 2163352, 1882752, -1133665, -4845510, -5787401, -3208542, 23330, 746566, -1244846, -3632166, -4595052, -4671046, -5390334, -6499078, -5579667, -1166724, 4496016, 7276392, 5762494, 2616830, 996618, 1213267, 1737081, 1824566, 1599695, 750266, -907292, -2184396, -1829873, -892590, -1775142, -4682845, -6965304, -6715458, -5257306, -4885067, -5628849]
36444e628849l20412K82085l88429r85917O46969L742467N165924L575684Q91602
36435F981124q77862k094546l377027l056519M74495M660929M485795q00956n613437
36426G81996m695448K95091L383933J962269j103693k371185j619833l62275O00215
36417c128930R39712J85523j220446j599460n1326K095821K844853J838764L33713
36408B238224n19763o54271o74059q97631p90312L64497J989584K322169Q64763
36399D243201m32844L7392Q41328n7466j252596K97267L563785L556300j552991
36390I243376o938994p003661k154661K629753L925555K191229l07732j467637
36382A17228l69943J677007K069027K11070j599687j780365j654501k272649j814607
$$ y = [-5628849, -5949261, -5667176, -6055605, -7041522, -6394553, -2652086, 2513838, 6089522, 6981124, 6103262, 4008716, 631689, -2424830, -1950335, 2710594, 7196389, 6395433, 781996, -3913452, -3618361, -234428, 1727841, 624148, -1747037, -3366870, -3729145, -3128930, -2189218, -2003695, -3224141, -4823601, -4874927, -2779106, 65747, 1904511, 2238224, 1718461, 1064190, 390131, -507500, -1297812, -933315, 1056269, 3378438, 4243201, 3810357, 3847749, 4689077, 4631611, 3379015, 3676282, 7240067, 10796367, 9243376, 2304382, -4699279, -6853940, -4224187, -298632, 1892597, 1584865, 117228, -252715, 1424292, 3493319, 3704389, 2104702, 324337, -1330164, -3602813, -5417420]
36373e417420J011007L482788K465056k92382n05309K064073L536546J992161
36365H336520m81483j916749k681765k969991j763710O36555K148250J983287
36357C290914J485982J287839N13475o56873q11548l30136j178033k932556k802143
36348b133079o62334J84266j099923r72747J879236K953585r55261n389581m301357
36339a0497195O68072K955516J161841J6702J883509L649335K883785J375618
36331D097183Q11767j08854k054006k929557j873021j387426k664837k603563
36323h712314R86087M580487L678467j41350j707607k52656L23835j179828j199867
36314c624746J919744M184607J850875k507377l522999n36629K151496J588742
$$ y = [-5417420, -4406413, -923625, 1541431, 1249049, 743740, 2807813, 6344359, 8336520, 7855037, 5938288, 3256523, 286532, -1477178, -840623, 1307627, 3290914, 4776896, 6064735, 6578210, 5921337, 5109789, 4779653, 3601620, 669064, -2133079, -2795413, -2611147, -3711070, -4683817, -2804581, 149004, -806257, -6195838, -10497195, -9829123, -6873607, -5711766, -5695064, -3811555, -162220, 2721565, 4097183, 4908950, 4800096, 2746090, -183467, -2056488, -3443914, -6108751, -8712314, -7726227, -3145740, 532727, 391377, -1316230, -1568886, -1245051, -2424879, -3624746, -1705002, 2479605, 4330480, 1823103, -1699896, -2236525, -85029, 1503713]
36306A503713p60750k204170j968387n46389J442170K659327J526017j354635
36298B96896l071397k145544o58461r07855j696720m27574K376102L728239K915543
36289D09229K230742K542035J549003k019624n364881n027204j337970K657645
36281d361025M871127M554854J140876m143682p037811m435829P37828K616472
36273f057190K48412j677712m16686J141242J58853j253224q9081K123591K056897
36264c764898L97314N09301K574012L466061K089658O73468M88343J47152j115851
36255E464560k067025k337551l161838m057311k463301J485427L548319J404423
36247b184297j290692k76892K761250L152827O38261r18085j59709L72473m57928
$$ y = [1503713, 742963, -1461207, -3429594, -3975983, -2533813, 125514, 1651531, 296896, -2774501, -4920045, -5578506, -6486361, -8183081, -8610655, -6234553, -2506314, 409229, 2639971, 5182006, 6731009, 4711385, -653496, -5680700, -7018670, -4361025, 510102, 5064956, 6205832, 2062150, -4975661, -9411490, -8673662, -6057190, -5808778, -7486490, -7903176, -6761934, -6603081, -7856305, -7945386, -5821795, -3764898, -3367584, -2858283, -284271, 3181790, 5271448, 5944916, 6433259, 6580411, 5464560, 3397535, 1059984, -2101854, -6159165, -8622466, -7137039, -3588720, -2184297, -3474989, -3751881, -990631, 2162196, 2800457, 1882372, 1722663, 2095136, 1637208]
36238A637208n55827P72174P92035j915240m304532l153277K24663K363025K617131
36229a522640K781222L238373K626996P40266j031431k120966l317790m604617
36221c210587m455269k013075J311726L163467K584723P28160m47037j45109N54244
36212a928757K65735o99950r54126m54409m70787q05253M92717L412105M659070
36203C516345K297853p21169p85104O58455l85366l483580m142716j215866J069027
36194c192121r7049j970885j466113l24994j362567k701339m43935M390122O364311
36185h04570L188681j235282k431981q34705J32545p41072j439357j71598J996084
36176b341255K405078J48067k390579j936574J522290M011484K164585k181667
$$ y = [1637208, 1081381, 1853555, 2645590, 730350, -3574182, -6727459, -6502796, -4139771, -1522640, 1258582, 4496955, 7123951, 7864217, 6832786, 4711820, 1394030, -3210587, -7665856, -9678931, -8367205, -5203738, -2619015, -1890855, -2337892, -2483001, -1928757, -1663022, -2362972, -3317098, -3771507, -4242294, -5047547, -4554830, -1142725, 3516345, 5814198, 5093029, 4307925, 4966380, 4581014, 1097434, -3045282, -4261148, -3192121, -3289170, -5260055, -6726168, -7051162, -8413729, -11115068, -11559003, -7168881, -804570, 2384111, 1148829, -1283152, -2117857, -1985312, -2726384, -4165741, -4337339, -2341255, 63823, 211890, -2178689, -4115263, -2592973, 1418511, 3583096, 1401429]
36168A401429l853218q61018K993178L025177n05887l259135k630957m94443J99375
36159c985499m44950m8184K096733L847294L232381R74902r81525k182530l338661
36150h30039m029227k783341L03807K860743L036136J729537J022927J388768
36142B699311J621768Q85858l89535j415397j855951j731203j158737k83574P31303
36133h96157J485351J233120l00004j975389k145488p52028O62444J346256K099281
36124G57386K917534J972965j320644m020493k964751O43712K662788J528408
36116B176905m61286j287375j511621j725216q08925J558871L136199K098867
36108C176419N9480k72551P63381N63895j365157k518952j231325Q77370J308017
$$ y = [1401429, -2451789, -3312807, -319629, 2705548, 2199661, -1059474, -3690431, -4184874, -3985499, -4430449, -4478633, -2381900, 1465394, 4697775, 5672677, 4691152, 2508622, -830039, -4859266, -7642607, -7338800, -4478057, -1441921, 287616, 1310543, 2699311, 4321079, 5206937, 4817402, 3402005, 1546054, -185149, -1343886, -1627460, -896157, 589194, 1822314, 1522310, -453079, -2598567, -3350595, -2688151, -1341895, 757386, 3674920, 5647885, 4327241, 306748, -2658003, -2014291, 648497, 2176905, 1715619, 428244, -1083377, -2808593, -3617518, -2058647, 1077552, 3176419, 3235899, 2963348, 3726729, 4290624, 2925467, 406515, -824810, 52560, 1360577]
36099A360577o649j020732l64039J249427K068504J133427p15416j461468q1401
36090B162230J823701J592712q72856k452925r68078J363428P84161k360317l694630
36081b622574j028283K428742K724155N32781p02453j55350J49321m26741l18080
36072E81518P02778P19226o91841j295329o8553Q62591j6578r34123k50913L99782
36062H558o04684j230074P25992K786863J184032k258821k029544K293383M648911
36053E524616J252002m176043o179305m275607j122391K067391M637149M205506
36045A933318k86707m987855m842106k11622L714418L625463R40628j586733k626666
36036d327862j578136J369855L731291K428550j771880m190864k025120K086489
$$ y = [1360577, 1353928, 333196, -30843, 1218584, 3287088, 4420515, 3705099, 2243631, 2162230, 3985931, 5578643, 4705787, 2252862, 1284784, 2648212, 3432373, 1072056, -2622574, -3650857, -1222115, 1502040, 2034821, 1332368, 1177018, 1326339, 899598, 581518, 1284296, 2003522, 1311681, 16352, -52201, 810390, 793812, -140311, -391224, 8558, -596126, -1826200, -1100208, 1686655, 2870687, 611866, -1417678, 875705, 5524616, 6776618, 2600575, -3578730, -7854337, -8976728, -6909337, -2272188, 1933318, 1646611, -3341244, -8183350, -8394972, -4680554, -1055091, -114463, -1701196, -4327862, -5905998, -4536143, -804852, 1623698, -148182, -4339046, -6364166, -4277677]
36028d277677L822308K437691M44633l34202l66506r45356k662533m690299m736452
36019a1308393j064466M355742O574419L432564j121201k019930J53307Q33290
36011a64668r87741j426281J282396L116995L77685m166100n197604k646611r92156
36002a0804085j728253j511085J431221L734620K151683j113609j558981J255194
35994h143295L809397L905935K600834J258615j84942j518446j431175M07167
35986G04090K093584J547257r88493l215868l058495m91218K328020K882380R53314
35977B754571r40844o71658O56500M84377j247656k084398r22032M91736N11168
35968i68236j67625k69345l7833k11137l61945L08106J517054K394744K541662
$$ y = [-4277677, -455369, 1982322, 2426955, 2092753, 1726247, 780891, -1881642, -6571941, -11308393, -12372859, -8017117, -1442698, 1989866, 868665, -1151265, -997958, -164668, -1152409, -2578690, -1296294, 1820701, 2198386, -1967714, -7165318, -9811929, -10804085, -12532338, -14043423, -12612202, -8877582, -6725899, -7839508, -9398489, -8143295, -4333898, -427963, 2172871, 3431486, 3246544, 1728098, 296923, 704090, 2797674, 4344931, 3356438, 140570, -2917925, -3409143, -1081123, 1801257, 2754571, 1813727, 1142069, 1798569, 2282946, 1035290, -1049108, -1971140, -1479404, -968236, -1135861, -1405206, -1443039, -1654176, -2016121, -1708015, -190961, 2203783, 4745445]
35959D745445J715556m44676l325705m946932l843573q19654J875408K532043
35951b512088Q98177j776899l247129k091150N65193K424200L076065L703618
35943A039987L829335J498457k422197l783230j112106J387875j82224l478749
35935c222852l747209j060788P90351Q74749J513925K885172K514981M32715k72223
35926G08821Q96266N10187k644058m652525k322141J917846L974777L644481K887405
35917D921059J473834j674419m708957m560815j661663N82730P17021M86920J249082
35908c175208K137621K194591J704382P44652j326631m024953n188050l353517
35900a0287113L78873L467788M076361K095913p15226j646610L10770K594910
$$ y = [4745445, 6461001, 6016325, 2690620, -2256312, -6099885, -6919539, -5044131, -2512088, -1613911, -3390810, -6637939, -8729089, -8163896, -5739696, -2663631, 1039987, 4869322, 6367779, 3945582, 162352, -949754, 438121, 255897, -3222852, -6970061, -8030849, -7240498, -6365749, -4851824, -1966652, 548329, 981044, 708821, 1605087, 2115274, -528784, -5181309, -7503450, -5585604, -1610827, 2033654, 4921059, 6394893, 4720474, 11517, -4549298, -6210961, -5628231, -4911210, -4424290, -3175208, -1037587, 1157004, 2861386, 3606038, 2279407, -1745546, -6933596, -10287113, -9908240, -6440452, -2364091, -268178, -983404, -2630014, -2319244, 275666]
35892B75666J751173j638813l083348m06245K713265J822863j705992k741059
35884c012490k67927J129494j292127l788096j931359K151650K858126j16188
35876d268917j371240J437149L816213J809270j524468j098042K008027K475557
35868C283549o61026k756300j074203J316285O45035k350954m249213l216737
35860i063564J51465L873133N182783K595768j421910k527401m02755O39052j525943
35851b499372l329896j512884J346523J319429j97625N95656K612032J437967
35843b28170k610774m066709o85929L231944L592885J728423N07740m01655k169067
35834a101312l149542j383237J443745K133131O99362k66631J5628r6441j302514
$$ y = [275666, 2026839, 388026, -2695322, -3101567, -388302, 1434561, -271431, -3012490, -3280417, -2150923, -3443050, -7231146, -9162505, -7010855, -4152729, -4268917, -5640157, -4203008, -386795, 1422475, -101993, -1200035, 807992, 3283549, 2622523, -133777, -1207980, 108305, 753340, -1597614, -5846827, -9063564, -8912099, -5038966, 143817, 2739585, 1317675, -1209726, -1612481, -973429, -2499372, -5829268, -7342152, -5995629, -4676200, -4873825, -4278169, -1666137, -228170, -2838944, -6905653, -7591582, -4359638, -766753, 961670, 1469410, 1067755, -1101312, -4250854, -5634091, -4190346, -2057215, -1357853, -1624484, -1608856, -1705297, -3007811]
35825c007811k245609j898402q07536K41134R82864J117724P11371R13330K372274
35816a620661L293397J518087j475738j640332J692453L962269J398398l617437
35808C510436n798276l694021j69431K453981L986794L587475j89738n371463
35800a684243o670733k211262K931320L088151n15323k359380q55263O55852M49948
35791g170933Q00766K823904L707538J403811j663591k334465j155186l01785
35783c889941J42973P44287J95547k116666l304691q94702K251828J617581j544000
35774f797784j704527K195670M983026L238868j50113j376023r13157o53892k6110
35765a204042J675489K466281Q40958q73019j9599J693695Q37366k039059l290309
$$ y = [-3007811, -5253420, -7151822, -7959358, -7718224, -6735360, -5617636, -4906265, -3992935, -1620661, 1672736, 3190823, 1715085, 74753, 1767206, 5729475, 7127873, 3510436, -2287840, -5981861, -6151292, -3697311, 289483, 3876958, 3687220, -1684243, -8354976, -10566238, -7634918, -4546767, -5062090, -7421470, -8276733, -7620881, -7170933, -6370167, -3546263, 161275, 1565086, -98505, -2432970, -3588156, -3889941, -3746968, -3002681, -2807134, -4923800, -8228491, -9123193, -6871365, -5253784, -6797784, -8502311, -6306641, -1323615, 1915253, 1765140, 389117, -524040, -1177932, -1204042, 471447, 2937728, 3778686, 2905667, 2886068, 4579763, 5417129, 3378070, 87761]
35756H7761j803911O986L63509k01594j096050k246324k388330n2502L337972
35747c992483M374635K276888j96572j082072j530460k708859l207213j337373
35739g403509J931859M050187L603126Q91279k680023m768045l394474M94496
35731g275104L158336K167254p63271k256747j340346L39570J178327Q90603n6648
35722c958026q02553m69927O26779Q91080k82460j143594k2541J800242J649483
35713a711517n62048k061477j118537P30061J064140l05041j567554j305950L00625
35704f537298K148150L248648L188579K077759L09753j524020k600721k294957
35696a984107r75139J39921M06411M87753J052534J465386Q11636l45783o09858
$$ y = [87761, -1716150, -1709164, -1345655, -1547249, -2643299, -4889623, -7277953, -7330455, -3992483, 382152, 2659040, 2462468, 1380396, -150064, -2858923, -6066136, -7403509, -5471650, -1421463, 2181663, 3072942, 392919, -4375126, -7769600, -7275104, -4116768, -1949514, -2712785, -4969532, -6309878, -5970308, -4791981, -3901378, -3958026, -4760579, -5230506, -4603727, -3712647, -3995107, -5138701, -5161242, -3361000, -1711517, -2273565, -4335042, -5453579, -4723518, -3659378, -3964419, -5531973, -6837923, -6537298, -4389148, -1140500, 2048079, 4125838, 4435591, 2911571, 310850, -1984107, -2959246, -2819325, -2412914, -1925161, -872627, 592759, 1404395, 1058612, 448754]
35687D48754O0659K72459n76588j435166j339516o55173j8429O21452J087709
35678a533839M13238j550657k904437j628461J573836L749098L107663Q88257
35670B114698m55337n9640Q60258Q35236j79731j068983j159136r54774r52146
35661a019555m53886J243921K765656J616156k082875m667326l285987K60347
35653e623549K086835J522556J142667J960453J909750m2091j439751l6927K380164
35644C860107K484246K96486j171558m67957Q01267Q86498k08700j911629l639244
35635I29516l693757l82901M466822N788307J358774m285945m839520j24836L968475
35626C184935L200425m89893k905999l043147k622477k244699q40416J509268
$$ y = [448754, 509413, 781872, 205284, -1229882, -2569398, -3224571, -3243000, -2621548, -1533839, -1120601, -2671258, -5575695, -7204156, -5630320, -1881222, 1226441, 2114698, 1659361, 1599721, 2459979, 3295215, 3115484, 2046501, 887365, -67409, -1019555, -1473441, -229520, 2536136, 4152292, 2069417, -2597909, -5883896, -5623549, -3536714, -2014158, -871491, 1088962, 2998712, 2956621, 1516870, 1479943, 3860107, 6344353, 6640839, 5469281, 5001324, 5802591, 6689089, 6480389, 4568760, 929516, -2764241, -3147142, 1319680, 7107987, 8466761, 4180816, -658704, -783540, 3184935, 6385360, 5895467, 2989468, -53679, -2676156, -4920855, -5761271, -4252003]
35618d252003K709649J307814j433922k928640j957262N53023K762485L378054
35610A39198K398865J005815M59961P08746L55855j607884m336969n846687n007893
35601a1730993k424226M36865K435634L222354L194185L131358L346561L060849
35593D672587J248658j563753l015816j241726K649793N173656L834437m17622
35585A1340214m226718m991087k811268K48581K177218K225400P84962j183788
35577C563514k546373k454947r82380P77184J619670J285172L88661n63400j584286
35568d97185k505446k459238p48120J782803K923181J258733j926200l559038
35560e730510j995068J090839K616648J551922m35944j564463j703814j180437
$$ y = [-4252003, -1542354, -234540, -1668462, -4597102, -6554364, -6001341, -3238856, 139198, 2538063, 3543878, 4003839, 4712585, 5068440, 3460556, -876413, -6723100, -11730993, -14155219, -13718354, -11282720, -8060366, -4866181, -1734823, 1611738, 4672587, 5921245, 4357492, 1341676, 99950, 2749743, 7923399, 11757836, 11340214, 7113496, 2122409, -688859, -440278, 1736940, 3962340, 4747302, 3563514, 1017141, -1437806, -2420186, -1643002, -23332, 1261840, 1650501, 1087101, -497185, -3002631, -5461869, -6209989, -4427186, -1504005, -245272, -2171472, -5730510, -7725578, -6634739, -4018091, -2466169, -2902113, -4466576, -6170390, -7350827]
35552g350827M21089K902200M266206K861831L3j603324j526448j508305j890347
35543c427892j046843J111228K062146N10208j340547j235137k32937l16618p48232
35534d664624L05404K019266J943408j5604j640844j952904j832990j453615r9726
35525g392229J468836J482622K44573j55306M93200K29125j166349j306163O65696
35516e435995K331979J930091R83040J192921J571095P43317n10751j170610j832440
35507a97353k416098q76986K942824M964117J999971k921406m338143j909053
35499b752127k0322p85165j761624o28852J730556L347810L306386J452124j327189
35490B561597k601106r20319J523403J700961M32376N97742J492707j87630l668515
$$ y = [-7350827, -6929738, -4027538, 238668, 3100499, 3100532, 1497208, -29240, -1537545, -3427892, -4474735, -3363507, -1301361, -791153, -2131700, -3366837, -3599774, -3916392, -4664624, -4359220, -2339954, -396546, -412150, -2052994, -4005898, -5838888, -7292503, -7392229, -5923393, -4440771, -4196198, -4351504, -3858304, -3629179, -4795528, -6101691, -5435995, -3104016, -1173925, -190885, 1002036, 2573131, 3316448, 2805697, 1635087, -197353, -2613451, -3490437, -547613, 4416504, 6416475, 3495069, -843074, -2752127, -2772449, -3557614, -5319238, -5948090, -4217534, -869724, 2436662, 3888786, 2561597, -39509, -959828, 563575, 2264536, 2696912, 3294654, 4787361, 4599731, 931216]
35481I31216l962040J28145L316082J764188j264489j186512Q46396J000960n76670
35472I97276r64322K7015L25358M7954Q86932J947833O08329k690425m409608
35463c223658k800515L97286K984068L903351K303134j404738l778968j589833
35455c209873K915646M045663O09720k493613j928805n20573j653354l368635
35447e603824j971164J495224K888995J468083L11224P83593P92284r20870k405854
35438c162309j783175j29266N93176M62518O91410J269104J347371J063218J214840
35429A566887J593808J256945K91618k03295J3197o6366q31349j177602k62069
35420B181774R81376J072744l2243j132079j313350m67941R13271J528166m7063
$$ y = [931216, -3030824, -2902679, 413403, 2177591, 913102, -273410, 572986, 1573946, 997276, 32954, 59969, 385327, 433281, 1320213, 3268046, 3876375, 1185950, -3223658, -6024173, -5626887, -2642819, 1260532, 3563666, 2158928, -1620040, -3209873, -294227, 3751436, 4361156, 1867543, -61262, -581835, -2235189, -5603824, -7574988, -6079764, -3190769, -1722686, -1411462, -627869, 164415, -756455, -3162309, -4945484, -5074750, -4481574, -4019056, -3327646, -2058542, -711171, 352047, 1566887, 3160695, 4417640, 4709258, 4505963, 4519160, 4452794, 3621445, 2443843, 2181774, 3163150, 4235894, 4203651, 3071572, 1758222, 1290281, 2203552, 3731718, 3684655]
35411C684655l043437m094720j277579K397002K325508j263674l510000j810293
35403f592538J152479K389115K749457L860740M466633K987824R24655K00843
35395A2139208m85712k841091m730582l240661k85628q4626k027001j598970J699990
35386a455073L268627J178949q58911k99876J52680j695721k878789l92860L259075
35377B78101M050810K538106J544272Q37784j070049k434556q35787J648962J205662
35368G763305j085598r60188J351737J058858l095753o284841m660665k48675
$$ y = [3684655, 641218, -3453502, -4731081, -2334079, -8571, -1272245, -4782245, -6592538, -5440059, -3050944, -301487, 3559253, 8025886, 11013710, 11938365, 12139208, 11653496, 8812405, 4081823, 841162, 555534, 470908, -1556093, -3155063, -1455073, 1813554, 2992503, 2133592, 1833716, 1986396, 290675, -2588114, -2980974, 278101, 4328911, 6867017, 8411289, 9249073, 8179024, 5744468, 4908681, 6557643, 7763305, 6677707, 5717519, 7069256, 8128114, 5032361, -1252480, -5913145, -6161820]
$$ [...]
##END NTUPLES=NMR SPECTRUM
##END=
