##TITLE=31Pdec_SR5_K_TFA
 CDCl3, 124 sc
 9.1.2020
##JCAMPDX= 6.0         $$ Bruker NMR JCAMP-DX V2.0
##DATA TYPE= NMR SPECTRUM
##DATA CLASS= NTUPLES
##ORIGIN= UXNMR, Bruker Analytische Messtechnik GmbH
##OWNER= root
$$ XWIN-NMR		Version 3.5
$$ Thu Jan  9 14:15:05 2020 Russian Standard Time (UT+4h)  she@DPX200
##.OBSERVE FREQUENCY= 81.013821
##.OBSERVE NUCLEUS= ^31P
##.ACQUISITION MODE= SIMULTANEOUS
##.ACQUISITION SCHEME= undefined
##.AVERAGES= 124
##.DIGITISER RES= 17
##SPECTROMETER/DATA SYSTEM= spect
##.PULSE SEQUENCE= zgpg30
##.SOLVENT NAME= DMSO
##.SHIFT REFERENCE= (INTERNAL, DMSO, 0, 182.463)
##AUDIT TRAIL= $$ (NUMBER, WHEN, WHO, WHERE, WHAT)
$$ ##TITLE= Audit trail, XWIN-NMR		Version 3.5
$$ ##JCAMPDX= 5.01
$$ ##ORIGIN= Bruker BioSpin GmbH
$$ ##OWNER= she
$$ F:/spectra/data/she/nmr/P31/1/pdata/1/auditp.txt
$$ ##AUDIT TRAIL=  $$ (NUMBER, WHEN, WHO, WHERE, WHAT)
(   1,<2020-01-09 14:13:31.14 +0400>,<she>,<DPX200>,
      <continue with go, POWCHK disabled, PULCHK disabled
       configuration hash MD5:
       00 E9 B6 7A A2 85 ED C7 34 08 36 98 17 FE 4E 26
       data hash MD5: 32K
       4F EE EA 06 35 5C 5F 7F 8A 0E AA 30 B0 E9 05 58>)
(   2,<2020-01-09 14:13:35.03 +0400>,<she>,<DPX200>,
      <Start of raw data processing
       efp BC_mod = 2 LB = 1 FT_mod = 6 PKNL = 1 PHC0 = -1648.576 PHC1 = 34.60118 SI = 64K 
       data hash MD5: 64K
       A3 77 1F 60 DA 87 B9 05 E3 F3 D0 9A FF E5 F3 81>)
(   3,<2020-01-09 14:14:05.46 +0400>,<she>,<DPX200>,
      <pk PHC0 = -25.13015 PHC1 = 100 
       data hash MD5: 64K
       A9 26 FC 50 11 60 DD 7B FD 9E 93 56 72 B6 58 0E>)
(   4,<2020-01-09 14:14:09.76 +0400>,<she>,<DPX200>,
      <abs ABSG = 5 
       data hash MD5: 64K
       B2 9F C2 C7 CB BA BD 71 BB 66 A8 6C 37 BC 85 96>)
(   5,<2020-01-09 14:14:26.48 +0400>,<she>,<DPX200>,
      <abs ABSG = 5 
       data hash MD5: 64K
       00 F4 93 E9 3B 71 AC 93 14 28 95 1F B5 F8 0E 90>)
$$ ##END=
$$ 
$$ hash MD5
$$ 81 5E C9 FF 1F 08 FA D4 78 C8 76 BE 6B 5F BA 47
##$RELAX= 
##$RELAX= 
##$RELAX= 
##$RELAX= 
##$RELAX= 
##$RELAX= 
##$RELAX= 
##$RELAX= 
$$ Bruker specific parameters
$$ --------------------------
##$DU= <F:/spectra>
##$EXPNO= 1
##$NAME= <P31>
##$PROCNO= 1
##$TYPE= <nmr>
##$USER= <she>
##$AMP= (0..31)
100 100 100 100 100 100 100 100 100 100 100 100 100 100 100 100 100 100 
100 100 100 100 100 100 100 100 100 100 100 100 100 100 
##$AQSEQ= 0
##$AQ_mod= 1
##$AUNM= <au_zg>
##$AUTOPOS= <>
##$BF1= 81.014009
##$BF2= 200.13
##$BF3= 200.13
##$BF4= 200.13
##$BF5= 200.13
##$BF6= 200.13
##$BF7= 200.13
##$BF8= 200.13
##$BYTORDA= 1
##$CFDGTYP= 0
##$CFRGTYP= 5
##$CHEMSTR= <none>
##$CNST= (0..31)
1 1 145 1 1 1 1 1 1 1 1 1 1 1 1 1 1 1 1 1 1 1 1 1 1 1 1 1 1 1 1 1 
##$CPDPRG= <waltz16>
##$CPDPRG1= <>
##$CPDPRG2= <waltz16>
##$CPDPRG3= <>
##$CPDPRG4= <mlev>
##$CPDPRG5= <mlev>
##$CPDPRG6= <mlev>
##$CPDPRG7= <mlev>
##$CPDPRG8= <mlev>
##$CPDPRGB= <>
##$CPDPRGT= <>
##$D= (0..31)
0 1 0 0 0 0 0 0 0 0 0 0.03 2e-05 3e-06 0 0 0 0 0 0 0 0 0 0 0 0 0 0 0 0 
0 0 
$$ [...]
##$SUBNAM3= <"">
##$SUBNAM4= <"">
##$SUBNAM5= <"">
##$SUBNAM6= <"">
##$SUBNAM7= <"">
##$SUBNAM8= <"">
##$SUBNAM9= <"">
##$SW= 369.568048894756
##$SWIBOX= (0..15)
0 1 3 0 0 0 0 0 0 0 0 0 0 0 0 0 
##$SW_h= 29940.119760479
##$TD= 32768
##$TD0= 1
##$TE= 0
##$TE2= 300
##$TE3= 300
##$TEG= 300
##$TL= (0..7)
0 120 53 12 22 120 120 120 
##$TP= (0..7)
150 150 150 150 150 150 150 150 
##$TP07= 0
##$TPNAME0= <>
##$TPNAME1= <>
##$TPNAME2= <>
##$TPNAME3= <>
##$TPNAME4= <>
##$TPNAME5= <>
##$TPNAME6= <>
##$TPNAME7= <>
##$TPOAL= (0..7)
0.5 0.5 0.5 0.5 0.5 0.5 0.5 0.5 
##$TPOFFS= (0..7)
0 0 0 0 0 0 0 0 
##$TUNHIN= 0
##$TUNHOUT= 0
##$TUNXOUT= 0
##$USERA1= <user>
##$USERA2= <user>
##$USERA3= <user>
##$USERA4= <user>
##$USERA5= <user>
##$V9= 5
##$VALIST= <valist>
##$VCLIST= <CCCCCCCCCCCCCCC>
##$VD= 0
##$VDLIST= <DDDDDDDDDDDDDDD>
##$VPLIST= <PPPPPPPPPPPPPPP>
##$VTLIST= <TTTTTTTTTTTTTTT>
##$WBST= 1024
##$WBSW= 4
##$XGAIN= (0..3)
0 0 0 0 
##$XL= 0
##$YL= 0
##$YMAX_a= 35363
##$YMIN_a= -23530
##$ZGOPTNS= <>
##$ZL1= 120
##$ZL2= 120
##$ZL3= 120
##$ZL4= 120
##$ABSF1= 182.463
##$ABSF2= -187.1042
##$ABSG= 5
##$ABSL= 3
##$ALPHA= 0
##$AQORDER= 0
##$ASSFAC= 0
##$ASSFACI= 0
##$ASSFACX= 0
##$ASSWID= 0
##$AUNMP= <proc_1d>
##$AZFE= 0.1
##$AZFW= 0.5
##$BCFW= 0
##$BC_mod= 2
##$BYTORDP= 0
##$COROFFS= 0
##$CY= -3
##$DATMOD= 1
##$DC= 0
##$DFILT= <>
##$DTYPP= 0
##$F1P= 0
##$F2P= 0
##$FCOR= 1
##$FTSIZE= 65536
##$FT_mod= 6
##$GAMMA= 0
##$GB= 0
##$INTBC= 1
##$INTSCL= 5.30512e-09
##$ISEN= 30
##$LB= 1
##$LEV0= 0
##$LPBIN= 0
##$MAXI= 10000
##$MC2= 0
##$MEAN= 0
##$ME_mod= 0
##$MI= 50
##$NCOEF= 0
##$NC_proc= -7
##$NLEV= 6
##$NOISF1= 182.463
##$NOISF2= 159.3651
##$NSP= 0
##$NTH_PI= 0
##$NZP= 0
##$OFFSET= 182.463
##$PC= 4
##$PHC0= -1673.706
##$PHC1= 134.6012
##$PH_mod= 1
##$PKNL= yes
##$PPARMOD= 0
##$PSCAL= 0
##$PSIGN= 0
##$REVERSE= no
##$SF= 81.0140089999434
##$SI= 65536
##$SIGF1= 159.3651
##$SIGF2= -187.1042
##$SINO= 113.3802
##$SIOLD= 16384
##$SREGLST= <1H.CDCl3>
##$SSB= 0
##$STSI= 65536
##$STSR= 0
##$SW_p= 29940.119760479
##$SYMM= 0
##$S_DEV= 0
##$TDeff= 32768
##$TDoff= 0
##$TI= <>
##$TILT= no
##$TM1= 0
##$TM2= 0
##$TOPLEV= 0
##$USERP1= <user>
##$USERP2= <user>
##$USERP3= <user>
##$USERP4= <user>
##$USERP5= <user>
##$WDW= 1
##$XDIM= 65536
##$YMAX_p= 291086686
##$YMIN_p= -71375022
$$ End of Bruker specific parameters
$$ ---------------------------------
##NTUPLES= NMR SPECTRUM
##VAR_NAME=  FREQUENCY,     SPECTRUM/REAL,   SPECTRUM/IMAG
##SYMBOL=    X,             R,               I
##VAR_TYPE=  INDEPENDENT,   DEPENDENT,       DEPENDENT
##VAR_FORM=  AFFN,          ASDF,            ASDF
##VAR_DIM=   65536,         65536,           65536
##UNITS=     HZ,            ARBITRARY UNITS, ARBITRARY UNITS
##FACTOR=    0.456856943014862, 1,           1
##FIRST=     14782.0589164792, 0,            0
##LAST=      -15158.0608439998, 0,           0
##MIN=       -15158.0608439998, -71375022,   0
##MAX=       14782.0589164792, 291086686,    0
$$ Real data points
##PAGE= N=1
##DATA TABLE= (X++(R..R)), XYDATA
$$ [...]
46445a59325J009093k901389p245245q773907n644342q05797K407597N519919
$$ -159325 849768 -2051621 -9296866 -18070773 -23715115 -24520912 -22113315 -16593396
46437a6593396J0249677J1730715M352242o961535j0306581k678973O064099P426102
$$ -16593396 -6343719 5386996 9739238 2777703 -7528878 -10207851 -4143752 3282350
46429C282350M451391L818466M840214K122843n010208j1150290j1161056m950359
$$ 3282350 7733741 11552207 16392421 18515264 13505056 2354766 -8806290 -13756649
46421a3756649K459925M438171r07493p167971o122334J613885P152879N518153
$$ -13756649 -11296724 -6858553 -7766046 -14934017 -21056351 -19442466 -12289587 -6771434
46413f771434J490829J120804L505857M625821L826650K078898j293604n239608
$$ -6771434 -5280605 -4159801 -653944 3971877 7798527 9877425 8583821 3344213
46405C344213m866637J655141P797938O425464Q0041k817217j44728K211781K51363
$$ 3344213 -1522424 132717 7930655 14356119 14436160 11618943 11474215 13685996 13937359
46396A3937359l068076l665276j834348N0552J374754K640746L521366L347697
$$ 13937359 10869283 7204007 5369659 5420211 6794965 9435711 12957077 16304774
46388A6304774K144460L40623j535988k849050l544262m308819n028640m307596
$$ 16304774 18449234 18789857 17253869 14404819 10860557 6551738 1523098 -2784498
46380b784498j915721k3862l3133r9011J549383K820646Q70292k505006k940957
$$ -2784498 -4700219 -4724081 -4757214 -4856225 -3306842 -486196 384096 -2120910 -5061867
46371e061867m03446P47388q64791j099664K788320O974456O248155J511796j990604
$$ -5061867 -5465313 -4717925 -5582716 -6682380 -3894060 3080396 9328551 10840347 8849743
46362H849743k476988l115464n423610n774492j133024M960549O328726K682583
$$ 8849743 6372755 3257291 -2166319 -7940811 -9073835 -4113286 2215440 4898023
46354D898023o10327j272333k788082o203813n861230J177653P038559K942749
$$ 4898023 4287696 3015363 227281 -5976532 -11837762 -10660109 -3621550 -678801
46346f78801n947554o157538L772588J0242387N162756k172680q58525M385737
$$ -678801 -6626355 -12783893 -9011305 1231082 6393838 4221158 3362633 7748370
46338G748370K381681n458585p999243k773511J518088O91683Q26470N477916
$$ 7748370 10130051 4671466 -3327777 -6101288 -4583200 -3891517 -3065047 2412869
46330B412869Q005227K190625p256976j1007642p019652q54870K549565K952421
$$ 2412869 10418096 12608721 5351745 -5655897 -12675549 -13530419 -10980854 -8028433
46322h028433K647397L358694M310091K705575j956154n099066k711711J424778
$$ -8028433 -5381036 -2022342 2287749 4993324 3037170 -2061896 -4773607 -3348829
46314c348829M03068m240222l815559L042082O644174J475987m194795j308222
$$ -3348829 -2945761 -7185983 -11001542 -7959460 -1315286 160701 -4034094 -5342316
46306e342316N399878N521314j78893k414211L17177L89269l990680m693827J954950
$$ -5342316 57562 5578876 5399983 2985772 3302949 3692218 -298462 -4992289 -3037339
46297c037339P197952K472186p460063j1213985n997997Q36642K941556J234855
$$ -3037339 4160613 6632799 -827264 -12041249 -18039246 -17202604 -14261048 -13026193
46289a3026193l73171k45216Q16771J291991k3157k618428l762075j341217K800766
$$ -13026193 -13399364 -13644580 -12827809 -11535818 -11558975 -14177403 -17939478 -19280695 -16479929
46280a6479929M460066K394338N8001R60740L780179L952289p8353m170481l365987
$$ -16479929 -12019863 -9625525 -9567524 -8606784 -4826605 -874316 -952669 -5123150 -8489137
46271h489137J709132N670581N540673M018040M189844M396426J810662j471476
$$ -8489137 -6780005 -1109424 4431249 8449289 12639133 17035559 18846221 17374745
46263A7374745j072761J805610J087391m543184q598744o286660j831396j822062
$$ 17374745 16301984 18107594 19194985 14651801 6053057 -233603 -2064999 -3887061
46255c887061n207095n526743r45717L744427M648036L125906K082797K145976
$$ -3887061 -9094156 -14620899 -15566616 -11822189 -7174153 -4048247 -1965450 180526
46247A80526K572817K716679J828621P9737k64115K198395M300891J645203m327867
$$ 180526 2753343 5470022 7298643 7378380 7114265 9312660 13613551 15258754 10930887
46238A0930887p338284n092217j951227j246281o15126K066116L743966J679168
$$ 10930887 3592603 -1499614 -3450841 -4697122 -5312248 -3246132 497834 2177002
46230B177002q64251J26667K216865O45604l162364l816977j026594L81107j056657
$$ 2177002 1312751 1439418 3656283 4301887 1139523 -2677454 -3704048 -3322941 -4379598
46221d379598j762094m72886o47137l771393o149139m908509k310289j274556
$$ -4379598 -6141692 -6614578 -7261715 -11033108 -17182247 -22090756 -24401045 -25675601
46213b5675601p26512J696370N459140Q081354P875639M621726L63867m07053
$$ -25675601 -26402113 -24705743 -19246603 -11165249 -3289610 1332116 1695983 1288930
46205A288930M254971Q471982M318307n895762j0472731m691895J469801k225477
$$ 1288930 5543901 14015883 18334190 12438428 1965697 -2726198 -1256397 -3481874
46197c481874j0987033j2240541l632971N202843O985351M404766L254888N014945
$$ -3481874 -14468907 -26709448 -30342419 -25139576 -18154225 -13749459 -10494571 -5479626
46189e479626P612804Q471244N672241k06747n260635o370883n142506m539228
$$ -5479626 2133178 10604422 16276663 16069916 10809281 4438398 -704108 -5243336
46181e243336l863417j427158M28311j324301m100719l025233J020429L203326
$$ -5243336 -9106753 -10533911 -10105600 -11429901 -15530620 -18555853 -17535424 -14332098
46173a4332098L091115M031671N502881M121309J467495J986765L276497j456821
$$ -14332098 -11240983 -7209312 -1706431 2414878 3882373 5869138 9145635 7688814
46165G688814j0178825j2253405m731539K764012L713234L565819O672218O537643
$$ 7688814 -2490011 -14743416 -19474955 -16710943 -12997709 -9431890 -2759672 3777971
46157C777971j241237p162834j609914P579914N721078n381702r856869k116913
$$ 3777971 2536734 -4626100 -6236014 1343900 7064978 1683276 -8173593 -10290506
46149a0290506O113343N163522L31514K18007K809945O05510o724199j1680607
$$ -10290506 -4177163 986359 1317873 1535880 4345825 4951335 -1772864 -13453471
46141a3453471q243994K186295J2356755J4918962Q794016L85448l705644l964776
$$ -13453471 -21697465 -19511170 -7154415 7764547 16558563 16944011 13238367 9273591
46133I273591m644922n807252m593255k427933l157065m499996j08138Q668562
$$ 9273591 4628669 -1178583 -5771838 -8199771 -11356836 -15856832 -15964970 -7296408
46125g296408J2103884O032572k088593m837502m109383l922909k469670J965199
$$ -7296408 4807476 10840048 8751455 3913953 -195430 -4118339 -6588009 -4622810
46117d622810M596185J579509k122749n11044L151331K584846J06914J857116
$$ -4622810 -26625 1552884 -569865 -1080909 2070422 4655268 4762182 6619298
46109F619298N190793K442543m394879n156971J464122M758504o78679o115675
$$ 6619298 11810091 14252634 9857755 4700784 6164906 10923410 10244731 4129056
46101D129056l132163L240115L849501r6661j260959O88977J92675l005640l630250
$$ 4129056 996893 4237008 8086509 7989848 6728889 7417866 7610541 4604901 974651
46092I74651j050126n99536l753060n005444r68474M000618M469122J208795j430429
$$ 974651 -75475 -675011 -4428071 -9433515 -10401989 -6401371 -1932249 -723454 -2153883
46083b153883j594400m91235J14343j149960l982602m833247l04062O652266Q636313
$$ -2153883 -3748283 -4239518 -4125175 -5275135 -9257737 -14090984 -14395046 -7742780 893533
46074H93533L832078j234020j684742o82434j472412k45233N695719R045647K133894
$$ 893533 4725611 3491591 1806849 1124415 -347997 -593230 5102489 14148136 16282030
46065A6282030q525405r413415m87042M611195K99580l028870J955248O484811
$$ 16282030 7756625 -1656790 -2143832 2467363 2766943 -261927 1693321 8178132
46057H178132J374338n972819l561392M259119L429920o039660r373815q95662
$$ 8178132 9552470 3579651 18259 4277378 7707298 1667638 -7706177 -8601839
46049h601839P059613L954799l764196n130004j386996k81713j560610M38472
$$ -8601839 -1542226 2412573 -1351623 -6481627 -7868623 -8150336 -9710946 -9272474
46041i272474M257795L033489k660457m670920j005178N96282l706640o086966
$$ -9272474 -5014679 -1981190 -4641647 -9312567 -10317745 -9721463 -13428103 -19515069
46033a9515069O25862J0064971J0640770K862570j634415J985636N030992q474
$$ -19515069 -18889207 -8824236 1816534 4679104 3044689 5030325 10061317 10052843
46025A0052843p118771o371773L78797K956249q47546k976457L69812K478904
$$ 10052843 2934072 -3437701 -3058904 -102655 -950201 -3926658 -3556846 -1077942
46017a077942j686913o320687m321378J170047K714239P98276J347398M394644
$$ -1077942 -2764855 -9085542 -13406920 -12236873 -9522634 -8724358 -7376960 -2982316
46009b982316M379705L39693k733979k312949l52888K508799O586921P486812
$$ -2982316 1397389 1737082 -996897 -3309846 -3662734 -1153935 5432986 12919798
46001A2919798K83840r856724j1459724l520661K028683j402979n300494r37099
$$ 12919798 13203638 3346914 -8112810 -11633471 -9604788 -11007767 -16308261 -17245360
45993a7245360O464580P505207L827023K755945L339763k09827n261066l588800
$$ -17245360 -10780780 -3275573 551450 3307395 6647158 6437331 1176265 -2412535
45985b412535L846323O919063J971095l403007l340829j435078j885151k025580
$$ -2412535 1433788 8352851 10323946 6920939 3580110 2145032 259881 -1765699
45977a765699R91357L264939K85708m754197n084346j82066L971155L393195M52644
$$ -1765699 -774342 2490597 2776305 -1977892 -7062238 -7244304 -3273149 120046 572690
45968E72690n34118R17672J365067j672977n862880o371662k265098J614413Q51638
$$ 572690 38572 956244 2321311 648334 -5214546 -11586208 -13851306 -12236893 -11385255
45959a1385255k696326l848361q21997L998719P784866Q312433M020947k590271
$$ -11385255 -14081581 -17929942 -18751939 -14753220 -6968354 1344079 5365026 2774755
45951B774755m631390M91725N065466Q63035p639208q761265j066937M992026
$$ 2774755 -1856635 -1364910 3700556 4563591 -3075617 -11836882 -12903819 -7911793
45943g911793L471096r4584o58938j055769k574597L25275Q321847J0684869M22949
$$ -7911793 -4440697 -4535281 -5194219 -6249988 -8824585 -8499310 -177463 10507406 10930355
45934A0930355j2256931j2832120k643088N412575O389909N667825M853324m45553
$$ 10930355 -1326576 -14158696 -16801784 -11389209 -4999300 668525 5521849 5076296
45926E076296q109129q296628J222085R426338P114995r33581m606338k395649
$$ 5076296 -3032833 -11329461 -10107376 -681038 6433957 5500376 894038 -1501611
45918a501611m88053k524254n934341o167035j238528N869767Q268865K329739
$$ -1501611 -1989664 -4513918 -10448259 -16615294 -17853822 -11984055 -3715190 -1385451
45910a385451n653951n475040K969973Q329335L231722n977430r263067n775766
$$ -1385451 -7039402 -12514442 -9544469 -1215134 2016588 -3960842 -13223909 -18999675
45902a8999675q32881L626284P933120Q847569L547524l253737m641742k237753
$$ -18999675 -19832556 -16206272 -8273152 574417 4121941 868204 -3773538 -6011291
45894f011291l028047o493320m677816L611393Q619857L891593l606980l718832
$$ -6011291 -9039338 -15532658 -20210474 -16599081 -7979224 -4087631 -7694611 -11413443
45886a1413443K674493O542946L646173k458105p558272r660902o253903L381023
$$ -11413443 -8738950 -2196004 1450169 -1007936 -8566208 -18227110 -24481013 -21099990
45878b1099990J2622461J2179744K953930l059617P88448N385244p14212j2613816
$$ -21099990 -8477529 3702215 6656145 3596528 4384976 9770220 9056008 -3557808
45870c557808j4461019k605442Q206380N644908l506820n196032J254576N221192
$$ -3557808 -18018827 -20624269 -12417889 -6772981 -10279801 -15475833 -14221257 -9000065
45862i000065L231267K553579O058326O256666q08645o594802k983251L826851
$$ -9000065 -5768798 -3215219 2843107 9099773 8291128 1696326 -1286925 2539926
45854B539926K320184o235611r542306k700844N554406O554826K548681J82320
$$ 2539926 4860110 -1375501 -10917807 -13618651 -8064245 -1509419 1039262 1221582
45846A221582L48083k38572k031548k756465k223504k400514l431972k921282
$$ 1221582 1569665 1331093 -700455 -3456920 -5680424 -8080938 -11512910 -14434192
45838a4434192P31068N988980R051749O646512p48667q017747r606232n321246
$$ -14434192 -13703124 -7714144 1337605 7984117 7235450 -782297 -10388529 -15709775
45830a5709775o5130K479182L085299L386181K978197J993425K468255M008727
$$ -15709775 -15774905 -13295723 -10210424 -6824243 -3846046 -1852621 615634 4624361
45822D624361K077923m700769q840617k258195J0704627J5862178O798845o317463
$$ 4624361 6702284 2001515 -6839102 -9097297 1607330 17469508 24268353 17950890
45814A7950890r582744k463774L501453Q23645n538616o775910j838397K928172
$$ 17950890 8368146 5904372 9405825 10229470 4690854 -2085056 -3923453 -995281
45806i95281K910712R7505n79113L148664R012522J1784286O979777m322286j4189646
$$ -995281 1915431 2012936 1433823 4582487 13595009 25379295 32359072 28036786 13847140
45797A3847140j4565093o379277J176152J925181n11179J57156L190597L181293
$$ 13847140 -717953 -7097230 -5921078 -3995897 -4507076 -4349920 -1159323 2021970
45789B021970o37760l485528k568514K09953K940684N334013N274970R9531p038183
$$ 2021970 1384210 -2101318 -4669832 -4459879 -1519195 3814818 9089788 9189319 2151136
45780B151136q356108j877709M974137N674059L071821L226772N664173N265913
$$ 2151136 -6204972 -8082681 -3108544 2565515 5637336 8864108 14528281 19794194
45772A9794194O51553m493949o418630l877373J725535N668840L150887l343108
$$ 19794194 20445747 15951798 9533168 5655795 7381330 13050170 16201057 12857949
45764A2857949m825349J442185N891557K42291q510221p255769L667320J0968436
$$ 12857949 8032600 9474785 15366342 15608633 7098412 -157357 3509963 14478399
45756A4478399P443970l48800m425381m904457m336030j926697K144231M090687
$$ 14478399 21922369 21573569 17148188 12243731 7907701 5981004 8125235 12215922
45748A2215922K602321J349529J762470k27813o138104j0036313o875597n54369
$$ 12215922 14818243 16167772 17930242 17702429 11564325 1528012 -5347585 -5901954
45740e901954J708752q74058l423093k847919l35475J386807M77971k142069k335392
$$ -5901954 -4193202 -5067260 -8490353 -11338272 -11673747 -10286940 -9808969 -11951038 -14286430
45731a4286430K316000P100543N279767j221330l775086q03614q5369m220336
$$ -14286430 -11970430 -4869887 409880 -811450 -4586536 -5390150 -5475519 -9695855
45723i695855m613491L785036J1983724R918528J354302l878240m926529o378664
$$ -9695855 -14309346 -10524310 1459414 11377942 12732244 8854004 3927475 -2451189
45715b451189o323283k71796P403696Q262136L222781k17792j337461m809662
$$ -2451189 -8774472 -9046268 -1642572 6619564 9842345 9624553 8287092 3477430
45707C477430q440661n344363K484699N724538K867376R69238J159468k509078
$$ 3477430 -4963231 -10307594 -7822895 -2098357 769019 1738257 2897725 388647
45699C88647q392558o797521K079041N237366k086622p630440k550974M057472
$$ 388647 -8003911 -14801432 -12722391 -7485025 -9571647 -17202087 -19753061 -15695589
45691a5695589J989554k187750K047144R149339O287747m506126q970545k293336
$$ -15695589 -13706035 -15893785 -13846641 -4697302 1590445 -2915681 -11886226 -14179562
45683a4179562O275781R170366P552380K747785o338679j5154609j4424187l168415
$$ -14179562 -7903781 1266585 8818965 11566750 5228071 -9926538 -24350725 -27519140
45675b7519140P951602J0041988N466294Q84026j912358m109002m806658k676828
$$ -27519140 -19567538 -9525550 -4059256 -3175230 -5087588 -9196590 -14003248 -16680076
45667a6680076Q03692L226602L965366L328234J791523J007451K300652L589396
$$ -16680076 -15876384 -12649782 -8684416 -5356182 -3564659 -2557208 -256556 3332840
45659C332840J657885j997599k290452J255752K580185k017826p592655o910129
$$ 3332840 4990725 2993126 702674 1958426 4538611 2520785 -5071870 -11981999
45651a1981999l3593O253990O807226K592489k070967l720553j464295L016556
$$ -11981999 -12015592 -5761602 1045624 3638113 1567146 -2153407 -3617702 -601146
45643f01146O407411N857270J206261m412923o426908k545756M427403Q512204
$$ -601146 5806265 11663535 12869796 8456873 2029965 -515791 3911612 12423816
45635A2423816O514522J194823k571196l147516j907026J48696K237771J762937
$$ 12423816 18938338 20133161 17561965 14414449 12507423 12656119 14893890 16656827
45627A6656827l061884q344744o881842K461214J1037890R331866j684643j1047080
$$ 16656827 13594943 5250199 -1631643 829571 11867461 21199327 19514684 8467604
45619H467604r924228j099146N130320L390521j249818j250890L040250M854081
$$ 8467604 -1456624 -2555770 2574550 5965071 4715253 3464363 6504613 11358694
45611A1358694J321362l041662l843675k282580q73080Q96876L124079K754414
$$ 11358694 12680056 9638394 5794719 3512139 2639059 3535935 6660014 9414428
45603I414428j116080l701264j518921J371626J16804k289899m63711L234206
$$ 9414428 8298348 4597084 3078163 4449789 4566593 2276694 1812983 5047189
45595E047189L006547J073195M050267R073357N900500n355488j1378563n580043
$$ 5047189 8053736 9126931 13177198 22250555 28151055 22795567 11417004 5836961
45587E836961J101034k553328j0270481q838686P45475N685925J931484q92729
$$ 5836961 6937995 4384667 -5885814 -14724500 -13979025 -8293100 -6361616 -7254345
45579g254345L587231Q220883M052626n750385j0479062o273442M89256K976193
$$ -7254345 -3667114 4553769 8606395 2856010 -7623052 -13896494 -13407238 -10431045
45571a0431045J677637J240723L123690M291987K411085m91400j014918M86532
$$ -10431045 -8753408 -7512685 -4388995 -97008 2314077 1822677 807759 1294291
45563A294291L27512k887780n684825m234333L11057L138179J874597o56113l46063
$$ 1294291 1621803 -1265977 -6950802 -11185135 -10874078 -7735899 -5861302 -6517415 -6863478
45554f863478K805324M611831K073964k677036n210669m422050k662465p64408
$$ -6863478 -4058154 553677 2627641 -49395 -5260064 -9682114 -12344579 -13108987
45546a3108987K859128O988919O557679L53406m748624k367332M144387O914248
$$ -13108987 -10249859 -3260940 3296739 3650145 -1098479 -3465811 678576 7592824
45538G592824M695207J734195j370263o452822r103525k469167R034868J1567600
$$ 7592824 12288031 14022226 12651963 6199141 -2904384 -5373551 3661317 15228917
45530A5228917J510024p910795n891477P58966N34551m151448l041033L683185
$$ 15228917 16738941 8828146 2936669 3695635 4230186 78738 -2962295 720890
45522G20890O344161K224975j540290j280442j305974l456751k862639K244490
$$ 720890 7065051 9290026 7749736 6469294 5163320 1706569 -1156070 1088420
45514A088420N496580J975486m103561o138993l970398j289621Q82483L166125
$$ 1088420 6585000 8560486 4456925 -1682068 -5652466 -6942087 -6059604 -2893479
45506b893479M158037K875536K062466M222934O460730M110876j769803n398355
$$ -2893479 1264558 4140094 6202560 10425494 16886224 20997100 19227297 13828942
45498A3828942m455625k505175k359752j773301J373603L225195j639395j0606241
$$ 13828942 9373317 6868142 4508390 2735089 4108692 7333887 5694492 -4911749
45490d911749j3391905m741188P260575J0449058M176080o30457K532722O831882
$$ -4911749 -18303654 -23044842 -15784267 -5335209 -1159129 -1789586 743136 7575018
45482G575018L202104n526459q580300k566650M824171O488540M034520J925462
$$ 7575018 10777122 5250663 -3329637 -5896287 -1072116 5416424 9450944 11376406
45474A1376406r7291l981914o923778m182722K639742N979754K504447j750673
$$ 11376406 11279115 7297201 373423 -3809299 -1169557 4810197 7314644 5563971
45466E563971R9194N318621M918441l138723j0186436q635774k060808J127344
$$ 5563971 5663165 10981786 15900227 12761504 2575068 -6060706 -8121514 -6994170
45458f994170j91242n92876J571936K541943J547116K575497N924000N847468
$$ -6994170 -7185412 -7778288 -6206352 -3664409 -2117293 458204 6382204 12229672
45450A2229672J12499n046422l911358O96581K809011J128720k828498q260061
$$ 12229672 12342171 7295749 3384391 4080972 6889983 8018703 5190205 -3069856
45442c069856j1886311q016380K093118P853863L627730j736113J351243P162572
$$ -3069856 -14956167 -22972547 -20879429 -13025566 -9397836 -11133949 -9782706 -2620134
45434b620134M211675m695077o286051J535820O708367K570399l615687m925146
$$ -2620134 1591541 -3103536 -9389587 -7853767 -1145400 1424999 -2190688 -7115834
45426g115834m762670p403999r289030n944484M87537N747190Q616924Q284597
$$ -7115834 -11878504 -19282503 -28571533 -34516017 -34028480 -28281290 -19664366 -11379769
45418a1379769M134248O93295L829200R351255O145850n280107r756758L9877
$$ -11379769 -7245521 -6552226 -2723026 6628229 12774079 7493972 -2262786 -2222909
45410b222909J0432722O557006n182048p585518J643925Q895840N879112j550567
$$ -2222909 8209813 14766819 9584771 1999253 3643178 12539018 18418130 16867563
45402A6867563n428872n281494m153246l346139k841722j682943J732210N575291
$$ 16867563 11438691 6157197 2003951 -1342188 -4183910 -5866853 -4134643 1440648
45394A440648L993761l750102q060918j122963R559009R823522q97786q947208
$$ 1440648 5434409 1684307 -6376611 -7499574 2059435 11882957 10985171 2037963
45386B037963o272983J26211J293547j102076m57208L569744N560521K588441
$$ 2037963 -4235020 -4108809 -2815262 -3917338 -4374546 -804802 4755719 7344160
45378G344160k296200l578908R81248O868720O357993j711031q333002n234226
$$ 7344160 5047960 1469052 2450300 9319020 15677013 13965982 5632980 398754
45370C98754L426993O758390K284883k577344l033063j808112j126918O76355
$$ 398754 3825747 10584137 12869020 10291676 7258613 5450501 4323583 4999938
45362D999938K418303p12573p543707r203223j944034N855816N099386k021924
$$ 4999938 7418241 6705668 -838039 -10041262 -11985296 -6129480 -1030094 -3052018
45354c052018p082255o687358k823905K690504P651435P734769J871459l978690
$$ -3052018 -10134273 -16821631 -19645536 -16955032 -9303597 -1568828 302631 -3676059
45346c676059m255031j469899n62910K25483N128335J0518481Q034248k095379
$$ -3676059 -7931090 -9400989 -9963899 -9738416 -4610081 5908400 13942648 11847269
45338A1847269r390956o775455R17062M773967K557920j575625l694020k846895
$$ 11847269 2456313 -4319142 -3402080 1371887 3929807 2354182 -1339838 -4186733
45330d186733j88895J531127k20631m009760m802572p18818L041902P61642m900473
$$ -4186733 -4375628 -2844501 -3065132 -7074892 -11877464 -12596282 -9554380 -8792738 -13693211
45321a3693211n450531J497968P720464M800224m336842q880068l945754M075979
$$ -13693211 -19143742 -17645774 -9925310 -5125086 -9461928 -18341996 -22287750 -18211771
45313a8211771O891303M258800J622690J411129J303822j62223r49705P26679
$$ -18211771 -11320468 -7061668 -5438978 -4027849 -2724027 -2886250 -3835955 -3109276
45305c109276L233157L553358P73389l414823o559864p192617n381472j960347
$$ -3109276 123881 3677239 4450628 1035805 -5524059 -12716676 -18098148 -20058495
45297b0058495K380923O357760P271277L638876j395995l138316k515636m918530
$$ -20058495 -17677572 -11319812 -4048535 -409659 -1805654 -4943970 -7459606 -12378136
45289a2378136r886088q887933J677866J2231878J2495128O349635M332027N994396
$$ -12378136 -22264224 -31152157 -29474291 -17242413 -4747285 1602350 5934377 11928773
45281A1928773K311214o354361r024522k618292K264374j193264n529136k793007
$$ 11928773 14239987 7885626 -1138896 -3757188 -1492814 -2686078 -8215214 -11008221
45273a1008221K548861K933859J95703n30265r33504l671959l937413K308165
$$ -11008221 -8459360 -5525501 -5329798 -5860063 -6793567 -10465526 -14402939 -12094774
45265a2094774P987975M430365l556703m130732L362674Q645929O952827L194159
$$ -12094774 -4106799 323566 -3233137 -7363869 -4001195 4644734 11597561 14791720
45257A4791720N32163l131106o558172m641639J464501M037068R42076j677404
$$ 14791720 15323883 12192777 5634605 992966 2457467 6494535 7436611 5759207
45249E759207j112821k183939o352626p190897j641499L683858L291547J375681
$$ 5759207 4646386 2462447 -3890179 -11081076 -12722575 -9038717 -5747170 -4371489
45241d371489L250459O028195M897758J855672P52709k67453l540436m593379
$$ -4371489 -1121030 4907165 9804923 11660595 12413304 12145851 8605415 4012036
45233D012036J148092Q397639P857000k51089o943568p343496m695149k272140
$$ 4012036 5160128 13557767 21414767 21163678 14220110 6876614 2181465 -90675
45225i0675M66757K795112J232837m550286r662040r724577m748366L034011J0502632
$$ -90675 376082 3171194 4404031 -146255 -9808295 -19532872 -24281238 -21247227 -10744595
45216a0744595J2848054P394784o75297k574804K129105M233018j235596o751361
$$ -10744595 2103459 9498243 8822946 6248142 8377247 12610265 11374669 4623308
45208D623308l669543L801807M308904l620521r438765o186596L33490J650000
$$ 4623308 953765 4755572 9064476 5443955 -3994810 -10181406 -9847916 -8197916
45200h197916j129041j268911J884708K764489j07286j228885K709152O865829
$$ -8197916 -9326957 -10595868 -8711160 -5946671 -6053957 -7282842 -4573690 2292139
45192B292139N123385j085370m972877l073751K146516O831521Q991961P746689
$$ 2292139 7415524 6330154 1357277 -1716474 430042 7261563 16253524 24000213
45184B4000213K919385l795552r120472j0125737n701448K038801O934608K977623
$$ 24000213 26919598 23124046 14003574 3877837 -1823611 215190 7149798 10127421
45176A0127421p471313j3092673o248879O163727J0573965M123670k910198k366194
$$ 10127421 2656108 -10436565 -16685444 -10521717 52248 4175918 1265720 -1100474
45168a100474J937241K413427j101147l268360j872453N37231J187518n71940
$$ -1100474 836767 3250194 2149047 -1119313 -2991766 -2454535 -1267017 -1838957
45160a838957l673753n422867l208072J844459N355746N331928L979595K437488
$$ -1838957 -5512710 -10935577 -14143649 -12299190 -6943444 -1611516 2368079 4805567
45152D805567j483863p377620r265550l414920M801497P292105L649322j47207
$$ 4805567 3321704 -4055916 -13321466 -16736386 -11934889 -4642784 -993462 -1140669
45144a140669r09995l65471J60292J162445J664260J7956j955790n40392L788347
$$ -1140669 -2050664 -2416135 -2255843 -1093398 570862 588818 -1366972 -1907364 1880983
45135A880983O156971L668771j608465o002779p088924l764041K368092N969790
$$ 1880983 8037954 11706725 10098260 4095481 -2993443 -6757484 -4389392 1580398
45127A580398K853011l673840n563318O1984P498823R715166N481160j419477
$$ 1580398 4433409 759569 -4803749 -4741765 2757058 12472224 17953384 16533907
45119A6533907o498547p013670l235487J487345L948697M408522M601812L725410
$$ 16533907 10035360 3021690 -213797 1273548 5222245 9630767 14232579 17957989
45111A7957989J11120l984070l955797M22294M145669L639499M91273k151190
$$ 17957989 18069109 14085039 10129242 10551536 14697205 18336704 18827977 16676787
45103A6676787l290522l483361l643904m589135n101493j914494M584100P273449
$$ 16676787 13386265 9902904 6259000 1669865 -3431628 -5346122 -762022 6511427
45095F511427J065121p406649p018572J626905O623142K311219l926263n265087
$$ 6511427 7576548 169899 -6848673 -5221768 1401374 3712593 -213670 -5478757
45087e478757m777372n656860k960526O190874J2984128Q235302k552324o490001
$$ -5478757 -10256129 -15912989 -18873515 -12682641 301487 8536789 5984465 -505536
45079e05536j959486R55682l069439q173848p609259j641620N820155J1184642
$$ -505536 -2465022 -1509340 -4578779 -12752627 -20361886 -22003506 -16183351 -4998709
45071d998709J1087496N036390j386336k183016M41875j70417l418258j829147
$$ -4998709 6088787 11125177 9738841 7555825 7997700 7827283 4409025 2579878
45063B579878N828195J0488144N119863n722625j2314584j0482710l175826L686520
$$ 2579878 8408073 18896217 24016080 18293455 5978871 -4503839 -7679665 -3993145
45055c993145M602366j426904q250386q590752l405269M43399J630359N121169
$$ -3993145 609221 -817683 -9068069 -17658821 -21064090 -20620691 -18990332 -13869163
45047a3869163J0442045R756539J733336l459561J70179L914988j280581q992360
$$ -13869163 -3427118 6329421 8062757 4603196 4773375 8688363 7407782 -1584578
45039a584578p526632R15924M609537J451546m95165M73004k124663p310207m845895
$$ -1584578 -9111210 -8195286 -3585749 -2134203 -2629368 -2156364 -4281027 -11591234 -16437129
45030a6437129O174448J1509095K766948q115447o271536L842895O708720J39332
$$ -16437129 -10262681 1246414 4013362 -4102085 -10373621 -6530726 177994 317326
45022C17326l300371K095895O563674J526897o682594o831306P79273N922443
$$ 317326 -2983045 -887150 5676524 7203421 520827 -6310479 -5531206 391237
45014C91237L068421l044574n862152m662574k018900J536123O445000R901923
$$ 391237 3459658 415084 -5447068 -10109642 -12128542 -10592419 -4147419 5754504
45006E754504P356701q30389p698946p207664j462072K528177J858572l60200
$$ 5754504 13111205 12280816 4581870 -2625794 -4087866 -1559689 298883 -61317
44998f1317j420006k268740l180089j494585L100920N505205J977540l261176
$$ -61317 -1481323 -3750063 -6930152 -8424737 -5323817 181388 2158928 -1102248
44990a102248l413923J098982L877285K369969M37249J015960K148978J627712
$$ -1102248 -4516171 -3417189 460096 2830065 3267314 4283274 6432252 8059964
44982H059964L64905p16266k506730m391403l520634L33384L425021L856845M234438
$$ 8059964 8424869 7708603 5201873 810470 -2710164 -2376780 1048241 4905086 9139524
44973I139524N766888M785375p34314n841325n136173j043037K67704j479982
$$ 9139524 14906412 19691787 18957473 13116148 7979975 6936938 7204642 5724660
44965E724660j368288J985626M713315M246276J945153o78190l151138l674824
$$ 5724660 4356372 6341998 11055313 15301589 17246742 16568552 13417414 9742590
44957I742590q66341K281357J635398j123008q79649J705559P49952m075855n698546
$$ 9742590 8876249 11157606 12793004 11669996 10790347 12495906 13245858 9170003 3471457
44948C471457j545018J278542k048913m883990L69219Q585897Q286213j266036
$$ 3471457 1926439 3204981 1156068 -3727922 -3358703 5227194 13513407 12247371
44940A2247371q932247p431740j489735J594288J975754L782378O600902N635073
$$ 12247371 3315124 -4116616 -5606351 -4012063 -2036309 1746069 8346971 13982044
44932A3982044j026754q950022j1685876p210404M43163N600697O264855M441235
$$ 13982044 12955290 4005268 -7680608 -14891012 -14447849 -8847152 -2582297 1858938
44924A858938K265450J00563j689468k128811j601203j492079j116828J377666
$$ 1858938 4124388 4224951 2535483 406672 -1194531 -2686610 -3803438 -2425772
44916b425772M181668K797623k219555m285378r32637J426338j901480n099285
$$ -2425772 1755896 4553519 2333964 -1951414 -2884051 -1457713 -3359193 -8458478
44908h458478j345298M517219K913409m244072n747722J069037O300438L349410
$$ -8458478 -9803776 -5286557 -2373148 -6617220 -12364942 -11295905 -4995467 -1646057
44900a646057j919774k080133J112552K445847K145954K760299K948262O84986
$$ -1646057 -3565831 -5645964 -4533412 -2087565 58389 2818688 5766950 6451936
44892F451936j646612j126897K50117o68134k047339m0855M251626N898542L140991
$$ 6451936 4805324 3678427 3928544 3260410 1213071 1172216 5423842 11322384 14463375
44883A4463375q87915k956466l014533k689794k556294j372181J832172M489005
$$ 14463375 13575460 10618994 7604461 4914667 2358373 986192 2818364 7307369
44875G307369J570314p050276j2938404q425593J985354O671502K737391j644713
$$ 7307369 8877683 1827407 -11110997 -19536590 -17551236 -10879734 -8142343 -9787056
44867i787056j160588M37049L71741K026578N380406L460685m749259q752162
$$ -9787056 -10947644 -10510595 -10138854 -8112276 -2731870 728815 -4020444 -12772606
44859a2772606k729418L268177o09277o634640k027827R054463J2047356N416217
$$ -12772606 -15502024 -12233847 -12843124 -19477764 -21505591 -12451128 -403772 5012445
44851E012445O00946J049617r70907o264154n413050K682545N974854n38543n283034
$$ 5012445 5613391 6663008 5692101 -572053 -5985103 -3302558 2672296 2133753 -3149281
44842c149281M22984P152796K915379p000339q624979n83542N966379M707102
$$ -3149281 -2726297 4426499 7341878 341539 -8283440 -8866982 -2900603 1806499
44834A806499m3104l202187m515560m133537q61137L614259M616700N88648m135456
$$ 1806499 1763395 -1438792 -5954352 -10087889 -10949026 -7334767 -2718067 -2129419 -6264875
44825f264875m081824J306728O592665N290976k607090q657714m877339N704156
$$ -6264875 -10346699 -9039971 -2447306 2843670 236580 -8421134 -13298473 -7594317
44817g594317J2140164R323878K656017j728629l779245m205242r00989M506642
$$ -7594317 4545847 13869725 16525742 14797113 11017868 6812626 5911637 10418279
44809A0418279M573235k874144q456235l812714N265824O989396O33508l884069
$$ 10418279 14991514 12117370 3661135 -151579 5114245 12103641 12737149 8853080
44801H853080j303501L125391K983035j530388o039140o950925l500774J417598
$$ 8853080 7549579 10674970 13658005 12127617 6088477 -862448 -4363222 -2945624
44793b945624L067913K99194l010602m338156n843563p634605m083204O432908
$$ -2945624 122289 421483 -2589119 -6927275 -12770838 -20405443 -24488647 -18055739
44785a8055739J4156599R630581j432648n343378J39129M777304L180416R04526
$$ -18055739 -3899140 5731441 4298793 -1044585 -905456 3871848 7052264 7956790
44777G956790J575974R8195o312985j0428466n548032L137415N372232J63340
$$ 7956790 9532764 9630959 3317974 -7110492 -12658524 -9521109 -4148877 -3985537
44769c985537l714630l06168O034226O971134J073702m350134l011029J333536
$$ -3985537 -7700167 -8006335 -1972109 4999025 6072727 1722593 -1288436 45100
44761D5100J67525n962950o609549K194231R477623M974650m529756n649264M97778
$$ 45100 212625 -5750325 -12359874 -10165643 -688020 4286630 -243126 -5892390 -5394612
44752e394612J496746m676135o642955M41191P004614N509955J303273P91922
$$ -5394612 -3897866 -8574001 -15216956 -14775765 -7771151 -2261196 -957923 -166001
44744a66001P78327k746084n395584k490569J754085J285772k179216l656959
$$ -166001 612326 -2133758 -7529342 -10019911 -8265826 -6980054 -9159270 -12816229
44736a2816229k669190l37935M400202R526358Q341499j60081o817290n088511
$$ -12816229 -15485419 -15823354 -11423152 -1896794 6444705 6284624 -532666 -5621177
44728e621177l17122J046785K175237O512872P339349j036406r533226n951889
$$ -5621177 -5938299 -4891514 -2716277 3796595 11135944 10099538 566312 -5385577
44720e385577M898130P437063j214811q467764o164412L23226L804930M086565
$$ -5385577 -487447 6949616 5734805 -2732959 -8897371 -8574145 -4769215 -682650
44712f82650L261661K050669K010220L181074P08843p292123j1682785l726844
$$ -682650 2579011 4629680 6639900 9820974 10529817 3237694 -8445091 -12171935
44704a2171935Q452029R054753j261387o489328r62110L714948O89978j619810
$$ -12171935 -3719906 5334847 4073460 -2415868 -3377978 336970 1026948 -592862
44696e92862K272218M033469j578742n387952j016286J979895m068812q467240
$$ -592862 1679356 5712825 4134083 -1253869 -2270155 -290260 -4359072 -12826312
44688a2826312j61781J0185153N676491q214159j1808141k873853K118067k563864
$$ -12826312 -12988093 -2802940 2873551 -5340608 -17148749 -20022602 -17904535 -20468399
44680b0468399l727300N342226J2036624N839564m165461m522479K374985N295945
$$ -20468399 -24195699 -18853473 -6816849 -977285 -5142746 -9665225 -7290240 -1994295
44672a994295K417011N14190J505789R10677k775619n934299n957130l341502
$$ -1994295 422716 936906 2442695 3353372 577753 -5356546 -11313676 -14655178
44664a4655178Q61619M789168N154048J518173j302192M59979L710012L624263
$$ -14655178 -13793559 -9004391 -3850343 -2332170 -3634362 -3174383 535629 4159892
44656D159892J252639M70330N28017j761659m764455m275685j714039k268392
$$ 4159892 5412531 5882861 6410878 4649219 -115236 -4390921 -6104960 -8373352
44648h373352n105145l793687K289297N811914L869605L544770R366616J3462696
$$ -8373352 -13478497 -17272184 -14982887 -9170973 -5301368 -1756598 7610018 21072714
44640B1072714P044364m091356o551221M97615L930544l256697j1812741j1023799
$$ 21072714 28117078 24025722 17474501 17972116 21902660 18645963 6833222 -4190577
44632d190577l992787m72671j564283j116551J740673J873573j060382j162008
$$ -4190577 -8183364 -8656035 -10220318 -11336869 -9596196 -7722623 -8783005 -9945013
44624i945013K787300M060040p69803n201823k731477K856056L649518j90226
$$ -9945013 -7157713 -3097673 -3867476 -9069299 -11800776 -8944720 -5295202 -5485428
44616e485428j527907K430516O604529N769300N47538n031549p931596p162457
$$ -5485428 -7013335 -4582819 2021710 7791010 8338548 3306999 -4624597 -11787054
44608a1787054l509286P35335L444392M223094L474105J428460m45966M14136
$$ -11787054 -15296340 -14561005 -11116613 -6893519 -3419414 -1990954 -2436920 -2022784
44600b022784L633676M854866K069379k59069J940341M694301J775380m144018
$$ -2022784 1610892 6465758 8535137 8276068 10216409 14910710 16686090 12542072
44592A2542072m373832J903472N418879P39287n721545n680791k05489M025417
$$ 12542072 8168240 10071712 15490591 16229878 10508333 4827542 4622053 8647470
44584H647470M226625J978799j362116m317721l929616o672K346360m84350m371697
$$ 8647470 12874095 14852894 13490778 9173057 5243441 5236769 7583129 7098779 2727082
44575B727082l439780N79006J300223j914096l406806p99874J357987j193965
$$ 2727082 -712698 -133692 1166531 -747565 -4154371 -4954245 -3596258 -4790223
44567d790223o440792q916031n350245K950829J0557715J1325759M629406k694184
$$ -4790223 -11231015 -20147046 -25497291 -22546462 -11988747 -662988 3966418 1272234
44559A272234m019116r03191P26407n3183M18639K304201J998717k33214k6788
$$ 1272234 -2746882 -3650073 -2923666 -2976849 -2558210 -254009 1744708 1511494 1484706
44550A484706K818866L698154K337020L880763P905242N876917m746685j2740876
$$ 1484706 4303572 8001726 10338746 14219509 22124751 28001668 23254983 10514107
44542A0514107p793925L621872O747836j118790q689802p349998k95937N227101
$$ 10514107 2720182 6342054 13089890 11971100 3281298 -4068700 -4364637 862464
44534H62464O400253L775412j338056n764161n785343k059382M32781j059964
$$ 862464 7262717 11038129 9700073 3935912 -1849431 -3908813 -3476032 -4535996
44526d535996l864153m353913k358454P8011J587939K096541K493279L835612
$$ -4535996 -8400149 -12754062 -15112516 -15034505 -13446566 -11350025 -8856746 -5021134
44518e021134N253128L819134j119341n309009m605336p47294J773622K464236
$$ -5021134 231994 4051128 2931787 -2377222 -6982558 -7729852 -5956230 -3491994
44510c491994L546546L951760P89283l996724m813684m73614M530243O612146
$$ -3491994 54552 4006312 4795595 798871 -4014813 -4488427 41816 6653962
44502F653962N335190J24754q114822j2665831o747024N464712J1937718Q321737
$$ 6653962 11989152 12113906 3999084 -8666747 -15413771 -9949059 1988659 10310396
44494A0310396J793807j885549m795222p497916m859213L134502P200190K624380
$$ 10310396 12104203 10218654 5423432 -2074484 -6933697 -3799195 3400995 6025375
44486F025375k631006j539767N32057k491825m587399J344737Q577254O791412
$$ 6025375 3394369 1854602 2386659 -105166 -4692565 -3347828 5229426 12020838
44478A2020838J16879m98105K606724j389874r960777r125025K056477P660862
$$ 12020838 12137717 11639612 14246336 12856462 2895685 -6229340 -4172863 3487999
44470C487999m1150r072498q222206l075820k219074j687236M696699J0608914
$$ 3487999 3446849 -5625649 -13847855 -16923675 -19142749 -20829985 -16133286 -5524372
44462e524372O636048k773852n281912M00193L981430M42348l837043k646586
$$ -5524372 1111676 -1662176 -6944088 -6543895 -2562465 -2120117 -5957160 -8603746
44454h603746J578981L490059K522879J551971J612222J117043p78729k120296
$$ -8603746 -7024765 -3534706 -1011827 540144 2152366 3269409 2490680 370384
44446C70384n39352K589611K949670l6153j058229K303304L153899m572230j3179516
$$ 370384 -168968 2420643 5370313 5334160 4275931 6579235 9733134 5160904 -8018612
44437h018612r778607L102012R005188K160430l865905J692560J0241462R277954
$$ -8018612 -17797219 -14695207 -5690019 -3529589 -7395494 -5702934 4538528 13816482
44429A3816482K030553q21911P40005l4849k180765p01600P52818m703974j2848882
$$ 13816482 15847035 15025124 15765129 15730280 13549515 12847915 13600733 8896759 -3952123
44420c952123j3365288o426886p03846K407467P949420J2812542Q216620k771586
$$ -3952123 -17317411 -23744297 -24448143 -22040676 -14091256 -1278714 6937906 4166320
44412D166320o595379o95691K385748l270034p136922j094017O714029O248868
$$ 4166320 -2429059 -3124750 -739002 -4009036 -11145958 -12239975 -5525946 722922
44404G22922J463198J347397M862929N198223J446086l160643p746640j0396199
$$ 722922 2186120 3533517 8396446 13594669 15040755 11880112 4133472 -6262727
44396f262727n825190N014125J0789832M721361l888047l483711J834594O98806
$$ -6262727 -12087917 -7073792 3716040 8437401 4549354 1065643 2900237 3599043
44388C599043n371545m877251L471602Q498371M915027P0655l21271n80204m378704
$$ 3599043 -1772502 -6649753 -3178151 5320220 10235247 10305902 9984631 9404427 5025723
44379E025723o501447k036726M143200M374774n21526l688928k706627j431740
$$ 5025723 -1475724 -3512450 630750 5005524 4483998 795070 -1911557 -3343297
44371c343297k555347l377116n0266O307049R457575M862351l577039o343781
$$ -3343297 -5898644 -9275760 -9326026 -3018977 6438598 11300949 7723910 1380129
44363A380129N9200P468615O267100j464651n212540j258270K936724Q41632m126564
$$ 1380129 1439329 8907944 15175044 13710393 8497853 7239583 10176307 11017939 6891375
44354F891375n225281j878161K117275N011651O466978M387531j579113n936081
$$ 6891375 1666094 -212067 1905208 6916859 13383837 17771368 16192255 10256174
44346A0256174l229297L072256M214385j191625n170622k918310j7481k545294
$$ 10256174 7026877 10099133 14313518 13121893 7951271 5032961 5015480 2470186
44338B470186o486160m601632L37677q84329p827853q827054J022078J0549268
$$ 2470186 -4015974 -8617606 -8279929 -9164258 -16992111 -25819165 -24797087 -14247819
44330a4247819Q325877m58110k746900K578372N547511K892349J716373M581954
$$ -14247819 -5921942 -6380052 -9126952 -6548580 -1001069 1891280 3607653 8189607
44322H189607M129819l082102q889659o068039Q87929M304470L969423K183963
$$ 8189607 12319426 9237324 347665 -5720374 -4832445 -527975 3441448 5625411
44314E625411k634191q620952o045314Q108724J8918361J1113548p131850j3701100
$$ 5625411 2991220 -5629732 -11675046 -3566322 15352039 26465587 19333737 5632637
44306E632637l802149M899655L5482r084737q689973n5822O733098P703074M474651
$$ 5632637 1830488 6730143 6765625 -2319112 -11009085 -11064907 -4331809 3371265 7845916
44297G845916k572052j0888165j2044966j609568J1188430J3044605L719838m615856
$$ 7845916 5273864 -5614301 -17659267 -19268835 -8080405 4964200 8684038 4068182
44289D068182l926164J559821L851282Q96946l896264o810487o186406k526435
$$ 4068182 142018 1701839 5553121 6450067 2553803 -4256684 -10443090 -12969525
44281a2969525J937273M860732N392775L825512Q55979j919836k584157j374747
$$ -12969525 -11032252 -6171520 -778745 3046767 3902746 1982910 -601247 -1975994
44273a975994p72050j696596j740674J041086M609061N186908J553909m157067
$$ -1975994 -2748044 -4444640 -6185314 -5144228 -535167 4651741 6205650 2048583
44265B048583q155642o800991N02961R013416J2093494Q227536J927888k639964
$$ 2048583 -6107059 -12908050 -12405089 -3391673 8701821 16929357 18857245 16217281
44257A6217281m887793m443599n65679L300219J213124n491170p096544P02479
$$ 16217281 11329488 6885889 6320210 9620429 10833553 5342383 -1754161 -1051682
44249a051682Q759813P079840q00147m567398k982467k619714m271823k481022
$$ -1051682 7708131 14787971 13987824 9420426 6437959 3818245 -453578 -2934600
44241b934600K053049J721301m206830o262228M31354P879353P658952L258960
$$ -2934600 -881551 839750 -3367080 -9629308 -9197954 -1318601 6340351 9599311
44233I599311K581638M650133K552389m034009q045842n954097k152143j538118
$$ 9599311 12180949 16831082 19383471 15349462 7303620 1349523 -802620 -2340738
44225b340738l365059m296292l484445k196707p23478J951898N889226Q890920
$$ -2340738 -5705797 -10002089 -13486534 -15683241 -16406719 -14454821 -8565595 325325
44217C25325P994352K600096l928677o630718l461840K821343P173120O220578
$$ 325325 8319677 10919773 6991096 360378 -3101462 -280119 6893001 13113579
44209A3113579O65709m807389m952831M47078N035767K739101m211596p674142
$$ 13113579 13779288 8971899 4019068 4466146 9501913 12241014 8029418 355276
44201C55276m263401O50033J124777j482877j840872J451406M993700N767906
$$ 355276 -3908125 -3258092 -2133315 -3616192 -5457064 -4005658 988042 6755948
44193F755948L888107J233482j65329O01341J810972M36531l289376m989172k210479
$$ 6755948 10644055 11877537 11712208 12313549 14124521 14561052 11271676 6282504 4072025
44184D072025J308809R06904j768900j220443L367146O648373M293125k055569
$$ 4072025 5380834 6287738 4518838 3298395 6665541 13313914 17607039 15551470
44176A5551470p340035p730214l004535K769039L718705j257500n543914k681761
$$ 15551470 8211435 481221 -2523314 245725 3964430 2706930 -2836984 -5518745
44168e518745M127610O095801J674250k103374j970343l181237q000207q485113
$$ -5518745 -1391135 4704666 6378916 4275542 2305199 -876038 -8876245 -17361358
44160a7361358J493615J3637265J4487506L970411n225512n496436j598522L85730
$$ -17361358 -15867743 -2230478 12257028 16227439 11001927 5505491 3906969 4292699
44152D292699J151652K271817J496836j115275k91692N103516O722439j572632
$$ 4292699 5444351 7716168 9213004 8097729 7806037 12909553 19631992 18059360
44144A8059360j1911326j1308185L45924J0159273R495189K951963r48347m07312
$$ 18059360 6148034 -5160151 -4814227 5345046 14840235 17792198 16843851 16436539
44136A6436539J029923N86682k267700o309300q096649m759212R64840K714165
$$ 16436539 17466462 18053144 15785444 9476144 1379495 -3379717 -2414877 299288
44128B99288n08097k208164J681701N729144K684495n349666r276369n061099
$$ 299288 -208809 -2416973 -735272 4993872 7678367 2328701 -6947668 -12008767
44120a2008767K032043N310849M053158J725011L94196n88389j796524k022043
$$ -12008767 -9976724 -4665875 -612717 1112294 1506490 918101 -878423 -2900466
44112b900466m1946K781246L210992J79881l325386m044805k569938j132488R08377
$$ -2900466 -2942412 -161166 3049826 3229707 -95679 -4140484 -6710422 -7842910 -6934533
44103f934533N087906Q458978O061604o30476m049800j343813J570329o3071k494264
$$ -6934533 -1846627 6612351 12673955 12043479 7993679 6649866 8220195 8157124 5662860
44094E662860q31435K475095K718776J239474J678041K506151R16410N2625L740054
$$ 5662860 4831425 7306520 10025296 11264770 12942811 15448962 16365372 16417997 20158051
44085B0158051P356915L663992m313993o542183j409651K599088J090129j114766
$$ 20158051 27514966 31178958 26864965 20322782 18913131 21512219 22602348 21487582
44077B1487582o43945n56499j906664j025012J283599j034353o376941m039238
$$ 21487582 20843637 20287138 18380474 17355462 18639061 17604708 11227767 7188529
44069G188529P501254J3515821M429808p225988m651598P570615J1648534M648186
$$ 7188529 14689783 28205604 32635412 25409424 20757826 28328441 39976975 44625161
44061D4625161N36318N285571P878922K36114r162527r091951j708094L708845
$$ 44625161 45161479 50447050 58325972 58562086 49399559 40307608 38599514 42308359
44053D2308359N068117O699954R283661Q822420L830593k278066n361036l894642
$$ 42308359 47376476 54076430 63360091 72182511 76013104 73735038 68374002 64479360
44045F4479360O40837M732321N809693N071866M942755M206019L22672l598167
$$ 64479360 65120197 69852518 75662211 80734077 85676832 89882851 90205523 86607356
44037H6607356j198728N776253O689635k367423r736752l122198J1782334J7649398
$$ 86607356 85408628 91184881 97874516 95507093 85770341 82648143 94430477 112079875
44029A12079875Q842195j930109k204177M211089N373749o64255l804162K980208
$$ 112079875 120922070 118991961 116787784 120998873 126372622 125708367 121904205 124884413
44021A24884413J3396662J5844645Q061659q76925k753548M04976J612724k78536
$$ 124884413 138281075 154125720 162187379 161310454 158556906 158961882 160574606 160296070
44013A60296070k32133L731765O883631N003779N51722j288126M98862K859751
$$ 160296070 160063937 163795702 170679333 175683112 176234834 174946708 175445570 178305321
44005A78305321L436193K421682J131750Q27866J788367K486978J468375L42941
$$ 178305321 181741514 184163196 185294946 186122812 187911179 190398157 191866532 192209473
43997A92209473J790676M213014L049528j223869k346617J446929L069100k149936
$$ 192209473 194000149 198213163 201262691 200038822 197692205 199139134 202208234 200058298
43989B00058298p357908m390563J977094M05821q571398j1929951l300968P775592
$$ 200058298 192700390 188309827 190286921 190692742 182121344 170191393 166890425 174666017
43981A74666017R707964L376969k498375l753171k368195l46677J753475K621828
$$ 174666017 184373981 187750950 185252575 181499404 179131209 178784532 180538007 183159835
43973A83159835J498625L16982J227238L467448M874749M336051J236050m132023
$$ 183159835 184658460 184975442 186202680 189670128 194544877 198880928 200116978 195984955
43965A95984955p923755n174236K307703N693235J006289m048761j033845O148493
$$ 195984955 188061200 182886964 185194667 190887902 191894191 187845430 186811585 192960078
43957A92960078O855269o08715p636950q738204p273059o512314l816154K214640
$$ 192960078 199815347 199206632 191569682 182831478 175558419 169046105 165229951 167444591
43949A67444591N822368J400170p129074j0191438m567737L100090M911463M26313
$$ 167444591 173266959 174667129 167538055 157346617 152778880 155878970 160790433 161216746
43941A61216746m385982n018221l219082l422282n844968n910089j343135L423929
$$ 161216746 156830764 151812543 148593461 145171179 139326211 133416122 132072987 135496916
43933A35496916K979225j255139l160956p69375J749218J027031j291862k533390
$$ 135496916 138476141 137221002 134060046 133290671 135039889 136066920 134775058 132241668
43925A32241668l086580m527630o668455q342521q932213p902252m768255j16902
$$ 132241668 129155088 124627458 117959003 109616482 100684269 92782017 88013762 87896860
43917H7896860N057754J0263775J3240667R050550l270480j4561675j3486218
$$ 87896860 92954614 103218389 116459056 125509606 122239126 107677451 94191233
43910I4191233j571448P371324N224213j128585k446050l71568r67222k356078
$$ 94191233 92619785 99991109 105215322 104086737 101640687 101269119 100301897 97945819
43902I7945819J434764Q319291R852720L917054k914845n615722n620190n027932
$$ 97945819 99380583 107699874 117552594 121469648 118554803 112939081 107318891 102290959
43894A02290959l190199n86578J37826j054712q31022J975865M559222M827924
$$ 102290959 99100760 98514182 98652008 97597296 96766274 98742139 103301361 108129285
43886A08129285L370270J80533n414106j0619163j0527940n487204j992860l843823
$$ 108129285 111499555 111680088 106265982 95646819 85118879 79631675 77638815 73794992
43878G3794992o920104n414446N28772N894181O429020J457873n873835j0011337
$$ 73794992 66874888 61460442 61989214 67883395 74312415 75770288 69896453 59885116
43870E9885116p903571l086967j165922j524948R92520N895501N708114k656630
$$ 59885116 51981545 48894578 47728656 46203708 47196228 53091729 58799843 56143213
43862E6143213j1844015j3222089o776743J578199P201718P833967L329960j775770
$$ 56143213 44299198 31077109 24300366 25878565 33080283 40914250 44244210 42468440
43854D2468440j294327L095130K174342o294398j1700517o367537J412877M15465
$$ 42468440 41174113 44269243 46443585 40149187 28448670 22081133 23494010 23909475
43846B3909475m837606j835513P934940J0251220J226867o282375l099395L272149
$$ 23909475 19071869 17236356 25171296 35422516 36649383 30367008 27267613 30539762
43838C0539762K771842j764134k375993m63388k910299q863249j0795956o744094
$$ 30539762 33311604 31547470 29171477 28708089 25797790 16934541 6138585 -605509
43830f05509k375193j033121K87056L631217N662607L667028Q55425J340288K931210
$$ -605509 -2980702 -4013823 -3726767 -95550 5567057 9234085 10089510 11429798 14361008
43821A4361008K00485n866416o991216Q09702R178823O855576m365001j0641438
$$ 14361008 14561493 8695077 1703861 2513563 11692386 18547962 14182961 3541523
43813C541523m893643L400190K724888l346465k952505M384157O892894l60613
$$ 3541523 -1352120 2048070 4772958 1426493 -1526012 2858145 9751039 9390426
43805I390426p450568m905498K887947O141388L874017J900543K018127J445309
$$ 9390426 1939858 -2965640 -77693 6063695 9937712 11838255 13856382 15301691
43797A5301691j25267o63253j224143m201465p223283n562283l23220K318251
$$ 15301691 15176424 14513171 13289028 9087563 1864280 -3698003 -4021223 -1702972
43789a702972M52538j358694l24561N48278r98552j975511Q1595K021311O83558
$$ -1702972 -1250434 -2609128 -2933689 -2385411 -3383963 -5359474 -5277879 -3256568 -2573010
43780b573010m73299L405035Q962519P525727j813985q935944n773169K792161
$$ -2573010 -3046309 358726 9321245 16846972 15032987 6097043 323874 3116035
43772C116035O276446L146109J165758M256256O696294K823140m025653p064446
$$ 3116035 9392481 12538590 13704348 17960604 24656898 27480038 23454385 16389939
43764A6389939o027607n631842o643478n014470L66892M920344M694620J247355
$$ 16389939 10362332 4730490 -1912988 -6927458 -6560566 -1640222 3054398 4301753
43756D301753j193575m32619K457899L951803N72271o197597q902183k864665
$$ 4301753 3108178 2675559 5133458 9085261 9657532 3459935 -5442248 -8306913
43748h306913N324642M793826m130473r503774m808149K360172L187331P54605
$$ -8306913 -2982271 1811555 -2318918 -11822692 -16630841 -14270669 -11083338 -10328733
43740a0328733K854784Q228929R275337M923052J398187J345334Q79468k018708
$$ -10328733 -7473949 754980 10030317 14953369 16351556 17696890 18576358 16557650
43732A6557650l896245k422338k38808J67665L01796J799973K933820J686062
$$ 16557650 12661405 10239067 10000259 10167924 10469720 12269693 15203513 16889575
43724A6889575p96849k196838k100073j325621m19434l59471k548326o298922
$$ 16889575 16092726 13895888 11795815 10470194 10050760 9691289 7142963 844041
43716H44041p999534m667492K392670Q618900J0397716P705381L221528l93396
$$ 844041 -7155493 -11822985 -9430315 -811415 9586301 17291682 20513210 20119814
43708B0119814k134124j868015P37210M873218P091277M288410j379621m059692
$$ 20119814 17985690 16117675 16854885 21728103 28819380 33107790 31728169 27668477
43700B7668477j895339P25165O00261P84579M492922Q208408O401822N63536k358405
$$ 27668477 25773138 26498303 27098564 27883143 32376065 40584473 46986295 47549831 45191426
43691D5191426M63774M923118O410147M622679K106613J636141M474178Q144126
$$ 45191426 45655200 50578318 56988465 61611144 63717757 65353898 69828076 77972202
43683G7972202P543310J666192l378506k448923O85749o54063n082941n590150
$$ 77972202 85515512 87181704 83803198 81354275 82040024 81385961 76303020 70712870
43675G0712870j027744L146733M826295P078723R586283P476053O56949m355211
$$ 70712870 69685126 72831859 77658154 84736877 94323160 101799213 102456162 98100951
43667I8100951m609339m346090n452915l158186M302224J0102079Q483793K772923
$$ 98100951 93491612 89145522 83692607 80534421 84836645 94938724 103422517 106195440
43659A06195440j638032m862364p140027l961180N431983J1704312P072370j964802
$$ 106195440 104557408 99695044 92555017 88593837 94025820 105730132 112802502 110837700
43651A10837700l406794K761201O226461K807369j716123l539992n594571q537640
$$ 110837700 107430906 110192107 116418568 119225937 117509814 113969822 108375251 99837611
43643I9837611o811714K114238J1521987J3089320O698544n42012k232536K045761
$$ 99837611 93025897 95140135 106662122 119751442 126449986 125907974 123675438 125721199
43635A25721199O894825O004838p10198n699898k596023N317613R783450Q634886
$$ 125721199 132616024 138620862 137910664 132210766 129614743 134932356 144715806 153350692
43627A53350692O332689N051989K596655q03610j374371R46738J309049j742338
$$ 153350692 159683381 164735370 167332025 166528415 165154044 166100782 167409831 165667493
43619A65667493l605113j908296m68201j605904j783730N15391o3579o268605
$$ 165667493 162062380 160154084 159685883 158079979 156296249 156811640 156748061 150479456
43611A50479456j0548856n321030L835687N059875k057942n995961r28172N297649
$$ 150479456 139930600 134609570 138445257 143505132 141447190 135451229 134523057 139820706
43603A39820706M099358j553357l394694j91407K905970L537268L571116K926238
$$ 139820706 143920064 142366707 138972013 138780606 141686576 145223844 148794960 151721198
43595A51721198j053176p262208r844070o064113q37315k21799l592013n844907
$$ 151721198 150668022 143405814 133561744 127497631 126660316 126438517 122846504 117001597
43587A17001597m876326k520749L95457M585025P578605M134004n748589j3413533
$$ 117001597 112125271 109604522 109999979 114585004 122163609 126297613 120549024 107135491
43579A07135491j0576706J15020P744499N821915j358903n305330k816143K427158
$$ 107135491 96558785 96673805 104418304 110240219 108881316 103575986 100759843 103187001
43571A03187001N104691K998975k109969o139651n595066n53135M680081M997345
$$ 103187001 108291692 111290667 109180698 103041047 97445981 96892846 101572927 106570272
43563A06570272m36828o928850q988557o048138k233796o89051l94868N08960
$$ 106570272 106133444 99204594 90216037 84167899 81934103 81245052 80850184 81359144
43555H1359144R19679j327273n568415q997225r854059p581338k090334L888724
$$ 81359144 82278823 80951550 75383135 66385910 56531851 48950513 46860179 50748903
43547E0748903M772325n77926m568417p74649M595574O68342r809231j2414491
$$ 50748903 55521228 54943302 50374885 49600236 54195810 54864152 45054921 32640430
43539C2640430l538309K750956l059729j0130065m774324P136482R736714J964466
$$ 32640430 29102121 31853077 28793348 18663283 13888959 21025441 30762155 32726621
43531C2726621l234382j137679l03533m975747p750952l471482K244891L127390
$$ 32726621 29492239 28354560 28051027 23075280 15324328 11852846 14097737 17225127
43523A7225127N36528k646960o678518r308732n273170L656332P466308K171133
$$ 17225127 17761655 15114695 8436177 -872555 -6145725 -2489393 4976915 7148048
43515G148048l782085l222354r77239l573575p217652n288762n60808K35262j307156
$$ 7148048 3365963 143609 -833630 -4407205 -11624857 -16913619 -17474427 -17239165 -18546321
43506a8546321J156621O471372P616469L815184J425948L024501M107539J577336
$$ -18546321 -17389700 -10918328 -3301859 513325 1939273 4963774 9071313 10648649
43498A0648649j590623j843822l8R18794m94334k906716k983871J373279O705462
$$ 10648649 9058026 7214204 7214166 8132960 7638626 4731910 1748039 3121318 9826780
43489I826780O215076p51152n792938k506684M095998N176092R26265j536449
$$ 9826780 16041856 15290704 9497766 6991082 11087080 16263172 17189437 15652988
43481A5652988j75429K79906k552540n688749o760206o171211l343599K565913
$$ 15652988 15477559 15757465 13204925 7516176 755970 -5415241 -8758840 -6192927
43473f192927Q041343P825050K766310r39623q08897l20130j556174j987241j29644
$$ -6192927 1848416 9673466 12439776 11500153 10691256 10371126 8814952 6827711 6698067
43464F698067J317709J02015k257361l363220k530974J00280L472270M824053
$$ 6698067 8015776 8117791 5860430 2497210 -33764 66516 3538786 8362839
43456H362839K723256m9393n34217m21702k051003k707300N44219L643597J443633
$$ 8362839 11086095 11036702 10502485 10080783 8029780 5322480 5866699 9510296 10953929
43447A0953929k288001r10090J777426l007690j1342935r711322K019028P453739
$$ 10953929 8665928 7755838 9533264 6525574 -4817361 -14528683 -12509655 -5055916
43439e055916k98886o306754J800691J2459292Q361627n492779r886707r69066
$$ -5055916 -5354802 -11661556 -9860865 2598427 10960054 5467275 -4419432 -5388498
43431e388498O580409L861224j978926l253811k449859l436897m122235k728605
$$ -5388498 1191911 5053135 3074209 -179602 -2629461 -6066358 -10188593 -12917198
43423a2917198j852809k000359N27715N631617P555620M740836L164646N505078
$$ -12917198 -14770007 -16770366 -16242651 -10611034 -3055414 1685422 4850068 10355146
43415A0355146N469735j354165q853322r583392n884815l928296k421653L388223
$$ 10355146 15824881 14470716 5617394 -3965998 -9850813 -13779109 -16200762 -12812539
43407a2812539J0190551R442470J066802n129255l161043K087020M058506L404573
$$ -12812539 -2621988 6820482 7887284 2758029 -403014 1684006 5742512 9147085
43399I147085L462886K853498j506538p326726q896250n148821q27326N48206
$$ 9147085 12609971 15463469 13956931 6630205 -2266045 -7414866 -8242192 -7693986
43391g693986O01344J871057L305603K342611o22154k475963j454540J048485
$$ -7693986 -7092642 -5221585 -1915982 426629 -195525 -2671488 -4126028 -3077543
43383c077543K731810K919880K422762J895680J126531k40870j797436k493554
$$ -3077543 -345733 2574147 4996909 6892589 8019120 7778250 5980814 3487260
43375C487260j689927J77597K072664L014038K120061p92730l695769l067248
$$ 3487260 1797333 1974930 4047594 7061632 9181693 8388963 4693194 1625946
43367A625946J492730M594056Q20646o824333r021958k539173M438995L296066
$$ 1625946 3118676 7712732 8533378 1709045 -7312913 -9852086 -5413091 -2117025
43359b117025k935971m370236J217384N586728K036795n922925r982944o764309
$$ -2117025 -5052996 -9423232 -8205848 -2619120 -582325 -6505250 -16488194 -23252503
43351b3252503J93047N192458N229909K080701M51162K494829M891460L893329
$$ -23252503 -23059456 -17866998 -12637089 -10556388 -10105226 -7610397 -2718937 1174392
43343A174392J488843K107692M660716L906624o02047l796485l882973m228599
$$ 1174392 2663235 4770927 9431643 13338267 12736220 8939735 5056762 828163
43335H28163m964861j578124M699744M737489m114131j0687337n762300K910904
$$ 828163 -4136698 -5714822 -1015078 3722411 -391720 -11079057 -16841357 -13930453
43327a3930453K606694l588108j954526Q504786J3294549N226939m334255l336453
$$ -13930453 -11323759 -14911867 -16866393 -8361607 4932942 10159881 5825626 2489173
43319B489173L519783M268568j706772n199227k825800l93570j552680k729655
$$ 2489173 6008956 10277524 8570752 3371525 545725 152155 -1400525 -4130180
43311d130180j234019m57220l071399n076005k108053K235617J110480m026377
$$ -4130180 -5364199 -5821419 -8892818 -13968823 -16076876 -13841259 -12730779 -16757156
43303a6757156m229257K928238P843393K712962n186800k625905R877270J7484785
$$ -16757156 -20986413 -18058175 -10214782 -7501820 -12688620 -15314525 -5437255 12047530
43295A2047530J1186265j001398o642561m164697J21718K909428M234644K233160
$$ 12047530 23233795 22232397 15589836 11425139 11546857 14456285 18690929 20924089
43287B0924089m048384r546767q481264k809506J178777K277144L378145L622270
$$ 20924089 16875705 7328938 -1152326 -3961832 -2783055 -505911 2872234 6494504
43279F494504j99425n539934n764528j39273N216494O558085N668405L960085
$$ 6494504 6295079 755145 -5009383 -5148656 67838 6625923 12294328 16254413
43271A6254413R16624j538284q28678J27119l216359p280647m192527M141587
$$ 16254413 17171037 15632753 14804075 14931194 11714835 4434188 241661 4383248
43263D383248O958822J698918j989402Q10365K370973k126037m446256J331125
$$ 4383248 11342070 13040988 11051586 11861951 14232924 12106887 7660631 8991756
43255H991756N532895j557549j0489532n364667R681013J4335023J812912j2023693
$$ 8991756 14524651 12967102 2477570 -2887097 6793916 21128939 22941851 10918158
43247A0918158j2589818m773521n51215o51459J601122N923543N562729m52903
$$ 10918158 -1671660 -6445181 -6996396 -7647855 -6046733 -123190 5439539 4986636
43239D986636m832592k695109J846943K504552P6481O85689N816293Q782140L669208
$$ 4986636 154044 -2541065 -694122 1810430 1886911 2572600 8388893 17171033 20840241
43230B0840241n371415q702695m149912P43516O28178m02841K560412N887386
$$ 20840241 15468826 6766131 2616219 3359735 3987913 3585072 6145484 12032870
43222A2032870L354922l041635o007521m083119j920503r35178J775058N094188
$$ 12032870 15387792 12346157 6338636 2255517 335014 -600164 1174894 6269082
43214F269082L350459l591297p631036l648523L084505N115053K814581J026445
$$ 6269082 9619541 6028244 -1602792 -5251315 -2166810 2948243 5762824 6789269
43206F789269M30433j463924l581027k212463K002884L929504J502418j471380
$$ 6789269 7219702 5755778 2174751 -37712 1965172 5894676 7397094 5925714
43198E925714j587956n04067p82459j009695Q91407K284969o33020m803372k610846
$$ 5925714 4337758 3833691 3051232 2041537 2932944 5217913 4584893 -218479 -2829325
43189b829325N938041J0364557L907036n569421o433796n32324N75489n225679
$$ -2829325 3108716 13473273 17380309 11810888 5377092 4844768 5420257 194578
43181A94578p234204K24922Q378304P783437J380926l133100m870828n618188
$$ 194578 -7039626 -6814704 1563600 9347037 10727963 7594863 2724035 -2894153
43173b894153k822609L484782M646714m091032j1720255n682839P150176R260541
$$ -2894153 -5716762 -2231980 2414734 -1676298 -13396553 -19079392 -11929216 -2668675
43165b668675l88450n303788J506541P455895K698504m271808k740438K419224
$$ -2668675 -3057125 -8360913 -6854372 601523 3300027 -971781 -3712219 -1292995
43157a292995J151413l776048k509183M371137P027149K357912k378016j511906
$$ -1292995 -141582 -3917630 -6426813 -2055676 4971473 7329385 4951369 3439463
43149C439463K370137M368973L167432R6402k914445l954819k802875j372791
$$ 3439463 5809600 10178573 13346005 13442407 10527962 6573143 3770268 2397477
43141B397477n06274J317917L952881M053132O48701k068010j371989o71514k766197
$$ 2397477 1891203 3209120 7162001 11215133 11863834 9795824 8423835 7752321 4986124
43132D986124l592710Q47503N816788M004374k563683n165935j596332J525878
$$ 4986124 1393414 2240917 8057705 12062079 9498396 4332461 2736129 4262007
43124D262007k41905l492673l631124q18466K486368M704822M327965N23145m097733
$$ 4262007 4020102 527429 -3103695 -3922161 -1435793 3269029 7596994 8120139 4022406
43115D022406n390973l364289k075094l150896l521016p75526K886428L628055
$$ 4022406 -1368567 -4732856 -6807950 -9958846 -13479862 -14255388 -11368960 -7740905
43107g740905N08003l676228m421659Q00233Q780357J2252840Q123870J489464
$$ -7740905 -7232902 -10909130 -15330789 -14530556 -5750199 6502641 14626511 16115975
43099A6115975k056636m249109q571261j0966925n002052N552740R586072M770769
$$ 16115975 14059339 9810230 1238969 -9727956 -14730008 -9177268 408804 5179573
43091E179573L53648J273654N83594o600616j1947961n970763N836194R602912
$$ 5179573 5533221 6806875 7390469 789853 -11158108 -17128871 -11292677 -1689765
43083a689765K422903n016261m246122J567225M980543L397846j374473o548483
$$ -1689765 733138 -4283123 -8529245 -6962020 -1981477 1416369 41896 -6506587
43075f506587q446216l995303M523950R632280O836432L77601k135810Q97151
$$ -6506587 -14952803 -18948106 -14424156 -4791876 2044556 2422157 286347 1183498
43067A183498M147923K997431j036421l134161j236212K189697L548323J846823
$$ 1183498 5331421 8328852 7292431 4158270 2922058 5111755 8660078 10506901
43059A0506901j050454k866787k914578j997576j146821q85745j455370k946475
$$ 10506901 9456447 6589660 3675082 1677506 530685 -355060 -1810430 -4756905
43051d756905m498005l821145P28894O719159Q227569K425779n425865p051071
$$ -4756905 -9254910 -13076055 -12347161 -5628002 2599567 5025346 -400519 -7451590
43043g451590j382971M158264L728305M5343j197932M38643J588101J219490L51543
$$ -7451590 -8834561 -4676297 -947992 -902649 -2100581 -1661938 -73837 1145653 1497196
43034A497196j580375m429466l838151L018693R569302O131417n069599j0066992
$$ 1497196 -83179 -4512645 -8350796 -5332103 4237199 10368616 5299017 -4767975
43026d767975j956217Q577412P722447k595453q392968l145719M881599N335506
$$ -4767975 -6724192 1853220 9575667 6980214 -1412754 -4558473 323126 5658632
43018E658632j120174n540858k694428L478899N652276J641332m139053o727064
$$ 5658632 4538458 -1002400 -3696828 -217929 5434347 7075679 2936626 -3790438
43010c790438n662828l040615M86005M377973N177523K49548n940268n656826
$$ -3790438 -9453266 -12493881 -12007876 -7629903 -2452380 -2202832 -8143100 -13799926
43002a3799926P83259M379305J047587j514720L833490J1030802Q951365j569142
$$ -13799926 -13016667 -8637362 -7589775 -9104495 -5271005 5759797 14711162 13142020
42994A3142020q411044n295978Q10279J408769k091613k744417J248616M992543
$$ 13142020 4730976 -565002 245277 1654046 -437567 -3181984 -1933368 3059175
42986C059175L840808j502499o064816n309413M20350N878985O544717L504650
$$ 3059175 6899983 5397484 -667332 -5976745 -5556395 322590 6867307 10371957
42978A0371957O28906j477385m619997p129895m601199K501026P762110P612314
$$ 10371957 11000863 9523478 4903481 -2226414 -6827613 -4326587 3435523 11047837
42970A1047837N489970L995540o38639j0248332j6424053r614138N314477J2266978
$$ 11047837 16537807 20533347 19894708 9646376 -6777677 -16391815 -11077338 1189640
42962A189640M364582p132086q201582N48361P583586O584450J807961n26907
$$ 1189640 5554222 -1577864 -9779446 -9231085 -1647499 4936951 6744912 6218005
42954F218005O71608L089228M372793K703703j850490n675103n069863j935506
$$ 6218005 6889613 9978841 14351634 17055337 15204847 9529744 4459881 2524375
42946B524375j771334n218009o651997l058504J160649J574379O85155K690981
$$ 2524375 753041 -4464968 -11116965 -14175469 -13014820 -11440441 -10755286 -8064305
42938h064305N697292N172555K023817O26214Q53701r06883l777485k834211K024502
$$ -8064305 -2367013 2805542 4829359 5455573 6309274 5402391 1624906 -1209305 815197
42929H15197M770822K381195j129464j788895p14711J73354J429697K353486O7677
$$ 815197 5586019 7967214 6837750 5048855 4334144 4507498 5937195 8290681 8358358
42920H358358m345925m840089M24990M757629K490313k766771m724038l633257
$$ 8358358 4012433 -827656 -402666 4354963 6845276 4078505 -645533 -4278790
42912d278790k586338j3890O212148J1273098Q818188J552167k230129j294095
$$ -4278790 -6865128 -6879018 -666870 10606228 19424416 20976583 18746454 17452359
42904A7452359j882042n896577p747201m262475O45305L511030N827305Q052078
$$ 17452359 15570317 9673740 1926539 -2335936 -1690631 1820399 7647704 15699782
42896A5699782O428163J6967n195789m120383J57044J669268K89501J68295K129447
$$ 15699782 22127945 22144912 16949123 12828740 12985784 14655052 14944553 15112848 17242295
42887A7242295K637856n26566n173229p140442m117550J983952N531319K201626
$$ 17242295 19880151 19353585 14180356 7039914 2922364 4906316 10437635 12639261
42879A2639261n130868q164644k886459M932044O588635R50441m907260m763146
$$ 12639261 7508393 -656251 -3542710 1389334 7977969 8928410 4021150 -741996
42871g41996q4389K791139N98289l285519l539104J60234L174660K727155R70198
$$ -741996 -826385 1964754 2563043 -722476 -4261580 -4101346 -926686 1800469 2770667
42862B770667k31267k743879o560965n916650K163015R282696M893179p252010
$$ 2770667 2539400 -204479 -6765444 -12682094 -10519079 -1236383 3656796 -3595214
42854c595214j2041035l542485P543291R982641N502674J183204j991865n486489
$$ -3595214 -15636249 -19178734 -11635443 -1652802 3849872 5033076 3041211 -2445278
42846b445278n889894k40358O330411O697228J973368j646424k679559l646011
$$ -2445278 -8335172 -8575530 -2245119 4452109 6425477 4779053 2099494 -1546517
42838a546517m014497j702575R81257N13749j027301K76594K207537J72503l603551
$$ -1546517 -5561014 -7263589 -6282332 -5768583 -6795884 -6519290 -4311753 -4139250 -7742801
42829g742801l433673n06943j93929q78250L279751R009945O254989m135753q379836
$$ -7742801 -11176474 -11683417 -11877346 -12755596 -9475845 -465900 5789089 1653336 -6726500
42820f726500m17445Q015178N480735k307719l542087J154275K977959R65964
$$ -6726500 -7143945 871233 6351968 4044249 502162 1656437 4634396 5600360
42812E600360R20640K159934j422085p718313o455628M635886J4232045J2308337
$$ 5600360 6521000 8680934 7258849 -459464 -6915092 -2279206 11952839 24261176
42804B4261176K498848n199404p328958o961837n845430l063314O24619K531188
$$ 24261176 26760024 21560620 14231662 7269825 1424395 -1638919 -1014300 1516888
42796A516888J811896N0163j551055k858894l059132p76330L618856P312931P190742
$$ 1516888 3328784 3378947 1827892 -1031002 -4090134 -4866464 -1247608 6065323 13256065
42787A3256065K448578m347839q513687o825997r07990L829878L610120j26337
$$ 13256065 15704643 11356804 2843117 -3982880 -4890870 -1060992 2549128 2422791
42779B422791l309247m112939l753306l421935k611684o94140J513458K592147
$$ 2422791 -886456 -4999395 -8752701 -12174636 -14786320 -15480460 -13967002 -11374855
42771a1374855K206894J347743J105776J425623J184066q0399o50251J777742
$$ -11374855 -9167961 -7820218 -6714442 -5288819 -4104753 -4185152 -4835403 -3057661
42763c057661O201090P806163L556978k904248n188215k792208j696916m932330
$$ -3057661 3143429 10949592 14506570 11602322 6414107 3621899 1924983 -3007347
42755c007347p069430k031685O754539R604735L291446m901315o880423k872415
$$ -3007347 -10076777 -12108462 -5353923 4250812 7542258 2640943 -4239480 -7111895
42747g111895J141290J272284j598918m148909l221213J418781N094693K259173
$$ -7111895 -5970605 -4698321 -6297239 -10446148 -13667361 -12248580 -7153887 -4894714
42739d894714n112603p292096R54046J1631286J2754552L818845m738341o497820
$$ -4894714 -10007317 -17299413 -16345367 -4714081 8040471 11859316 7120975 623155
42731F23155n659504p183062q026324k972056N699144J0078186O454009q97218
$$ 623155 -5036349 -12219411 -20245735 -23217791 -17518647 -7440461 -986452 -1883670
42723a883670n126768l256912K217086O072658N058564R88728j539951p67646
$$ -1883670 -7010438 -10267350 -8050264 -1977606 3080958 4069686 2529735 1762089
42715A762089P56935P33548K45219Q88219J718968J377463P90457J153246J367761
$$ 1762089 2519024 3252572 3497791 4386010 6104978 7482441 8272898 9426144 10793905
42706A0793905K30107r21045q11767j416402m748298q061804o797067j805178
$$ 10793905 11024012 10102967 9291200 7874798 3126500 -4935304 -11732371 -13537549
42698a3537549J117047m52778k322020n87530K405388K285991m4231L15529M415780
$$ -13537549 -12420502 -12873280 -15195300 -15782830 -13377442 -11091451 -11135682 -10820153 -6404373
42689f404373P116817M076065j797879l689973K98569M792977M404093N76519
$$ -6404373 712444 4788509 2990630 -699343 -400774 4392203 8796296 9372815
42681I372815j190875P67636K607489J023282k458685m327869l494603j337862
$$ 9372815 8181940 8949576 11557065 12580347 10121662 5793793 2299190 961328
42673I61328N41793J246799J082432J920375M715174O282036K389484m691672
$$ 961328 1503121 2749920 3832352 5752727 10467901 16749937 19139421 14447749
42665A4447749o834921j438073L178743q25383q528280q829861o84181N883570
$$ 14447749 7612828 6174755 9353498 8528115 -165 -8830026 -9514207 -3630637
42657c630637M660801L52783r80327j75927J67991J698938N527313O893687J133087
$$ -3630637 1030164 1382947 402620 226693 394684 2093622 7620935 14514622 15647709
42648A5647709q216805j3216613j1436024o804702k278554K647582P398724Q659428
$$ 15647709 7430904 -5785709 -17221733 -24026435 -26304989 -23657407 -16258683 -7599255
42640g599255M865195p17723k888319N55696O482071Q291680K137794p104843
$$ -7599255 -2734060 -3451783 -6340102 -5784406 697665 8989345 11127139 4022296
42632D022296r118436m79619R439116R450623P14454n988244n263381j968298
$$ 4022296 -5096140 -5575759 3863357 13313980 14028434 8040190 2776809 808511
42624H08511j063309q72041P43897R81424k069009l797793N32011P331022Q965112
$$ 808511 -254798 -1126839 -382942 598482 -1470527 -5268320 -4736309 2594713 11559825
42615A1559825M547447K54128n69831j521179o038044j1135544j1104336m896391
$$ 11559825 16107272 16361400 15791569 14270390 8232346 -2903198 -14007534 -18903925
42607a8903925K723951O374451M804342R57755j467919j048313J476987M924761
$$ -18903925 -16179974 -9805523 -5001181 -4043426 -5511345 -6559658 -5082671 -157910
42599a57910P600035O570892O06064n707035n425169Q69909L794356j756665p403507
$$ -157910 7442125 14013017 14619081 8912046 3486877 4356786 8151142 6394477 -1009030
42590a009030k647331Q033105R692834j248694j0624492o283165N226074R102610
$$ -1009030 -3656361 4376744 14069578 12820884 2196392 -4086773 1139301 10241911
42582A0241911K598333m259394m574500j693889q65126k025664k660402j951182
$$ 10241911 12840244 8580850 4006350 2312461 1447335 -578329 -3238731 -5189913
42574e189913j04963K248310K969571O89965j622595j65805K440178m19313q109528
$$ -5189913 -5294876 -3046566 -76995 612970 -1009625 -1175430 1264748 845435 -7264093
42565g264093j0943287l577145O149459P795627K817901P68926L851852M422694
$$ -7264093 -18207380 -21784525 -15635066 -7839439 -5021538 -4252612 -400760 4021934
42557D021934j575845p580265o622150j576099P36556Q44452M369162J0402999
$$ 4021934 2446089 -5134176 -11756326 -13332425 -12595869 -11751417 -7382255 3020744
42549C020744J0719134K483105n711262n354581k10151k16582o117156q302177
$$ 3020744 13739878 16222983 10511721 5157140 4946989 4730407 -1386749 -9688926
42541i688926j353361Q057135J0853996O766873J415769k479037n210430n437675
$$ -9688926 -11042287 -2985152 7868844 14635717 16051486 13572449 8362019 2924344
42533B924344k293483O8752k932993p962555o922052J171336Q060576P354916
$$ 2924344 630861 699613 -2233380 -10195935 -17117987 -15946651 -7886075 -531159
42525e31159J768987k576084l495042k132348r5580M84179j440446k675821N47698
$$ -531159 1237828 -1338256 -4833298 -6965646 -7061226 -6577047 -8017493 -10693314 -10145616
42516a0145616M845600K799038m232500n406896K979841R655953M662315n117883
$$ -10145616 -5300016 -2500978 -6733478 -12140374 -9160533 495420 5157735 39852
42508C9852o850457j424717n2521n227850q249521m840343n78231O72391K218660
$$ 39852 -6810605 -8235322 -8287843 -13515693 -21765214 -26605557 -27183788 -26511397 -24292737
42499b4292737N597850O595792L946180K604826M203166L221939k563419o528145
$$ -24292737 -18694887 -12099095 -8152915 -5548089 -1344923 1877016 -686403 -7214548
42491g214548l715896J192436K612635K876511N217419N650127O05956l920308
$$ -7214548 -10930444 -9738008 -7125373 -4248862 968557 6618684 7224640 3304332
42483C304332r81122M526955K733922m623952o284540M44041N287966Q75877p114198
$$ 3304332 2323210 6850165 9584087 4960135 -1324405 -880364 4407602 5283479 -1830719
42474a830719r677731o251641j914099R31582K791592L206191J528987p07335
$$ -1830719 -11508450 -17760091 -19674190 -18742608 -15951016 -12744825 -11215838 -11923173
42466a1923173j436912j81913L151477Q564412J3111460J1330677J716469r510651
$$ -11923173 -13360085 -13541998 -10390521 -1826109 11285351 22616028 24332497 14821846
42458A4821846j3994483r310059r038P104256P198237Q4467q362536r765521j746627
$$ 14821846 827363 -8482696 -8491734 -1387478 5810759 5895226 -2467310 -12232831 -13979458
42449a3979458Q165779J0103013K734211n990416q450659m869916q40024N9093
$$ -13979458 -5813679 4289334 7023545 1033129 -7417530 -12287446 -13127470 -13068377
42441a3068377o73311k8902J768506J557502j687520m020260r75194N719750Q805116
$$ -13068377 -13741688 -13770590 -12002084 -10444582 -12132102 -16152362 -17127556 -11407806 -2602690
42432b602690L890647n037119j0018752p333583K48711P645448J1438124J0512224
$$ -2602690 1287957 -3749162 -13767914 -21101497 -20852786 -13207338 -1769214 8743010
42424H743010N609343p42254n172493n567733k437759J735751M441567M784108
$$ 8743010 14352353 13610099 8437606 2869873 432114 2167865 6609432 11393540
42416A1393540L588445J975967J27141k182755m293413m872476l464435j135984
$$ 11393540 14981985 16957952 17085093 14902338 10608925 5736449 2272014 1136030
42408A136030L99609r4735k419335m252513k578792K500902O495043N627496K465134
$$ 1136030 1535639 1440904 -978431 -5230944 -7809736 -5308834 1186209 6813705 9278839
42399I278839K827607O732665O811225j734928j3001514j6142821p931496L948528
$$ 9278839 12106446 18839111 25650336 23915408 10913894 -5228927 -13160423 -9211895
42391i211895R847047P419861J730666j249962o2228K023379J291291j771281
$$ -9211895 635152 8055013 9785679 8535717 8473489 10496868 11788159 10016878
42383A0016878k826845L47070L677457J361813n589057q959710l310432O458010
$$ 10016878 7190033 7537103 11214560 12576373 6987316 -1972394 -5282826 1175184
42375A175184J0683346O564008K88988k277228k357244l648156n395358m725248
$$ 1175184 11858530 18422538 18711526 16434298 14077054 10428898 5033540 308292
42367C08292l265499n169404q666031o380869L321522J1401256R365101R95038
$$ 308292 -2957207 -8126611 -16792642 -23173511 -19851989 -8450733 914368 1909406
42359A909406l074115M23957N235576O209406M884403L952477K816954O50751
$$ 1909406 -1164709 -740752 4494824 10704230 15588633 19541110 22358064 23008815
42351B3008815j541272l976362q158862j1884592r728813j538694M899738L629990
$$ 23008815 21467543 17491181 9332319 -2552273 -12281086 -13819780 -8920042 -5290052
42343e290052j671931l835493j600650J858354N243069P963852O490457r28769
$$ -5290052 -6961983 -10797476 -12398126 -10539772 -5296703 2667149 9157606 8228837
42335H228837q118228p001918R13185O060944L924286j93575n06136J789869K723843
$$ 8228837 110609 -6891309 -5978124 82820 4007106 3813531 3307395 5097264 7821107
42326G821107J674624K44390r08921j438105p44635L6709j262386l657294l189453
$$ 7821107 9495731 9740121 8831200 7393095 6648460 6685169 5422783 1765489 -1423964
42317a423964R87085M547661M182355K054570J426371J358226q81818m626209
$$ -1423964 -436879 4110782 8293137 10347707 11774078 13132304 12250486 7624277
42309G624277o304871l825000J478901N816726N143562q17075o012304l587198
$$ 7624277 1319406 -2505594 -1026693 4790033 9933595 9116520 3104216 -482982
42301d82982M433257P863295J688766o418511o481542L75903M906191L001697
$$ -482982 3950275 11813570 13502336 7083825 602283 978186 5884377 8886074
42293H886074q18156j877917p25365J97874k04551k474821o065863p506476l486537
$$ 8886074 8067918 6190001 5464636 5662510 5457959 2983138 -3082725 -10589201 -14075738
42284a4075738L607018P383939N282986P59461k547067m206057m011732q93159
$$ -14075738 -10468720 -3084781 2198205 2957666 410599 -3795458 -7807190 -8700349
42276h700349L452199M692900J936322o49840m85166j77743j713593k080862J135962
$$ -8700349 -5248150 -555250 1381072 731232 246066 68323 -1645270 -3726132 -2590170
42267b590170M187858K485687j612022k026068J852274M756172L534753M26012
$$ -2590170 1597688 4083375 2471353 445285 2297559 7053731 10588484 11014496
42259A1014496j563044j973256j307742j34900o6919k045363l809243k924089
$$ 11014496 9451452 7478196 6170454 6035554 5968635 3923272 114029 -2810060
42251b810060j755987m387564q522072o712681K384121J0188238R436506L994866
$$ -2810060 -4566047 -8953611 -17475683 -24188364 -21804243 -11616005 -2179499 1815367
42243A815367K251185M670507M454188r93510n872743m339882J718714N503083
$$ 1815367 4066552 8737059 13191247 12197737 6324994 1985112 3703826 9206909
42235I206909L347315j946868m811126k920519O14463J553869M54851J593831
$$ 9206909 12554224 10607356 5796230 2875711 3490174 5044043 5498894 7092725
42227G092725N366660O099988N58625n578469n101697j77699R23621l275965n477948
$$ 7092725 12459385 18559373 19117998 13539529 8437832 8260133 9183754 5907789 429841
42218D29841j267264M755075O943553N888750M220563J387814k822811m954124
$$ 429841 -837423 3917652 10861205 16749955 20970518 22358332 19535521 14581397
42210A4581397l274477j989226m668129p669234o064940k236445j646013l051506
$$ 14581397 11306920 9317694 4649565 -3019669 -9084609 -11321054 -12967067 -16018573
42202a6018573o62313N553131R529771Q666940O267116M175600M60602m346328
$$ -16018573 -16680886 -11127755 -1597984 7068956 13336072 17511672 17972274 13625946
42194A3625946n860095k873517L98522J229048J668269K922649K552632k50843
$$ 13625946 7765851 4892334 5290856 6519904 8188173 11110822 13663454 13412611
42186A3412611k490975k934860l764499m286649k32124P046122Q479219M1944
$$ 13412611 10921636 7986776 4222277 -64372 -296496 6749626 15228845 15270789
42178A5270789r252501q947244j116706M464971M267978K295721J162473J8504
$$ 15270789 6018288 -2928956 -4045662 419309 4687287 6983008 8145481 8163985
42170H163985o85333N65834K792199M572520O878865Q777286N056541n026047
$$ 8163985 7478652 8044486 10836685 15409205 22288070 31065356 36121897 31095850
42162C1095850j2046147q392562q73095n55941m629026j868459O443231O951913
$$ 31095850 19049703 10657141 9784046 9228105 4599079 2730620 9173851 16125764
42154A6125764l291040j0876684p151851l39108M31515n67815L340617P774950
$$ 16125764 12834724 1958040 -5193811 -5532919 -5101404 -5669219 -2328602 5446348
42146E446348N896429J217664M43243J036455k557051o604609m105381J588881
$$ 5446348 11342777 12560441 13003684 14040139 11483088 4878479 773098 2361979
42138B361979J539124l293231l514307K873023P641268N756364J253646j556685
$$ 2361979 3901103 607872 -2906435 -33412 7607856 13364220 14617866 13061181
42130A3061181l328595m166390j412036M222783P205367M584153n61923m651780
$$ 13061181 9732586 5566196 4154160 8376943 15582310 20166463 19604540 14952760
42122A4952760p292063q320430o488849k420475J460159M224716N622735L449836
$$ 14952760 7660697 -659733 -7148582 -9569057 -8108898 -3884182 1738553 5188389
42114E188389k733221p095383l800238L440032N806412K437706L75626J824266
$$ 5188389 2455168 -4640215 -8440453 -5000421 805991 3243697 3619323 5443589
42106E443589J341150l099089o304511n500891m033843k728990K169208Q825262
$$ 5443589 6784739 3685650 -2618861 -8119752 -12153595 -14882585 -12713377 -3888115
42098c888115Q560000J09048n629699j870708L434644J355373l688707l229958
$$ -3888115 4671885 4780933 -848766 -2719474 715170 2070543 -1618164 -4848122
42090d848122N73540R16662l76443K235290N621962L175893j980143j831152J788773
$$ -4848122 -4274582 -3357920 -3734363 -1499073 4122889 7298782 5318639 3487487 5276260
42081E276260N62278m373953l773120K914193O134981K784051J42738O85186k576171
$$ 5276260 5838538 1464585 -2308535 605658 6740639 9524690 9667428 10352614 7776443
42072G776443j0470391j1592389k88957J1115132Q693841l011381q421380k844848
$$ 7776443 -2693948 -14286337 -14575294 -3460162 5233679 2222298 -6199082 -9043930
42064i043930L823718K634073m429288r368134o557029L200505J2500424J2937494
$$ -9043930 -5220212 -2586139 -7015427 -16383561 -22940590 -19740085 -7239661 5697833
42056E697833M612680k890849k775340J07919k097691p398805p204014K32314
$$ 5697833 10310513 7419664 4644324 4752243 2654552 -4744253 -11948267 -11715953
42048a1715953P470009Q406992M500698L70231j232288J48467K592444K375163
$$ -11715953 -4245944 4161048 8661746 9031977 7799689 7948156 10540600 12915763
42040A2915763j348708l820999j235638K196414j32496o343865q242314l742301
$$ 12915763 11567055 7746056 6510418 8706832 8574336 2230471 -6011843 -9754144
42032i754144R39276K102153L061560N715730O086473K080648j842935k348313
$$ -9754144 -8814868 -6712715 -3651155 2064575 8151048 10231696 8388761 6040448
42024F040448k620166m975883n034518K92824N367363M138277M66365J270912
$$ 6040448 3420282 -1555601 -6590119 -6297295 -929932 3208345 3674710 4945622
42016D945622L916418R55748n316907n038197K447479O202858R51763m916258
$$ 4945622 8862040 9817788 4500881 -537316 1910163 8113021 9064784 4148526
42008D148526l895671j074501l268491n661895j50091Q937374R690648J043188
$$ 4148526 252855 -821646 -4090137 -9752032 -9902123 -964749 8725899 9769087
42000I769087n486824l345797N86675j363131n683770m380602K310406O713554
$$ 9769087 4282263 936466 1523141 160010 -5523760 -9904362 -7593956 -880402
41992h80402M656525Q965j397329J236868L564108J788937k160302k462200K433250
$$ -880402 3776123 3785088 2387759 3624627 7188735 8977672 6817370 4355170 6788420
41983F788420O163276K867047l222383l132581K778124M623291j382098o446912
$$ 6788420 12951696 15818743 12596360 9463779 12241903 16865194 15483096 9036184
41975I036184l213912K570265K047341k368959k465868R55720J27018n028870
$$ 9036184 5822272 8392537 10439878 8070919 5605051 6560771 6687789 1658919
41967A658919o088024o66765L332860R58244k272030p76044J796385K8970l110443
$$ 1658919 -4429105 -5095870 -1763010 -804766 -3076796 -3852840 -2056455 -2027485 -5137928
41958e137928r52602N950322J0402139Q155321J595138m813257q277480p833115
$$ -5137928 -6090530 -140208 10261931 18417252 20012390 15199133 6921653 -911462
41950i11462m583800j402603J25092J499778M068777N804038L884203r37398m918287
$$ -911462 -5495262 -6897865 -6772773 -5272995 -1204218 4599820 8484023 7546625 2628338
41941B628338n150108j322755M302008P146674L504799m009746p160520j596833
$$ 2628338 -2521770 -3844525 457483 7604157 11108956 7099210 -61310 -1658143
41933a658143O795272Q798701L072488l660112n993381m640498k386858k33250
$$ -1658143 5137129 13935830 17008318 13348206 7354825 2714327 327469 94219
41925I4219J285527R34822r22066j420507J061070L610677J663473m757502r706003
$$ 94219 1379746 2314568 1392502 -28005 1033065 4643742 6307215 1549713 -8156290
41916h156290p770635r48419L454367K062933q38903o59763O68533l94390j148858
$$ -8156290 -15926925 -16875344 -13420977 -11358044 -12196947 -12856710 -12188177 -12582567 -13731425
41907a3731425L116606Q991269P791213r22884p593360o585166k803786r80394
$$ -13731425 -10614819 -1623550 6167663 5244779 -2348581 -8933747 -11737533 -12717927
41899a2717927J824858P167680Q255138O23239p813606p086642K03085M284413
$$ -12717927 -10893069 -3725389 4529749 5152988 -2660618 -9747260 -9544175 -5259762
41891e259762L187346K127853K304586J195663O54275L530534N053502o60825
$$ -5259762 -2072416 55437 2360023 3555686 4209961 7740495 12793997 12133172
41883A2133172p910867o108123K273354M550597j298588l844687J452924M927146
$$ 12133172 4222305 -1885818 387536 4938133 3639545 -205142 1247782 6174928
41875F174928P08502l285414p33181J978640q11226k743525J490330L911553k943423
$$ 6174928 6883430 3598016 2864835 4843475 4032249 1288724 2779054 6690607 3747184
41866C747184j0299914o025693M524003O492510n17882l010503L363252P474616
$$ 3747184 -6552730 -12578423 -8054420 -1561910 -2079792 -5090295 -1727043 5747573
41858E747573J740878o394595p017326j344408L082218L547837K834583K990654
$$ 5747573 7488451 1093856 -5923470 -7267878 -4185660 -637823 2196760 5187414
41850E187414K838915J53863n148971r211724p240832k86939M266662K329156
$$ 5187414 8026329 8180192 3031221 -6180503 -13421335 -13708274 -9441612 -7112456
41842g112456j085125l24259J936304R32754m81685K496404N763803K159790m657232
$$ -7112456 -8197581 -8521840 -6585536 -5652782 -6134467 -3638063 2125740 4285530 -371702
41833c71702m399273K665547N413412k47000n826413n178120k587001k011201
$$ -371702 -4770975 -2105428 3307984 3060984 -2765429 -7943549 -10530550 -12541751
41825a2541751m09445K817392J554617m885860o426956K525540J2417785J2542113
$$ -12541751 -12951196 -10133804 -8579187 -13465047 -19892003 -17366463 -4948678 7593435
41817G593435O606484L767720K595869l167346r133251n336295N522042R244649
$$ 7593435 14199919 17967639 20563508 17396162 8262911 2926616 8448658 17693307
41809A7693307P74161q600620p811467L68961O524399P212577N286761L377427
$$ 17693307 18467468 9866848 2055381 2424342 8948741 16161318 21448079 24825506
41801B4825506K006749Q94670j079495m720992p833936o836460k164761J461487
$$ 24825506 26832255 27726925 26647430 21926438 14092502 7256042 5091281 6552768
41793F552768J291791n55728j508286j931802k665108k996334k803919l062712
$$ 6552768 7844559 7288831 5780545 3848743 1183635 -1812699 -4616618 -7679330
41785g679330k605490J402560P377880Q305127R40500p540203p538877M1561M762430
$$ -7679330 -10284820 -8882260 -1504380 6800747 7741247 201044 -7337833 -7296272 -2533842
41776b533842P81833n845810o564540j996955Q29613Q6648R86393N377406O802136
$$ -2533842 -1752009 -7597819 -14162359 -16159314 -15329701 -15243053 -14256660 -8879254 -2077118
41767b077118N36965o892428n536593L255701Q353597M971128K78907N00536J633515
$$ -2077118 -1540153 -8432581 -13969174 -10713473 -2359876 2611252 2890159 3390695 5024210
41758E024210j527311n315256m122794j119908k454946n052899j105076P136158
$$ 5024210 3496899 -1818357 -5941151 -7061059 -9516005 -14568904 -15673980 -8537822
41750h537822Q651053P62807o031404l709584K429844L432849r53525n247376
$$ -8537822 113231 876038 -5155366 -8864950 -6435106 -3002257 -3955782 -9203158
41742i203158o685890m747517J629342R816404J1857956M213526n211033p048059
$$ -9203158 -15889048 -20636565 -19007223 -9190819 2667137 6880663 1669630 -5378429
41734e378429l475511l134735o423789n506771K151983R994204J2792555J1705437
$$ -5378429 -8853940 -11988675 -18412464 -23919235 -21767252 -11773048 1019507 12724944
41726A2724944P354496k412762j4051561j6958780p045961N447610Q878049M958856
$$ 12724944 20079440 17666678 3615117 -13343663 -20389624 -14942014 -6063965 -1105109
41718a105109K599371K563537r79013o406714m831950L930863P587574p23443
$$ -1105109 1494262 4057799 3078786 -3327928 -8159878 -4229015 3358559 2635116
41710B635116j0523612q565154J608044N277542j578724p481632l323990N402688
$$ 2635116 -7888496 -16453650 -14845606 -9568064 -11146788 -18628420 -21952410 -16549722
41702a6549722Q502943N097547J386131l30235l032969p424462r529614o291004
$$ -16549722 -8046779 -2949232 -1563101 -1893336 -4926305 -12350767 -21880381 -28171385
41694b8171385O39577P202333J0122863Q010068K255964l010064m256504j950976
$$ -28171385 -27531808 -20329475 -10206612 -2196544 59420 -2950644 -7207148 -9158124
41686i158124Q41468K157186J641164o13735k934683k000711K445412N167774
$$ -9158124 -8316656 -6159470 -4518306 -5132041 -8066724 -10067435 -7622023 -2454249
41678b454249K349528j531952J00568M846796M433683j585920m574669r33950
$$ -2454249 -104721 -1636673 -1536105 3310691 7744374 6158454 1583785 649835
41670F49835K382005L88964j807087L17814J376328l743012q444963m278863L689187
$$ 649835 3031840 3420804 1613717 1931531 3307859 -435153 -8880116 -13158979 -9469792
41661i469792L937992k536501l797838L218060Q096118M230381j971036l307641
$$ -9469792 -5531800 -8068301 -11866139 -8648079 -551961 3678420 1707384 -1600257
41653a600257j819005j170769O32360M331142M459165j167828n061005j200284
$$ -1600257 -3419262 -4590031 -3957671 373471 4832636 3664808 -1396197 -2596481
41645b596481M585971L859497j368231l929749l737240m453082l216811M421896
$$ -2596481 1989490 5848987 4480756 551007 -3186233 -7639315 -10856126 -6434230
41637f434230J2546925J0501104j79996o421082k272300M000209L580862k045782
$$ -6434230 6112695 16613799 16433803 10012721 7740421 11740630 15321492 13275710
41629A3275710o550208o273156j67313R048884J2325417L056050r771906r336272
$$ 13275710 6725502 452346 285033 9333917 21659334 24715384 14943478 5607206
41621E607206M309729J0908084j353581j7391360j6677734j817053Q487454O932382
$$ 5607206 9916935 20825019 19471438 2080078 -14597656 -16414709 -7927255 -994873
41613i94873K230682O09286j019611l685619k828952J447343K692218l38159j136626
$$ -994873 1235809 1845095 825484 -2860135 -5689087 -4241744 -1549526 -1887685 -3024311
41604c024311K416399L811656l4743k451026J545740O073463L633617k920899
$$ -3024311 -607912 3203744 3169001 717975 2263715 8337178 11970795 9049896
41596I049896m928130k47731N321752O328462K462676k917389n591640l891823
$$ 9049896 4121766 3874035 9195787 15524249 17986925 15069536 9477896 5586073
41588E586073j411709l291188q391898r684441m320058K238100N030110O330812
$$ 5586073 4174364 883176 -7508722 -17193163 -21513221 -19275121 -14245011 -7914199
41580g914199R110479R879790M524623l079941n383775j693606J914277J628643
$$ -7914199 1196280 11076070 15600693 12520752 7136977 5443371 7357648 8986291
41572H986291q34705k919436l977434l826573k792152k646936m181274n109936
$$ 8986291 8151586 5232150 1254716 -2571857 -5364009 -8010945 -12192219 -17302155
41564a7302155l526715j389543j016008n69826K649761O617805P048371L864565
$$ -17302155 -20828870 -22218413 -23234421 -23804247 -21154486 -14536681 -7488310 -3623745
41556c623745O79082o98113q50630M66402L489303N813608N036709K447943n4945
$$ -3623745 -2944663 -3642776 -4493406 -4027004 -537701 5275907 10312616 12760559 12705614
41547A2705614m036158j0246424j3305712p720437K460384P498120M927055J349877
$$ 12705614 8669456 -1576968 -14882680 -22603117 -20142733 -12644613 -7717558 -6367681
41539f367681J381533K496354J890158R81512R43267J01243k079866l858509n194943
$$ -6367681 -4986148 -2489794 -599636 381876 1325143 1426386 -653480 -4511989 -9706932
41530i706932p055459o384169Q13338J0176721J1314704K400108n842262m874165
$$ -9706932 -16762391 -23146560 -22333222 -12156501 -841797 1558311 -4283951 -9158116
41522i158116Q67915L024301J411215M22506q4194k533804m890594l645957j95882
$$ -9158116 -8290201 -5265900 -3854685 -3432179 -3516373 -6050177 -10940771 -14586728 -14782610
$$ [...]
##END NTUPLES=NMR SPECTRUM
##END=
