##TITLE=31Pdec_SR59_oil
 D2O, 24 sc
 14.05.2021
##JCAMPDX= 6.0         $$ Bruker NMR JCAMP-DX V2.0
##DATA TYPE= NMR SPECTRUM
##DATA CLASS= NTUPLES
##ORIGIN= UXNMR, Bruker Analytische Messtechnik GmbH
##OWNER= root
$$ XWIN-NMR		Version 3.5
$$ Fri May 14 09:52:49 2021 Russian Standard Time (UT+4h)  she@DPX200
##.OBSERVE FREQUENCY= 81.013821
##.OBSERVE NUCLEUS= ^31P
##.ACQUISITION MODE= SIMULTANEOUS
##.ACQUISITION SCHEME= undefined
##.AVERAGES= 24
##.DIGITISER RES= 16
##SPECTROMETER/DATA SYSTEM= spect
##.PULSE SEQUENCE= zgpg30
##.SOLVENT NAME= D2O
##.SHIFT REFERENCE= (INTERNAL, D2O, 0, 248.564)
##AUDIT TRAIL= $$ (NUMBER, WHEN, WHO, WHERE, WHAT)
$$ ##TITLE= Audit trail, XWIN-NMR		Version 3.5
$$ ##JCAMPDX= 5.01
$$ ##ORIGIN= Bruker BioSpin GmbH
$$ ##OWNER= she
$$ F:/spectra/data/she/nmr/P31/1/pdata/1/auditp.txt
$$ ##AUDIT TRAIL=  $$ (NUMBER, WHEN, WHO, WHERE, WHAT)
(   1,<2021-05-14 09:51:22.56 +0400>,<she>,<DPX200>,
      <created by zg, POWCHK disabled, PULCHK disabled
       configuration hash MD5:
       00 E9 B6 7A A2 85 ED C7 34 08 36 98 17 FE 4E 26
       data hash MD5: 32K
       74 FF DF A1 DF 10 DC DA 56 42 75 5F 85 F2 36 F5>)
(   2,<2021-05-14 09:51:24.87 +0400>,<she>,<DPX200>,
      <Start of raw data processing
       efp BC_mod = 2 LB = 1 FT_mod = 6 PKNL = 1 PHC0 = -6642.083 PHC1 = 229.6005 SI = 64K 
       data hash MD5: 64K
       AF FB 08 18 95 6A 25 BD B3 7E 09 F9 7E B6 FB F1>)
(   3,<2021-05-14 09:51:50.43 +0400>,<she>,<DPX200>,
      <pk PHC0 = -73.23327 PHC1 = 123 
       data hash MD5: 64K
       F3 E4 3D 8C 72 3C 47 67 B5 BE C6 F6 1F FA 0F BA>)
(   4,<2021-05-14 09:52:14.29 +0400>,<she>,<DPX200>,
      <pk PHC0 = -2.471997 PHC1 = 0.7999988 
       data hash MD5: 64K
       8E 91 3E 62 F0 BA 90 8D ED A8 65 37 30 3F 1A 8E>)
(   5,<2021-05-14 09:52:17.75 +0400>,<she>,<DPX200>,
      <abs ABSG = 5 
       data hash MD5: 64K
       15 E1 52 01 4C 47 C1 66 EE 81 99 55 55 AC 89 3E>)
$$ ##END=
$$ 
$$ hash MD5
$$ AA 1F AF D7 CB E8 36 1D 20 94 7F 8B 2B 9D AB F8
##$RELAX= 
##$RELAX= 
##$RELAX= 
##$RELAX= 
##$RELAX= 
##$RELAX= 
##$RELAX= 
##$RELAX= 
$$ Bruker specific parameters
$$ --------------------------
##$DU= <F:/spectra>
##$EXPNO= 1
##$NAME= <P31>
##$PROCNO= 1
##$TYPE= <nmr>
##$USER= <she>
##$AMP= (0..31)
100 100 100 100 100 100 100 100 100 100 100 100 100 100 100 100 100 100 
100 100 100 100 100 100 100 100 100 100 100 100 100 100 
##$AQSEQ= 0
##$AQ_mod= 1
##$AUNM= <au_zg>
##$AUTOPOS= <>
##$BF1= 81.014009
##$BF2= 200.13
##$BF3= 200.13
##$BF4= 200.13
##$BF5= 200.13
##$BF6= 200.13
##$BF7= 200.13
##$BF8= 200.13
##$BYTORDA= 1
##$CFDGTYP= 0
##$CFRGTYP= 5
##$CHEMSTR= <none>
##$CNST= (0..31)
1 1 145 1 1 1 1 1 1 1 1 1 1 1 1 1 1 1 1 1 1 1 1 1 1 1 1 1 1 1 1 1 
##$CPDPRG= <waltz16>
##$CPDPRG1= <>
##$CPDPRG2= <waltz16>
##$CPDPRG3= <>
##$CPDPRG4= <mlev>
##$CPDPRG5= <mlev>
##$CPDPRG6= <mlev>
##$CPDPRG7= <mlev>
##$CPDPRG8= <mlev>
##$CPDPRGB= <>
##$CPDPRGT= <>
##$D= (0..31)
0 1 0 0 0 0 0 0 0 0 0 0.03 2e-05 3e-06 0 0 0 0 0 0 0 0 0 0 0 0 0 0 0 0 
$$ [...]
##$SUBNAM3= <"">
##$SUBNAM4= <"">
##$SUBNAM5= <"">
##$SUBNAM6= <"">
##$SUBNAM7= <"">
##$SUBNAM8= <"">
##$SUBNAM9= <"">
##$SW= 501.771253377433
##$SWIBOX= (0..15)
0 1 3 0 0 0 0 0 0 0 0 0 0 0 0 0 
##$SW_h= 40650.406504065
##$TD= 32768
##$TD0= 1
##$TE= 0
##$TE2= 300
##$TE3= 300
##$TEG= 300
##$TL= (0..7)
0 120 53 12 22 120 120 120 
##$TP= (0..7)
150 150 150 150 150 150 150 150 
##$TP07= 0
##$TPNAME0= <>
##$TPNAME1= <>
##$TPNAME2= <>
##$TPNAME3= <>
##$TPNAME4= <>
##$TPNAME5= <>
##$TPNAME6= <>
##$TPNAME7= <>
##$TPOAL= (0..7)
0.5 0.5 0.5 0.5 0.5 0.5 0.5 0.5 
##$TPOFFS= (0..7)
0 0 0 0 0 0 0 0 
##$TUNHIN= 0
##$TUNHOUT= 0
##$TUNXOUT= 0
##$USERA1= <user>
##$USERA2= <user>
##$USERA3= <user>
##$USERA4= <user>
##$USERA5= <user>
##$V9= 5
##$VALIST= <valist>
##$VCLIST= <CCCCCCCCCCCCCCC>
##$VD= 0
##$VDLIST= <DDDDDDDDDDDDDDD>
##$VPLIST= <PPPPPPPPPPPPPPP>
##$VTLIST= <TTTTTTTTTTTTTTT>
##$WBST= 1024
##$WBSW= 4
##$XGAIN= (0..3)
0 0 0 0 
##$XL= 0
##$YL= 0
##$YMAX_a= 11657
##$YMIN_a= -12473
##$ZGOPTNS= <>
##$ZL1= 120
##$ZL2= 120
##$ZL3= 120
##$ZL4= 120
##$ABSF1= 248.5645
##$ABSF2= -253.2056
##$ABSG= 5
##$ABSL= 3
##$ALPHA= 0
##$AQORDER= 0
##$ASSFAC= 0
##$ASSFACI= 0
##$ASSFACX= 0
##$ASSWID= 0
##$AUNMP= <proc_1d>
##$AZFE= 0.1
##$AZFW= 0.5
##$BCFW= 0
##$BC_mod= 2
##$BYTORDP= 0
##$COROFFS= 0
##$CY= -3
##$DATMOD= 1
##$DC= 0
##$DFILT= <>
##$DTYPP= 0
##$F1P= 0
##$F2P= 0
##$FCOR= 1
##$FTSIZE= 65536
##$FT_mod= 6
##$GAMMA= 0
##$GB= 0
##$INTBC= 1
##$INTSCL= 5.30512e-09
##$ISEN= 30
##$LB= 1
##$LEV0= 0
##$LPBIN= 0
##$MAXI= 10000
##$MC2= 0
##$MEAN= 0
##$ME_mod= 0
##$MI= 50
##$NCOEF= 0
##$NC_proc= -6
##$NLEV= 6
##$NOISF1= 182.463
##$NOISF2= 159.3651
##$NSP= 0
##$NTH_PI= 0
##$NZP= 0
##$OFFSET= 248.5645
##$PC= 4
##$PHC0= -6717.788
##$PHC1= 353.4005
##$PH_mod= 1
##$PKNL= yes
##$PPARMOD= 0
##$PSCAL= 0
##$PSIGN= 0
##$REVERSE= no
##$SF= 81.014009
##$SI= 65536
##$SIGF1= 159.3651
##$SIGF2= -187.1042
##$SINO= 113.3802
##$SIOLD= 16384
##$SREGLST= <1H.CDCl3>
##$SSB= 0
##$STSI= 65536
##$STSR= 0
##$SW_p= 40650.406504065
##$SYMM= 0
##$S_DEV= 0
##$TDeff= 32768
##$TDoff= 0
##$TI= <>
##$TILT= no
##$TM1= 0
##$TM2= 0
##$TOPLEV= 0
##$USERP1= <user>
##$USERP2= <user>
##$USERP3= <user>
##$USERP4= <user>
##$USERP5= <user>
##$WDW= 1
##$XDIM= 65536
##$YMAX_p= 360787186
##$YMIN_p= -24915931
$$ End of Bruker specific parameters
$$ ---------------------------------
##NTUPLES= NMR SPECTRUM
##VAR_NAME=  FREQUENCY,     SPECTRUM/REAL,   SPECTRUM/IMAG
##SYMBOL=    X,             R,               I
##VAR_TYPE=  INDEPENDENT,   DEPENDENT,       DEPENDENT
##VAR_FORM=  AFFN,          ASDF,            ASDF
##VAR_DIM=   65536,         65536,           65536
##UNITS=     HZ,            ARBITRARY UNITS, ARBITRARY UNITS
##FACTOR=    0.620285442955139, 1,           1
##FIRST=     20137.2065510759, 0,            0
##LAST=      -20513.1999529892, 0,           0
##MIN=       -20513.1999529892, -24915931,   0
##MAX=       20137.2065510759, 360787186,    0
$$ Real data points
##PAGE= N=1
##DATA TABLE= (X++(R..R)), XYDATA
$$ [...]
$$ plain form
40261 -3286989 446660 3805262 5265034 4893343 4097754 3970025 4016320 3221466 2032215
40252 2032215 1982085 3252571 4066714 3070759 1033436 -592212 -1580887 -2341947 -2444519
40243 -2444519 -1168121 947093 2469133 2927539 3191900 3939566 4733791 4821943 3974894
40234 3974894 2272574 -20706 -1871769 -1771542 308693 1910681 651321 -2174700
40226 -2174700 -2494198 1025093 4264266 2707471 -2002900 -3844373 -835004 2106381
40218 2106381 463563 -3239989 -3508736 -182321 1821186 330368 -1233270 249664
40210 249664 2980571 3602203 2106180 881955 989353 1825070 2954561 3977730 3788518
40201 3788518 2138120 879670 1525568 2580508 1641603 -657701 -1402609 279792 2332615
$$ packed form
40261c286989L733649L358602J459772l71691p95589j27729M6295p94854j189251
40252B032215n0130J270486Q14143r95955k037323j625648r88675p61060j02572
40243b444519J276398K115214J522040M58406K64361P47666P94225Q8152q47049
40234C974894j702320k293280j851063J00227K080235J601988j259360k826021
40226b174700l19498L519291L239173j556795m710371j841473L009369K941385
40218B106381j642818l703552k68747L326415K003507j490818j563638J482934
40210B49664K730907O21632j496023j224225J07398Q35717J129491J023169j89212
40201C788518j650398j258450O45898J054940r38905k299304p44908J682401K052823
$$ plain form
40192 2332615 3278734 3892525 4697767 4386241 2157730 -257934 -620090 909973 2354509
40183 2354509 2639466 2381085 2429839 2852229 3270519 3400500 3265480 3284207 3901691 4863518
40173 4863518 5370856 5305243 5616405 6984270 8879001 10664074 12752780 15581525 18242116
40164 18242116 19693715 20916972 24044181 29369193 35356786 42271135 53403933 70622885
40156 70622885 89845798 103102330 104956328 95693022 79175730 59920057 42150344
40149 42150344 28933965 20657512 15416163 11680363 9528833 8864448 8114103 5884445
40141 5884445 2774042 418267 -418088 -6728 1012624 1644342 1036420 -250224 -823923
40132 -823923 -981530 -2613245 -5411274 -5774765 -1842741 2720419 3254852 768704 221201
$$ packed form
40192B332615R46119O13791Q05242l11526k228511k415664l62156J530063J444536
40183B354509K84957k58381M8754M22390M18290J29981j35020J8727O17484R61827
40173D863518N07338o5613L11162J367865J894731J785073K088706K828745K660591
40164A8242116J451599J223257L127209N325012N987593O914349J1132798J7218952
40156G0622885J9222913J3256532J853998r263306j6517292j9255673j7769713
40149D2150344j3216379q276453n241349l735800k151530o64385p50345k229658
40141E884445l110403k355775q36355M11360J019352O31718o07922j286644n73699
40132h23923j57607j631715k798029l63491L932024M563160N34433k486148n47503
$$ plain form
40123 221201 2982624 5183654 3758123 153514 -2879642 -4590439 -4959639 -3404811
40115 -3404811 -624790 845328 -176482 -1791848 -2024789 -1558909 -1979034 -3204675 -4211084
40106 -4211084 -4623844 -4298347 -2979080 -1397594 -841764 -848299 336950 2220673 1995626
40097 1995626 -722164 -2517314 -1497101 -434560 -1938942 -4047827 -4088338 -3579219 -4950896
40088 -4950896 -6159016 -3667768 958355 2733139 669186 -1544867 -1893870 -1983822 -2512438
40079 -2512438 -1928927 -497457 -852160 -3072001 -3682259 -1322758 869644 683126 457424
40070 457424 2420550 4084495 1965609 -2585092 -4959225 -3335291 -123521 1684058
40062 1684058 1078651 -1289824 -3734374 -4182820 -1873209 1769035 4656777 5648887 4387716
$$ packed form
40123B21201K761423K201030j425531l604609l033156j710797l69200J554828
40115c404811K780021J470118j021810j615366k32941M65880m20125j225641j006409
40106d211084m12760L25497J319267J581486N55830o535J185249J883723k25047
40097A995626k717790j795150J020213J062541j504382k108885m0511N09119j371677
40088d950896j208120K491248M626123J774784k063953k214053l49003q9952n28616
40079b512438N83511J431470l54703k219841o10258K359501K192402j86518k25702
40070D57424J963126J663945k118886m550701k374133J623934L211770J807579
40062A684058o05407k368475k444550m48446K309611L642244K887742R92110j261171
$$ plain form
40053 4387716 1353857 -1207108 -685278 2275264 3868758 2444500 1183853 3182260
40045 3182260 6341033 6343311 3017233 230096 287895 1753859 2539407 2150927 825147
40036 825147 -912921 -1697686 -711266 376424 -697692 -2929812 -2773234 821458 4660597
40027 4660597 5399407 3138837 134226 -1891830 -2183736 -807351 727897 470230 -1281600
40018 -1281600 -2026725 -746950 525691 94705 -718380 -190259 589369 -307587 -1963254
40009 -1963254 -1889271 -287246 -31674 -2327154 -5052211 -5989227 -5441064 -4806228 -4443142
40000 -4443142 -3956827 -3167773 -1906794 -34967 1712146 2185414 1645886 1607710 2261591
39991 2261591 1921210 49365 -1223818 -261217 1293924 1084682 -193225 -275856 592996
$$ packed form
40053D387716l033859k560965N21830K960542J593494j424258j260647J998407
40045C182260L158773K278l326078k787137N7799J465964P85548l88480j325780
40036H25147j738068p84765R86420J087690j074116k232120J56578L594692L839139
40027D660597P38810k260570l004611k026056k91906J376385J535248k57667j751830
40018a281600p45125J279775J272641m30986q13085N28121P79628q96956j655667
40009a963254P3983J602025K55572k295480k725057r37016N48163O34836L63086
40000d443142M86315P89054J260979J871827J747113M73268n39528l8176O53881
39991B261591l40381j871845j273183R62601J555141k09242j277907q2631Q68852
$$ plain form
39982 592996 265186 -1112162 -1006358 954999 1762637 -337223 -2912929 -2925074 -929125
39973 -929125 372053 -30670 -1187823 -2329832 -3106204 -2746906 -1045380 599387 930036
39964 930036 804689 1685873 3131259 3776988 3897103 4659530 5418829 4232387 1008286
39955 1008286 -2022619 -3016645 -1879137 727332 3596818 4567572 2452540 -587826
39947 -587826 -1184882 528565 1075162 -1101534 -3571620 -4099446 -3814729 -4489448 -5266362
39938 -5266362 -4266353 -1564296 1435509 4011992 5748520 5754658 4109163 2616488 2369776
39929 2369776 2099442 756700 -42357 1496986 3921574 4290406 2379016 479340 -238589
39920 -238589 -412190 11050 2048298 5273835 7683410 8432421 8567918 8636698 7748013
$$ packed form
39982E92996l27810j377348J05804J961357Q07638k099860k575706j2145J995949
39973i29125J301178m02723j157153j142009p76372L59298J701526J644767L30649
39964I30036j25347Q81184J445386O45729J20115P62427P59299j186442l224101
39955A008286l030905r94026J137508K606469K869486R70754k115032l040366
39947e87826n97056J713447N46597k176696k470086n27826K84717o74719p76914
39938e266362J000009K702057K999805K576483J736528O138j645495j492675k46712
39929B369776k70334j342742p99057J539343K424588L68832j911390j899676p17929
39920b38589j73601M23240K037248L225537K409575P49011J35497O8780q88685
$$ plain form
39911 7748013 5728497 4218750 4508224 5615642 5519727 3464129 461725 -1771080 -2080948
39902 -2080948 -756377 728933 1286015 1117551 580747 -679389 -2233594 -1918855 1446226
39893 1446226 5370336 6370706 4888448 4655098 7206024 10147311 11414990 12081407
39885 12081407 13730918 15909908 17760464 19711804 21906612 23264022 23771074 25291941
39877 25291941 28160172 29437381 26975871 22934029 20478908 19149872 16817977 14387444
39869 14387444 14477183 16403276 16815131 15306470 15193123 17999414 21164217 22593972 23744332
39860 23744332 26080321 27733593 26398851 23067379 20009864 17093728 13259300 10024148
39852 10024148 9793307 11329053 10701697 7071139 3991878 3926440 4768609 3697575 1640490
$$ packed form
39911G748013k019516j509747K89474J107418r5915k055598l002404k232805l09868
39902b080948J324571J485310N57082j68464n36804j260136j554205L14739L365081
39893A446226L924110J000370j482258k33350K550926K941287J267679O66417
39885A2081407J649511K178990J850556J951340K194808J357410N07052J520867
39877B5291941K868231J277209k461510m041842k455121j329036k331895k430533
39869A4387444Q9739J926093M11855j508661j13347K806291L164803J429755J150360
39860B3744332K335989J653272j334742l331472l057515k916136l834428l235152
39852A0024148k30841J535746o27356l630558l079261o5438Q42169j071034k057085
$$ plain form
39843 1640490 1204883 2249669 2839852 3535976 7018520 13202869 18192384 19432299 19130952
39834 19130952 20636106 23603566 25177213 24477521 23240062 22684735 22232077 21078165
39826 21078165 18879459 15171532 10362010 6950221 7047848 8716010 7869122 4283293
39818 4283293 2288918 4405252 8006575 10280401 12645680 17031978 21135681 21721833
39810 21721833 20360104 21035506 23317163 22962929 19021076 15230985 13691381 12066888
39802 12066888 8719398 6115331 6564115 8111165 7557206 4949109 2406456 683057
39794 683057 -569030 -1029023 -658898 -812021 -2195776 -3293957 -2810507 -1901082 -1874702
39785 -1874702 -1645539 64357 1874555 1857260 779237 280029 -504909 -3060378 -5563187
$$ packed form
39843A640490m35607J044786N90183O96124L482544O184349M989515J239915l01347
39834A9130952J505154K967460J573647o99692j237459n55327m52658j153912
39826B1078165k198706l707927m809522l411789R7627J668162q46888l585829
39818D283293j994375K116334L601323K273826K365279M386298M103703N86152
39810B1721833j361729O75402K281657l54234l941853l790091j539604j624493
39802A2066888l347490k604067M48784J547050n53959k608097k542653j723399
39794F83057j252087m59993L70125j53123j383755j098181M83450R09425K6380
39785a874702K29163J709896J810198j7295j078023m99208p84938k555469k502809
$$ plain form
39776 -5563187 -4757397 -1241463 915330 -118888 -2088701 -2749455 -2439008 -2003068 -1322480
39767 -1322480 -733533 -1125360 -1871258 -1312019 121336 123458 -1480205 -2068636 -631133
39758 -631133 370959 -832171 -2294671 -1632030 180195 698756 -166302 -585723 235963
39749 235963 1542333 2421243 2137763 159960 -2757215 -4594086 -4287860 -2704841 -617974
39740 -617974 2376845 5731089 6943053 4645716 1002266 -1004881 -1262299 -1549227 -2279397
39731 -2279397 -2453560 -1946600 -1752544 -2390792 -3469638 -4206086 -3522364 -961808 1571544
39722 1571544 972505 -2712802 -5286425 -3727762 -363636 641648 -1190866 -3448482
39714 -3448482 -5078603 -6439538 -6671793 -4720532 -2036354 -782997 -241339 1504071
$$ packed form
39776e563187Q05790L515934K156793j034218j969813o60754L10447M35940O80588
39767a322480N88947l91827p45898N59239J433355K122j603663n88431J437503
39758f31133J002092j203130j462500O62641J812225N18561q65058m19421Q21686
39749B35963J306370Q78910k83480j977803k917175j836871L06226J583019K086867
39740f17974K994819L354244J211964k297337l643450k007147k57418k86928p30170
39731b279397j74163N06960J94056o38248j078846p36448O83722K560556K533352
39722A571544n99039l685307k573623J558663L364126J005284j832514k257616
39714c448482j630121j360935k32255J951261K684178J253357N41658J745410
$$ plain form
39706 1504071 3345055 2675806 398268 -152144 867799 -162067 -3771423 -5856710
39698 -5856710 -4126899 -1315943 105935 1742507 4845222 6389249 3623242 -574588
39690 -574588 -1295888 1348737 2969088 1585964 -393265 -632807 176354 283054 -768049
39681 -768049 -2330173 -3422572 -3030292 -1073747 894760 1188903 -50236 -1486530 -2526502
39672 -2526502 -3221300 -2998713 -1367788 473908 679924 -569400 -1200553 -307573 536962
39663 536962 -445801 -2925714 -5019604 -5256655 -3524855 -838516 1315148 1867810 873451
39654 873451 -680068 -1702306 -1654810 -868519 -454356 -1285451 -2698486 -2952353 -1481490
39645 -1481490 195107 513078 -170174 -585153 -502231 -423896 -250338 233061 269788 -782599
$$ packed form
39706A504071J840984o69249k277538n50412J019943j029866l609356k085287
39698e856710J729811K810956J421878J636572L102715J544027k766007m197830
39690e74588p21300K644625J620351j383124j979229k39542Q09161J06700j051103
39681g68049j562124j092399L92280J956545J968507K94143j239139j436294j039972
39672b526502o94798K22587J630925J841696K06016j249324o31153Q92980Q44535
39663E36962r82763k479913k093890k37051J731800K686339K153664N52662r94359
39654H73451j553519j022238M7496P86291M14163q31095j413035k53867J470863
39645a481490J676597L17971o83252m14979Q2922P8335J73558M83399L6727j052387
$$ plain form
39635 -782599 -1830273 -1313558 293284 1203244 1281679 2063160 3715897 4413624 3321320
39626 3321320 1802654 680605 -1234526 -4320479 -6201943 -4945653 -2445871 -1940250
39618 -1940250 -3295620 -3620406 -1915897 -49129 866504 1879975 3302966 3451796 1714232
39609 1714232 259581 810393 1899927 1524942 640706 1424970 3468037 4546845 4313068
39600 4313068 4248213 4404905 3331781 1371782 922433 2698311 4538933 4867189 4622459
39591 4622459 4630787 3910330 2260168 1777877 3514407 4941002 3408453 317766 -948325
39582 -948325 173980 1564673 2210585 2798273 3181245 2348349 833417 407128 1222000
39573 1222000 1666268 1121219 496427 -23834 -1271611 -2889058 -3312841 -2412928 -1769901
$$ packed form
39635g82599j047674N16715J606842R09960P8435P81481J652737O97727j092304
39626C321320j518666j122049j915131l085953j881464J256290K499782N05621
39618a940250j355370l24786J704509J866768R15633J013471J422991J48830j737564
39609A714232j454651N50812J089534l74985q84236P84264K043067J078808k33777
39600D313068o4855J56692j073124j959999m49349J775878J840622L28256k44730
39591D622459Q328p20457j650162m82291J736530J426595j532549l090687j266091
39582i48325J122305J390693O45912N87688L82972q32896j514932m26289Q14872
39573A222000M44268n45049o24792n20261j247777j617447m23783Q99913O43027
$$ plain form
39564 -1769901 -1771084 -816909 1760281 4153704 4402757 2473249 -585851 -3652533 -5211468
39555 -5211468 -4235018 -2134928 -1672081 -3135874 -3886433 -2584585 -1320069 -2116797 -3705724
39546 -3705724 -3600812 -1495664 1159225 3294371 4307459 3633760 1834335 614484
39538 614484 389945 -432546 -2414722 -3517359 -2377957 -854749 -913638 -1138535 641516
39529 641516 2949278 2462157 -533829 -2043273 79766 3378232 4233435 1901857 -1481519
39520 -1481519 -3295950 -2424796 -84285 1254173 621597 -431020 -575055 -967259 -2792941
39511 -2792941 -4138754 -2445422 731972 1106634 -2016235 -4539414 -3779992 -2312238
39503 -2312238 -3570446 -6584458 -7932790 -7001863 -6206688 -6850073 -7617660 -7134200 -5719863
$$ packed form
39564a769901j183R54175K577190K393423K49053j929508l059100l066682j558935
39555e211468R76450K100090M62847j463793p50559J301848J264516p96728j588927
39546c705724J04912K105148K654889K135146J013088o73699j799425j219851
39538F14484k24539q22491j982176j102637J139402J523208n8889k24897J780051
39529F41516K307762m87121k995986j509444K123039L298466Q55203k331578l383376
39520a481519j814431Q71154K340511J338458o32576j052617j44035l92204j825682
39511b792941j345813J693332L177394L74662l122869k523179P59422J467754
39503b312238j258208l014012j348332R30927P95175o43385p67587M83460J414337
$$ plain form
39494 -5719863 -4315044 -3469169 -3675157 -4964477 -5761361 -4026810 -453719 1321648 -680218
39485 -680218 -3399150 -2243149 2665614 6439478 5962251 3730092 3688404 5524334 5598421
39476 5598421 2377992 -1773662 -4039807 -4012503 -2841879 -1609896 -1166887 -1865766 -2715796
39467 -2715796 -2168021 -318337 1006242 830083 179699 -24088 -663644 -2896685 -5980829
39458 -5980829 -7703861 -6515744 -2854229 1011215 2513674 1254425 -168961 864594
39450 864594 3465869 4484785 3060147 1492131 1327179 1340755 359377 -547735 -132271
39441 -132271 976675 1706446 2039424 1841790 371393 -1701181 -2075405 -170029 1573636
39432 1573636 1329370 444708 632094 1146360 810918 358788 543707 454511 46907 1551429
$$ packed form
39494e719863J404819Q45875k05988j289320p96884J734551L573091J775367k001866
39485f80218k718932J156001M908763L773864m77227k232159m1688J835930P4087
39476E598421l220429m151654k266145K7304J170624J231983M43009o98879q50030
39467b715796N47775J849684J324579j76159o50384k03787o39556k233041l084144
39458e980829j723032J188117L661515L865444J502459j259249j423386J033555
39450H64594K601275J018916j424638j568016j64952J3576r81378r07112M15464
39441a32271J108946P29771L32978j97634j470397k072574l74224J905376J743665
39432A573636k44266q84662J87386N14266l35442m52130J84919q9196m07604J504522
$$ plain form
39422 1551429 5528533 8330369 6876048 3428070 1946224 2122016 1225981 -241964
39414 -241964 431307 2780073 3612270 2318319 1272790 1177002 258133 -1807824 -3108294
39405 -3108294 -2884832 -2261284 -1580715 -315036 677293 230832 -309253 979871 2539880
39396 2539880 1373094 -1409187 -1741895 794306 2426450 1623117 1103003 2529315 4037343
39387 4037343 4316168 4556530 4911579 3480933 375973 -1488903 -1134589 -744309 -906692
39378 -906692 534441 3333155 3842886 1380746 241362 2616611 4929099 4542165 4533662
39369 4533662 7461186 9657325 7107153 2638880 1416337 2775698 2590032 934843
39361 934843 1068057 2656521 2292721 -174317 -1585580 -1268853 -1564525 -2798373 -2823338
$$ packed form
39422A551429L977104K801836j454321l447978j481846J75792q96035j467945
39414b41964O73271K348766Q32197j293951j045529r5788r18869k065957j300470
39405c108294K23462O23548O80569J265679R92329m46461n40085J289124J560009
39396B539880j166786k782281l32708K536201J632144q03333n20114J426312J508028
39387D037343K78825K40362L55049j430646l104960j864876L54314L90280j62383
39378i06692J441133K798714N09731k462140j139384K375249K312488l86934q503
39369D533662K927524K196139k550172m468273j222543J359361j85666j655189
39361I34843J33214J588464l63800k467038j411263L16727k95672j233848k4965
$$ plain form
39352 -2823338 -1620334 -1477942 -2283537 -1322394 1657500 3638568 3358012 2874082 3152841
39343 3152841 2266892 -603348 -3101065 -3188357 -1527686 830924 3812782 6095218 5105375
39334 5105375 1157795 -1600820 -627847 1364191 553194 -2579342 -4545493 -3724146 -1389012
39325 -1389012 841847 2267387 2693157 2677555 3474442 5254176 6314701 5446624 3881192
39316 3881192 3250286 2885110 1243621 -954631 -1500433 -216756 804147 615821 596040
39307 596040 1575897 2224395 1615860 1258647 2553750 3843783 2613608 -166563 -875286
39298 -875286 1387639 3213288 1821262 -1001564 -1795951 -215223 1489348 2306150 3015971
39289 3015971 3643735 3152073 1604055 246019 -546607 -1171863 -912026 1190359 3634017
$$ packed form
39352b823338J203004J42392q05595R61143K979894J981068k80556m83930K78759
39343C152841q85949k870240k497717q7292J660671K358610K981858K282436r89843
39334E105375l947580k758615R72973J992038q10997l132536j966151Q21347K335134
39325a389012K230859J425540M25770j5602P96887J779734J060525q68077j565432
39316C881192o30906l65176j641489k198252n45802J283677J020903j88326j9781
39307E96040R79857O48498o08535l57213J295103J290033j230175k780171p08723
39298h75286K262925J825649j392026k822826p94387J580728J704571Q16802P09821
39289C015971O27764m91662j548018j358036p92626o25256K59837K102385K443658
$$ plain form
39280 3634017 3720846 1902558 1529757 3354604 3846556 680425 -3508285 -5189922 -4644725
39271 -4644725 -3738495 -1891790 1977393 5481950 4986186 1143923 -1554892 -810827 1185992
39262 1185992 1890203 1785945 2500337 3828434 4253061 3307423 2064683 1530632 1393757
39253 1393757 775533 47105 926863 3866603 6339115 5690492 3135067 2194726 3197917
39244 3197917 2767335 -405656 -3134465 -2880123 -1428156 -768770 806847 4766914 7999224
39235 7999224 7202462 5035006 6466318 10534105 11468191 7626318 3637592 2934980 3388684
39226 3388684 2046304 -215571 -1096657 -629080 -190621 -31361 374348 1147526 2261592
39217 2261592 3426345 3299272 746244 -2880088 -4942485 -5162833 -5559042 -6566250 -6175427
$$ packed form
39280C634017Q6829j818288l72801J824847M91952l166131m188710j681637N45197
39271d644725R06230J846705L869183L504557m95764l842263k698815P44065J996819
39262A185992P04211j04258P14392J328097M24627r45638j242740n34051j36875
39253A393757o18224p28428Q79758K939740K472512o48623k555425r40341J003191
39244C197917m30582l172991k728809K54342J451967O59386J575617L960067L232310
39235G999224p96762k167456J431312M067787R34086l841873l988726p02612M53704
39226C388684j342380k261875q81086M67577M38459J59260M05709P73178J114066
39217B261592J164753j27073k553028l626332k062397k20348l96209j007208L90823
$$ plain form
39208 -6175427 -3603824 -864031 409222 1005739 1828822 2132296 1478841 1096590 1665265
39199 1665265 1710190 -149437 -2823947 -4033272 -2938805 -675762 779165 18427 -2354505
39190 -2354505 -3879555 -3250719 -2401431 -3452210 -4666457 -2722181 1603475 4087497
39182 4087497 3576787 3395235 5197955 6052257 3778206 956109 631383 1507291 779381
39173 779381 -979592 -1247559 145211 1419399 2074306 2799892 3351320 3032176 2219008
39164 2219008 1351642 -185776 -2183197 -2387677 432476 3833711 4642241 3072910 1384120
39155 1384120 58295 -1689966 -2961941 -2142997 -166439 449673 -397012 -405205 1072687
39146 1072687 1968570 1041360 -136877 292606 1900695 2874195 2125577 -117930 -2628554
$$ packed form
39208f175427K571603K739793J273253N96517Q23083L03474o53455l82251N68675
39199A665265M4925j859627k674510j209325J094467K263043J454927p60738k372932
39190b354505j525050O28836Q49288j050779j214247J944276M325656K484022
39182D087497n10710j81552J802720Q54302k274051k822097l24726Q75908p27910
39173G79381j758973k67967J392770J274188O54907P25586N51428l19144q13168
39164B219008q67366j537418j997421k04480K820153L401235Q08530j569331j688790
39155A384120j325825j748261j271975Q18944J976558O16112q46685q193J477892
39146A072687Q95883r27210j178237M29483J608089R73500p48618k243507k510624
$$ plain form
39137 -2628554 -3654587 -2285858 145722 1031277 -584872 -2745295 -2805749 -566672 1344171
39128 1344171 418253 -2583707 -4133324 -2062837 1741876 3985580 4303900 4811573 5921652
39119 5921652 5658171 3525447 1798409 1677515 1284296 -578439 -1619624 329822 3283678
39110 3283678 3756779 1834723 571022 1381998 2792558 3098755 2020633 335796 -435312
39101 -435312 933161 3197774 3331980 1076689 222037 2844474 5270721 3523035 16911
39092 16911 -112130 2603494 3109731 619661 -120175 2794798 4934953 2777386 -773465
39083 -773465 -1386525 246410 653089 -705682 -1726240 -1708493 -1627273 -1523559 -611596
39074 -611596 710126 1424317 1910429 3200085 4640303 4401182 2305698 432880 612957
$$ packed form
39137b628554j026033J368729K431580Q85555j616149k160423o0454K239077J910843
39128A344171r25918l001960j549617K070487L804713K243704L18320N07673J110079
39119E921652k63481k132724j727038j20894l93219j862735j041185J949446K953856
39110C283678M73101j922056j263701Q10976J410560L06197j078122j684837p71108
39101d35312J368473K264613J34206k255291q54652K622437K426247j747686l506124
39092A6911j29041K715624N06237k490070p39836K914973K140155k157567l550851
39083g73465o13060J632935M06679j358771j020558J7747Q1220J03714R11963
39074f11596J321722P14191M86112J289656J440218k39121k095484j872818J80077
$$ plain form
39065 612957 2466309 4176104 4449412 3532014 2678564 2685611 2967034 2384726 792934
39056 792934 -977546 -2548419 -4340611 -6302926 -7373208 -6702843 -4704529 -2551534
39048 -2551534 -1181240 -803390 -748165 6204 1386104 1747316 -42149 -2518025 -3085241
39039 -3085241 -1337154 586802 809571 -595673 -2475878 -3530736 -2656409 -153552
39031 -153552 1673451 1028311 -645955 -582651 1247040 2691976 3468371 5105565 6851410
39022 6851410 5822510 2213496 18953 678013 301564 -3883598 -8278905 -8000163 -4167710
39013 -4167710 -1700917 -1971250 -2333830 -1720590 -1790016 -2549076 -1409741 2258921 5185266
39004 5185266 4417228 1089857 -1451152 -1603937 -457549 55003 -863363 -2212810 -2516503
$$ packed form
39065F12957J853352J709795K73308r17398q53450P047K81423n82308j591792
39056G92934j770480j570873j792192j962315j070282O70365J998314K152995
39048b551534J370294L77850N5225P54369J379900L61212j789465k475876n67216
39039c085241J748087J923956K22769j405244j880205j054858Q74327K502857
39031a53552J827003o45140j674266O3304J829691J444936P76395J637194J745845
39022F851410j028900l609014k194543O59060l76449m185162m395307K78742L832453
39013d167710K466793k70333l62580O13240o9426p59060J139335L668662K926345
39004E185266p68038l327371k541009j52785J146388N12552r18366j349447l03693
$$ plain form
38995 -2516503 -2119529 -3035381 -5516705 -6576405 -4028661 -350516 415556 -1599627 -2896054
38986 -2896054 -2318197 -1859582 -1820401 207618 4305457 6594845 4956010 2681020 3502268
38977 3502268 5962309 6049501 3183829 58177 -1932526 -3502430 -4533908 -3823125 -1754224
38968 -1754224 -283573 75538 788299 2439161 3643176 3454552 2833872 2819779 2853115
38959 2853115 1945274 431743 -320468 626779 2962249 5218418 5777133 4560945 3422631
38950 3422631 3836924 4708778 3946498 1746664 302594 315868 156472 -986040 -1541081
38941 -1541081 -276060 1602430 2557191 2955899 3408984 2760986 117754 -2514670 -2381598
38932 -2381598 -103873 1055298 -143078 -1611568 -1515484 -572245 -38266 290690 895192
$$ packed form
38995b516503L96974r15852k481324j059700K547744L678145P66072k015183j296427
38986b896054N77857M58615L9181K028019M097839K289388j638835k274990Q21248
38977C502268K460041Q7192k865672l125652j990703j569904j031478P10783K068901
38968a754224J470651L59111P12761J650862J204015j88624o20680j4093L3336
38959B853115r07841j513531p52211R47247K335470K256169N58715j216188j138314
38950C422631M14293Q71854p62280k199834j444070J3274j59396j142512n55041
38941a541081J265021J878490R54761L98708M53085o47998k643232k632424J33072
38932b381598K277725J159171j198376j468490R6084R43239N33979L28956O04502
$$ plain form
38923 895192 1172261 578276 -196066 -329961 -23041 374456 1148091 2164788 2315080
38914 2315080 1154172 -78507 -285976 -203604 -946008 -2020194 -2333272 -2159328 -2368397
38905 -2368397 -2529533 -1657779 -249606 347191 160346 232300 371015 -614190 -2514141
38896 -2514141 -3752421 -3987235 -4470868 -5425608 -5340638 -3590945 -1522939 22338 2009178
38887 2009178 4717232 6164967 4861467 2346680 976066 684155 115314 -383403 522316
38878 522316 2259126 2871714 2280849 2563277 4751235 7454280 8999324 9056595 7855135
38869 7855135 5731847 3875912 3504798 3674734 2015281 -1404336 -3164001 -1077680
38861 -1077680 2199099 2409197 -576500 -2738375 -1350592 1841086 3390115 2389977
$$ packed form
38923H95192K77069n93985p74342j33895L06920L97497P73635J016697J50292
38914B315080j160908j232679k07469Q2372p42404j074186l13078J73944k09069
38905b368397j61136Q71754J408173N96797j86845P1954J38715r85205j899951
38896b514141j238280k34814m83633r54740Q4970J749693K068006J545277J986840
38887B009178K708054J447735j303500k514787j370614k91911n68841m98717R05719
38878E22316J736810O12588n90865K82428K187958K703045J545044N7271j201460
38869G855135k123288j855935l71114J69936j659453l419617j759665K086321
38861a077680L276779K10098k985697k161875J387783L191678J549029j000138
$$ plain form
38853 2389977 980838 1490003 3938728 6215089 6361979 4592238 2762463 1836124 813077
38844 813077 -1062605 -2112095 -42413 4275081 6967687 5861713 3224935 2437435
38836 2437435 3354130 3033064 402251 -2272734 -2962655 -2554547 -2584940 -2202621 260249
38827 260249 3588482 4431447 2177665 377363 1707230 3634382 1703112 -3823328
38819 -3823328 -7617097 -5986083 -1345914 1297249 424667 -1286977 -1264970 31955 489028
38810 489028 -875275 -3037683 -4228027 -3675583 -2191715 -931738 211076 2115855
38802 2115855 4251582 4502107 2183094 -174357 222356 2638142 4035111 3481211 2818961
38793 2818961 2891494 1927068 -1219892 -4614593 -5766914 -4885129 -3748423 -2764817 -1356122
$$ packed form
38853B389977j409139N09165K448725K276361J46890j769741j829775r26339j023047
38844H13077j875682j049490K069682M317494K692606j105974k636778p87500
38836B437435R16695l21066k630813k674985o89921M08108l0393L82319K462870
38827B60249L328233Q42965k253782j800302J329867J927152j931270n526440
38819c823328l793769J631014M640169K643163q72582j711644K2007J296925M57073
38810D89028j364303k162408j190344N52444J483868J259977J142814J904779
38802B115855K135727K50525k319013k357451L96713K415786J396969n53900o62250
38793B818961P2533r64426l146960l394701j152321Q81785J136706R83606J408695
$$ plain form
38784 -1356122 -306339 -1127345 -3101655 -3309742 -346314 3671387 5751452 5490779 4857112
38775 4857112 5286686 6148329 5951111 4173810 1553483 -992167 -3105354 -4533137 -4634668
38766 -4634668 -3224591 -1704374 -2117308 -4603209 -6820744 -6629166 -4492041 -2447238
38758 -2447238 -1606762 -1668409 -2014516 -2043357 -1129940 383495 780945 -968831 -3265790
38749 -3265790 -3560432 -1555837 882739 2493933 3338383 3152147 1372436 -1065489 -2315481
38740 -2315481 -2374878 -2899481 -3865805 -3208110 -714768 744906 -403213 -1708109 -710563
38731 -710563 914734 336530 -1349523 -769795 2061521 3685510 2754839 1862550 2961356
38722 2961356 4287620 3520367 1520209 849709 2012635 3035466 2163757 -245982 -2169712
$$ packed form
38784a356122J049783q21006j974310k08087K963428M017701K080065k60673o33667
38775D857112M29574Q61643j97218j777301k620327k545650k113187j427783j01531
38766d634668J410077J520217m12934k485901k217535J91578K137125K044803
38758b447238Q40476o1647l46107k8841R13417J513435L97450j749776k296959
38749c265790k94642K004595K438576J611194Q44450j86236j779711k437925j249992
38740b315481n9397n24603r66324O57695K493342J459674j148119j304896R97546
38731g10563J625297n78204j686053N79728K831316J623989r30671q92289J098806
38722B961356J326264p67253k000158o70500J162926J022831q71709k409739j923730
$$ plain form
38713 -2169712 -1717317 916683 3130603 2530110 -44854 -1526122 -856839 -243625 -1350071
38704 -1350071 -2532092 -1766890 -475362 -1593794 -4613312 -5654927 -2915730 722421
38696 722421 1832934 1004292 1231796 3079201 3934649 1998481 -1160695 -2809221 -2340760
38687 -2340760 -1299440 -1014479 -1365571 -1520677 -918289 402942 1769421 2262303 1667883
38678 1667883 818604 496022 418215 -25477 -580665 -619178 -360485 -490864 -965282 -1407880
38668 -1407880 -2218955 -3763445 -4951876 -4564687 -3618798 -4009165 -4925999 -3644143 -349925
38659 -349925 1318147 -65062 -1085535 1170488 4545640 5710415 5544838 6585794
38651 6585794 7536055 5178051 501101 -2020921 -907799 1209641 2835335 5062780
$$ packed form
38713b169712M52395K634000K213920o00493k574964j481268O69283O13214j106446
38704a350071j182021P65202J291528j118432l019518j041615K739197L638151
38696G22421J110513q28642K27504J847405Q55448j936168l159176j648526M68461
38687b340760J041320K84961l51092j55106O02388J321231J366479M92882n94420
38678A667883q49279l22582p7807m43692n55188l8513K58693j30379m74418m42598
38668a407880q11075j544490j188431L87189R45889l90367r16834J281856L294218
38659c49925J668072j383209j020473K256023L375152J164775j65577J040956
38651F585794R50261k358004m676950k522022J113122K117440J625694K227445
$$ plain form
38643 5062780 7289878 6648477 3253482 1239522 2404493 3262054 1079240 -1400374
38635 -1400374 -673748 1743329 2221867 866772 310281 777819 532316 -197236 270406
38626 270406 1560445 1932709 1775386 2899554 4898521 5678555 5261286 5587587 6657891
38617 6657891 6392302 4591455 3566374 4106366 4039560 1945778 -445047 -894574 464458
38608 464458 2031023 2690529 2012849 262117 -1057789 -326303 1964024 3654368 3769006
38599 3769006 3112561 2112314 464924 -875549 -117749 2223325 3219998 1542077 -845313
38590 -845313 -1881071 -1716617 -834231 1258993 3983405 5127158 4104076 3108192 3157562
38581 3157562 1924629 -1976798 -5340147 -4280704 171706 3666787 4210946 3116694
$$ packed form
38643E062780K227098o41401l394995k013960J164971Q57561k182814k479614
38635a400374P26626K417077M78538j355095n56491M67538k45503p29552M67642
38626B70406J290039L72264j57323J124168J998967P80034m17269L26301J070304
38617F657891k65589j800847j025081N39992o6806k093782k390825m49527J359032
38608D64458J566565O59506o77680j750732j319906P31486K290327J690344J14638
38599C769006o56445j000247j647390j340473P57800K341074R96673j677921k387390
38590h45313j035758J64454Q82386K093224K724412J143753j023082r95884M9370
38581C157562j232933l901427l363349J059443M452410L495081N44159j094252
$$ plain form
38573 3116694 1688766 350242 134569 1668935 3127569 2242503 -17488 -647052 914754
38564 914754 2357899 2183829 976226 -565696 -1905571 -1548191 998786 2599419 -302734
38555 -302734 -5867531 -8441149 -6438557 -4165394 -4668911 -5599577 -4404799 -2978026 -3707500
38546 -3707500 -4693665 -3054305 -322270 -249882 -2884292 -4819050 -4307478 -2517902 -488215
38537 -488215 1677605 3024777 2476185 1239646 1559625 3191793 3905743 3219484 2564882
38528 2564882 1846828 -661611 -4350211 -5591212 -2485189 2271690 4689595 3568015
38520 3568015 212638 -3595516 -5948994 -5330572 -2543280 -493796 -620143 -1271392 -998161
38511 -998161 -1181456 -3177579 -4900830 -3360938 462797 2570057 1573833 223130 753139
$$ packed form
38573C116694j427928j338524k15673J534366J458634q85066k259991o29564J561806
38564I14754J443145j74070j207603j541922j339875L57380K546977J600633k902153
38555c02734n564797k573618K002592K273163n03517r30666J194778J426773p29474
38546c707500r86165J639360K732035P2388k634410j934758N11572J789576K029687
38537d88215K165820J347172n48592j236539L19979J632168P13950o86259o54602
38528B564882p18054k508439l688600j241001L106023M756879K417905j121580
38520C568015l355377l808154k353478O18422K787292K049484j26347o51249K73231
38511i98161j83295j996123j723251J539892L823735K107260r96224j350703N30009
$$ plain form
38502 753139 1749469 1153130 -61832 426753 2275268 2804531 1214490 54645 1556671
38493 1556671 4252681 4935171 3203879 2065750 3688989 6300478 6538276 3865902
38485 3865902 984701 67228 289082 -271541 -1565336 -1615369 795169 4561255 7513074
38476 7513074 8501707 7849695 6223610 3863400 1151474 -744795 -686849 977386 2540918
38467 2540918 2736434 1706781 18991 -2180754 -4322765 -4804707 -2555973 1185979
38459 1185979 3815708 3961149 2380548 672064 9971 716861 1957740 2076442 251455
38450 251455 -2370501 -3990162 -4098638 -3238894 -1741046 -79464 426802 -847790 -2210092
38441 -2210092 -1610145 243291 984986 420243 557706 1783247 1945347 -98559 -2792671
$$ packed form
38502G53139R96330n96339j214962M88585J848515N29263j590041j159845J502026
38493A556671K696010O82490j731292j138129J623239K611489K37798k672374
38485C865902k881201r17473K21854n60623j293795n0033K410538L766086K951819
38476G513074R88633o52012j626085k360210k711926j896269N7946J664235J563532
38467B540918J95516j029653j687790k199745k142011m81942K248734L741952
38459A185979K629729J45441j580601j708484o62093P06890J240879J18702j824987
38450B51455k621956j619661j08476Q59744J497848J661582N06266j274592j362302
38441b210092N99947J853436P41695n64743J37463J225541J62100k043906k694112
$$ plain form
38432 -2792671 -4605029 -5684668 -5765076 -3437383 793565 3562073 2963193 1438065 1982916
38423 1982916 3672504 3651499 1767002 288494 283670 1079946 2338563 3910923 4361034
38414 4361034 2315949 -1091860 -3377942 -3728175 -2760347 -337686 3555678 6492187
38406 6492187 5495306 1417229 -1583244 -1441287 -302450 -584973 -1775905 -2432457 -2835872
38397 -2835872 -3694821 -3915184 -1894058 1584688 3606671 2479755 -272821 -1791613
38389 -1791613 -1242657 -479564 -1142531 -2168061 -1524217 248294 512293 -1246195 -2385908
38380 -2385908 -1398136 -396289 -1370263 -2671305 -1963315 -291318 118647 89579 1639435
38371 1639435 3443427 2527488 -352674 -1586870 -670268 -570059 -1921075 -1881996 135320
$$ packed form
38432b792671j812358j079639q0408K327693M230948K768508n98880j525128N44851
38423A982916J689588k1005j884497j478508m824P96276J258617J572360M50111
38414D361034k045085l407809k286082l50233R67828K422661L893364K936509
38406F492187r96881m078077l000473J41957J138837k82523j190932o56552m03415
38397b835872q58949k20363K021126L478746K021983j126916k752576j518792
38389a791613N48956P63093o62967j025530O43844J772511K63999j758488j139713
38380b385908R87772J001847r73974j301042P07990J671997M09965k9068J549856
38371A639435J803992r15939k880162j234196R16602J00209j351016L9079K017316
$$ plain form
38362 135320 641749 -1929845 -3958001 -2203640 1178963 2396123 1583403 1186348 1364056
38353 1364056 658615 -544262 -750185 -423703 -1164678 -2579025 -2853813 -1997546 -1812123
38344 -1812123 -2674482 -2749197 -915625 1232019 1122730 -1734365 -4903289 -5317752 -2623654
38335 -2623654 213655 459552 -955571 -1199902 -43988 26487 -1815259 -3342379 -3010068
38326 -3010068 -1986846 -1223432 330304 2767991 3570141 1361896 -1240523 -1194573 723062
38317 723062 1871540 1890461 2025197 2041020 826781 -1070265 -2135375 -2125729 -1511988 -59356
38307 -59356 1957068 2846803 2099103 1934048 3696145 4894045 2992930 62959 -88107
38298 -88107 2264539 3823022 3799292 4078549 4721958 3798533 1496740 180825 285240
$$ packed form
38362A35320N06429k571594k028156J754361L382603J217160q12720l97055J77708
38353A364056p05441j202877k05923L26482p40975j414347k74788Q56267J85423
38344a812123q62359p4715J833572K147644j09289k857095l168924m14463K694098
38335b623654K837309K45897j415123k44331J155914P0475j841746j527120L32311
38326c010068J023222P63414J553736K437687Q02150k208245k602419M5950J917635
38317G23062J148478J8921J34736J5823j214239j897046j065110R646O13741J452632
38307e9356K016424Q89735p47700j65055J762097J197900j901115k929971j51066
38298h8107K352646J558483k3730K79257O43409r23425k301793j315915J04415
$$ plain form
38289 285240 111621 -325140 595773 2099371 1630909 -66847 753127 4437230 6657169
38280 6657169 5214417 3322445 3697783 3983599 1342767 -2363798 -3885006 -3930002 -5063410
38271 -5063410 -6644078 -6206756 -4339501 -3851290 -4801391 -4464363 -2233365 -748694 -1438276
38262 -1438276 -2250474 -1162751 657260 920454 -354844 -1313840 -1086469 -338606 535046
38253 535046 1970721 3666615 3997149 2130573 -152930 -354570 1229130 1752355 71021
38244 71021 -1337005 -101202 2354010 3161883 2554853 2944400 4171159 3386209 193576
38235 193576 -1748708 47029 3085382 3679373 2284906 2190583 4248152 5985519 5715323
38226 5715323 4756588 4838667 5312590 4336066 1905623 206104 766684 2337205 2521156
$$ packed form
38289B85240j73619m36761R20913J503598m68462j697756Q19974L684103K219939
38280F657169j442752j891972L75338K85816k640832l706565j521208m4996j133408
38271e063410j580668M37322J867255M88211r50101L37028K230998J484671o89582
38262a438276q12198J087723J820011K63194j275298r58996K27371P47863Q73652
38253E35046J435675J695894L30534j866576k283503k01640J583700N23225j681334
38244G1021j408026J235803K455212Q07873o07030L89547J226759p84950l192633
38235A93576j942284J795737L038353N93991j394467r4323K057569J737367k70196
38226E715323r58735Q2079M73923r76524k430443j699519N60580J570521J83951
$$ plain form
38217 2521156 1067260 117987 933259 2074973 1910719 1210479 1410178 1778352 866617
38208 866617 -261058 623366 2765629 3135694 1545077 1304945 3639453 5137637 2838453
38199 2838453 -1286041 -3461852 -3126472 -2092402 -1024061 122912 -26629 -2479155
38191 -2479155 -5001639 -4397163 -1172842 1100046 760182 -646495 -1914340 -3683666
38183 -3683666 -5736423 -5917726 -3253974 125366 1727363 1561349 813235 -538829 -2751812
38174 -2751812 -4162862 -2483456 1751804 5020642 4797229 2422470 1111079 1973809
38166 1973809 3216649 2974928 1524628 197568 -651353 -1352162 -1284267 706621 3999349
38157 3999349 5939449 4913426 2611006 1916434 3151184 3925043 2675219 740165
$$ packed form
38217B521156j453896r49273Q15272J141714j64254p00240J99699L68174r11735
38208H66617j127675Q84424K142263L70065j590617k40132K334508J498184k299184
38199B838453m124494k175811L35380J034070J068341J146973j49541k452526
38191b479155k522484O04476L224321K272888l39864j406677j267845j769326
38183c683666k052757j81303K663752L379340J601997j66014p48114j352064k212983
38174b751812j411050J679406M235260L268838k23413k374759j311391Q62730
38166A973809J242840k41721j450300j327060q48921p00809O7895J990888L292728
38157C999349J940100j026023k302420o94572J234750P73859j249824j935054
$$ plain form
38149 740165 150092 619672 278136 -1009073 -962971 1687182 4676902 4797740 2205148
38140 2205148 50147 -14620 427034 -179718 -930735 -664962 -219032 -440789 11801
38131 11801 2310051 4474061 3684260 545093 -1865287 -2319029 -1737516 -53684 3479591
38122 3479591 7049605 7323188 4324390 1675292 1214653 991355 -404021 -1332748 -495591
38113 -495591 782226 1548907 3093538 5674733 6663963 4411542 1019929 -1142659 -2690527
38104 -2690527 -4458414 -4755595 -2558602 -489343 -1033697 -2338812 -1498239 317656 30794
38095 30794 -1997848 -2937680 -2247213 -1348885 53756 2992840 5544916 4540360 621333
38086 621333 -2294369 -2235848 -342110 2249109 4620388 4177639 -642984 -6090874 -6542484
$$ packed form
38149G40165n90073M69580l41536j287209M6102K650153K989720J20838k592592
38140B205148k155001o4767M41654o06752p51017K65773M45930k21757M52590
38131A1801K298250K164010p89801l139167k410380m53742N81513J683832L533275
38122C479591L570014K73583k998798k649098m60639k23298j395376r28727Q37157
38113d95591J277817P66681J544631K581195R89230k252421l391613k162588j547868
38104b690527j767887k97181K196993K069259n44354j305115Q40573J815895k86862
38095C0794k028642r39832O90467Q98328J402641K939084K552076j004556l919027
38086F21333k915702N8521J893738K591219K371279m42749m820623n447890m51610
$$ plain form
38077 -6542484 -2486687 -36948 -1823262 -3709784 -2129896 539690 535754 -1686725 -3350146
38068 -3350146 -3442753 -2243611 156862 2364609 1726523 -1542428 -3151326 -415432 3491763
38059 3491763 3902807 949723 -1582936 -1768259 -711548 420653 1443381 1868903 1082679
38050 1082679 -436774 -1620485 -1955618 -1214562 627179 2254480 1649183 -934123 -2752211
38041 -2752211 -2696042 -3078756 -5467069 -7569371 -6903624 -4913119 -4193801 -3938557 -1933860
38032 -1933860 662126 714533 -1688565 -3507756 -3694056 -3814042 -3952395 -2323493 437097
38023 437097 851832 -2001978 -4303536 -2767582 788683 2462543 1569248 441041 512652
38014 512652 1143281 1564261 1756807 1521998 425054 -1058204 -1544035 -404888 1183759
$$ packed form
38077f542484M055797K449739j786314j886522J579888K669586l936k222479j663421
38068c350146r2607J199142K400473K207747o38086l268951j608898K735894L907195
38059C491763M11044k953084k532659j85323J056711J132201J022728M25522p86224
38050A082679j519453j183711l35133P41056J841741J627301o05297k583306j818088
38041b752211N6169l82714k388313k102302O65747J990505P19318K55244K004697
38032a933860K595986N2407k403098j819191j86300j19986j38353J628902K760590
38023D37097M14735k853810k301558J535954L556265J673860q93295j128207P1611
38014E12652O30629M20980J92546k34809j096944j483258m85831J139147J588647
$$ plain form
38005 1183759 1416541 -1466 -1357846 -970530 603866 1308160 521033 -169828 258933
37996 258933 438785 -969563 -2563364 -2127376 -283048 401337 -492319 -859340 71255
37987 71255 443123 -876841 -2414876 -2834506 -3034986 -3836451 -3908100 -2194682 -499232
37978 -499232 -1077657 -3024650 -3778999 -3235429 -3306482 -3832754 -2411933 1040083 2901964
37969 2901964 802187 -2642476 -3471521 -1887597 -1142604 -1937310 -1454575 1625658 4499918
37960 4499918 4363908 2638250 2533453 3981771 4064522 1991389 405855 1029511 1898701
37951 1898701 609637 -1843249 -2678374 -1443041 -185688 -174931 -736567 -1247711 -2093925
37942 -2093925 -3181455 -3360333 -2202062 -997388 -1017113 -1725128 -1639197 -326131 1250855
$$ packed form
38005A183759K32782j418007j356380L87316J574396P04294p87127o90861M28761
37996B58933J79852j408348j593801M35988J844328O84385q93656l67021R30595
37987G1255L71868j319964j538035m19630k00480q01465p1649J713418J695450
37978d99232n78425j946993p54349N43570p1053n26272J420821L452016J861881
37969B901964k099777l444663q29045J583924P44993p94706M82735L080233K874260
37960D499918j36010j725658j04797J448318Q2751k073133j585534O23656Q69190
37951A898701j289064k452886q35125J235333J257353J0757n61636n11144q46214
37942b093925j087530j78878J158271J204674j9725p08015Q5931J313066J576986
$$ plain form
37933 1250855 1925604 1248921 -370630 -1839280 -1966231 -446745 1756166 3261527 3477756
37924 3477756 2967319 2788201 3401474 4032773 3400147 1467213 22880 714463 2757961
37915 2757961 3603898 1906941 -1092310 -3196114 -3285316 -1687344 290622 914877 -627366
37906 -627366 -2898323 -3412781 -1808082 -561245 -1669258 -3902973 -4657521 -3495679 -2267958
37897 -2267958 -2355903 -3459119 -4815988 -5919638 -5889247 -3710919 232774 3796028 4835021
37888 4835021 3034481 91075 -1363251 522635 5006184 8702984 8525278 4849802
37880 4849802 822435 -1364907 -2157905 -2585200 -2354709 -886314 1105324 2213855 1822120
37871 1822120 306270 -1424317 -2111764 -1021320 722582 971439 -467989 -1215458 182050
$$ packed form
37933A250855O74749o76683j619551j468650j26951J519486K202911J505361K16229
37924C477756n10437j79118O13273O31299o32626j932934j444333O91583K043498
37915B757961Q45937j696957k999251k103804q9202J597972J977966O24255j542243
37906f27366k270957n14458J604699J246837j108013k233715p54548J161842J227721
37897b267958q7945j103216j356869j103650L0391K178328L943693L563254J038993
37888D835021j800540k943406j454326J885886M483549L696800j77706l675476
37880D849802m027367k187342p92998m27295K30491J468395J991638J108531l91735
37871A822120j515850j730587o87447J090444J743902K48857j439428p47469J397508
$$ plain form
37862 182050 1867809 1554010 167329 231854 1794324 2757216 2602813 2737852 3291866
37853 3291866 2831609 1713924 2388272 5208488 7081416 5976381 3888771 3189722 2763937
37844 2763937 556533 -2297958 -3181684 -2273957 -1693785 -1391481 459831 3309256 4151511
37835 4151511 2102295 -167312 -436880 470690 1141279 1888066 3153017 3904288 3342383
37826 3342383 2448194 2280042 2289016 1792641 1604787 2600661 3921940 4159641 3278041 2068223
37816 2068223 891517 273438 1317471 3857906 5519471 4560752 2576385 2303904 3686303
37807 3686303 4447152 3936520 3779111 4692813 5176419 4002964 2077596 1024563 1320881
37798 1320881 2356844 3089691 2338095 -171205 -2675285 -2700583 -1750 3089544 4606934
$$ packed form
37862A82050J685759l13799j386681O4525J562470R62892j54403J35039N54014
37853C291866m60257j117685O74348K820216J872928j105035k087610o99049m25785
37844B763937k207404k854491q83726R07727N80172L02304J851312K849425Q42255
37835D151511k049216k269607k69568R07570O70589P46787J264951P51271n61905
37826C342383q94189j68152Q974m96375j87854R95874J321279K37701q81600j209818
37816B068223j176706o18079J044033K540435J661565r58719j984367k72481J382399
37807C686303P60849n10632j57409R13702M83606j173455j925368j053033K96318
37798A320881J035963P32847p51596k509300k504080k5298K698833L091294J517390
$$ plain form
37789 4606934 4817444 4716468 4309910 3326701 2322342 2007475 2386294 3297701 4781231
37780 4781231 6227620 6419758 5330857 4620278 5221603 5682179 4317163 1959172 919073
37771 919073 1936532 3779504 5243544 5813369 4850034 2133951 -837115 -1988758 -1254073
37762 -1254073 -268085 475066 1874301 3307410 2384413 -879893 -2407658 729345 5362947
37753 5362947 5951290 2409994 344876 2980822 6704641 6609635 3387154 1624566 3106452
37744 3106452 5388701 6454445 7124256 8100772 7854577 5363329 2778835 3011714 5793762
37735 5793762 8353579 9439842 10572493 13448214 18154045 24212091 31342601 38346155
37727 38346155 43087489 45152693 47423924 53307713 62830979 72950029 81460573 88982566
$$ packed form
37789D606934K10510j00976m06558r83209j004359l14867L78819R11407J483530
37780D781231J446389J92138j088901p10579O01325M60576j365016k357991j040099
37771I19073J017459J842972J464040N69825r63335k716083k971066j151643P34685
37762a254073R85988P43151J399235J433109r22997l264306j527765L137003M633602
37753E362947N88343l541296k065118K635946L723819r5006l222481j762588J481886
37744C106452K282249J065744O69811R76516k46195k491248k584494K32879K782048
37735E793762K559817J086263J132651K875721M705831O058046P130510P003554
37727C8346155M741334K065204K271231N883789R523266J0119050Q510544P521993
$$ plain form
37719 88982566 96875993 104822051 111323190 115434363 116911015 115518703 111648335 107317834
37711 107317834 105001986 105034275 105265103 103822479 101121184 98212053 94127286 86574659
37703 86574659 75308774 63244245 53439555 46065435 39495949 33613436 30195201 29695694
37695 29695694 29416636 26407258 21398582 17940867 17521018 17592147 15549688 12719893 12018460
37686 12018460 12668483 10589163 4730328 -161851 692677 5735110 9339502 9277173 8627037
37677 8627037 10302419 12979212 13672504 11875275 9418154 7852430 7619265 8597767 9880479
37668 9880479 9897408 8225972 6558106 6567020 7612839 8010739 7825307 8647209 10886623
37659 10886623 12976098 13397482 12278102 10922480 10719374 12270691 14612684 15826563
$$ packed form
37719H8982566P893427P946058O501139M111173J476652j392312l870368m330501
37711A07317834k315848L2289K30828j442624k701295k909131m084767p552627
37703H6574659j1265885j2064529r804690p374120o569486n882513l418235m99507
37695B9695694k79058l009378n008676l457715m19849P1129k042459k829795p01433
37686A2018460O50023k079320n858835m892179Q54528N042433L604392o2329o50136
37677H627037J675382K676793O93292j797229k457121j565724k33165R78502J282712
37668I880479J6929j671436j667866Q914J045819L97900j85432Q21902K239414
37659A0886623K089475M21384j119380j355622k03106J551317K341993J213879
$$ plain form
37651 15826563 15643196 16599611 20710938 25756096 27715187 27036441 29186787 37537399
37643 37537399 48675600 57316630 63639100 72309809 85291149 99694152 113609086
37636 113609086 130474798 154912648 185718957 215799797 239208739 256404548 271989112
37629 271989112 288738280 305069367 317629113 324768058 327132535 326128153 323086539
37622 323086539 319754677 318241729 319338725 320756395 317587930 305175579 282057874 250599023
37614 250599023 215277543 180670704 150511420 127085053 110191262 97064843 84745776
37607 84745776 72900619 63395147 57017005 52088043 46962122 42356177 39899458 39504714
37599 39504714 39702273 39722066 39612794 39047420 37877060 37288842 38313214 39646906 39528818
$$ packed form
37651A5826563j83367R56415M111327N045158J959091o78746K150346Q350612
37643C7537399J1138201Q641030O322470Q670709J2981340J4403003J3914934
37636A13609086J6865712K4437850L0806309L0080840K3408942J7195809J5584564
37629B71989112J6749168J6331087J2559746P138945K364477j004382l041614
37622C23086539l331862j512948J096996J417670l168465j2412351k3117705l1458851
37614B50599023l5321480l4606839l0159284k3426367j6893791j3126419j2319067
37607H4745776j1845157r505472o378142m928962n125921m605945k456719l94744
37599C9504714J97559J9793j09272n65374j170360n88218J024372J333692j18088
$$ plain form
37590 39528818 39690689 44285995 54005679 64421322 71975394 78698604 88214363 99365633
37582 99365633 107553306 111466644 114565017 119400217 123842096 124456107 121242943 117079647
37574 117079647 113866483 111218590 108445844 106020406 104601931 103418783 100263961 93286261
37566 93286261 82855244 71472882 61551714 53453382 46061601 38894327 32866065 29058489
37558 29058489 27535091 27437625 27560717 26803412 24792657 22153087 19562234 16772604 13512542
37549 13512542 10998272 10867283 12297055 12069741 8644390 4658308 3762232 5989063
37541 5989063 8136619 8204908 7381071 7514642 8616036 9619846 10063245 9879163 8596945
37532 8596945 6052257 3392471 2232009 2907367 4318836 5358512 5848718 6231544 6985160
$$ packed form
37590C9528818J61871M595306R719684J0415643P554072O723210R515759J1151270
37582I9365633Q187673L913338L098373M835200M441879O14011l213164m163296
37574A17079647l213164k647893k772746k425438j418475j183148l154822o977700
37566I3286261j0431017j1382362r921168q098332p391781p167274o028262l807576
37558B9058489j523398r7466J23092p57305k010755k639570k590853k789630l260062
37549A3512542k514270j30989J429772k27314l425351l986082q96076K226831
37541E989063K147556O8289q23837J33571J101394J003810M43399j84082j282218
37532H596945k544688k659786j160462O75358J411469J039676M90206L82826P53616
$$ plain form
37523 6985160 8300596 9846445 10945995 11293923 11102418 10186600 7783879 4239066 1912753
37514 1912753 2631746 4654736 4455981 1871294 962910 4444164 9474057 11162730 8715486
37505 8715486 5528320 4116568 3863776 3671494 3856486 4624363 5131820 5221667 6003786
37496 6003786 7439366 7426160 5067659 3071358 4558212 8536896 10995201 10122750 8173492
37487 8173492 7983356 9608722 10975783 10369794 7636392 4044642 1588539 1629448 3763877
37478 3763877 6528647 9123851 11513571 12986760 12179329 9154042 6191475 5486412
37470 5486412 6778343 8139450 8442440 7995386 7196123 5965145 4817852 5326025 8487355
37461 8487355 12980626 16109560 16777361 16705060 18134696 21181108 24578039 28337481 33751434
$$ packed form
37523F985160J315436J545849J099550L47928j91505r15818k402721l544813k326313
37514A912753P18993K022990j98755k584687r08384L481254N029893J688673k447244
37505H715486l187166j411752k52792j92282J84992P67877N07457Q9847P82119
37496F003786J435580j3206k358501j996301J486854L978684K458305q72451j949258
37487H173492j90136J625366J367061o05989k733402l591750k456103M0909K134429
37478C763877K764770K595204K389720J473189q07431l025287k962567p05063
37470E486412J291931J361107L02990m47054p99263j230978j147293N08173L161330
37461H487355M493271L128934O67801p2301J429636L046412L396931L759442N413953
$$ plain form
37452 33751434 40670090 47020783 52089763 58265149 67731450 78973802 88769132 96552943
37444 96552943 104255635 112316685 118549166 121131129 120425414 117604595 113741473 110531523
37436 110531523 109394566 109161957 107026409 102517200 97967741 94177815 88758523 80521321
37428 80521321 72287509 66501040 60722150 51238607 39602209 31495586 29343272 29612350
37420 29612350 27923842 23872286 19886554 17684806 17049514 16646688 15211325 12756193
37412 12756193 10627482 9487729 8032472 5316412 3318762 4588191 7797226 8751691
37404 8751691 6160990 3265676 2738558 3038577 1637843 -641398 -896936 1721975 5260741
37395 5260741 7471552 7497913 5793540 3660272 2354920 1978747 1992420 2852446 5366740
$$ packed form
37452C3751434O918656O350693N068980O175386R466301J1242352R795330P783811
37444I6552943P702692Q061050O232481K581963p05715k820819l863122l209950
37436A10531523j136957k32609k135548m509209m549459l789926n419292q237202
37428H0521321q233812n786469n778890r483543j1636398q106623k152314K69078
37420B9612350j688508m051556l985732k201748o35292m02826j435363k455132
37412A2756193k128711j139753j455257k716060j997650J269429L209035R54465
37404H751691k590701k895314n27118L00019j400734k279241k55538K618911L538766
37395E260741K210811K6361j704373k133268j305352l76173J3673Q60026K514294
$$ plain form
37386 5366740 8079988 7821710 4143943 782064 811188 2509503 2275679 -303485 -2896600
37377 -2896600 -4249845 -4664998 -3975930 -2144181 -935231 -1825509 -2920803 -1282986 2140133
37368 2140133 3595015 2566821 2744613 6025347 9412179 9672088 7768028 6341171
37360 6341171 5505405 3875419 1861079 1146812 1950706 3079964 3920556 4486847 4328963
37351 4328963 3241286 2374590 2921176 4269679 4993179 4989282 5073924 5153032 4505843 3358322
37341 3358322 2509159 1859275 956192 478583 1330710 2619686 2536857 1191751 583787
37332 583787 1556969 2658851 2399457 920442 -963711 -2634541 -3129711 -1630269 756873
37323 756873 1562190 338662 -288615 1703205 4666247 5650007 4550457 3792369 4539782
$$ packed form
37386E366740K713248k58278l677767l361879K9124J698315k33824k579164k593115
37377b896600j353245m15153O89068J831749J208950q90278j095294J637817L423119
37368B140133J454882j028194J77792L280734L386832K59909j904060j426857
37360F341171q35766j629986k014340p14267Q03894J129258Q40592N66291j57884
37351D328963j087677q66696N46586J348503P23500l897Q4642P9108o47189j147521
37341C358322q49163o49884r03083m77609Q52127J288976q2829j345106o07964
37332E83787R73182J101882k59394j479015j884153j670830m95170J499442K387142
37323G56873Q05317j223528o27277J991820K963042R83760j099550p58088P47413
$$ plain form
37314 4539782 5357602 4643668 2624341 579177 -614271 -772893 -248878 144296 -254574
37305 -254574 -1188411 -1785892 -1512589 -353570 1452662 3062174 3050431 1040623 -1152067
37296 -1152067 -1483568 -463220 -273054 -1363265 -2079825 -1770103 -1637322 -1760291 -177039
37287 -177039 3380204 5625278 4193583 1673907 1856299 3698231 3142555 185983 -577455
37278 -577455 2776397 6159307 5472216 2332839 972962 2106125 3137357 2767174 2077910
37269 2077910 1825500 1596047 1450430 1990802 2831560 3024220 2873468 3428762 4392746
37260 4392746 4531645 3993103 4057252 4540574 3734594 1375795 -471555 -256649 1159217
37251 1159217 2221761 2623799 2756637 2894751 3804740 6485936 10183733 12223118 11207933
$$ packed form
37314D539782Q17820p13934k019327k045164j193448j58622N24015L93174l98870
37305b54574r33837n97481K73303J159019J806232J609512j1743k009808k192690
37296a152067l31501J020348J90166j090211p16560L09722J32781j22969J583252
37287a77039L557243K245074j431695k519676J82392J841932n55676k956572p63438
37278e77455L353852L382910o87091l139377j359877J133163J031232l70183o89264
37269B077910k52410k29453j45617N40372Q40758J92660j50752N55294R63984
37260D392746J38899n38542O4149M83322q05980k358799j847350K14906J415866
37251A159217J062544M02038J32838J38114R09989K681196L697797K039385j015185
$$ plain form
37242 11207933 9111794 8668432 9684404 9636310 7415867 4820539 4203385 5777007 7626340
37233 7626340 7874778 6548358 5343466 5626247 7035699 8379730 9217308 9604474 8958811
37224 8958811 6830410 4655911 4903000 8131364 12564693 16919918 21786579 27610955
37216 27610955 33341377 38074957 42145646 45373563 46082899 43309747 38346456 32710595
37208 32710595 26424448 19942526 15656200 14981959 15493498 13733417 9925179 7163297
37200 7163297 6591053 6268055 4733099 2979088 2464852 3345377 5138295 7286779 8648181
37191 8648181 8094159 6028639 3962029 2528698 1364193 758720 1578032 3389322 4444355
37182 4444355 3887325 2539653 1389269 769877 939540 1798039 2190081 1384418 1013786
$$ packed form
37242A1207933k096139m43362J015972m8094k220443k595328o17154J573622J849333
37233G626340K48438j326420j204892K82781J409452J344031Q37578L87166o45663
37224H958811k128401k174499K47089L228364M433329M355225M866661N824376
37216B7610955N730422M733580M070689L227917P09336k773152m963291n635861
37208C2710595o286147o481922m286326o74241N11539j760081l808238k761882
37200G163297n72244l22998j534956j754011n14236Q80525J792918K148484J361402
37191H648181n54022k065520k066610j433331j164505o05473Q19312J811290J055033
37182D444355n57030j347672j150384o19392J69663Q58499L92042q05663l70632
$$ plain form
37173 1013786 3193253 6679151 7643911 4897860 1627005 878699 1921553 2509930 2266322
37164 2266322 1924096 1327762 306184 -197835 28019 -803273 -3483964 -5096512 -2327146
37155 -2327146 3277165 6553132 5281757 2520384 1692856 2188007 1468905 -576009 -1732481
37146 -1732481 -989828 311489 918346 1361404 2462851 3515994 3214803 1740847 569492
37137 569492 357018 364802 136011 269659 912297 943288 -230834 -1294193 -793966 770446
37127 770446 2188935 3806146 6506252 9178596 9618630 7808067 5976500 5349011 5232435
37118 5232435 5529007 7344578 10172440 11191854 9034294 6181273 5833608 8029721
37110 8029721 10581876 12347157 13659557 14700813 15463215 16641837 18765435 20868256
$$ packed form
37173A013786K179467L485898R64760k746051l270855p48306J042854N88377k43608
37164B266322l42226n96334j021578n04019K25854q31292k680691j612548K769366
37155b327146N604311L275967j271375k761373q27528M95151p19102k044914j156472
37146a732481P42653J301317O06857M43058J101447J053143l01191j473956j171355
37137E69492k12474P784k28791J33648O42638L0991j174122j063359N00227J564412
37127G70446J418489J617211K700106K672344M40034j810563j831567o27489j16576
37118E232435K96572J815571K827862J019414k157560k853021l47665K196113
37110H029721K552155J765281J312400J041256P62402J178622K123598K102821
$$ plain form
37102 20868256 21624680 21586859 22862849 26453098 30923149 34053998 35382919 36719652
37094 36719652 39706184 42794759 41917851 35406272 26965826 21557181 19332955 16698801
37086 16698801 12646792 9777610 8670439 6273517 1894398 -133645 2811787 6501913
37078 6501913 5842152 2532889 1701938 3619686 4486497 3681509 3973210 5086058 3464687
37069 3464687 -796078 -2795565 -370337 2539481 2422705 1247238 1981767 3305209
37061 3305209 2436634 55979 -1269543 -1146506 -429102 1582484 5399285 8418418 7453756
37052 7453756 3411487 265614 -67517 1008697 1968974 2541341 2109522 -143037 -3047237
37043 -3047237 -4027490 -2522415 -625030 239552 999316 2508712 3801956 4200825 5134839
$$ packed form
37102B0868256P56424l7821J275990L590249M470051L130849J328921J336733
37094C6719652K986532L088575q76908o511579q440446n408645k224226k634154
37086A6698801m052009k869182j107171k396922m379119k028043K945432L690126
37078F501913o59761l309263q30951J917748Q66811q04988K91701J112848j621371
37069C464687m260765j999487K425228K909818j16776j175467P34529J323442
37061C305209q68575k380655j325522J23037P17404K011586L816801L019133r64662
37052G453756m042269l145873l33131J076214R60277N72367m31819k252559k904200
37043c047237r80253J505075J897385Q64582P59764J509396J293244L98869R34014
$$ plain form
37034 5134839 7777594 10113389 8753733 3496953 -1926417 -4047712 -3018059 -1168814
37026 -1168814 166939 1008056 1067809 -49604 -1007030 630532 4840561 8034188 7255713
37017 7255713 4236487 3062949 4528935 5485061 3931321 1886389 1931985 3256826 3205183
37008 3205183 1381663 -326 596669 2196767 2780864 1419067 -1029715 -2531268
37000 -2531268 -1536801 1072796 2196065 -126202 -3805763 -4512294 -577332 5011866
36992 5011866 7918932 6908320 4470086 3601350 4694315 5655782 4681855 2391398 891377
36983 891377 1096666 1832201 1708341 890843 431168 703013 1355711 2129108 2697664 2287395
36973 2287395 726083 -452693 533959 3049107 4392588 3418767 2272446 3286565
$$ packed form
37034E134839K642755K335795j359656n256780n423370k121295J029653J849245
37026a168814J335753Q41117N9753j117413r57426J637562M210029L193627p78475
37017G255713l019226j173538J465986R56126j553740k044932M5596J324841n1643
37008C205183j823520j381989N96995J600098N84097j361797k448782j501553
37000b531268R94467K609597J123269k322267l679561p06531L934962N589198
36992E011866K907066j010612k438234q68736J092965R61467r73927k290457j500021
36983H91377K05289P35535j23860q17498m59675K71845O52698P73397N68556m10269
36973B287395j561312j178776R86652K515148J343481r73821j146321J014119
$$ plain form
36965 3286565 5355100 5361309 2920940 1449132 3583763 7309503 8390196 5710930 2099820
36956 2099820 93107 -696567 -1337537 -1188066 416668 1833365 942733 -1476742 -2665325
36947 -2665325 -1901759 -1109742 -1254937 -771267 1434151 3695073 3860838 2222426 567202
36938 567202 -389137 -931440 -698360 992693 3460401 4816185 3932264 1480827 -780882
36929 -780882 -1226464 515090 2918496 3698747 2337790 741552 660410 1518855 1885574
36920 1885574 1914472 2630073 3526442 2862725 343426 -2110878 -2596485 -1205307 329498
36911 329498 183146 -2143401 -5113559 -6229632 -4689680 -2426787 -1574335 -1806464 -1566473
36902 -1566473 -888103 -936101 -1404782 -842390 526440 835393 -224090 -769523 -43469
$$ packed form
36965C286565K068535O209k440369j471808K134631L725740J080693k679266l611110
36956B099820k006713p89674o40970J49471J604734J416697q90632k419475j188583
36947b665325P63566P92017j45195M83670K205418K260922J65765j638412j655224
36938E67202r56339n42303K33080J691053K467708J355784q83921k451437k261709
36929g80882m45582J741554K403406P80251j360957j596238q1142Q58445L66719
36920A885574K8898P15601Q96369o63717k519299k454304m85607J391178J534805
36911C29498j46352k326547k970158j116073J539952K262893Q52452k32129K39991
36902a566473O78370m7998m68681N62392J368830L08953j059483n45433P26054
$$ plain form
36893 -43469 173451 -1227032 -2367323 -1165348 1272587 2134128 757306 -856509 -740509
36884 -740509 1324009 4158205 5943808 5394763 3481039 3053911 5237014 7269474 6008535
36875 6008535 2737563 1807723 4559889 7445521 7022064 4234371 2154285 1556707 994774
36866 994774 55445 7432 1391381 3200827 4974427 7907103 12901327 18822544 23956622
36857 23956622 28337050 33083378 37708275 39775645 37789730 33180132 28528258 24734384
36849 24734384 21072213 17383026 14646822 13308824 12443813 11102606 9434680 7904295
36841 7904295 6432969 5151727 5069690 6790924 9061516 9824275 8569726 6560232 4804259
36832 4804259 3018816 869931 -893561 -1254138 -270190 990015 1519135 1005997 -224220
$$ packed form
36893d3469K16920j400483j140291J201975K437935Q61541j376822j613815J16000
36884g40509K064518K834196J785603n49045j913724m27128K183103K032460j260939
36875F008535l270972r29840K752166K885632m23457k787693k080086n97578n61933
36866I94774r39329m8013J383949J809446J773600K932676M994224N921217N134078
36857B3956622M380428M746328M624897K067370j985915m609598m651874l793874
36849B4734384l662171l689187k736204j337998q65011j341207j667926j530385
36841G904295j471326j281242q2037J721234K270592P62759j254549k009494j755973
36832D804259j785443k148885j763492l60577R83948J260205N29120n13138j230217
$$ plain form
36823 -224220 -1505830 -2303375 -2675545 -3117221 -3855632 -4552372 -4675790 -3794339 -1673466
36814 -1673466 1188173 3172139 2787935 716548 -495075 459747 1915015 1761681 737874
36805 737874 1391616 4076161 6056371 5170195 2584108 738882 -52309 -1244195 -2994697
36796 -2994697 -3463818 -1516872 1433779 3234110 3706313 4393338 5951644 7072147 6330279
36787 6330279 4134418 2074539 922957 271633 -106604 186492 931038 837361 -764509
36778 -764509 -2654119 -3259162 -2833991 -2768019 -3114190 -2429657 -174931 2337001 3851356
36769 3851356 4540632 4792564 4142552 2480896 1006238 613748 365160 -940554 -2524537
36760 -2524537 -2668821 -1461296 -663367 -983916 -1286466 -718833 4396 -103067 -1102304
$$ packed form
36823b24220j281610p97545l72170m41676p38411o96740j23418Q81451K120873
36814a673466K861639J983966l84204k071387j211623R54822J455268j53334j023807
36805G37874O53742K684545J980210q86176k586087j845226p91191j191886j750502
36796b994697m69121J946946K950651J800331M72203O87025J558306J120503p41868
36787F330279k195861k059879j151582o51324l78237K93096P44546r3677j601870
36778g64509j889610o05043M25171O5972l46171O84533K254726K511932J514355
36769C851356O89276K51932o50012j661656j474658l92490k48588j305714j583983
36760b524537j44284J207525P97929l20549l02550N67633P23229j07463r99237
$$ plain form
36751 -1102304 -2698741 -4696210 -6286187 -6086221 -3672101 -258758 2640729 4383139
36743 4383139 4754476 3639764 1789570 685004 722522 595910 -516320 -1222217 294230
36734 294230 3520362 6119262 6773067 6084860 4834010 2898683 293360 -2000357 -3075668
36725 -3075668 -3327736 -3787122 -4369199 -3590414 -537306 3265143 5013834 4122562 3400608
36716 3400608 5308739 7833105 6503610 797600 -4259232 -4449204 -1824408 -1148741
36708 -1148741 -2731432 -2609518 517952 2796232 1193845 -1476550 -452587 3949581
36700 3949581 6528480 4109011 -584891 -2696492 -849761 2207383 3332934 1998092
36692 1998092 40833 -428212 1187451 3568883 4675977 3687923 1803979 880351 1417702
$$ packed form
36751a102304j596437j997469j589977J99966K414120L413343K899487J742410
36743D383139L71337j114712j850194j104566L7518j26612j112230p05897J516447
36734B94230L226132K598900O53805o88207j250850j935327k605323k293717j075311
36725c075668k52068m59386n82077P78785L053108L802449J748691q91272p21954
36716C400608J908131K524366j329495n706010n056832j89972K624796O75667
36708a148741j582691J21914L127470K278280j602387k670395J023963M402168
36700C949581K578899k419469m693902k111601J846731L057144J125551j334842
36692A998092j957259m69045J615663K381432J107094r88054j883944r23628N37351
$$ plain form
36683 1417702 2291736 2302618 1321223 -183156 -1947046 -3709001 -4745371 -4387849 -2962294
36674 -2962294 -1723560 -1776857 -3168878 -4802615 -5151076 -3602463 -1430046 -786134 -2217507
36665 -2217507 -3877774 -3843212 -2319289 -627318 872334 2281967 2577078 755332 -1760528
36656 -1760528 -2268390 -523839 976115 797756 150301 4542 -538171 -1665782 -1485984
36647 -1485984 679982 2103073 317019 -3021209 -4703141 -4576295 -4412528 -3767830 -890070
36638 -890070 2926843 4090621 2247886 1275894 3567699 6561227 6624732 3862514 1239231
36629 1239231 762744 2123830 3723134 3857664 2141172 444035 889364 2528376 2247356
36620 2247356 -291469 -1422375 1175764 4590107 4609556 1501639 -989579 -998180 106505
$$ packed form
36683A417702Q74034J0882r81395j504379j763890j761955j036370L57522J425555
36674b962294J238734n3297j392021j633737l48461J548613K172417O43912j431373
36665b217507j660267L4562J523923J691971J499652J409633K95111j821746k515860
36656a760528n07862J744551J499954j78359o47455j45759n42713j127611J79798
36647a485984K165966J423091j786054l338228j681932J26846J63767O44698K877760
36638h90070L816913J163778j842735r71992K291805K993528O3505k762218k623283
36629A239231m76487J361086J599304J34530j716492j697137M45329J639012k81020
36620B247356k538825j130906K598139L414343J9449l107917k491218q601J104685
$$ plain form
36611 106505 865270 1142365 543706 -1657420 -4436819 -5162228 -2689578 1250632 4293345
36602 4293345 5603834 5441320 4230263 2803408 2178068 2241351 1768514 502216 69820
36593 69820 1823975 4638897 5995507 4833115 2416152 664999 383311 879228 652661
36584 652661 -1291588 -4143378 -5613434 -4405776 -2099925 -1423524 -2650777 -3195065 -1381068
36575 -1381068 961899 1125064 -426169 -762905 1096376 2857457 2489049 848642 -245676
36566 -245676 -513953 -365354 510174 1854758 1943700 243136 -704026 1165038 3487931
36557 3487931 2572211 -618156 -1767930 -178825 424783 -1137156 -980008 2996538 6554209
36548 6554209 5194661 1071630 -593133 757812 1669478 1149512 1322466 2421744 2252791
$$ packed form
36611A06505P58765K77095n98659k201126k779399p25409K472650L940210L042713
36602D293345J310489j62514j211057j426855o25340O3283m72837j266298m32396
36593F9820J754155K814922J356610j162392k416963j751153k81688M95917k26567
36584F52661j944249k851790j470056J207658K305851O76401j227253n44288J813997
36575a381068K342967J63165j551233l36736J859281J761081l68408j640407j094318
36566b45676k68277J48599Q75528J344584Q8942j700564r47162J869064K322893
36557C487931r15720l190367j149774J589105O03608j561939J57148L976546L557671
36548F554209j359548m123031j664763J350945R11666n19966J72954J099278j68953
$$ plain form
36539 2252791 840490 835211 2416060 2275690 -768921 -3252129 -2334306 -81291 214220
36530 214220 -864829 -524153 1440781 2651797 1920108 316545 -964838 -1572625 -1230535
36521 -1230535 -1806 900108 296157 -1122111 -1675940 -1184720 -916308 -1085328 -177150
36512 -177150 2685981 6084488 7839117 7351722 5641281 3702804 1825016 394996
36504 394996 304963 1867306 3786566 4218167 3028504 2031570 2416406 2976397 1999621
36495 1999621 9237 -1058025 -900034 -1002814 -1729528 -1576596 -11487 1264918 1199658
36486 1199658 1387886 3256905 5005726 3900933 656555 -1206107 -223253 1280794
36478 1280794 737363 -1527567 -3463350 -3837850 -2623338 -273765 2167061 3168948
$$ packed form
36539B252791j412301n279J580849j40370l044611k483208R17823K253015K95511
36530B14220j079049L40676J964934J211016p31689j603563j281383o07787L42090
36521a230535J228729R01914o03951j418268n53829M91220K68412j69020R08178
36512a77150K863131L398507J754629m87395j710441j938477j877788j430020
36504C94996r0033J562343J919260M31601j189663r96934L84836N59991r76776
36495A999621j990384j067262J57991j02780p26714J52932J565109J276405o5260
36486A199658J88228J869019J748821j104793l244378j862662R82854J504047
36478A280794n43431k264930j935783l74500J214512K349573K440826J001887
$$ plain form
36470 3168948 2124673 220857 -894866 -872184 -436982 -20722 460206 792546 476833
36461 476833 -305824 -477535 813768 3150440 5127912 5541854 4294053 2394986 1206980
36452 1206980 1484174 2857690 4103788 3981516 2131632 -442803 -1749993 -189955
36444 -189955 3846016 7776575 8814789 6549505 3326452 1725331 1907723 2020996 1074298
36435 1074298 402827 1687379 4289678 5704958 4577465 2166419 490046 23816
36427 23816 -12447 133928 1012226 2525476 3410458 2735344 1279397 748739 1865558
36418 1865558 3759571 5064737 5051285 3799334 2011441 820141 1009734 1980446 2136474
36409 2136474 865251 -533199 -608081 351990 1310072 2502597 4592365 6173894 4650614
$$ packed form
36470C168948j044275j903816j115723K2682M35202M16260M80928L32340l15713
36461D76833p82657j71711J291303K336672J977472M13942j247801j899067j188006
36452A206980K77194J373516J246098j22272j849884k574435j307190J560038
36444a89955M035971L930559J038214k265284l223053j601121J82392J13273r46698
36435A074298o71471J284552K602299J415280j127493k411046j676373m66230
36427B3816l6263J46375Q78298J513250Q84982o75114j455947n30658J116819
36418A865558J894013J305166j3452j251951j787893j191300J89593R70712J56028
36409B136474j271223j398450p4882R60071R58082J192525K089768J581529j523280
$$ plain form
36400 4650614 306147 -2900501 -2156255 447144 852046 -1759266 -4828542 -6289180
36392 -6289180 -6111954 -4718273 -2460233 -499150 189170 626708 2322768 4149720 3570437
36383 3570437 1165537 588341 2923899 4437244 1989708 -2134329 -3527372 -1706323
36375 -1706323 169500 329367 19832 547605 1517594 2271132 2897012 3315792 2954119
36366 2954119 1799575 643074 -10601 -445113 -1117975 -2159294 -3186515 -3132347 -1068069
36357 -1068069 2063286 3676336 2662851 1060210 1081769 1789162 845412 -1454645 -2571371
36348 -2571371 -1751058 -885957 -1096639 -1110462 110875 1380512 1164494 -136808 -952202
36339 -952202 -507783 744658 1705319 1191023 -973058 -3082315 -2994229 -780815 1309075
$$ packed form
36400D650614m344467l206648P44246K603399M04902k611312l069276j460638
36392f289180J77226J393681K258040J961083O88320M37538J696060J826952n79283
36383C570437k404900n77196K335558J513345k447536m124037j393043J821049
36375a706323J875823J59867l09535N27773R69989P53538O25880M18780l61673
36366B954119j154544j156501o53675m34512o72862j041319j027221N4168K064278
36357a068069L131355J613050j013485j602641K1559P07393r43750k300057j116726
36348b571371Q20313Q65101k10682j3823J221337J269637k16018j301302q15394
36339i52202M44419J252441R60661n14296k164081k109257Q8086K213414K089890
$$ plain form
36330 1309075 1763950 1231804 795236 594040 735504 1774477 3397438 4222356 3794880
36321 3794880 3168840 2620742 759024 -2657670 -4965880 -3829706 -944018 -119337 -2278286
36312 -2278286 -4649260 -4814095 -3360142 -2066103 -1372061 -734484 -299102 -847805 -2313931
36303 -2313931 -3379545 -2923484 -1393976 -186994 177929 445315 941136 573994 -1506842
36294 -1506842 -4063367 -4970689 -3844386 -2055382 -566831 522941 671160 -631928
36286 -631928 -2016511 -1316900 1051575 2393508 2123157 2825746 5507297 7066374 5091097
36277 5091097 2360453 3027632 6165392 7058641 4110601 538587 -884110 -1100325 -1905403
36268 -1905403 -2952844 -3135735 -2676452 -2205324 -1337278 315310 1783571 1761004 423530
$$ packed form
36330A309075M54875n32146m36568k01196J41464J038973J622961Q24918m27476
36321C794880o26040n48098j861718l416694k308210J136174K885688Q24681k158949
36312b278286k370974j64835J453953J294039O94042O37577M35382n48703j466126
36303b313931j065614M56061J529508J206982L64923K67386M95821l67142k080836
36294a506842k556525r07322J126303J789004J488551J089772J48219j303088
36286f31928j384583O99611K368475J341933k70351P02589K681551J559077j975277
36277E091097k730644O67179L137760Q93249k948040l572014j422697k16215q05078
36268a905403j047441j82891M59283M71128Q68046J652588J468261k2567j337474
$$ plain form
36259 423530 -757810 -766956 -13203 365803 -48157 -326618 582237 2029355 2132681 546653
36249 546653 -669081 -39713 1018815 590625 -559622 -575026 -23792 -776189 -2037664
36240 -2037664 -1072570 1895049 3190518 1237238 -826131 7511 2088582 1997177 -253856
36231 -253856 -1883132 -1918143 -2017834 -2924421 -2780397 177773 4764614 7700724 6944209
36222 6944209 3685690 863542 -270918 -1382304 -4050888 -6529746 -5642327 -1812152
36214 -1812152 573187 -1059137 -3878909 -3834731 -1365957 -237536 -1852303 -3690668
36206 -3690668 -3272816 -1065004 1084470 2361135 2986285 3240921 3344003 3345171 2539940
36197 2539940 -54486 -3901107 -6401815 -5196457 -897222 3219852 4481975 3372787
$$ packed form
36259D23530j181340r146P53753L79006m13960k78461R08855J447118J03326j586028
36249E46653j215734O29368J058528m28190j150247j5404N51234p52397j261475
36240b037664R65094K967619J295469j953280k063369Q33642K081071r1405k251033
36231b53856j629276l5011r9691r06587J44024K958170M586841K936110p56515
36222F944209l258519k822148j134460j111386k668584k478858Q87419L830175
36214a812152K385339j632324k819772M4178K468774J128421j614767j838365
36206c690668M17852K207812K149474J276665O25150K54636J03082J168q05231
36197B539940k594426l846621k500708J205358M299235M117074J262123j109188
$$ plain form
36189 3372787 2490524 3240479 4267713 3420165 550821 -2374862 -3560203 -2898623 -1441727
36180 -1441727 -291315 7324 -217356 -119031 347015 12761 -1534137 -2384512 -550152
36171 -550152 2669135 3823959 1858979 -856722 -2297097 -2854114 -2947143 -1632589 843108
36162 843108 1969175 617606 -699329 329910 1995980 1484501 -327086 -368241 1570114
36153 1570114 2738107 1801590 128071 -1037955 -1763750 -1961373 -1525025 -1771441 -3908374
36144 -3908374 -6191669 -5658242 -2810706 -1333276 -2600399 -3774747 -2470858 -180528
36136 -180528 628269 226033 456828 1746355 3093106 3682270 3140347 1459748 -278429
36127 -278429 -479206 763825 1504818 770801 -95925 267938 1375977 2154863 2195381
$$ packed form
36189C372787q82263P49955J027234q47548k869344k925683j185341O61580J456896
36180a441727J150412K98639k24680R8325M66046l34254j546898q50375J834360
36171e50152L219287J154824j964980k715701j440375n57017r3029J314554K475697
36162H43108J126067j351569j316935J029239J666070n11479j811587m1155J938355
36153A570114J167993r36517j673519j166026p25795j97623M36348k46416k136933
36144c908374k283295N33427K847536J477430j267123j174348J303889K290330
36136a80528Q08797m02236K30795J289527J346751N89164n41923j680599j738177
36127b78429k00777J243031P40993p34017q66726L63863J108039P78886M0518
$$ plain form
36118 2195381 960912 -1957777 -4702585 -3895464 694582 4687551 4529139 2183158
36110 2183158 1769647 3447839 3822667 1307855 -2122532 -4165046 -4411980 -3377026 -1596043
36101 -1596043 165930 1494734 2871340 4206379 3776181 633561 -2919739 -3861954
36093 -3861954 -2804591 -2899114 -4612169 -4825939 -1760688 2185262 3766280 2741135 1080365
36084 1080365 261177 700595 2266159 3960793 4264933 2894778 1258396 476094 124027
36075 124027 -461638 -1055777 -1476303 -2182045 -3044608 -2960513 -1678542 -572937 -477365 -216777
36065 -216777 1322064 3004902 3016696 1681153 1042476 2149795 4071696 5148029 4278800
36056 4278800 1767277 -217139 772287 4195982 6268635 4564103 1332422 92369
$$ packed form
36118B195381j234469k918689k744808Q07121M590046L992969j58412k345981
36110B183158m13511J678192L74828k514812l430387k042514k46934J034954J780983
36101a596043J761973J328804J376606J335039m30198l142620l553300r42215
36093c861954J057363r4523j713055k13770L065251L945950J581018j025145j660770
36084A080365q19188M39418J565564J694634L04140j370155j636382p82302l52067
36075A24027n85665n94139m20526p05742q62563Q4095J281971J105605R5572K60588
36065b16777J538841J682838J1794j335543o38677J107319J921901J076333q69229
36056D278800k511523j984416R89426L423695K072653j704532l231681j240053
$$ plain form
36048 92369 540251 -119316 -1955174 -2356098 -1188025 -1601169 -4473811 -6091723 -3698511
36039 -3698511 41138 1220966 637275 1779540 4620447 5624315 3450177 645018
36031 645018 -698369 -1303638 -1850481 -1314592 191016 156797 -2316724 -3908408 -1552610
36022 -1552610 2337164 2689043 -1013726 -4023342 -3038322 -124272 1275905 1214125 1934582
36013 1934582 3722825 4716092 4099308 3149899 3058428 3471690 3536511 3041801 2049198 424691
36003 424691 -1696591 -3660825 -4914886 -5294476 -4484134 -2059382 1378916 3900510 3978053
35994 3978053 2184068 426445 -170051 182849 1118314 2641231 4386518 5538015 5892450
35985 5892450 5930320 5342471 2836940 -1503204 -4909587 -4723164 -1867572 359306 643308
$$ packed form
36048I2369M47882o59567j835858m00924J168073m13144k872642j617912K393212
36039c698511L739649J179828n83691J142265K840907J003868k174138k805159
36031F45018j343387o05269n46843N35889J505608l4219k473521j591684K355798
36022a552610L889774L51879l702769l009616R85020K914050J400177o1780P20457
36013A934582J788243R93267o16784r49409r1471M13262O4821m94710r92603j624507
36003D24691k121282j964234j254061l79590Q10342K424752L438298K521594P7543
35994C978053j793985j757623n96496L52900R35465J522917J745287J151497L54435
35985E892450L7870n87849k505531m340144l406383J86423K855592K226878K84002
$$ plain form
35976 643308 592734 1191805 1012536 -802999 -2276039 -1591733 -642968 -2648802 -6927776
35967 -6927776 -9160408 -7216947 -3813642 -2099864 -1147295 1800279 6040819 7431991
35959 7431991 4031173 -729092 -2066987 249559 2112959 995092 -737212 257361
35951 257361 2970163 3338930 315922 -2531562 -2283128 -481590 140474 -53027 522483
35942 522483 744655 -1381988 -4138900 -3726236 -442171 1252115 -220389 -958709 1887488
35933 1887488 5199497 4755040 1695289 199676 1088480 2056115 2735493 4810715 7445518
35924 7445518 7252926 3678133 488716 493348 2107257 2864375 3265189 4773196 6339981
35915 6339981 5697440 2848281 -86004 -1695495 -2026152 -1298473 128136 1029369 474862
$$ packed form
35976F43308n0574N99071j79269j815535j473040O84306R48765k005834m278974
35967f927776k232632J943461L403305J713778R52569K947574M240540J391172
35959G431991l400818m760265j337895K316546J863400j117867j732304R94573
35951B57361K712802L68767l023008k847484K48434J801538O22064j93501N75510
35942E22483K22172k126643k756912M12664L284065J694286j472504p38320K846197
35933A887488L312009m44457l059751j495613Q88804R67635O79378K075222K634803
35924G445518j92592l574793l189417M632J613909P57118M00814J508007J566785
35915F339981o42541k849159k934285j609491l30657P27679J426609R01233n54507
$$ plain form
35906 474862 -547129 -417213 437433 44964 -1899330 -3322124 -2767933 -1259182 -349255
35897 -349255 -60136 48015 -596571 -2148366 -2604897 101220 4457804 6183729 3354134
35888 3354134 -1176782 -3509455 -3205324 -2581195 -2845307 -3039880 -2347521 -1270498 -172417
35879 -172417 1532435 3866455 5258391 4151472 1052333 -1837575 -2716056 -1491438
35871 -1491438 502678 1655266 1359211 514347 430518 1149704 1429561 473340 -1058532
35862 -1058532 -1925437 -1464884 181182 2122890 3040019 2557276 2174537 3287028 4425273
35853 4425273 2804054 -952809 -2633157 -508521 1550950 -126162 -2784407 -988519
35845 -988519 4781304 8117814 5558502 912051 -832641 44631 235210 -952042 -1581214
$$ packed form
35906D74862j021991J29916Q54646l92469j944294j422794N54191J508751R09927
35897c49255K89119J08151o44586j551795m56531K706117M356584J725925k829595
35888C354134m530916k332673L04131O24129k64112j94573O92359J077023J098081
35879a72417J704852K334020J391936j106919l099139k889908q78481J224618
35871a491438J994116J152588k96055q44864q3829P19186K79857r56221j531872
35862a058532q66905M60553J646066J941708R17129m82743l82739J112491J138245
35853D425273j621219l756863j680348K124636K059471j677112k658245J795888
35845i88519N769823L336510k559312m646451j744692Q77272J90579j187252o29172
$$ plain form
35836 -1581214 -1092328 -909563 -1427841 -1197456 547794 2625561 3732575 3994754 4076846
35827 4076846 3956388 3293768 2166865 757485 -1055285 -3090550 -4312074 -3711319 -1696313
35818 -1696313 82007 462007 -184294 -826968 -1059009 -1034891 -800007 -542542 -983850
35809 -983850 -2311454 -3101315 -1970403 -247494 -778209 -3439187 -4479267 -2067098 58609
35800 58609 -2519992 -8083145 -10674063 -8271899 -4923172 -4016103 -3568157 -456780 3863265
35791 3863265 5160488 2341025 -1580704 -3854197 -4547049 -4567065 -3612408 -1246145 1386240
35782 1386240 2336561 1131610 -588531 -934759 159370 1152735 945820 -82987 -1227512
35773 -1227512 -2498936 -3761804 -4008247 -2845791 -1689959 -1689329 -1393797 1102969 4299623
$$ packed form
35836a581214M88886J82765n18278K30385J745250K077767J107014K62179Q2092
35827D076846j20458o62620j126903j409380j812770k035265j221524O00755K015006
35818a696313J778320L80000o46301o42674k32041K4118K34884K57465m41308
35809i83850j327604p89861J130912J722909n30715k660978j040080K412169K125707
35800E8609k578601n563153k590918K402164L348727R07069M47946L111377M320045
35791C863265J297223k819463l921729k273493o92852k0016R54657K366263K632385
35782A386240R50321j204951j720141l46228J094129R93365k06915j028807j144525
35773a227512j271424j262868k46443J162456J155832O30K95532K496766L196654
$$ plain form
35764 4299623 4672698 2146949 782871 2801911 5166914 4197186 881551 -1053727
35756 -1053727 -368143 1214709 2315289 2857676 2641982 1613055 987468 1766958 2693071
35747 2693071 1946267 232970 -269154 527956 820622 322970 478323 1151049 315293
35738 315293 -2100329 -3096621 -929708 1877201 1828668 -960389 -3491694 -3999482 -3300017
35729 -3300017 -2590078 -1780115 -253353 1802281 3272877 3164988 1830572 975479 1856335
35720 1856335 3594512 4186214 3154705 2024138 2006895 2628499 3141539 3822412 4924942
35711 4924942 5582127 4931340 3483339 2315649 1681499 1420018 1830256 2808893 2867115
35702 2867115 692175 -2491230 -3716457 -1722165 1586304 3442863 2947495 1175313
$$ packed form
35764D299623L73075k525749j364078K019040K365003r69728l315635j935278
35756a053727O85584J582852J100580N42387k15694j028927o25587P79490R26113
35747B693071p46804j713297n02124P97110K92666m97652J55353O72726q35756
35738C15293k415622r96292K166913K806909m8533k789057k531305n07788O99465
35729c300017P09939Q09963J526762K055634J470596j07889j334416q55093Q80856
35720A856335J738177N91702j031509j130567j7243O21604N13040O80873J102530
35711D924942O57185o50787j448001j167690o34150k61481M10238R78637N8222
35702B867115k174940l183405j225227J994292L308469J856559m95368j772182
$$ plain form
35694 1175313 -280962 -212795 1708016 4215560 4822755 2231282 -1670815 -3468523 -2201306
35685 -2201306 -450060 -699343 -1894870 -1187664 1664458 3831192 3476235 1962035 1006469
35676 1006469 -91135 -2420504 -4423310 -3679452 -967664 449136 -323273 -640378 1156279
35667 1156279 2864941 1797933 -1119579 -2756279 -1823455 626516 3594288 6551778
35659 6551778 7974616 6083913 1578415 -2257079 -2949496 -1136074 954018 1986636
35651 1986636 1862168 869634 -350424 -632962 794578 3180354 4595018 3613804 669342
35642 669342 -2195987 -3146420 -2427808 -2082471 -3259012 -4363572 -3054314 151861 1894119
35633 1894119 126480 -3184475 -4542248 -2996954 -475801 1117330 1526705 1156593
$$ packed form
35694A175313j456275O8167J920811K507544O07195k591473l902097j797708J267217
35685b201306J751246k49283j195527P07206K852122K166734l54957j514200r55566
35676A006469j097604k329369k002806P43858K711788J416800p72409l17105J796657
35667A156279J708662j067008k917512j636700R32824K449971K967772K957490
35659F551778J422838j890703m505498l835494o92417J813422K090092J032618
35651A986636j24468r92534j220058k82538J427540K385776J414664r81214k944462
35642F69342k865329r50433P18612L45337j176541j104560J309258L206175J742258
35633A894119j767639l310955j357773J545294K521153J593131M09375l70112
$$ plain form
35625 1156593 138556 -1171570 -1919210 -1638311 -826505 -229901 -14272 102699 362421
35616 362421 854029 1520853 2112056 2379290 2243596 1484737 -288108 -2658161 -3936843
35607 -3936843 -2927947 -896221 -166746 -660807 213119 3483389 6485487 6337620 3903094
35598 3903094 2274838 2462151 2929157 2866955 3389201 5161081 6913482 7089571 5661150
35589 5661150 3812189 2826105 3360736 4698910 4881502 2928817 547680 -133288 1035
35580 1035 -1553859 -4219398 -4363136 -963031 2187281 1875645 -17432 -60148 1397031
35571 1397031 1819867 1305168 1749375 2425665 838210 -2130958 -2399976 968534 3631596
35562 3631596 2099773 -1329713 -2292238 -378960 1565804 2362091 3277897 4492617 4085919
$$ packed form
35625A156593j018037j310126p47640K80899Q11806N96604K15629J16971K59722
35616C62421M91608O66824N91203K67234j35694p58859j772845k370053j278682
35607c936843J008896K031726P29475m94061Q73926L270270L002098j47867k434526
35598C903094j628256J87313M67006o2202N22246J771880J752401J76089j428421
35589E661150j848961r86084N34631J338174J82592j952685k381137o80968J34323
35580A035j554894k665539j43738L400105L150312l11636j893077m2716J457179
35571A397031M22836n14699M44207O76290j587455k969168k69018L368510K663062
35562C631596j531823l429486r62525J913278J944764P96287R15806J214720m06698
$$ plain form
35553 4085919 1227866 -2020937 -3260517 -2548095 -1472905 -618887 587369 2068838
35545 2068838 2729500 2070488 882656 -205567 -1679656 -3672107 -4640953 -3140735 -318533
35536 -318533 1344269 1613261 2426634 3882365 3287640 -250271 -3260234 -2720078 -1053485
35527 -1053485 -2523563 -6060898 -6267117 -1609152 3011044 3310265 1196346 841392 2437332
35518 2437332 3128247 2110919 1268411 1434751 1081982 -1050440 -4120642 -6357121 -6689103
35509 -6689103 -5064922 -2282565 333661 1801656 2016095 1225816 -229175 -1259719
35501 -1259719 -480824 1595467 2179582 -358380 -3747160 -4470461 -2423857 -684908 -920687
35492 -920687 -1466821 -415719 1639825 3052075 3616808 4160040 4580646 3773073 1300296
$$ packed form
35553D085919k858053l248803j239580P12422J075190Q54018J206256J481469
35545B068838O60662o59012j187832j088223j474089j992451r68846J500218K822202
35536c18533J662802K68992Q13373J455731n94725l537911l009963N40156J666593
35527a053485j470078l537335k06219M657965M620196K99221k113919l54954J595940
35518B437332O90915j017328q42508J66340l52769k132422l070202k236479l31982
35509f689103J624181K782357K616226J467995K14439p90279j454991j030544
35501a259719P78895K076291N84115k537962l388780p23301K046604J738949k35779
35492i20687n46134J051102K055544J412250N64733N43232M20606q07573k472777
$$ plain form
35483 1300296 -1834886 -4150739 -4880696 -4195234 -2703658 -1027507 238786 582334 59981
35474 59981 -371756 310603 1832501 2750831 2250345 1077293 288012 -59083 -384350
35465 -384350 -706816 -1022678 -1555293 -1802873 -633191 1493026 1979867 -318907 -2489511
35456 -2489511 -1258975 1765114 2055095 -866171 -2478988 -337235 1980859 452487
35448 452487 -3169622 -4160346 -1693669 858811 1362543 850230 291110 -848009 -2186817
35439 -2186817 -1897716 106674 1202720 -56981 -1399736 -215924 2338838 3031916
35431 3031916 1233976 -579051 -594614 418221 1152997 1637862 2289505 2659642 2238180
35422 2238180 1614541 1788861 2762868 3671919 4085011 4327729 4412792 3453909 831113
$$ packed form
35483A300296l135182k315853p29957O85462J491576J676151J266293L43548n22353
35474E9981m31737O82359J521898R18330n00486j173052p89281l47095l25267
35465c84350l22466l15862n32615k47580J169682K126217M86841k298774k170604
35456b489511J230536L024089K89981k921266j612817K141753K318094j528372
35448D52487l622109r90724K466677K552480N03732n12313n59120j139119j338808
35439b186817K89101K004390J096046j259701j342755J183812K554762O93078
35431C031916j797940j813027j5563J012835P34776M84865O51643L70137m21462
35422B238180o23639J74320R74007R09051M13092K42718Q5063r58883k622796
$$ plain form
35413 831113 -2323418 -3747643 -2594115 -575430 318164 563201 2003934 4212235 4163095
35404 4163095 477514 -4019439 -5687959 -4487387 -2930043 -1937375 -477236 1291770
35396 1291770 1638541 363733 -544927 -183306 -82040 -1187699 -1995803 -1261378 -390879
35387 -390879 -1261824 -3372582 -4939662 -5253767 -4264733 -1589914 2077789 4281245 3773781
35378 3773781 2649539 3185320 4246072 3610473 2199280 2489910 3876683 3558263 1557725
35369 1557725 702234 1433868 934220 -1598857 -2973969 -1170430 1095618 398590 -2567114
35360 -2567114 -4712370 -4989038 -4632432 -4461019 -4069910 -2776504 -122863 3308037 4910323
35351 4910323 2098336 -3535666 -6663681 -4546630 -474011 1068171 58622 -742663
$$ packed form
35413H31113l154531j424225J153528K018685Q93594K45037J440733K208301m9140
35404D163095l685581m496953j668520J200572J557344R92668J460139J769006
35396A291770L46771j274808r08660L61621J01266j105659q08104P34425Q70499
35387c90879q70945k110758j567080l14105R89034K674819L667703K203456n07464
35378C773781j124242N35781J060752o35599j411193K90630J386773l18420k000538
35369A557725q55491P31634m99648k533077j375112J803539K266048o97028k965704
35360b567114k145256k76668L56606J71413L91109J293406K653641L430900J602286
35351D910323k811987n634002l128015K117051M072619J542182j009549q01285
$$ plain form
35343 -742663 -599044 -621665 -615602 340712 1216220 268975 -1653326 -2098865 -833518 206387
35333 206387 409584 1083885 2714022 4313743 5459237 6449524 6534187 4516780 1149400
35324 1149400 -1451457 -2702663 -3522295 -3746724 -2381701 -337907 171321 -634895 890
35315 890 2922258 5256578 4191017 342222 -3533283 -5177217 -3666734 75465 3023609
35306 3023609 2691208 625746 773486 3859140 6332057 5715896 3742024 2802934 2608953
35297 2608953 2309284 2809172 4566443 5818083 5536819 5561573 7098283 7795466 5574479
35288 5574479 2878211 3117001 4743235 3394997 -939677 -3534393 -1846362 1398424
35280 1398424 2853952 2517163 1759975 776801 -167652 377708 2835449 5157803 5455759
$$ packed form
35343g42663J43619k2621O063R56314Q75508r47245j922301m45539J265347J039905
35333B06387K03197O74301J630137J599721J145494R90287Q4663k017407l367380
35324A149400k600857j251206q19632k24429J365023K043794N09228q06216O35785
35315H90K921368K334320j065561l848795l875505j643934J510483L742199K948144
35306C023609l32401k065462J47740L085654K472917o16161j973872r39090j93981
35297B608953k99669M99888J757271J251640k81264K4754J536710O97183k220987
35288E574479k696268K38790J626234j348238m334674k594716J688031L244786
35280A398424J455528l36789p57188r83174r44453N45360K457741K322354K97956
$$ plain form
35271 5455759 4563016 4307187 4594909 4021055 2443996 1224445 1353871 2656963 4476384
35262 4476384 6059932 6612332 5943002 4875383 4363523 4510731 4876402 5089880 4651179
35253 4651179 3090395 1187102 956901 3057588 5087093 4284602 1466470 127166
35245 127166 1525386 3032519 2238674 399663 68617 1110894 1442258 643125 162564
35236 162564 280277 -402189 -2163267 -3479208 -3847723 -4705342 -6401334 -6917318 -5354843
35227 -5354843 -4128736 -5232704 -6587015 -5227469 -2344535 -1404709 -2344792 -1861117 698671
35218 698671 2166451 1095302 177452 1361934 2440559 1078562 -974765 -822920 872712
35209 872712 1458169 787189 696659 1086406 53503 -2296440 -3351082 -1766919 698037
$$ packed form
35271E455759q92743k55829K87722n73854j577059j219551J29426J303092J819421
35262D476384J583548N52400o69330j067619n11860J47208L65671K13478m38701
35253D651179j560784j903293k30201K100687K029505q02491k818132j339304
35245A27166J398220J507133p93845j839011l31046J042277L31364p99133m80561
35236A62564J17713o82466j761078j315941l68515q57619j695992n15984J562475
35227e354843J226107j103968j354311J359546K882934R39826r40083M83675K559788
35218F98671J467780j071149r17850J184482J078625j361997k053327J51845J695632
35209H72712N85457o70980r0530L89747j032903k349943j054642J584163K464956
$$ plain form
35200 698037 1754206 1138600 89924 -211289 769871 2676659 4263084 4497533 3629558
35191 3629558 2467655 1241307 278090 889702 3773368 7020576 7739124 5636720 3142067
35182 3142067 1921659 1278274 336830 -389938 -689597 -2030682 -5451762 -8959219 -8991789
35173 -8991789 -4810299 -164919 436475 -3133207 -6293680 -5088369 -828478 1923453
35165 1923453 1304468 -155088 -14521 554838 -748123 -3426831 -4930516 -4166884 -2313196
35156 -2313196 -934165 -890695 -2171775 -3298354 -2087470 1369884 3930360 3429906 1763075
35147 1763075 1665966 2420730 1846428 753069 1531833 3495450 3851637 2658249 2394216
35138 2394216 2971212 2078501 666815 2588894 7498859 9667726 6290489 1824368
$$ packed form
35200F98037J056169o15606j048676l01213R81160J906788J586425K34449q67975
35191C629558j161903j226348r63217O11612K883666L247208P18548k102404k494653
35182C142067j220408o43385r41444p26768k99659j341085l421080l507457l2570
35173h991789M181490M645380O01394l569682l160473J205311M259891K751931
35165A923453o18985j459556J40567N69359j302961k678708j503685P63632J853688
35156b313196J379031M3470j281080j126579J210884L457354K560476n00454j666831
35147A763075r7109P54764n74302j093359P78764J963617L56187j193388k64033
35138B394216N76996q92711j411686J922079M909965K168867l377237m466121
$$ plain form
35130 1824368 816876 1183588 -1164633 -4989869 -6076739 -4274154 -3060244 -3506451
35122 -3506451 -3430362 -2036048 -1229332 -2147729 -3609489 -4264724 -3869135 -2537074 -773766
35113 -773766 236464 199818 623674 2366963 3806580 3596962 3294860 4405657 4893882
35104 4893882 2330734 -1143627 -1287525 1818076 4252334 4540958 4693475 5043484 3251426
35095 3251426 -518704 -2343751 -373992 2201760 2084564 58308 -1808303 -3460207
35087 -3460207 -4884168 -4289845 -1219942 1322533 771796 -1422875 -2820309 -3901557
35079 -3901557 -5745804 -6339499 -3268903 1395344 3009431 631911 -2185758 -2756303
35071 -2756303 -2136005 -2314667 -3327014 -3932803 -3284275 -1410297 693237 1597167 1215341
$$ packed form
35130A824368j007492L66712k348221l825236j086870J802585J213910m46207
35122c506451P6089J394314Q06716r18397j461760o55235L95589J332061J763308
35113g73766J010230l6646M23856J743289J439617k09618l02102J110797M88225
35104D893882k563148l474361j43898L105601K434258K88624J52517L50009j792058
35095C251426l770130j825047J969759K575752j17196k026256j866611j651904
35087c460207j423961N94323L069903K542475n50737k194671j397434j081248
35079c901557j844247n93695L070596M664247J614087k377520k817669n70545
35071b756303O20298j78662j012347o05789O48528J873978K103534R03930l81826
$$ plain form
35062 1215341 1253000 2443802 2688611 176960 -2978470 -3282172 -1240985 -688099 -2773379
35053 -2773379 -4291321 -2741465 416287 2890006 4725305 6436496 6739724 4626448
35045 4626448 1808834 688048 1148852 1401682 835245 50999 -879299 -2116209 -2759718
35036 -2759718 -1817259 34950 1343330 1924902 2354901 2201240 832432 -585739 -262891
35027 -262891 1193260 1368800 -85259 -651301 1236819 3901673 5114646 4985508 4659298
35018 4659298 4012025 2587463 1389442 1522210 1949655 863626 -1213971 -1947113 -641695
35009 -641695 1051945 2004109 2822218 3666849 3307135 1599229 753965 2337497 4632957
35000 4632957 5005781 3647108 2717230 2629663 1724804 -572895 -2752833 -3673253 -3790471
$$ packed form
35062A215341L7659J190802K44809k511651l155430l03702K041187N52886k085280
35053b773379j517942J549856L157752K473719J835299J711191L03228k113276
35045D626448k817614j120786M60804K52830n66437p84246r30298j236910o43509
35036b759718R42459J852209J308380N81572M29999j53661j368808j418171L22848
35027b62891J456151J75540j454059n66042J888120K664854J212973j29138l26210
35018D659298o47273j424562j198021J32768M27445j086029k077597p33142J305418
35009f41695J693640R52164Q18109Q44631l59714j707906q45264J583532K295460
35000D632957L72824j358673r29878q7567r04859k297699k179938r20420j17218
$$ plain form
34991 -3790471 -3419129 -1975189 173722 1228109 574848 -47279 508064 622643 -1258611
34982 -1258611 -3294032 -2460975 765878 2823451 1984385 106736 -858075 -1349300 -2232698
$$ packed form
34991c790471L71342J443940K148911J054387o53261o22127N55343J14579j881254
34982a258611k035421Q33057L226853K057573q39066j877649r64811m91225q83398
$$ [...]
##END NTUPLES=NMR SPECTRUM
##END=
