##TITLE=31Pdec_SR59H_x:TFAA-1:1
 CDcl3, 124 sc
 3.06.2021
##JCAMPDX= 6.0         $$ Bruker NMR JCAMP-DX V2.0
##DATA TYPE= NMR SPECTRUM
##DATA CLASS= NTUPLES
##ORIGIN= UXNMR, Bruker Analytische Messtechnik GmbH
##OWNER= root
$$ XWIN-NMR		Version 3.5
$$ Thu Jun  3 12:23:07 2021 Russian Standard Time (UT+4h)  she@DPX200
##.OBSERVE FREQUENCY= 81.013821
##.OBSERVE NUCLEUS= ^31P
##.ACQUISITION MODE= SIMULTANEOUS
##.ACQUISITION SCHEME= undefined
##.AVERAGES= 124
##.DIGITISER RES= 16
##SPECTROMETER/DATA SYSTEM= spect
##.PULSE SEQUENCE= zgpg30
##.SOLVENT NAME= CDCl3
##.SHIFT REFERENCE= (INTERNAL, CDCl3, 0, 248.564)
##AUDIT TRAIL= $$ (NUMBER, WHEN, WHO, WHERE, WHAT)
$$ ##TITLE= Audit trail, XWIN-NMR		Version 3.5
$$ ##JCAMPDX= 5.01
$$ ##ORIGIN= Bruker BioSpin GmbH
$$ ##OWNER= she
$$ F:/spectra/data/she/nmr/P31/1/pdata/1/auditp.txt
$$ ##AUDIT TRAIL=  $$ (NUMBER, WHEN, WHO, WHERE, WHAT)
(   1,<2021-06-03 12:20:23.76 +0400>,<she>,<DPX200>,
      <continue with go, POWCHK disabled, PULCHK disabled
       configuration hash MD5:
       00 E9 B6 7A A2 85 ED C7 34 08 36 98 17 FE 4E 26
       data hash MD5: 32K
       01 B5 6C C8 B3 CB 29 61 13 49 72 33 12 2D DE 5F>)
(   2,<2021-06-03 12:20:27.42 +0400>,<she>,<DPX200>,
      <Start of raw data processing
       efp BC_mod = 2 LB = 1 FT_mod = 6 PKNL = 1 PHC0 = -5952.473 PHC1 = 247.0723 SI = 64K 
       data hash MD5: 64K
       12 B4 5C 67 CB C2 DA 2B F0 3C BA D4 C6 CA 2C A7>)
(   3,<2021-06-03 12:20:54.23 +0400>,<she>,<DPX200>,
      <pk PHC0 = 32.44932 PHC1 = 31.6 
       data hash MD5: 64K
       4F 40 19 0F B0 25 29 D2 9D 33 3E 65 53 45 7C 60>)
(   4,<2021-06-03 12:21:24.09 +0400>,<she>,<DPX200>,
      <pk PHC0 = 47.42171 PHC1 = -130 
       data hash MD5: 64K
       69 99 DA 7D B8 1D 59 CC A8 07 0A 16 AF B3 B1 1D>)
(   5,<2021-06-03 12:21:27.93 +0400>,<she>,<DPX200>,
      <abs ABSG = 5 
       data hash MD5: 64K
       3E AC 01 7C EC 93 FD 43 9C 3C BF 2F D2 65 04 3C>)
$$ ##END=
$$ 
$$ hash MD5
$$ A1 24 8C 15 97 5D 16 C6 EC EC 5F B9 20 DB 42 B5
##$RELAX= 
##$RELAX= 
##$RELAX= 
##$RELAX= 
##$RELAX= 
##$RELAX= 
##$RELAX= 
##$RELAX= 
$$ Bruker specific parameters
$$ --------------------------
##$DU= <F:/spectra>
##$EXPNO= 1
##$NAME= <P31>
##$PROCNO= 1
##$TYPE= <nmr>
##$USER= <she>
##$AMP= (0..31)
100 100 100 100 100 100 100 100 100 100 100 100 100 100 100 100 100 100 
100 100 100 100 100 100 100 100 100 100 100 100 100 100 
##$AQSEQ= 0
##$AQ_mod= 1
##$AUNM= <au_zg>
##$AUTOPOS= <>
##$BF1= 81.014009
##$BF2= 200.13
##$BF3= 200.13
##$BF4= 200.13
##$BF5= 200.13
##$BF6= 200.13
##$BF7= 200.13
##$BF8= 200.13
##$BYTORDA= 1
##$CFDGTYP= 0
##$CFRGTYP= 5
##$CHEMSTR= <none>
##$CNST= (0..31)
1 1 145 1 1 1 1 1 1 1 1 1 1 1 1 1 1 1 1 1 1 1 1 1 1 1 1 1 1 1 1 1 
##$CPDPRG= <waltz16>
##$CPDPRG1= <>
##$CPDPRG2= <waltz16>
##$CPDPRG3= <>
##$CPDPRG4= <mlev>
##$CPDPRG5= <mlev>
##$CPDPRG6= <mlev>
##$CPDPRG7= <mlev>
##$CPDPRG8= <mlev>
##$CPDPRGB= <>
##$CPDPRGT= <>
##$D= (0..31)
$$ [...]
##$SUBNAM3= <"">
##$SUBNAM4= <"">
##$SUBNAM5= <"">
##$SUBNAM6= <"">
##$SUBNAM7= <"">
##$SUBNAM8= <"">
##$SUBNAM9= <"">
##$SW= 501.771253377433
##$SWIBOX= (0..15)
0 1 3 0 0 0 0 0 0 0 0 0 0 0 0 0 
##$SW_h= 40650.406504065
##$TD= 32768
##$TD0= 1
##$TE= 0
##$TE2= 300
##$TE3= 300
##$TEG= 300
##$TL= (0..7)
0 120 53 12 22 120 120 120 
##$TP= (0..7)
150 150 150 150 150 150 150 150 
##$TP07= 0
##$TPNAME0= <>
##$TPNAME1= <>
##$TPNAME2= <>
##$TPNAME3= <>
##$TPNAME4= <>
##$TPNAME5= <>
##$TPNAME6= <>
##$TPNAME7= <>
##$TPOAL= (0..7)
0.5 0.5 0.5 0.5 0.5 0.5 0.5 0.5 
##$TPOFFS= (0..7)
0 0 0 0 0 0 0 0 
##$TUNHIN= 0
##$TUNHOUT= 0
##$TUNXOUT= 0
##$USERA1= <user>
##$USERA2= <user>
##$USERA3= <user>
##$USERA4= <user>
##$USERA5= <user>
##$V9= 5
##$VALIST= <valist>
##$VCLIST= <CCCCCCCCCCCCCCC>
##$VD= 0
##$VDLIST= <DDDDDDDDDDDDDDD>
##$VPLIST= <PPPPPPPPPPPPPPP>
##$VTLIST= <TTTTTTTTTTTTTTT>
##$WBST= 1024
##$WBSW= 4
##$XGAIN= (0..3)
0 0 0 0 
##$XL= 0
##$YL= 0
##$YMAX_a= 20294
##$YMIN_a= -31270
##$ZGOPTNS= <>
##$ZL1= 120
##$ZL2= 120
##$ZL3= 120
##$ZL4= 120
##$ABSF1= 248.5645
##$ABSF2= -253.2056
##$ABSG= 5
##$ABSL= 3
##$ALPHA= 0
##$AQORDER= 0
##$ASSFAC= 0
##$ASSFACI= 0
##$ASSFACX= 0
##$ASSWID= 0
##$AUNMP= <proc_1d>
##$AZFE= 0.1
##$AZFW= 0.5
##$BCFW= 0
##$BC_mod= 2
##$BYTORDP= 0
##$COROFFS= 0
##$CY= -3
##$DATMOD= 1
##$DC= 0
##$DFILT= <>
##$DTYPP= 0
##$F1P= 0
##$F2P= 0
##$FCOR= 1
##$FTSIZE= 65536
##$FT_mod= 6
##$GAMMA= 0
##$GB= 0
##$INTBC= 1
##$INTSCL= 5.30512e-09
##$ISEN= 30
##$LB= 1
##$LEV0= 0
##$LPBIN= 0
##$MAXI= 10000
##$MC2= 0
##$MEAN= 0
##$ME_mod= 0
##$MI= 50
##$NCOEF= 0
##$NC_proc= -6
##$NLEV= 6
##$NOISF1= 182.463
##$NOISF2= 159.3651
##$NSP= 0
##$NTH_PI= 0
##$NZP= 0
##$OFFSET= 248.5645
##$PC= 4
##$PHC0= -5872.602
##$PHC1= 148.6723
##$PH_mod= 1
##$PKNL= yes
##$PPARMOD= 0
##$PSCAL= 0
##$PSIGN= 0
##$REVERSE= no
##$SF= 81.014009
##$SI= 65536
##$SIGF1= 159.3651
##$SIGF2= -187.1042
##$SINO= 113.3802
##$SIOLD= 16384
##$SREGLST= <1H.CDCl3>
##$SSB= 0
##$STSI= 65536
##$STSR= 0
##$SW_p= 40650.406504065
##$SYMM= 0
##$S_DEV= 0
##$TDeff= 32768
##$TDoff= 0
##$TI= <>
##$TILT= no
##$TM1= 0
##$TM2= 0
##$TOPLEV= 0
##$USERP1= <user>
##$USERP2= <user>
##$USERP3= <user>
##$USERP4= <user>
##$USERP5= <user>
##$WDW= 1
##$XDIM= 65536
##$YMAX_p= 306655009
##$YMIN_p= -175376436
$$ End of Bruker specific parameters
$$ ---------------------------------
##NTUPLES= NMR SPECTRUM
##VAR_NAME=  FREQUENCY,     SPECTRUM/REAL,   SPECTRUM/IMAG
##SYMBOL=    X,             R,               I
##VAR_TYPE=  INDEPENDENT,   DEPENDENT,       DEPENDENT
##VAR_FORM=  AFFN,          ASDF,            ASDF
##VAR_DIM=   65536,         65536,           65536
##UNITS=     HZ,            ARBITRARY UNITS, ARBITRARY UNITS
##FACTOR=    0.620285442955139, 1,           1
##FIRST=     20137.2065510759, 0,            0
##LAST=      -20513.1999529892, 0,           0
##MIN=       -20513.1999529892, -175376436,  0
##MAX=       20137.2065510759, 306655009,    0
$$ Real data points
##PAGE= N=1
##DATA TABLE= (X++(R..R)), XYDATA
$$ [...]
42864 -3790643 -6601337 -6714588 -5472472 -4910303 -5578228 -6739680 -7109240 -5420065 -2033300
42855 -2033300 184388 -1356341 -5441550 -8517225 -9362169 -9541763 -9449653 -7593132 -4538138
42846 -4538138 -3568467 -5517485 -6490171 -3346091 1495564 3672793 2805929 1612018 1236265
42837 1236265 1022937 1372440 3127706 5098595 5676652 6000797 7937999 9885108 8748173
42828 8748173 5485480 3884203 3791021 1075485 -4387362 -6551385 -2097511 3541409
42820 3541409 3399780 -1491981 -4601175 -3354738 -1207050 -1700320 -4867797 -8649199
42812 -8649199 -10191752 -7089311 -1154829 953414 -4189105 -9708190 -5700410 6768429
42804 6768429 15771556 13804245 6169650 1638403 1443071 1755246 1345813 1109931 -201857
42795 -201857 -4022357 -8035801 -9155957 -8532659 -9002353 -9453853 -6767424 -2241400 -988321
42786 -988321 -4868230 -10084928 -12069857 -9663151 -4780678 -856797 -928701 -4445560 -7063665
42777 -7063665 -6238905 -4854588 -5887536 -6576958 -3254351 643668 -1433769 -7946109
42769 -7946109 -9765684 -3079044 5292257 7860449 5514100 3395377 3022335 2355534
42761 2355534 45267 -3618268 -7386778 -8971300 -7292512 -5560344 -7957965 -12541146
42753 -12541146 -12692724 -7057063 -2240624 -3453316 -8370156 -12814217 -16034218 -16973807
42745 -16973807 -12329097 -3209381 2720985 1338517 -1718620 -689996 1107794 -1066039
42737 -1066039 -3318562 -273163 3124222 -1606435 -10732731 -11427174 -667191 10144428
42729 10144428 11483565 6922321 4868980 7308517 10703229 11785758 8876426 2350493
42721 2350493 -3767479 -5209869 -3730853 -4909499 -9138311 -11113317 -9306092 -8692935
42713 -8692935 -11874729 -14750964 -14052096 -12074336 -10385470 -6199039 327729 2530945
42705 2530945 -2704921 -7536076 -3318898 6188908 9535637 2957250 -6023759 -9109442
42697 -9109442 -5326076 725861 3816139 1814073 -1823219 -637841 6481860 12110525
42689 12110525 9561315 2385479 -726972 1989100 4818496 4660026 4584840 6923880
42681 6923880 9452927 10285440 10922543 11797940 9537697 2235288 -5745737 -8112351 -4343707
42672 -4343707 243515 1828328 2538065 6231107 11628192 12715728 6943460 44180
42664 44180 -793793 2999934 3085291 -3838883 -11483321 -13358889 -11002405 -9260700 -8741188
42655 -8741188 -7926393 -8142600 -10380141 -10903567 -6684093 -2169394 -3376242 -7625268 -7218672
42646 -7218672 -1907195 1090823 -706699 -2170865 -1203782 -2593207 -7872032 -10475184
42638 -10475184 -6383845 -1892396 -4179779 -10217219 -12217439 -9497696 -7419955 -7667576
42630 -7667576 -7145840 -5088667 -4362784 -5902223 -7447046 -7740382 -7140266 -4604054 681843
42621 681843 4919016 2824541 -3887327 -6885671 -2282220 3826597 4103776 -171317
42613 -171317 -2453044 -1010139 -8361 -1298178 -898732 4285381 10370592 10797508 4901417
42604 4901417 -1621769 -4481157 -5143349 -6298736 -6796100 -4186062 116351 2155606
42596 2155606 965039 -1036745 -2803146 -5692527 -9259147 -10227140 -7183240 -2677854
42588 -2677854 991755 4378888 7285627 6748438 1900819 -2716316 -2678279 293414 1885681
42579 1885681 2024833 3342765 5124794 4559672 2912176 4327815 8343323 9584530
42571 9584530 6088764 2184329 1030189 -123174 -3927029 -7128756 -5425277 -823326
42563 -823326 849065 -1953449 -5480004 -6905332 -7125990 -7212048 -6233330 -4092300 -3487281
42554 -3487281 -6783856 -12290323 -15536550 -13951918 -9181277 -4862105 -2975676 -2732282
42546 -2732282 -2498663 -1877341 -1585173 -2233123 -4174442 -7712119 -11841862 -13322584 -9370201
42537 -9370201 -1776788 3819242 3761370 -300149 -4610950 -7353683 -8043863 -5752567 -865827
42528 -865827 3242632 3702772 2356084 3062596 5301892 4296001 -1870865 -8811881 -11080745
42519 -11080745 -8222859 -3987425 -1765146 -2494603 -5003191 -6417052 -3944588 1583256
42511 1583256 5296010 3604614 -1159361 -3688587 -2264389 340655 1953811 3661257
42503 3661257 6592672 8997591 8592556 6265680 5149810 6229966 6732611 3746638
42495 3746638 -1430512 -4013888 -1273959 3857145 6206747 4562285 1873849 -687184
42487 -687184 -5838608 -13994017 -18768098 -13609238 -1492305 7222977 6864260 1769343
42479 1769343 -1131280 -148893 2437689 4613285 4661932 1074022 -4212675 -6088621 -3243865
42470 -3243865 -957468 -2688313 -3237996 3397764 12677528 14163569 6640054 157057
42462 157057 1655453 6464368 7204677 4084463 1632421 746185 -397373 -1266386 -299369
42453 -299369 1219410 1542357 2549881 6501670 10487853 9563724 4720951 2353206 5350328
42444 5350328 9530687 10099895 7458918 4818466 3517468 2987947 2902576 3024008 2392093
42435 2392093 551081 -1321946 -1878850 -1452417 -1324138 -1676929 -1334330 433794 2433369
42426 2433369 2401182 -271830 -3041989 -2644919 755580 3413823 2741044 410107 -600355
42417 -600355 -200937 -377349 -1654842 -2879553 -3744969 -5152684 -7313772 -9249565 -9815248
42408 -9815248 -8091064 -3969851 380138 1569432 -739355 -2962110 -3057000 -3527806 -5730651
42399 -5730651 -5288737 1260172 8518479 8268657 1927580 -1025336 2986867 7596247
42391 7596247 7731376 6202274 5912756 3908076 -1732732 -6152268 -4899156 -1198462
42383 -1198462 -9202 30255 2333808 4842866 3910312 1768398 2594909 4333157 2314195
42374 2314195 -1533423 -1506190 1545805 1558388 -1801358 -2839647 -1020279 -2696795 -9235643
42365 -9235643 -12865172 -8872715 -3742404 -5149792 -10347231 -11374393 -7210655 -3535847
42357 -3535847 -2965761 -2359201 643221 3724587 3265577 -1418581 -7420342 -10231010 -7523049
42348 -7523049 -2407951 -876990 -4271247 -7151270 -5161411 -1579128 -1936944 -4978119
42340 -4978119 -4631299 -99519 1942771 -3443906 -12725339 -18826088 -19522268 -17786742
42332 -17786742 -15637432 -11505564 -4422354 2110125 3334260 -96733 -1869359 1923555
42324 1923555 7192635 7557372 3640579 1831512 4250717 5866829 3380591 1098305
42316 1098305 3802234 8129473 6593386 -1774512 -9871485 -11176087 -6191612 -422286
42308 -422286 1188178 -1980330 -5924585 -6167123 -3509710 -3451730 -7963502 -11223918 -7279416
42299 -7279416 999898 5532397 3673652 -53054 -1848554 -2806865 -5132077 -8905442
42291 -8905442 -12960560 -15216661 -12920431 -6897295 -4001007 -9292784 -16769701 -15462443
42283 -15462443 -5347634 1282291 -2918520 -10089875 -9270444 -1720673 2723839 -133039
42275 -133039 -5535612 -8113412 -7055426 -4212215 -2354190 -4428347 -10040716 -13650994
42267 -13650994 -10446992 -3017413 1737911 1091957 -2080254 -4651499 -5114410 -1343907
42259 -1343907 7565502 16704872 18121027 10172697 146799 -4367837 -3343996 -1574697
42251 -1574697 -1163829 239997 4799685 10415105 12019219 7108824 -192529 -2281641
42243 -2281641 3506645 11475637 14416732 11657679 7526526 4292270 881904 -2964568
42235 -2964568 -6097879 -8809197 -11591184 -11869142 -7399025 -2373624 -3499416 -9344122
42227 -9344122 -10967287 -5316125 -224533 -2066759 -6146572 -5644353 -3339840 -5762387
42219 -5762387 -10182194 -7660597 2092488 8809612 6294519 652220 556492 5859998
42211 5859998 10160849 9858543 6096626 1068488 -3150180 -4222044 -1995683 -41083
42203 -41083 -1481621 -4557304 -5559966 -4928546 -6445873 -10540938 -12592044 -9340415 -3688085
42194 -3688085 -685388 -886470 -670778 1682228 3471265 1975154 -1054401 -1423428 1785291
42185 1785291 4669896 3187650 -2033941 -6577735 -7208760 -4819004 -2573591 -2307145
42177 -2307145 -3326668 -4078688 -4000191 -3592439 -3355640 -3109467 -2029960 950795 6106807
42168 6106807 11475813 13264872 9503922 3297613 340778 2511963 6084809 7279591
42160 7279591 6691950 6002173 3533882 -2617366 -9034335 -10058665 -6203376 -3873160
42152 -3873160 -5630336 -6463915 -2285838 3296501 4845338 3453510 4077908 7177400
42144 7177400 8372536 5491758 1540719 774141 4708947 11175672 14902556 11023262
42136 11023262 1142350 -6365227 -5819532 -1433549 -543180 -2598161 -1203336 4849000
42128 4849000 10164947 12025386 13212910 14572970 12796710 8152679 6646501 10413886
42120 10413886 12873117 8500679 1397734 -1687034 -1550962 -2883279 -4408854 -499271
42112 -499271 8845515 16554209 17276129 12707033 8058683 7140557 10652499 15891583 18575134
42103 18575134 17558793 16241466 16789519 16126111 11847507 8692271 12759136 21101435
42095 21101435 24263202 19374946 14053420 15628003 21969136 25325155 21259324 11895178
42087 11895178 3458722 1651627 6381958 10694571 8291279 1882220 -315528 3583235
42079 3583235 6195316 1178342 -8617983 -15736050 -16772876 -13888560 -10834481 -9800538
42071 -9800538 -10058049 -8660324 -4556740 -1435218 -2940245 -6104505 -4802193 679024
42063 679024 3937240 2770519 1870925 3624891 4200493 1812506 631659 1996856 136210
42054 136210 -7025735 -10765103 -3749617 6915250 8565474 818649 -5345145 -3963958
42046 -3963958 188069 1565955 473035 -1107493 -2827538 -3928970 -3727286 -4340893
42038 -4340893 -7459178 -9311978 -5266055 1545373 3513462 70587 -1933860 362667
42030 362667 2417101 1545395 1001767 2141099 648175 -5540847 -11512449 -12688530 -10864856
42021 -10864856 -9249203 -7450371 -5231457 -5317041 -8293819 -10290326 -9744390 -10613561 -14569419
42012 -14569419 -16391505 -12493044 -7849225 -8141031 -10699017 -10303236 -8710642 -10327172
42004 -10327172 -12772365 -10770303 -6519553 -6867107 -11630716 -13880803 -11424483 -8901527
41996 -8901527 -7749521 -3343332 5169691 10412198 6578820 -2221223 -7792380 -7547198
41988 -7547198 -4381513 -624105 3550213 7708359 10668393 11725596 10770978 8234341
41980 8234341 5517818 3831719 2397757 -128554 -2714761 -3266240 -2595242 -3438732 -5351157
41971 -5351157 -4770703 -1064772 1895602 1855465 1510991 3288907 4922173 3654294 1545509
41962 1545509 2443047 5587250 6306267 2534011 -2500188 -4195959 -1208728 3871620
41954 3871620 7280647 7744482 7792747 10441578 14551174 15632083 11890150 6723055 3726587
41945 3726587 2125723 -396260 -3041772 -3664008 -3485331 -5789578 -10074873 -11601197
41937 -11601197 -8028306 -3260974 -2413633 -4990302 -5939422 -2943573 257749 -991177
41929 -991177 -5688787 -7975632 -4179665 3035726 8147822 8674092 6622317 5573391
41921 5573391 7574872 11587183 13724928 10629827 4221028 1168404 5198376 11618859
41913 11618859 12550996 6325036 -1672462 -6318247 -6885874 -4564373 -555838 2835600
41905 2835600 3456681 2477687 2504116 2334764 -1492440 -7238973 -8142706 -2475858 2591835
41896 2591835 1068868 -3400654 -4229345 -2223641 -2807011 -6338345 -8478707 -8560754 -10189371
41887 -10189371 -13563737 -14430674 -12193431 -12254717 -16964629 -19887030 -14103507 -2796094
41879 -2796094 4028114 2202840 -2471638 -3468000 -2115900 -3955436 -9566470 -13673710
41871 -13673710 -13040012 -10490420 -9097900 -6544695 571916 9426105 13408571 11300427
41863 11300427 8493447 8351486 8007168 4868119 1759301 1745714 2213282 -1107088 -7075558
41854 -7075558 -10824596 -10678012 -9099834 -8033234 -7269939 -6654383 -6450722 -6032159 -4811584
41845 -4811584 -3549290 -2736887 -1591870 -710379 -2616860 -6635390 -7018554 -885242 5341694
41836 5341694 3416094 -5075951 -11027894 -10440484 -7866932 -7485699 -7747804 -6210897 -3679978
41827 -3679978 -1530715 448272 2004596 2151758 1629337 1722537 807245 -3393099 -8758222
41818 -8758222 -11345431 -12053083 -14205933 -15629243 -11669419 -6051497 -8190232 -17179008
41810 -17179008 -19660175 -9080368 3438286 5221340 -251309 -1575953 2149108 2838066
41802 2838066 -1205768 -3595088 -2020067 -1100308 -2930505 -4568073 -5837722 -10221508
41794 -10221508 -15919942 -15026266 -5360003 4468257 6607520 4550302 6588359 12873295
41786 12873295 15290551 9124401 -233266 -3685573 636542 5001408 1487251 -7596099
41778 -7596099 -12158432 -7986631 -2903926 -5298898 -11286077 -10409295 -1525522 5776982
41770 5776982 5876150 4470136 8495404 16363616 22767234 27209317 32198701 36834667
41762 36834667 37643859 34008213 28950161 25853080 26598294 30586878 33487098 29920664
41754 29920664 19934074 9948440 4975189 3318165 1572262 565112 2244918 4450038
41746 4450038 3837757 1323451 -431133 -2587156 -7794724 -14127551 -17053304 -16300130
41738 -16300130 -14992758 -12805113 -6472299 2538024 7533757 5645971 1632882 250610
41730 250610 75185 -2101215 -5513903 -7756543 -8996298 -10068479 -9641827 -7070847 -5052583
41721 -5052583 -5496500 -5714970 -3161836 -965696 -3076833 -6171422 -3485592 3712296
41713 3712296 6303229 1009701 -3573452 702444 9084079 10519878 3506778 -2263659
41705 -2263659 -20042 5264923 4880591 -1559305 -6229948 -3392838 4037429 8297215
41697 8297215 5052141 -2731875 -8299636 -7846611 -3525472 122884 1399855 1591262
41689 1591262 898318 -2626996 -9065141 -14264890 -13868353 -8486787 -2828871 -438910
41681 -438910 -1072347 -2495800 -2771949 -1004235 2158700 4474714 4014919 1289065 -1651162
41672 -1651162 -3855713 -5606735 -6244167 -4163069 393038 4488920 5594912 4307663
41664 4307663 3099353 3464460 5106514 6800700 7082954 5094993 1883142 121401
41656 121401 1393305 4219163 5800296 5264035 3977209 2878379 1146275 -1629352
41648 -1629352 -3155423 -311843 6228924 11130630 10133128 5871105 5210761 10380332
41640 10380332 15874987 15970678 12344978 11052323 14101885 18187020 20689533 22265103
41632 22265103 23343933 22761734 20998051 20399134 20542591 17746421 11417537 6413575
41624 6413575 6037605 7195805 6559034 6856692 11118915 14502971 9885665 198071 -3599287
41615 -3599287 1813054 6817579 3026169 -4391195 -4621221 3249820 9775530 8397672
41607 8397672 2353432 -2080590 -3394196 -3545740 -3040858 -996269 1579519 2119104 426649
41598 426649 -361935 1548088 2526063 -2781108 -13045691 -18949680 -13432623 -1255262
41590 -1255262 6164240 4963912 2415707 4979575 9092270 8319495 4528078 4820550
41582 4820550 9626699 11650910 7144396 1104917 -1028636 -737427 -2026244 -4773571
41574 -4773571 -6754558 -8199036 -9514869 -7822078 -1344047 4968884 4315489 -2223881
41566 -2223881 -6777866 -5766665 -4022186 -6377111 -10641553 -11800657 -9027644 -5350364
41558 -5350364 -3359841 -3919330 -6345356 -7513886 -3896717 2920643 6200987 2764761
41550 2764761 -1910367 -1607915 1064349 -1146610 -8555265 -13829633 -12570799 -8207957
41542 -8207957 -5391564 -4410787 -4075909 -4824534 -6241391 -5852228 -3207445 -1374837 -1740856
41533 -1740856 -1295747 1794545 3907005 1324315 -3338455 -4610571 -1760791 1580487
41525 1580487 3523572 4864124 5080603 2407482 -1978004 -4091396 -2150469 1721563
41517 1721563 4969039 6693127 6427052 4364414 2992043 4756281 7434099 5672269
41509 5672269 -1411798 -7657644 -7073808 -1030380 4111959 4759834 3050516 2804763 4570889
41500 4570889 5330196 2735823 -1304205 -2920617 -2213903 -3683287 -8711471 -11469960
41492 -11469960 -6889867 304834 1113638 -4528692 -7801982 -4763830 -1522793 -2905226
41484 -2905226 -4693458 -2613488 -1254204 -6096885 -12355203 -11148595 -3679391 309904
41476 309904 -2874382 -7156217 -8035348 -8458920 -10923829 -12105830 -9619851 -7342285 -8753105
41467 -8753105 -10075945 -5667801 3147761 9745584 10270113 5707429 -1527434 -8250641
41459 -8250641 -9758897 -3887296 4469163 7380478 2709435 -4512357 -9175955 -10661314
41451 -10661314 -10309567 -8665423 -6427756 -4551394 -2012037 3140437 8916114 9396333
41443 9396333 2601264 -4776668 -4749737 1446802 4959512 1479773 -3175032 -1962682
41435 -1962682 2944549 3189329 -3798794 -11093925 -11758516 -7513200 -4634241 -4474328 -3245718
41426 -3245718 -277048 -447071 -6287551 -12489914 -12320062 -6770402 -2957183 -4626465
41418 -4626465 -8419104 -9444265 -6853771 -3218070 -1280275 -2099875 -4091152 -3559368
41410 -3559368 1330395 6948319 7545652 2736235 -1641055 -1147267 2246146 4389951
41402 4389951 4616628 4636714 4859610 4849156 5030054 5038398 2841567 -1370144 -3175647 154190
41392 154190 4184588 2741891 -2849205 -5532595 -2782553 925867 2237232 3132931
41384 3132931 5148284 5380551 1722427 -2559435 -3454465 -2093963 -2338245 -5204481 -9066112
41375 -9066112 -12823886 -15437876 -14631013 -9621787 -3336804 1133471 4111218 6391493
41367 6391493 5799926 1019215 -3773737 -3451102 401100 1872365 -59393 -541618 2816563
41358 2816563 6539215 7467455 6863621 6153268 3371858 -3055374 -10346943 -14106214 -12941828
41349 -12941828 -8666957 -4147392 -2080168 -3248067 -4923635 -3749992 -792366 -240355
41341 -240355 -2553687 -3515258 -1504671 -397496 -2415386 -3366797 625655 5893309 5945493
41332 5945493 719376 -3850052 -3748030 -78730 4121350 6359247 5332159 2477101
41324 2477101 1337629 2639540 2597023 -857391 -3964375 -3667112 -4045024 -9921156 -17444936
41315 -17444936 -18771872 -14152551 -10981720 -11502645 -10430016 -5804520 -3123556 -5583162
41307 -5583162 -8189753 -5959485 -1551134 -108418 -1805505 -3977686 -5948433 -7386216
41299 -7386216 -6238494 -2704259 -1278078 -4542414 -8737433 -9681127 -9026481 -9990147 -10926786
41290 -10926786 -8583198 -4367239 -1742481 -266243 2061024 3157752 -283055 -6249391
41282 -6249391 -9765329 -10198958 -10303982 -9698760 -5913209 -825506 905414 -565419 -1170048
41273 -1170048 -1143426 -4579174 -10124757 -10708411 -5154977 -1809833 -6209923 -12344844 -11759957
41264 -11759957 -5393637 7148 2473660 4659517 6319833 4604625 811480 -201393
41256 -201393 2039151 2161270 -2965744 -9422625 -11716098 -9421094 -5833618 -2779861
41248 -2779861 137364 2549357 2877734 1220217 245822 1778054 3864368 3263945 349194
41239 349194 -1108312 294706 1061225 -1750912 -5219398 -4337591 549135 4383225 4678783
41230 4678783 3441578 1940695 -1025019 -4562390 -4959649 -1819466 248543 -1038709
41222 -1038709 -1721528 1384354 4926212 4927576 3553682 4286668 4927953 2368333 400885
41213 400885 4287291 10010716 8551596 352424 -4546538 -2231536 -509804 -5054368
41205 -5054368 -9774644 -7382483 -1539582 -419273 -3947795 -6114092 -5972651 -7241122
41197 -7241122 -9211861 -7492680 -3516383 -3981115 -8969517 -9338775 -154274 10189402
41189 10189402 10102782 -131342 -9246361 -8974378 -2206072 2291301 -426375 -7404080
41181 -7404080 -11246203 -7412701 1068170 6733962 5645588 436906 -4569222 -7902052
41173 -7902052 -9479218 -8839507 -7628019 -9835886 -15607832 -18477864 -13775885 -6470763
41165 -6470763 -4390275 -6395161 -5247382 -886919 -1182636 -8021975 -12660157 -9393624
41157 -9393624 -4895512 -7089397 -12032617 -10608204 -3357802 991365 -511506 -1938946
41149 -1938946 787968 4386183 4661882 1614698 -3299016 -8812415 -11426439 -7636691
41141 -7636691 -535809 1875875 -2457497 -6191643 -3060862 3577493 6480701 4116926
41133 4116926 214141 -2534079 -3802974 -3274957 -1011740 1385898 2667298 3106648
41125 3106648 2130806 -2045406 -8326611 -12081081 -11378574 -10055083 -11379161 -12740035
41117 -12740035 -10559830 -6539504 -4375866 -3719047 -2330535 -1081574 -1544392 -1546566 1161808
41108 1161808 3362590 656487 -4641609 -6284989 -3489100 -1163383 -1605275 -2496026
41100 -2496026 -2962696 -5055769 -8497668 -9921506 -8416002 -6706971 -6245850 -6209491 -7463143
41091 -7463143 -11684200 -16092140 -15347430 -9886859 -6161097 -6976196 -7866752 -5258915 -2002607
41082 -2002607 -1701775 -3022623 -3077307 -1967110 -986628 -402167 -1287706 -5185456 -9976100
41073 -9976100 -10893697 -7502461 -4404196 -3388264 -1284481 2171305 1891503 -3338589
41065 -3338589 -6698231 -3449848 1765111 3359009 3492258 5727642 6910471 3377415
41057 3377415 -784009 -520856 431651 -3818885 -9541395 -8912522 -3956730 -3426364 -7493849
41048 -7493849 -7462407 -770337 5395636 6830951 7272376 8230022 5373021 -869071 -2332269
41039 -2332269 3275034 6105825 -756930 -9020291 -7522779 180306 1620534 -5328413
41031 -5328413 -10531072 -8070433 -3887918 -4700286 -7971243 -7471264 -3238474 -711266
41023 -711266 -2327144 -4460601 -2698185 2657924 7485386 8910459 7643821 5155728
41015 5155728 1039066 -4537497 -7855706 -5605764 -1517247 -3466909 -11993878 -17222032
41007 -17222032 -11377563 103030 5630270 2561119 -1558337 -1601496 -1031736 -3891880
40999 -3891880 -7604966 -7877071 -5929429 -5739744 -7003427 -6229350 -3454786 -2366634 -3696793
40990 -3696793 -3966323 -2182889 -2268140 -5779407 -7636554 -4433582 -2537855 -9932904 -21920176
40981 -21920176 -24631809 -14430992 -4103382 -4765619 -10406493 -8628291 -81155 3770182
40973 3770182 -757701 -5021124 -2921493 466831 -1163108 -5558450 -7325905 -6573916
40965 -6573916 -6444538 -6795673 -5842880 -4628611 -4944559 -5529334 -4510559 -3009690 -2628810
40956 -2628810 -2283838 -1198824 -1718563 -5039966 -7594166 -6275639 -3752539 -3381286 -2606004
40947 -2606004 2067372 6841213 5331378 -478848 -2713485 -392325 -337931 -4277497
40939 -4277497 -5005978 1060953 6799185 5474206 1104525 812400 3252501 2681351 -335619
40930 -335619 -1173187 -914658 -4359910 -9385650 -7931574 1077361 8338829 6599373 -499437
40921 -499437 -5271107 -5455268 -3158182 -130181 1513272 -1000370 -5886789 -6171240 282479
40912 282479 4903177 -530101 -10864048 -13935160 -7702972 -1763129 -1996434 -3531005
40904 -3531005 -1433178 846375 -1176209 -4348192 -2981133 1966887 4959881 4171752
40896 4171752 2261381 958794 -230679 -1218387 -1170723 -106285 2009691 5723391 9246952
40887 9246952 8437336 2881611 -1645782 -777665 2370864 3520538 5110252 11184909
40879 11184909 18127881 18659125 13019102 7776396 4641740 -627971 -8196417 -12372197
40871 -12372197 -11451384 -10421295 -11227674 -8967276 -1488361 5322565 6550933 5309714
40863 5309714 5626339 5059661 427361 -4932260 -6186781 -4779137 -4976291 -6582675 -6984327
40854 -6984327 -6699148 -6993472 -5688080 -1629130 175099 -5030281 -12684417 -13578007 -6379140
40845 -6379140 1208265 3201652 1031065 -1383850 -2426313 -2082694 -1159319 -1705345 -4602733
40836 -4602733 -7160829 -6539768 -4306294 -3833126 -4973856 -5574492 -6028781 -7226837 -6304637
40827 -6304637 -619576 5804761 6711442 3483850 3234430 7233989 9069689 5388697
40819 5388697 774687 -288744 785030 1772243 3871906 7282471 8497221 6155584
40811 6155584 4629570 7629504 12506969 14837137 14558862 13437304 10283622 3448017
40803 3448017 -4618115 -9653636 -10558757 -8800064 -5317036 -1465591 -376829 -3211881
40795 -3211881 -5971635 -4180770 628630 3116124 1756624 110067 734760 1766578
40787 1766578 280679 -3889762 -8641593 -11861168 -12519753 -11117479 -9513179 -9043683
40779 -9043683 -8661230 -6279155 -2110571 861881 383741 -2347819 -4483792 -5172418 -5841195
40770 -5841195 -6980734 -6770290 -4168054 -1474141 -1321188 -2454820 -2057609 -1477801 -4619732
40761 -4619732 -10063198 -11008690 -5700700 -1263500 -2418640 -3131610 3174725 11045366
40753 11045366 10655961 4202654 2854817 8573705 11617788 7605731 4156398 6337428
40745 6337428 7926346 3970385 781539 4299851 7950940 2966215 -6349372 -9374719
40737 -9374719 -6145500 -5404347 -8696266 -8895332 -4069065 -947565 -2994613 -5526676
40729 -5526676 -5371321 -5827726 -8390104 -8299540 -3103091 1937022 2454159 2376422 6359295
40720 6359295 10309824 7104679 -1430800 -6117504 -3210234 1403092 1695202 -840251
40712 -840251 -1512353 225655 1599702 2117948 4111373 8154310 11628899 12688338 12571468
40703 12571468 12272701 9754094 3495525 -3133044 -5001270 -1973434 1567291 3643039
40695 3643039 6246212 9441641 9784106 6959729 6045193 9083325 10011549 3869782 -3449496
40686 -3449496 -2097396 7558103 15357378 15154369 10851062 8384780 8826404 10836243
40678 10836243 13391818 13846074 9142474 1569622 -2072738 178395 2301579 -171996
40670 -171996 -2973178 -294621 5295225 6277508 1294337 -3008199 -893180 6146877
40662 6146877 12247222 13147007 9050020 3804752 1231508 886458 -1404094 -7243452
40654 -7243452 -12037416 -10552099 -4346686 148112 219003 -510414 1721322 5942493 9044030
40645 9044030 9903000 8948509 6198470 2180078 -815135 -919449 529760 465355 -1859303
40636 -1859303 -3949320 -3183659 484347 4891478 7406987 6319020 2025152 -2640048
40628 -2640048 -4406384 -2404214 1776029 6523233 10795723 12255981 8005863 -885357
40620 -885357 -8216702 -8984939 -5194270 -2392069 -2304001 -2854307 -3829326 -6976438 -10502837
40611 -10502837 -9445027 -3102339 3368047 6898328 10271207 14830523 15808304 10348832
40603 10348832 4842722 7032932 14102993 16279341 10693971 4135758 2306217 3561973
40595 3561973 4221271 3529972 1661785 -1546624 -3988283 -2485643 1656998 3229437
40587 3229437 952831 -386195 2309009 5836860 6543975 5691845 5732170 5963321 5509618
40578 5509618 6139121 8155923 7833390 3397857 -574886 215911 2684863 1718993 -865695
40569 -865695 198519 3539372 2690023 -2565185 -4719653 -362291 4121524 2553595
40561 2553595 -1571926 -1123913 3431050 5306851 2042700 -1685770 -2313674 -2352926 -4386686
40552 -4386686 -5041427 -85015 6847457 7084697 -492230 -5631872 505349 12776825
40544 12776825 18052979 12099875 3945173 2682731 6470958 7986387 5479141 2911123
40536 2911123 1904562 -366997 -5388165 -10430852 -12916589 -14084786 -16095627 -17579445
40528 -17579445 -14677999 -6336053 3150614 7790285 5762122 739309 -2814090 -4272482
40520 -4272482 -5632584 -7439172 -8791918 -10449053 -13718983 -15695367 -10509235 1909956
40512 1909956 12520863 13014736 6394860 2879739 6600125 11578423 11153315 6400253
40504 6400253 3144202 4100084 6811515 7767338 6123530 3574638 1897066 1064273 -91750
40495 -91750 -1329439 -187075 4947887 11543781 14583235 11894302 6477558 2975442
40487 2975442 2858228 3789699 3005536 272050 -2609637 -4357419 -5211439 -5483538 -4729686
40478 -4729686 -3339102 -3199149 -4718557 -4728648 -474564 5291056 7238309 5282375 4670030
40469 4670030 7428737 9223675 7076209 4575014 5409280 6905790 5518830 4433026
40461 4433026 8699179 15458419 16816767 11889125 8404078 11076359 15025177 13316739
40453 13316739 5928890 -1686988 -5241618 -4368648 -1716460 -1057969 -3719190 -6098210
40445 -6098210 -3909935 809036 1382545 -3813424 -8590675 -8244939 -6263467 -7723373
40437 -7723373 -10532806 -8837230 -2620315 1989052 1570704 -461703 357353 3280654
40429 3280654 3826687 -206314 -5992671 -8908271 -7731588 -5594057 -5139228 -4385974 -108199
40420 -108199 5520957 6042654 -281496 -6932684 -7506375 -4022375 -2924332 -5552653 -7681294
40411 -7681294 -7442871 -8242701 -12617901 -17421697 -17599367 -12558948 -6621103 -4156011 -5711751
40402 -5711751 -8292768 -8362544 -4924569 -435679 1471564 -357537 -3477884 -4955954
40394 -4955954 -5246865 -7474377 -12076847 -14085216 -8645584 1303829 7000408 4810299
40386 4810299 757018 1184743 3848775 3768093 3463068 8750877 16289201 15759946 6024654
40377 6024654 -1234756 1660742 7413766 6095927 13875 -2438773 -1142974 -2152515
40369 -2152515 -5384240 -5194296 -1432752 386968 -369049 1479746 6659018 9726631
40361 9726631 9302287 10834724 16433771 20557913 19325591 16077254 13828621 10301989
40353 10301989 5185679 4205081 9798013 15058393 14065000 11617703 14599425 19552067
40345 19552067 18404849 12350629 9657999 11944180 13183376 11950731 14097628 21396145
40337 21396145 27029312 25989936 22185572 20907535 20760206 18040061 14026672 12489708
40329 12489708 13186300 12713993 9896066 6424174 3540387 1248910 -237517 -811403
40321 -811403 -1339066 -2220578 -1932793 1295365 6805571 11397736 11573376 6312145 -1086668
40312 -1086668 -4830188 -2588317 1301442 1511069 -790033 -521716 2448810 3413601 2155352
40303 2155352 4550046 12057387 17139040 14170482 8468389 8030331 11569733 12258984
40295 12258984 9347268 7592595 7424530 4492382 -1343976 -4770057 -3639254 -1618840
40287 -1618840 -1045885 -89579 1434125 499527 -2550883 -2803072 785246 2562486 -310011
40278 -310011 -2366067 977560 5208175 4428729 1882097 4636519 11378185 14255458
40270 14255458 11069471 6916598 4389669 1330744 -820956 3759722 14284542 20573665
40262 20573665 16833227 10497876 10287315 12412359 8299579 1228341 3059461 14822518
40254 14822518 22759049 17293708 5603666 -564707 -703067 -1112415 -1857686 1249076
40246 1249076 5398240 2986569 -5057146 -8623285 -3279792 3328735 3329252 -1378295 -5344475
40237 -5344475 -7988479 -9951033 -7939750 -585256 5704318 4598500 -146568 -349470
40229 -349470 3909422 5582284 2729057 544444 1693506 3080363 3075442 4099242 6403597
40220 6403597 6479963 3629129 1451554 915601 -1256595 -5227363 -6387204 -3975621 -3850308
40211 -3850308 -8541226 -11772693 -8274662 -2669488 -2260426 -6113206 -7999391 -6217585
40203 -6217585 -3750190 -1530271 1918587 5766036 7267884 5815857 2758328 -820455
40195 -820455 -2912140 -601479 4810158 6834508 2860732 -207633 4509554 12850567
40187 12850567 15497348 11582987 8069654 7448685 4903053 -2163745 -9527594 -12090665
40179 -12090665 -8441422 373916 10430013 14068841 6930451 -3919389 -6277892 2081678
40171 2081678 11805479 15909612 16973840 18755723 19518140 17464068 15253264 14687553
40163 14687553 13203245 9778027 8307766 10870955 13379791 12309101 10222327 10120428
40155 10120428 9926258 7719312 7109008 11471906 17246911 19059089 17958245 18658813
40147 18658813 21583148 23277778 22133226 18554529 12306421 4891790 1429658 4352625
40139 4352625 8136730 6584473 2633474 3738486 9442737 11695632 7392657 2603902
40131 2603902 2785155 5797415 7236818 6833044 6339375 5645899 4342964 3833094 5009410
40122 5009410 6416100 6967251 8005740 10496249 12398710 11043899 6532615 1101017
40114 1101017 -3371784 -5894964 -6201784 -5645631 -6657979 -9536827 -11057763 -8229894
40106 -8229894 -2631795 1037453 601917 -1315492 -1302210 136598 -440772 -4124706 -7448012
40097 -7448012 -6636124 -2660734 -65676 -1249875 -4047324 -5063975 -3290931 47747
40089 47747 3146937 4345047 3052203 743954 -530103 -806429 -1341616 -1415094 634102
40080 634102 2923836 1103799 -4351884 -6712597 -2283657 2938567 642194 -8314587
40072 -8314587 -14740136 -12239996 -3147189 6020896 10939059 11260106 9510162 8893219
40064 8893219 10157027 10725773 8465499 5173919 4288400 6479238 9899795 13371641
40056 13371641 16510294 17881367 16154142 12625327 10059142 9409223 9617844 9827228
40048 9827228 9981077 10272903 11440953 14006008 15994068 13988643 8177344 3337207
40040 3337207 2669906 3950364 3955598 2553599 -165062 -5362449 -10173916 -7402461 3378537
40031 3378537 10742925 5843043 -3345885 -2508085 7929262 14026903 9334580 2077119
40023 2077119 -76998 -98128 -2187306 -2976534 1503753 7757156 9890039 7200759 2123371
40014 2123371 -3847993 -8041863 -6305584 451122 4602461 1400228 -4351874 -5491269
40006 -5491269 -1862076 1723106 2616008 1329283 -707892 -837744 3475747 10088708
39998 10088708 13349560 12064634 10663450 10226461 5988158 -2248793 -5693996 1053479
39990 1053479 10777624 14318730 13513037 14884563 16964357 14307780 9316897 8687947
39982 8687947 10890132 8611617 2468695 917457 6040281 10242365 8995838 6803900
39974 6803900 7346334 6927567 2354131 -2139209 -1124688 4150677 8686743 10365551
39966 10365551 9899700 7801934 4864251 2902941 2520545 2539528 2926152 5059437 7987785
39957 7987785 8261927 5104115 2113794 2199626 4305079 6625233 9332632 12278839 13436291
39948 13436291 11639335 8272458 5236867 4061460 6979876 14564813 21857718 22054653
39940 22054653 15465222 9671511 9186224 10685713 10681897 11211482 13888026 14784675 11108178
39931 11108178 7882481 11282833 18947128 23708745 24194956 24657949 26229925 25979872
39923 25979872 24176666 24859329 28068234 28397576 23460308 17796001 15613097 15148039
39915 15148039 13745832 13473698 16829760 20533788 19257401 13847186 10475084 11861563
39907 11861563 14089962 12915243 9132920 6016278 4714157 4579681 5808207 8867086
39899 8867086 12071002 12166327 7785614 1336982 -2746453 -1545094 3767910 8510316
39891 8510316 8758247 5571031 3583774 4892994 6701210 6509461 6682141 10553077 16160896
39882 16160896 18332126 16180394 13819155 13518243 13097282 11195189 10103530 11124832
39874 11124832 11637956 9711070 7647781 7666625 7782137 5721695 3490409 3781791 4883366
39865 4883366 3857513 2225866 3375555 6278922 7157127 6026070 6095082 7457360 6976382
39856 6976382 4314012 2620317 2860483 2692328 1645882 2195483 4597412 5874626 5584533
39847 5584533 7414123 12375031 14856422 9066296 -3084703 -13259216 -14429884 -6387315
39839 -6387315 4265541 9019514 5025318 -1713160 -3337380 109810 1941515 -374042
39831 -374042 -1299216 4062138 12484988 16984418 14972313 9188516 3580980 864997
39823 864997 1531222 3066405 2378186 140977 -69403 2584053 5431423 7684908 11266340
39814 11266340 14767628 12787149 4452338 -3208732 -4499755 -2345030 -1870217 -2214945
39806 -2214945 -531939 806645 -1825730 -5524002 -4569228 -34617 1632064 -1208716
39798 -1208716 -3689012 -3100660 -2475204 -3977060 -4592121 -1137759 4592386 8667445 10403770
39789 10403770 12097621 14371433 14015934 7461189 -3639026 -11758610 -10714519 -3062040
39781 -3062040 3007004 4180721 4818859 8207465 11088456 10266041 8801936 10468257
39773 10468257 12893787 12188464 10179357 10447519 10971425 8326720 6282834 11622844
39765 11622844 22582070 29760367 28498996 22832054 17230566 12321194 9391660 10955064
39757 10955064 14907704 15404541 11666994 9045523 9307002 7283532 304908 -6080311
39749 -6080311 -5912717 -430697 6178001 13033648 20015663 23810888 21645690 15979552
39741 15979552 11641866 10746028 12721218 16020666 17838083 16110294 13537822 14876886
39733 14876886 18648955 17754718 11046410 7206526 12471995 21024473 23463158 19270107
39725 19270107 14521576 12297138 12394627 16144046 23682733 29652894 29448698 27244508
39717 27244508 29829064 34498435 32006772 21249908 12105280 11989420 17219995 20334124
39709 20334124 19454305 17031630 14563247 12550835 12355488 14558314 17193661 17793345
39701 17793345 16110753 13974174 13549518 15615175 18254639 18298528 15747842 14702291
39693 14702291 17237512 19167674 16196152 11694341 12463832 18124727 21313412 18360010
39685 18360010 13135616 9496364 6681231 4062903 3799731 5682238 5244762 835295
39677 835295 -2383462 461527 7021829 11834496 13527924 13905150 13455516 12272264 12523817
39668 12523817 15351696 17380366 14701874 8876062 5064689 5375206 7522120 8975143
39660 8975143 9163086 8395656 7330222 6729584 5955078 3454435 424010 1033107 6381616
39651 6381616 11501941 11851386 9537295 8943355 9512019 8063735 5371275 4381418 4172941
39642 4172941 2319528 1433180 5724395 11886858 11935557 5883513 2841837 7191635 12310321
39633 12310321 11883203 9162708 9614237 11988220 13610327 17924537 28194625 38326361
39625 38326361 39288578 32298456 26771867 26401237 26148600 23119905 21330212 23365136
39617 23365136 25056746 22040686 15805563 9979871 5738101 3919281 6520416 12397894
39609 12397894 16074897 14811157 12786197 14167356 16156063 14110094 10408998 12175764
39601 12175764 21306967 31906686 37417017 36290591 30938471 24925360 21458447 21689470
39593 21689470 24213597 27762779 32826311 38470596 40529522 37254119 34421100 39078385
39585 39078385 49133254 55418222 54473488 52674787 55640404 59910085 59102942 53404457
39577 53404457 47924126 44781936 41988217 38541785 35726494 33608825 30449235 26360999
39569 26360999 24363401 26419883 30450819 32720096 32056766 30318604 29041840 27176588
39561 27176588 23220688 18848319 18076770 21726203 24969916 23001902 17614756 14602679
39553 14602679 15398611 15796132 13550807 12283290 15414568 20420949 22646435 21789850
39545 21789850 20826570 20816593 20769666 20902610 21756015 21202556 16992069 12150413 13010006
39536 13010006 20447888 27081140 25663123 17692447 11137385 11301000 16504796 21835379
39528 21835379 24275588 23736127 21462739 19135699 18390772 19224333 19174802 16315702 13403366
39519 13403366 16193197 25883425 36021930 40059866 39740877 41703995 47290369 51259744
39511 51259744 50445290 47423467 44273642 39345328 33250873 31460407 35931709 39714347
39503 39714347 36124218 28912183 26298739 28322436 28132581 23971068 21277639 22724402
39495 22724402 24162024 22086047 18358810 15657788 14406592 15877015 21643426 27546872
39487 27546872 25320416 14216396 4524833 4377911 8809096 8254098 3116691 1910192
39479 1910192 7322790 12560103 12020357 8338733 6308348 5336841 1977550 -3005522
39471 -3005522 -4379685 955899 9806712 16059584 17003190 15069500 13696475 13305450
39463 13305450 12394556 10935377 10444400 11507967 13688049 17248512 22112827 25740628
39455 25740628 25821603 25007584 28390669 35417782 39403921 37127687 33720252 34776724
39447 34776724 38595421 40698330 41575854 44165427 46820507 45248282 39952472 35782735
39439 35782735 34725443 34524982 34008446 34392997 35279811 34588261 32959340 33374016 35880762
39430 35880762 37452476 37438815 37967843 38402109 35365408 29697526 26946715 28235721 27106633
39421 27106633 19789288 12906365 15112175 24952974 33091919 34119484 30502306 26729361
39413 26729361 25356412 27803066 33178656 36194828 31639563 21962828 15907130 18243411
39405 18243411 24625014 27842117 25502537 19967204 14187357 9976332 8184726 8593647
39397 8593647 10750270 15115305 21185814 24833513 21504243 13081411 7293610 8202043
39389 8202043 11418691 11558256 9965595 10678875 12635804 11895727 9327235 9415339 12036907
39380 12036907 12206258 8982662 8169310 13680060 21812392 27494218 31401395 36589817
39372 36589817 41866393 43536929 41579779 39563413 39870043 42884555 49176193 57947593
39364 57947593 64431980 63786701 57664864 52634058 51809321 52219515 50816695 48377055
39356 48377055 45990181 42181022 36280247 31592320 32338215 38976189 48063810 55168797
39348 55168797 57403509 55629805 54719533 58460030 63515183 62490793 54405550 47352484
39340 47352484 47910998 52427224 52783106 46953891 39122525 32562619 27949365 26608331
39332 26608331 29499184 33526695 33908047 30127140 25481083 21570807 17775250 15259194
39324 15259194 16168583 18967687 19860873 19029967 20050976 22771686 22772870 19009437 15775600
39315 15775600 15301514 14827630 13459851 14902372 19530096 20858188 15487211 10110856
39307 10110856 11603290 15792877 14758377 10945931 13506145 22284562 26775626 22572662
39299 22572662 18279007 21661263 27716730 26971188 19493389 13562312 14098073 18967156
39291 18967156 24390659 27763355 26399836 19603627 12070870 9948295 12784493 14127110
39283 14127110 11103586 8325677 9855934 12022966 8656933 784877 -4034344 -1722239
39275 -1722239 3457485 5348754 3849355 4036113 9237151 17634526 25269923 30153545
39267 30153545 32952502 35227180 37999976 41415070 44957100 47959999 50060862 51128424
39259 51128424 50975886 49481066 46786275 43102016 38828193 35280981 34221064 35409848
39251 35409848 35638958 32232830 26997187 24139110 24265664 23515397 19443337 14343894
39243 14343894 10852621 7710094 3173551 -92660 2017260 8387880 13503024 14943615
39235 14943615 15910819 19447131 23939143 26053452 25192155 22993299 20444775 17439816
39227 17439816 14017590 10742663 8590962 8654022 10592059 11647528 9531557 6388465
39219 6388465 6974226 12094513 16795459 16408996 11747592 6923196 4738161 5803503
39211 5803503 9347049 12850813 13444248 11643142 11142456 13170557 14376735 12605479
39203 12605479 10861041 12177514 14482574 14971007 15816826 19835831 23563009 21732049
39195 21732049 17172369 18640110 28447677 39381538 45306067 47973742 50892682 53139516
39187 53139516 53359918 54483755 59232958 64309895 64054557 58131132 51656019 48883101
39179 48883101 49843173 52139708 53343782 52296249 50037154 48948546 50108957 52667341
39171 52667341 55994500 60055442 63267994 63304169 61146585 60895734 64163375 68400932
39163 68400932 72179378 77245329 82822499 83450739 76942990 69578518 67617263 67522987
39155 67522987 61296048 48992774 38889799 36225638 38283748 40248042 39661680 35004185
39147 35004185 26206601 17621970 14724530 16430603 15995305 11002810 6991828 8993018
39139 8993018 14749814 19352366 21938974 24072800 25125105 23426307 19911539 17246687
39131 17246687 16620950 17610336 19641926 21729588 22447035 21799624 21428545 21746299 20956079
39122 20956079 18035734 14280329 10866742 7932488 7344819 12438717 22339514 30102845
39114 30102845 30084841 24590889 19844016 18093578 17687434 18133597 19533656 18470836 11071952
39105 11071952 1071374 -1383318 7901370 20539001 25406993 21967765 18843982 20848530
39097 20848530 23569947 21960290 18417134 18200292 20660640 20801324 18106100 17455667
39089 17455667 20473518 22192992 19089604 14907112 14388988 16106884 16862471 18886015
39081 18886015 25638411 33331597 34820623 31077849 30434396 35590176 39558025 36826875
39073 36826875 30851409 26864309 24265565 20854248 18530264 19153766 19498985 16270996
39065 16270996 12616526 13843048 19229604 23473527 24189780 22809566 19774512 14199518
39057 14199518 7624601 3347133 1913043 786330 -1595353 -4229553 -5543113 -4687386
39049 -4687386 -1808311 933166 154247 -4684117 -9536061 -9999807 -5472708 2082334
39041 2082334 10198809 15001779 12793248 5879626 2498920 6857559 13409343 15475051
39033 15475051 14702758 15972642 17527609 14122615 7279380 4109746 6875487 11105205
39025 11105205 13515569 14751289 14685163 12161505 9506607 10414184 13132640 12496080 8715220
39016 8715220 6910401 7803497 6912327 3791623 3379693 6246570 6494505 2588609 1381159
39007 1381159 6711315 12261743 11523411 7438303 5561823 4458300 690213 -2285455
38999 -2285455 798559 6639577 7345898 3347712 3438479 11241921 19384485 19692836 13488788
38990 13488788 8379559 8440429 11145317 12597667 12775402 14714766 19467003 23638594
38982 23638594 23301320 19215962 15544021 13741770 11193873 6381703 1401268 -2117387
38974 -2117387 -5473194 -8961912 -9517328 -5494774 -319565 2309562 3826598 7413738
38966 7413738 11900376 13574759 12150070 10202967 7981487 3910316 127915 2241032
38958 2241032 11601779 21368125 23093774 16061732 8106327 7190450 13285201 19346559
38950 19346559 19852458 16407967 13818378 13280353 12935850 13272015 16468414 20294487 18896997
38941 18896997 11906839 7000424 9658043 15218774 15725077 10715011 5968296 4421218
38933 4421218 3907871 2385754 342393 -1293235 -1540803 1468536 7911113 13783430
38925 13783430 14721948 11486720 8216515 6457387 4820951 3499445 4570682 7722937
38917 7722937 9659219 8527514 6115786 5195188 6820274 10062789 12488918 11717826
38909 11717826 8475672 6630311 7871956 8509802 4891802 -159031 -869421 2736365
38901 2736365 4695068 1821109 -2225571 -2817827 -398420 1265329 188252 -2496017
38893 -2496017 -5030343 -7384879 -10970803 -15838521 -18661169 -15588679 -7616570 -253978
38885 -253978 3444972 5999623 9496658 10747511 6467603 -253698 -3694202 -3303791
38877 -3303791 -2827382 -3759713 -4839377 -6173618 -8270608 -8337950 -3419105 3388673 5428853
38868 5428853 1005743 -5520457 -10463422 -13436689 -14045635 -11573035 -7632260 -4052480
38860 -4052480 720198 7613028 11666576 8400271 3585603 7039676 16772058 20054175
38852 20054175 12324701 3921563 3624387 6283889 3697493 -1599305 -2323582 745249
38844 745249 1588693 -7861 296196 1821490 -392247 -6086475 -8954791 -5898777 -844516
38835 -844516 1748150 2298261 3735909 7094455 10492861 10867298 7216295 3162695 3927129
38826 3927129 8930608 10784594 4712624 -4472937 -8782530 -7199229 -4662693 -3698933
38818 -3698933 -2636122 -578563 1245340 2406749 3089295 2059136 -828405 -1668192
38810 -1668192 2890258 9332436 11004932 7255504 3130011 692531 -2605041 -6419387
38802 -6419387 -5765940 472889 5469304 3046589 -3778146 -6932167 -3304069 2846007
38794 2846007 5733219 3522458 -1043497 -3822453 -3808480 -4512208 -8843205 -13248548 -10947824
38785 -10947824 -1684078 6460285 7229064 3743142 2509854 3956938 3870117 1593548
38777 1593548 808945 2527645 2953490 -102829 -3120707 -2002435 1555274 2270277 -1234676
38768 -1234676 -4458904 -3029383 1870499 5650614 6336922 6166278 7516560 9740078
38760 9740078 10917277 10574552 8916513 5167554 -635966 -5134816 -4220961 1408830
38752 1408830 6059346 5475272 1165402 -2941546 -5692704 -8327419 -10671607 -10805749
38744 -10805749 -8478218 -6388495 -7025500 -9350162 -9678029 -5808323 214147 3977065
38736 3977065 3524222 1434662 1089393 2014321 1401106 -230510 1165554 6278137 9624184
38727 9624184 7232493 3674510 5943697 12203603 13511410 7241909 1569466 3590084
38719 3590084 9566258 12092811 11460472 12709821 14954141 12467761 5859445 3229156
38711 3229156 7816787 12190824 9113545 2235614 405625 5327412 10806241 12157206
38703 12157206 10825885 10200344 11215799 12378943 11454491 7583692 3645358 4663369
38695 4663369 11256285 17058442 16169956 10773752 7131359 6609699 6292003 6406503 9797048
38686 9797048 14122262 12516403 4353415 -1604396 1363283 8951232 12820148 12077850
38678 12077850 12402061 16467748 20824471 21773266 20075553 19000214 19890829 20482270 17326626
38669 17326626 10249400 3724868 1994037 3620597 3991836 2583807 3205256 6729885
38661 6729885 9161512 8701628 8958856 12135561 14869546 15104062 17239963 24437974 30883197
38652 30883197 29489981 23865498 23542869 28406375 27506178 15453126 1564912 -2023833
38644 -2023833 4314224 9746127 7202652 200277 -3734827 -2014641 1877160 3759479
38636 3759479 3162841 2537494 3633899 5950973 8264978 10008249 11008866 11542803 12664931
38627 12664931 14357499 13677587 8291826 2141913 2610314 10077066 15714725 13289922
38619 13289922 7776130 7009471 9866977 9932947 7169473 7285779 11103764 13372637 12273910
38610 12273910 11716277 13084388 12960236 11152829 12793457 18991907 23065183 20729345
38602 20729345 17292864 19178722 24110446 26030507 25015121 25215919 26125929 23252913
38594 23252913 16298557 10261932 8395347 9097439 9990138 10897474 12549269 15611128
38586 15611128 20552964 25336252 24572957 15392063 3588820 -951511 4359325 12321863
38578 12321863 15920329 16424085 19271201 25507159 30956115 32546378 32237055 34047963
38570 34047963 38552025 41373818 37693491 28096902 18599352 14057344 13260916 12250902
38562 12250902 10454996 10215857 11382639 10886185 8473319 8649511 14605706 23180169
38554 23180169 28522086 28662368 25851523 22351481 19283143 18623518 22368205 28868379
38546 28868379 32973243 31435495 26260736 21073491 15982937 8799152 816372 -2120191
38538 -2120191 3576608 13223635 17929024 14965384 11138943 14085767 22616561 28754368
38530 28754368 27928653 22949500 17759348 12300002 6213355 3161175 6353288 11964302
38522 11964302 12851308 8694987 6643937 10422405 14562010 12897856 7909249 6408290
38514 6408290 9099300 10513290 8039895 4797953 3170624 1485353 -1000669 -1209479
38506 -1209479 2393549 5731316 4429112 325681 -1407064 463003 3149049 5637831
38498 5637831 9664475 14731608 16811685 13946270 10029474 10529026 15938428 21486060
38490 21486060 22700632 19859223 17176929 18552672 24138614 30566386 34220645 34067672
38482 34067672 31394581 27722257 23880350 20691288 19320060 20417805 23134168 25149534
38474 25149534 24113977 19982564 16054174 16392780 21405674 27085159 29713873 30249332
38466 30249332 32459352 37340143 41346800 40568072 35342100 29923225 28077233 29704965
38458 29704965 31869525 32468200 31838199 30687746 28293580 24319113 20881294 20131941
38450 20131941 20575979 19050054 16178466 15972705 19247864 21631795 19978330 16792767
38442 16792767 15681387 16118716 15977058 15828152 16880647 17635036 16830083 17021203 20534392
38433 20534392 24241185 23610258 20090674 18771550 20026075 19627294 16497252 13800415
38425 13800415 12317526 9787486 7827531 11864846 21456066 28041070 26693662 23557791
38417 23557791 25864792 30102030 27454205 17602834 9185005 7557080 9485112 10657356
38409 10657356 11677415 14080514 15826901 14680982 12719113 13333277 15486198 14973519
38401 14973519 11008879 7732671 8177731 10053316 9922755 9195807 12204307 18856571
38393 18856571 23361002 21694661 16890049 14289709 14296351 13573471 11850899 12803041 17446818
38384 17446818 20633938 16696474 7005419 -445042 668480 7896140 12078687 7244140
38376 7244140 -2249945 -6438548 -1401982 7044499 12120688 13992422 15797342 16179935
38368 16179935 11476314 3263655 -2191663 -1728841 2238088 6643634 10375393 12168233
38360 12168233 10862502 8216360 7243661 7855827 8378982 10250030 15406224 19782143
38352 19782143 16667932 7300716 686978 1123166 3370365 2706005 1752210 3300179
38344 3300179 4177970 1946514 1036091 5692065 12230911 14994812 15300135 17495869 20176147
38335 20176147 18764767 13984694 10600790 9877562 9949580 11541881 16347552 21371593
38327 21371593 22143455 20775413 23715810 31444338 37077509 35998473 31143634 27987952
38319 27987952 29355192 35382669 43390837 47755279 45487012 42130709 46271634 57791829
38311 57791829 67887797 71644395 73695119 79289868 86634040 91740715 95055585 98810870
38303 98810870 102349173 104678865 108174954 115197159 123466674 128791605 130576153 131342188
38295 131342188 132514937 133657306 134326150 134090916 132204645 129297216 127354499 125982719
38287 125982719 121461379 112400246 103536134 99981269 99835114 97179216 91289590 87652950
38279 87652950 89280008 91781282 89109483 80817544 71294536 64320844 60887752 60508033
38271 60508033 61697903 61793154 58812838 53580811 48371222 43990091 40304108 38901768
38263 38901768 41653208 45956955 45534979 38530345 31274968 30103314 32351439 30910376
38255 30910376 25932890 24947089 30676392 36107797 34787745 29468394 25653197 22176239
38247 22176239 14941749 6319768 2987126 5566106 7798619 6597727 6188057 10150504
38239 10150504 15004721 15183256 10767922 6736591 6416290 8576685 10334822 10928621
38231 10928621 12176665 15525823 19235889 19977721 17601858 15855878 16868690 17885194
38223 17885194 16044684 13102508 11666033 10263744 7395682 7056712 12965180 19557349
38215 19557349 17722274 9339428 6325988 13119253 20004141 18227302 12238545 10162604
38207 10162604 10518582 7567297 3659118 5377840 10422658 9447406 1070133 -4915693
38199 -4915693 -1590193 6141998 10165153 9823289 9274629 9292903 7366625 3603500 1622906
38190 1622906 3833822 8702777 12623492 12850607 9107718 3739486 36159 -360970
38182 -360970 1804462 4949457 7661760 8431730 6505883 3493750 2045698 2280032 1860968
38173 1860968 508029 1309717 5268128 7469012 2721484 -6170114 -10261148 -5346661
38165 -5346661 2761922 5768009 2838589 150162 2137149 6787664 9939455 10985050
38157 10985050 12036917 13006083 10791190 4337784 -1911221 -2436561 1891039 4049314
38149 4049314 164136 -4416250 -2114503 5292947 7666631 661316 -6631497 -3050238
38141 -3050238 8993063 15982813 11135183 2783701 2119617 8268542 10945706 5026741
38133 5026741 -3606183 -6543442 -1894543 6569733 14904085 20615284 21672334 17911698
38125 17911698 12865040 10832521 11592435 10752566 6378523 2349067 2711873 5157618
38117 5157618 4191672 -97139 -1552140 2473146 6158009 3412758 -2868775 -4796130
38109 -4796130 -489372 4478174 5887301 5415652 5652640 5794556 4244265 1537052 -1232078
38100 -1232078 -3648317 -4319203 -1486149 3358137 6137173 5924203 6230600 9212212 12854365
38091 12854365 15396200 17476134 17767231 12445227 2676907 -3175693 121580 7034580
38083 7034580 9370241 7402938 6690729 7927327 7237387 3881405 491010 -2596013
38075 -2596013 -6578838 -9420676 -8355981 -5542212 -4701772 -4137893 -325534 3705293
38067 3705293 2233475 -2222763 -1666298 3504958 3932103 -3222473 -8755689 -5732992
38059 -5732992 215436 922563 -2025895 -2168971 864508 2842430 3059238 3725693 4111269
38050 4111269 1940636 -1136673 -1336449 1001835 1956112 310304 -936159 676160
38042 676160 3982832 5953644 4529092 146160 -4217390 -5468927 -3666250 -1303882
38034 -1303882 836778 4217516 8295360 9590090 6842743 3659918 3825809 6919542
38026 6919542 10292080 12072362 10680665 5491084 84124 315978 6318631 10956051
38018 10956051 9569265 6532702 7958491 12553552 15001283 14474144 13769605 13022972
38010 13022972 10786891 9433094 12753823 18697477 20658280 16495621 11007599 8538172
38002 8538172 7857426 5943911 3006974 1539343 2454062 3763466 2458145 -2208475
37994 -2208475 -6731184 -6217027 -712465 3568037 1876038 -2592823 -3577273 -1101076
37986 -1101076 -813630 -4395560 -6311112 -2078341 4785174 7632308 5900470 5304122
37978 5304122 9221645 13735380 13031677 7305896 2225215 1252299 2039576 1139482 -1495622
37969 -1495622 -4674139 -8561777 -11669432 -9389807 -894351 6017516 4056190 -1956611
37961 -1956611 -1181255 6551048 10261619 5370739 804100 4207597 10305460 10966415
37953 10966415 8309896 9024410 11944422 10889476 6091048 3585504 4990343 5885574
37945 5885574 3771355 1011747 -109176 -105882 -86410 -383971 -601723 1074642 5939531
37936 5939531 10409266 8572865 1932969 -10852 6373771 11775791 7593309 -677560
37928 -677560 -2797561 -39746 -920005 -5330528 -5436724 -305004 2748476 1308885 888763
37919 888763 3825928 5712783 4464100 3190486 2434900 -877505 -4919631 -3023363
37911 -3023363 5206474 11833621 12197624 9889286 7972861 4698397 811036 1298769
37903 1298769 5940194 7611842 4359862 3419776 7944973 9762734 2515272 -6937302
37895 -6937302 -8647161 -3755550 153472 1595742 3865615 5974267 4300531 454444
37887 454444 -722893 1041672 2654765 4264791 7684871 10444763 8668321 4398053
37879 4398053 2953452 3918887 1941594 -3436138 -5813503 -1453843 4959587 6647154
37871 6647154 2875520 -1702745 -3290930 -2326858 -1764608 -3315301 -5343458 -4700814 -843757
37862 -843757 2907874 2851841 -1346228 -6651190 -9064116 -6188608 491608 5964431 6765427
37853 6765427 5342933 6281379 9011671 8903300 5387611 3137763 4132183 4940586 4193961
37844 4193961 6036401 12122407 16166247 11798847 1602715 -6577745 -8681591 -5559725
37836 -5559725 648722 6279973 6265088 113291 -5219648 -3574527 2390094 6490779
37828 6490779 8538630 12051012 15552294 14082177 8467810 5435091 7568566 9645082
37820 9645082 6927361 1971724 576134 4375366 9790926 12177472 9349487 2605922
37812 2605922 -4126882 -6659192 -3274406 3804567 9274861 8702900 3633434 1223652
37804 1223652 5595149 11210947 9699557 2019937 -2806240 -1017280 1895957 2081991
37796 2081991 3032360 6385301 6197483 -1037137 -8293859 -7663337 -2040003 564580 -994605
37787 -994605 -2552248 -3128826 -3672080 -1891544 3303250 6561004 3693677 -126783 1284599
37778 1284599 3804383 502856 -4615581 -2848630 3048843 2961417 -2342784 -2139286 4873146
37769 4873146 7676830 2169814 -1800012 2416158 8181007 9267114 10572271 16786436
37761 16786436 21849874 19441359 14567922 14550398 16175722 12181436 4401615 83813
37753 83813 -362017 -1947605 -4640109 -3839481 381701 2997523 2385897 1941277 3565722
37744 3565722 5292783 5259670 3712286 1818824 1698770 5408952 10632021 10856819 4111276
37735 4111276 -2276078 -770203 6186387 10814942 11108336 10433116 9132105 4670199
37727 4670199 -1034081 -2421187 1125256 4284613 4187331 3721447 5511395 8277445 10380791
37718 10380791 11741635 11053183 6349314 -86773 -2499769 586329 4166555 4744254
37710 4744254 5783590 11581092 19484845 22866094 20024131 15716949 14056464 13670485
37702 13670485 11192067 6893060 4248335 4625855 5407388 4615965 4618038 8021690 11780654
37693 11780654 10396315 4897263 2638051 6223303 8970099 5509621 875678 2609628
37685 2609628 8518411 10563727 8369640 9608873 16928754 23522912 24047963 22161194
37677 22161194 23511661 27666298 31418406 34860828 39206267 42492525 42409930 40541915
37669 40541915 39223706 36679100 30073558 21633179 16730371 16492673 16846045 15062476
37661 15062476 13222316 14281310 17933265 21675676 23746001 23947794 23271349 23420023
37653 23420023 25253246 27371632 27874011 27651465 29722550 34602675 38756816 39247020
37645 39247020 37887609 38447842 40989241 41762143 38491218 33084652 28535834 25488080
37637 25488080 22916292 20099396 16494053 11712059 7582307 8143105 14539868 21262444
37629 21262444 21171263 13990832 6173978 2393236 1579629 2155495 5641467 11874872 15473364
37620 15473364 12175965 5830480 3704989 6571108 8972329 8477211 8632752 12037261
37612 12037261 16154035 17943668 17817227 16493797 12363751 5395974 170687 946230
37604 946230 5720155 8847898 8288097 7001545 7972580 10797824 13025819 12813877 10552766
37595 10552766 9092408 11085344 14756766 14596131 8712300 3004233 4153708 10272712
37587 10272712 13421482 10720036 7241493 6946355 6836433 3400671 -137012 1874793
37579 1874793 8745532 14357725 15820913 16111246 17755718 18606304 15726282 10033910
37571 10033910 4678064 1022019 -1416918 -2492271 -1181604 2689846 7863405 12249161
37563 12249161 13443665 10170534 4611246 1742322 4217787 8895676 10674802 8933557
37555 8933557 7478201 8522508 9994644 9566981 8338780 8745674 10831528 12469222
37547 12469222 11994822 9143264 4661527 559877 -448986 2359663 6217649 7708284
37539 7708284 6754653 6287492 8051896 10073399 8781329 3352990 -2318991 -2885599 2071789
37530 2071789 5961255 2298258 -6266266 -10117704 -5343783 457284 -1236819 -7496256
37522 -7496256 -7970662 642269 10572790 13503790 9243477 2698002 -2373588 -4341425
37514 -4341425 -3040824 -904870 -1233830 -3123818 -1916794 2957871 5049865 -533432
37506 -533432 -9445246 -13424693 -10360858 -4515854 590629 4256533 5412397 3135567
37498 3135567 9230 4722 2941230 5333249 6380944 8373784 11257307 12065526 10463695
37489 10463695 9677958 10711932 10792725 9148856 8904655 10911243 11340399 8818120 8293258
37480 8293258 12794600 16156472 10564157 -1403445 -9102824 -7326915 -1347708 1715163
37472 1715163 922698 -436281 -143413 1924832 5114563 8231232 10010430 10382483 10206572
37463 10206572 9884254 9580426 9850321 10052716 7701997 2475113 -803712 2323706 8257945
37454 8257945 8569230 1409404 -5877126 -6958131 -3417904 1027012 6608639 12909121
37446 12909121 14150953 6707692 -1985346 -676474 9918563 16741242 11561928 1244319
37438 1244319 -2593244 2087436 8756171 12809230 14604191 14613623 12434385 10403901 12103608
37429 12103608 16095456 16370364 10898893 4938004 3262128 3777690 2578304 1051109
37421 1051109 2678434 5707194 5134370 673950 -3297070 -5142595 -6871332 -7463653
37413 -7463653 -2720295 6045763 10454291 6242563 -290884 -2002109 -1233093 -4160452
37405 -4160452 -9786096 -12161892 -10248428 -7650355 -4897266 -419393 2203534 -2595534
37397 -2595534 -11332489 -12967068 -4134038 5383725 6210111 1087488 -1660598 -43099
37389 -43099 1888218 1695761 385976 -556619 122104 3022061 5612673 3960402 -511605
37380 -511605 -1154009 3549570 5975856 1104660 -4014897 -341687 8434106 10778651
37372 10778651 4514156 -941809 389805 3546717 2737596 517546 2139088 6636996
37364 6636996 8966813 7759247 6161728 6420820 7371129 7141713 5963805 5708277 7437836
37355 7437836 9931532 11057188 10547810 10241956 11210762 12405586 12887099 13061000 12575134
37346 12575134 10050570 6796500 7184702 12285067 16610524 15004843 9509603 5193577
37338 5193577 2764975 564418 288982 4031343 8242150 7983277 5362160 5951264 8253570
37329 8253570 5687066 -1066491 -3445394 1426498 6008517 4588651 1495733 2405716
37321 2405716 5272672 5562783 3907116 2590549 264544 -3538902 -3865049 2669728
37313 2669728 10326593 10862882 5023958 700068 1600370 4359073 5783540 6518950 7322960
37304 7322960 7097193 5489836 3506870 1137250 -2162811 -4517781 -2650165 3544927
37296 3544927 10112367 13265796 12614830 10173671 7933994 6526046 5248229 3637372
37288 3637372 3012258 4810896 7303024 6865369 3453381 1327406 2583722 3757785
37280 3757785 1609369 -1365849 -895861 2497187 4872888 4621925 2973952 602447
37272 602447 -2431411 -4660581 -4546338 -2762537 -558101 2405498 6014106 7883536
37264 7883536 6686412 4912769 4993219 5160644 2809637 -514329 -1408168 480600 3710834
37255 3710834 8325802 13256672 13465389 5656499 -4824547 -8730124 -3873733 3661919
37247 3661919 8189477 8992221 7170865 3650002 477739 -588511 -735208 -1467152 -716557
37238 -716557 3802914 9151043 10564233 8658841 7297029 6146493 2409545 -1559171
37230 -1559171 -600186 3695217 4448610 1003603 -107716 2902574 3909123 648717
37222 648717 -113051 5812666 11983070 11250852 6679147 5755268 9254095 12302687 11921663
37213 11921663 7779048 47851 -7894941 -9350478 -2729437 4379771 5259672 3155317
37205 3155317 4012738 5832813 3605979 118540 1822740 6614580 6272619 517728
37197 517728 -1683658 3680842 9478942 8472479 2856672 -957926 -952866 939307 3033597
37188 3033597 4042488 2699577 62724 -846817 582623 1940568 2634672 4963118
37180 4963118 8831451 10351010 8155395 6225723 7201016 7627094 4138142 251920
37172 251920 1637851 7226285 10593224 9038982 6133516 5286513 5350753 3645003 52012
37163 52012 -3201434 -3903878 -1461974 2237688 3691078 1433994 -1380258 -345371 4205748
37154 4205748 7113824 4984830 531796 -934862 2391195 7609142 10655469 9533307
37146 9533307 4988879 -195080 -2654471 -725776 3926255 7354726 6583497 2132648
37138 2132648 -2544912 -4227234 -2682474 -138656 1948712 4611002 8887876 12605770
37130 12605770 11914136 6436637 546740 -1992770 -2631627 -4778332 -7423023 -5871512
37122 -5871512 720028 6521682 6279521 2698586 2856033 8206391 12332165 9787806
37114 9787806 3743858 1898596 6284658 10546956 7960393 -383531 -7225627 -7676605
37106 -7676605 -3728535 -249071 979868 1678334 3305199 5431572 7381592 8902530
37098 8902530 8885220 5934368 1182031 -1764696 -1104720 937433 1683203 1581739 2228576
37089 2228576 3196759 3742334 5553584 9942024 13593282 11567735 4365374 -2277764
37081 -2277764 -4927695 -5345091 -5111053 -2497963 2982919 7603402 8553826 8420697 10487965
37072 10487965 12484481 9728423 2817600 -2569133 -3031150 -506498 1828690 2818898
37064 2818898 2299980 582638 -351072 1467234 4289547 3965029 -22114 -3329285 -3100449
37055 -3100449 -1827645 -2355177 -2619418 597027 5057932 5269732 779542 -2759723 -1969989
37046 -1969989 -557130 -2934295 -6775536 -6503883 -2511878 -1500371 -6685802 -12404074
37038 -12404074 -11467826 -4712290 850748 1775645 1384542 3015588 4745579 3192909
37030 3192909 -650574 -2661243 -1069013 2335677 5683622 8749801 11191897 11804936
37022 11804936 10444980 8861948 8606729 9312078 9795080 9717845 9241159 7904703 5040300
37013 5040300 1272963 -1063826 436085 5622740 10660179 10643046 4578854 -2872440
37005 -2872440 -6164265 -4869587 -2933273 -2391490 -1134995 2086989 4255802 2832197
36997 2832197 1096095 4029193 9929322 11529379 6282106 18743 -2339411 -4420066
36989 -4420066 -11629991 -20473003 -21717976 -13476433 -4086476 -561236 -671115 397545
36981 397545 1566044 -594317 -3935022 -2852355 3173499 8977396 11334743 11980142
36973 11980142 12722465 12648635 11438619 10855762 10958476 8777486 3192845 -2136132 -3309141
36964 -3309141 -989383 1784383 4001470 6084887 7126984 6018997 4111669 3801016
36956 3801016 5117826 6049793 5567023 4291112 3005505 2483614 3739860 6200191 6668523
36947 6668523 2815700 -2866071 -5389770 -3469852 -670510 -39318 -349700 1126963
36939 1126963 4239481 6185014 5303933 3229035 3210627 6846325 12565608 17161001 18403584
36930 18403584 15752597 9337058 220109 -8022558 -10595549 -6451095 -560596 1060162
36922 1060162 -2053069 -5124446 -4350613 -525060 3371065 5808659 7123645 7735970
36914 7735970 7034999 4038474 -705346 -4198579 -3619676 -515905 -136847 -4765142 -9825651
36905 -9825651 -9344184 -3515957 2566409 6257130 8928729 10632605 8628417 2999119
36897 2999119 -1017650 359581 3754841 3355510 -690110 -2724880 99084 3800254
36889 3800254 2940973 -2381861 -6453042 -3919133 5043004 14986458 19903577 17833334
36881 17833334 11499969 5226000 1664005 863797 1143763 510855 -1741911 -4171512
36873 -4171512 -4460808 -1974297 1415894 3223196 2556843 584000 -338809 1811584 6684860
36864 6684860 10776972 10145047 4695006 -1130514 -2509022 1492826 7573972 10838683
36856 10838683 8121678 829145 -5236974 -5212533 -900208 1490897 18894 -462203
36848 -462203 3329524 6579436 2916118 -5477975 -10379805 -9063140 -6723194 -6724136 -5397362
36839 -5397362 354091 6337226 7072985 4449231 4522099 7860503 8943011 4673556 -1635929
36830 -1635929 -5259509 -4941415 -2282605 170372 -83241 -2978584 -4463399 -1430154
36822 -1430154 2499003 1289129 -3572606 -4323574 412839 2295195 -3197613 -7896096
36814 -7896096 -2784948 7703343 12520747 10785925 10872578 14478563 13608096 5434024
36806 5434024 -1002878 1845403 8598601 9302423 2804928 -4841906 -10225430 -13677337
36798 -13677337 -14095761 -10003708 -4163459 -828218 720953 4331347 9439772 11086088
36790 11086088 7677096 3492231 2319486 2862139 1950247 -988567 -4101267 -5356780
36782 -5356780 -3763380 -319657 2094130 1891540 1503709 4197089 8395601 8593714 2750390
36773 2750390 -4257913 -6114919 -1985557 3438550 5444223 3641535 1449744 1938188
36765 1938188 4336897 5334136 3784952 2111769 2078544 1937112 153500 -700947 2470116
36756 2470116 7464806 8727973 4530796 -1529074 -5701909 -7022172 -5617331 -2314490
36748 -2314490 57185 -747686 -2135462 654186 6967125 10462340 7776339 2844735
36740 2844735 418833 -410244 -3124644 -7563395 -10313701 -9444160 -6130601 -2874403
36732 -2874403 -1907740 -3863699 -6554356 -6622124 -3505841 -63468 1367723 1201162 292453
36723 292453 -1581937 -3702449 -3857494 -1426249 1659069 4322467 7523504 10412826
36715 10412826 9068554 2007637 -5881179 -8178831 -4013882 2109613 5789717 5889107
36707 5889107 4038560 3028495 4230458 5542883 4105645 1534539 2574893 7156098
36699 7156098 8726563 3667960 -2300587 -1654274 4661992 9513677 9280582 6025676
36691 6025676 2184400 -1337939 -2944583 -1394066 1483162 3362965 5515264 9764152
36683 9764152 12926808 9971835 2130347 -4065405 -6068898 -7670734 -11029939 -12468712
36675 -12468712 -8838469 -3115462 -243313 -798634 -1912076 -2028523 -1984804 -2896527 -4906264
36666 -4906264 -7030696 -7613950 -6372607 -5759984 -7915658 -10745706 -10492282 -8005251 -7882302
36657 -7882302 -10476295 -9968706 -3099719 4691181 5796294 69722 -6118023 -8343332
36649 -8343332 -7510320 -5890446 -3951700 -1646482 23347 197 -1325754 -2220122 -1107684
36640 -1107684 1724061 4030328 3992438 2250390 281730 -2151364 -5340765 -6514933
36632 -6514933 -2733749 2895098 3218540 -2746716 -6999094 -3633855 2258621 2249273 -2659882
36623 -2659882 -3949270 1210450 5962403 3990046 -2302856 -6242868 -5139453 -1328115
36615 -1328115 2089102 3981624 5277456 7726259 11292189 12741312 9204239 3087801
36607 3087801 55700 1508852 2909740 922032 -1992511 -2561871 -2210321 -3828273
36599 -3828273 -6152943 -5855590 -3416157 -2512882 -4425753 -6891630 -7840362 -6669894 -2712940
36590 -2712940 3427861 7539000 5407245 -857604 -4442538 -2397817 1708026 4265359
36582 4265359 5720575 6895640 6743797 6178081 8554927 13013602 13134350 6915111 2341116
36573 2341116 6534010 14211407 14977293 8615578 3909498 4092590 3727351 472279 -596734
36564 -596734 2634939 4271993 473179 -3828862 -3993200 -3828013 -7787353 -11799566 -10205975
36555 -10205975 -6435832 -7157815 -9358112 -3984038 8228944 15112387 9530931 -1089451
36547 -1089451 -5441441 -1961353 2497150 2649595 -1163825 -5808671 -8101002 -6231245
36539 -6231245 -1373275 2815432 3716483 1941752 -210071 -746154 1469452 5542910
36531 5542910 7707900 4706426 -1297177 -4335630 -2251438 470053 -1028137 -5922824
36523 -5922824 -9892761 -10646362 -8918642 -6085138 -3359813 -2113596 -2778047 -4015295
36515 -4015295 -4291956 -3515913 -2239312 -395147 2139439 4709985 6524590 7354199 7076971
36506 7076971 5401517 2460950 -987897 -3967443 -5399059 -4698662 -3231191 -3716987
36498 -3716987 -6499873 -8121283 -5909781 -1939339 676556 2929409 6759037 9075388
36490 9075388 5529795 -382768 359542 9161917 16164248 13183263 4269605 -982075
36482 -982075 311466 3670763 5102184 4442564 2960555 1776558 1440805 608871 -2909293
36473 -2909293 -8036300 -10381154 -8164138 -4497797 -1764138 1610264 5927779 7088920
36465 7088920 3036418 -1311734 -439357 4475087 9194214 12750377 15012261 13113516
36457 13113516 6907526 3256557 7261928 13347666 13437065 10124438 11937191 18390788
36449 18390788 20897572 17394734 14260051 13081574 7917196 -1331426 -5004388 1364805
36441 1364805 8794087 8380709 3793714 2448393 2693474 -566267 -4057913 -1088016
36433 -1088016 5276545 5139736 -2791297 -8731902 -6165334 -99181 1934976 154795
36425 154795 -462497 1391349 2874184 2695119 2847528 4687261 6299211 5032900 1392171
36416 1392171 -1197698 -707736 765983 -144208 -3326895 -5246400 -3682674 -431532
36408 -431532 1151373 -273770 -3103718 -4027548 -723899 4698340 6077687 229452
36400 229452 -7371053 -8381500 -2809229 1055623 -1209994 -4467327 -3248784 -357828
36392 -357828 -1390490 -5665229 -8555430 -9384074 -10705559 -11956417 -10296804 -6902177
36384 -6902177 -6189895 -8404024 -8579564 -4278796 435999 1029505 -1144519 -1418684 1316776
36375 1316776 3344616 1549179 -2069131 -2728121 803071 4413683 4611938 3954005 6919324
36366 6919324 11786584 12138634 7005550 3173413 4759687 6844678 4104377 16588
36358 16588 888401 4916969 5010846 522352 -1578327 2817417 9854320 13773786 12718403
36349 12718403 7961534 2239636 -696376 645056 2534823 607308 -3174401 -3040015
36341 -3040015 1852224 6876108 9551970 11175299 10950663 6114638 -838110 -3035999
36333 -3035999 -25837 164055 -6247690 -11591367 -7865644 1501506 7722582 9055541
36325 9055541 9411063 8580612 2761227 -6419123 -11690264 -9886245 -5447553 -2866725
36317 -2866725 -1418789 502339 997089 -1930865 -5925088 -6890801 -4414216 -1560548
36309 -1560548 -173998 713521 1744869 1345379 -1556090 -4900617 -6122488 -6436594 -9004725
36300 -9004725 -12379951 -10188108 -249189 9757830 10571219 3065149 -3767247 -5133638
36292 -5133638 -4218101 -3801946 -1839074 2214004 3960190 1452793 130226 4807722
36284 4807722 11251372 11822426 6243847 463964 -2859652 -6033390 -9445468 -9723289
36276 -9723289 -5681348 -777960 1896397 2960037 3652461 3162368 1050825 -358545
36268 -358545 1736254 6981144 11599047 11386567 5464653 -1905010 -4343082 -86198
36260 -86198 5265194 5007264 -502239 -4594393 -2690463 2986310 7235787 7646542 5745985
36251 5745985 4432860 5240495 7101142 7460770 5198495 1961628 -42293 -413090 227015
36242 227015 1601787 2738564 1554266 -2120525 -4815647 -3477738 224227 2587736
36234 2587736 3339124 4851886 7011558 6921933 3599758 -665348 -3740331 -5128406 -4118699
36225 -4118699 -140839 4633746 6615178 5451751 4085445 3528274 1240470 -3942020
36217 -3942020 -8677222 -8997419 -4978234 218998 4069863 6018201 6713444 7076772 6989201
36208 6989201 4847324 268858 -3157069 -917815 6183416 12192398 13555362 13187082
36200 13187082 15252336 19127264 21169877 19914658 16338517 10691221 2667764 -5528805
36192 -5528805 -9417363 -6674921 -23264 5118288 5466132 2316228 -316109 204319
36184 204319 2783857 4237525 2920299 348365 -585428 1410433 4761359 6636125
36176 6636125 5968035 4307386 2809714 -420848 -7391882 -15132596 -17483616 -13066236
36168 -13066236 -7413152 -5127376 -4242870 -1459829 1635397 2206699 1878275 3040294
36160 3040294 3032998 -1070436 -4707619 -1039365 7423337 11088364 7183870 2590159 1911150
36151 1911150 2198572 1927560 5122275 11725278 13358232 5832340 -1871848 418933
36143 418933 9042549 12632188 9010965 5993945 7333245 8081991 4895004 2098810
36135 2098810 4356238 9581575 12707190 12137966 9215300 4559846 -1666006 -7615264
36127 -7615264 -10737900 -10503272 -8576617 -6488923 -4199249 -1227485 1404919 1530416
36119 1530416 -1114511 -3419410 -2565241 -499783 -1738798 -6545023 -9916468 -8566043
36111 -8566043 -5183539 -3600833 -3225872 -1337370 1873031 4014607 4363819 3857387 2710865
36102 2710865 870900 -510267 -616929 -656556 -1749020 -2761135 -2595918 -2847585 -5433008
36093 -5433008 -8897751 -9629504 -5896823 869703 7256237 9111110 4272421 -3961904
36085 -3961904 -8759001 -7333278 -3887459 -3043586 -4065693 -4431039 -4881283 -6599575 -7011333
36076 -7011333 -3719606 -177715 -1939608 -8435976 -13203553 -11648162 -5027375 1981251
36068 1981251 4470207 227761 -6901893 -9032435 -3446243 3103836 3505309 20435
36060 20435 -598639 1962126 2638354 429801 -1018836 -992806 -2066358 -3389301 -1453192
36051 -1453192 2173298 1719721 -3050490 -5554737 -2702242 686442 244982 -1868515
36043 -1868515 -2320198 -1943663 -2242203 -1798368 190752 1196342 -356097 -1751485 -8108
36034 -8108 3828177 6803967 7615321 6287819 3215763 -101549 -2082082 -3350207 -5062725
36025 -5062725 -5522804 -2609224 1265900 2028149 1186564 3677975 8342168 8034781 725513
36016 725513 -6950799 -9470956 -8483374 -6653764 -3323359 268547 -439928 -4781495 -4587530
36007 -4587530 3739975 11876773 10800681 3159140 -2483549 -4056909 -5014811 -5700207
35999 -5700207 -3932494 -1283347 -1315802 -3483189 -4764634 -4970457 -4978171 -2913595 2057591
35990 2057591 5607996 4215691 1709785 3143729 5904083 4562850 971850 708763
35982 708763 2379437 401529 -3264160 -1114711 5946270 7889480 1340764 -4339781
35974 -4339781 -1233166 5855987 8112374 5495281 4114303 5851684 7268182 5945512
35966 5945512 2367344 -2562868 -7222665 -8042487 -3004091 4163320 6959287 3665537
35958 3665537 -525967 334874 6036592 10483221 8963604 4164946 2964191 6976769
35950 6976769 9690936 5505031 -1767293 -3900265 674598 6511931 10412976 14063341
35942 14063341 17143702 15492469 8910375 4087541 5534303 9021294 8788891 6392232
35934 6392232 6486603 7602680 4239801 -3386311 -8643982 -7880776 -4561942 -2812299 -2369633
35925 -2369633 -2320252 -4751601 -10559997 -15014935 -12522915 -4583567 1587952 2299220 883312
35916 883312 1068633 1340257 -1315393 -5384872 -6460515 -3332776 1088261 3977625 4408794
35907 4408794 1964609 -2567182 -5580055 -4055537 -848840 -2101261 -8417433 -13046492
35899 -13046492 -10426462 -2510167 4899915 7926485 5465867 -578479 -4023031 732557
35891 732557 9734958 11826429 3857299 -3635693 -1589091 4377016 4127726 -566954
35883 -566954 -871554 2558269 942422 -6117664 -9042498 -4978243 -3180398 -9039156
35875 -9039156 -14203460 -9861277 -952340 1430261 -4148134 -9662491 -9866872 -6526588
35867 -6526588 -2443125 1722725 4944448 5544795 4002085 2643811 2492036 2907513 3803022
35858 3803022 5741454 8133773 9295397 8319237 6033894 4431255 5045863 6758310
35850 6758310 5907140 803682 -4744696 -5848166 -3931417 -5059196 -10232640 -12609371
35842 -12609371 -6833928 3167209 8899652 6852726 631562 -4047497 -4266010 -1793596
35834 -1793596 -1436309 -5533748 -10081002 -9585210 -5362626 -4003195 -7208872 -9300492
35826 -9300492 -6539389 -2508152 -1405593 -2284948 -3427305 -6057841 -9545727 -9498549 -5733425
35817 -5733425 -5425911 -12072385 -18087327 -16238439 -12012124 -14537209 -20086601 -16730292
35809 -16730292 -3723516 6067068 4570243 -1524390 -2643002 960980 3204995 1971359
35801 1971359 -395062 -1877178 -1717234 348668 2884471 3654397 3502673 5794226 10285524
35792 10285524 11648171 6633627 -773360 -4103269 -1664291 3190661 6665126 7346752
35784 7346752 6336777 6005990 7124481 7133536 3738827 -162245 1002950 7594048 13534298
35775 13534298 14013073 10331685 5949735 2286523 230378 1014534 2875038 1224980
35767 1224980 -4690116 -9365535 -8601841 -5366948 -4163180 -3747221 -701799 3095310
35759 3095310 2907731 -615311 -2006192 385867 2244770 734420 -1289301 -723562
35751 -723562 402056 -1855903 -7269736 -11566813 -11513062 -7702646 -2926871 447291 1561214
35742 1561214 872932 -556900 -1927591 -3276875 -5385103 -8775973 -12234434 -12755178
35734 -12755178 -8444381 -1660530 2697777 3037158 3099421 6297998 10145148 9542733 4529385
35725 4529385 690278 1346252 3364856 2818676 1400050 3505697 8622071 11002569
35717 11002569 7449329 1766934 -420096 1304802 2955013 2449665 1967728 4142609
35709 4142609 8663020 13205897 15454266 13654793 7901365 2119368 1855270 7709870
35701 7709870 13303760 12706183 7930830 5451893 6780201 7160029 3552627 -1034193
35693 -1034193 -2839167 -2830324 -4063698 -6276584 -6285696 -2673419 2274317 4996741 3888174
35684 3888174 621574 -1329273 -364665 1246663 605590 -1269994 -967025 1534418 2436230
35675 2436230 137170 -2552302 -3560903 -4252367 -4820331 -2301226 3165137 5486772
35667 5486772 1425619 -2558703 674827 6816252 5673694 -2954598 -8713224 -6599173
35659 -6599173 -3477349 -5440260 -7955716 -4616649 1529672 3074592 78680 -1254592
35651 -1254592 418521 -355560 -6462872 -13001896 -13114704 -5408821 5431132 12875548
35643 12875548 13369660 9428833 7450423 9970888 11505413 5776806 -4163253 -8195195
35635 -8195195 -2000388 7462251 11351577 9379590 7562884 8635105 8949263 4423170
35627 4423170 -3471060 -8672653 -6902251 -847571 1711385 -3720181 -12376779 -14926211
35619 -14926211 -8274552 992974 4733527 1913916 -2426661 -4138455 -3317326 -2365714
35611 -2365714 -3219618 -5652567 -6588936 -2342847 6545898 14084778 14871398 10398715 6654483
35602 6654483 6065149 5105832 501876 -5321707 -7061229 -3201142 2429174 5514910
35594 5514910 5808526 6130030 8069224 10216220 10535050 8800188 5849846 1980845 -2247974
35585 -2247974 -4785015 -4003931 -1402589 35925 625 705206 2547202 3131282 1453712
35576 1453712 -133128 452231 2321652 4011549 5537819 6360080 4624142 739307
35568 739307 -1506286 -3726 2732303 4359476 6528368 10257297 11714406 7764733
35560 7764733 2160351 161501 26288 -3088111 -7126092 -5574600 632883 2757563
35552 2757563 -2558853 -8314448 -8452873 -6070684 -5671143 -4525217 1627141 9382828
35544 9382828 11551724 7705555 4376480 5707773 9145937 10119464 6767390 74576
35536 74576 -7175893 -11378877 -10748780 -7280868 -4421532 -3240065 -2443253 -1319192 -792489
35527 -792489 -1821163 -3908144 -5104685 -3538996 151035 2618418 1886578 407432
35519 407432 949076 1011842 -3533996 -9967557 -10673965 -4560761 1001570 2126002 4004605
35510 4004605 9996358 13689543 9319957 3032258 4388381 11580961 15097070 12767203
35502 12767203 10639802 10558628 7746773 1183871 -3727954 -4620384 -5268249 -7170993 -6760315
35493 -6760315 -3654080 -3032058 -6212014 -7179177 -2930029 691806 -1151273 -4088681
35485 -4088681 -2585091 603620 594010 345411 5710419 14186368 17610329 14366150 10454252
35476 10454252 8881612 6175662 539068 -3896455 -3468121 45677 3441762 6241754
35468 6241754 8138436 6853142 2131675 -1576069 -427097 3055782 3410422 -53169
35460 -53169 -2967957 -2724890 -1308358 -595577 1004870 4775719 7734151 6218112 1870467
35451 1870467 -115845 1578413 3181127 2926943 4448834 10092939 15015843 12734040
35443 12734040 4352409 -2597676 -3446714 3664 4222920 7244676 7446464 4513978
35435 4513978 2411614 5938846 12758903 14386342 7679621 -3832 -727154 3848640
35427 3848640 6792047 6148235 5061254 4481400 2289415 -984756 -1505939 1874655 5441401
35418 5441401 5763076 3650480 1727547 902964 676139 765818 1010037 1150152 1792738
35409 1792738 4254107 8273287 10845000 8881628 3263254 -832368 1068950 7288420
35401 7288420 11201604 9166909 5441100 6453293 11532819 13620722 9336022 3399335
35393 3399335 1265818 2192635 2866320 3657198 6683049 10534429 11901323 10953223 10698312
35384 10698312 12009778 13217738 13590376 13347348 11362570 6996692 3143296 2939931
35376 2939931 4357763 3164295 799269 3339921 11703989 18819323 18899596 14489561
35368 14489561 11285059 10320580 9024488 6775961 5403210 5921507 7840729 10385429
35360 10385429 12318434 12362617 11596002 12890049 15720577 14647566 6528472 -3228743
35352 -3228743 -6012394 -281888 7790465 12928011 14990713 14621819 10560319 3910557
35344 3910557 405467 3942574 10118164 10760863 4493233 -1311628 -131302 5473322
35336 5473322 7540971 2719804 -4282262 -6918799 -3866615 920047 3173902 1762855
35328 1762855 -1517723 -3549542 -1746021 3537071 8149130 7740726 3075072 -197841
35320 -197841 1464119 4664232 3806950 -612959 -2290174 1788694 6564336 5904822 1439185
35311 1439185 206100 4559471 9095550 8573356 4840710 3592308 7149018 13108473
35303 13108473 17965942 19334363 16520694 11950709 10297998 12790202 14063928 8887762
35295 8887762 657534 -2184904 1993617 5913241 4616654 2427525 4994083 9703112
35287 9703112 9505585 3331007 -2747957 -3585564 119492 4326777 5561561 2854660
35279 2854660 -1350767 -2942297 -1067345 218550 -2302600 -5992195 -6590936 -5006758
35271 -5006758 -5116138 -6547620 -5374429 -1610750 -138173 -3099841 -6514307 -6305877
35263 -6305877 -3488664 -1298280 -621339 -307121 623266 2553875 4874001 5563823 3755927
35254 3755927 2323091 4233745 6870305 5051233 -131926 -1737191 2217843 5123263
35246 5123263 2206668 -1952053 -1215577 2526753 3759735 2845304 4016018 6767116
35238 6767116 6754800 4209894 4355437 8888757 12913711 11687255 6035080 -3111 -3316881
35229 -3316881 -2895248 -80147 2041338 2114968 2543344 5048096 6303037 2809679 -1704330
35220 -1704330 -363099 5620451 7046779 -328602 -9782188 -13292359 -10932066 -7109107
35212 -7109107 -3541628 -802693 -1673758 -6996552 -11562252 -9862429 -3725698 715122
35204 715122 1513570 1458706 2139570 2703974 3304854 4852561 6201053 6001075 6083771 8339670
35194 8339670 9844137 6672422 1372134 325305 4124814 7264764 7425974 7539643
35186 7539643 7633985 3259643 -4773650 -7618858 -831357 7580407 8277237 3768794 2563868
35177 2563868 4813207 3167081 -4004447 -9531630 -8178541 -2828121 1598622 4087078
35169 4087078 5509074 5998887 6373356 7835702 8802178 6215252 1142110 -1411834 466527
35160 466527 3370631 4732849 6131558 8392370 8557374 4747601 -385959 -3982659
35152 -3982659 -6225282 -6338250 -928619 8808195 13314527 5037654 -10077410 -18336762
35144 -18336762 -14664649 -7250092 -6018262 -11990311 -18770391 -19823614 -13105772 -2379084
35136 -2379084 4814227 3637917 -2572422 -5879836 -2957712 2289426 5300264 6080436
35128 6080436 6711581 7385169 7164679 6223952 5179107 3826497 2152522 1121421 1019639
35119 1019639 363691 -2007033 -4639427 -4772808 -1812268 1430005 1412692 -2136989 -5362769
35110 -5362769 -4458461 -611814 1096724 -1701546 -5655485 -6747002 -5450628 -4176205
35102 -4176205 -2388841 1630318 5977868 6895460 4821963 4025306 5892240 6949701
35094 6949701 4565130 879840 -226528 2718612 8221614 12607710 11543410 4371538
35086 4371538 -3138494 -4398348 -299025 2677640 2389688 2939837 5784871 6321387 2577211
35077 2577211 287765 4059228 9137448 8329014 2985408 363148 2874024 6694961
35069 6694961 9177560 10752011 10245830 5214717 -2349204 -6573231 -5316735 -2304870
35061 -2304870 -565818 1159581 3796800 4933849 3322022 1979611 3134450 3576251
35053 3576251 -495702 -6192650 -6536573 -172889 5950720 5109072 -1109211 -5594471
35045 -5594471 -4793500 -1993812 -1609284 -3099671 -2473888 1509655 5101471 3812943 -2611916
35036 -2611916 -9936229 -13130319 -10281669 -4169571 -274497 -2010238 -7580109 -12355977
35028 -12355977 -13771264 -12281970 -8615039 -3329416 958284 894787 -2711730 -4844924
35020 -4844924 -2929971 -64110 601310 932788 3916667 7931963 9126221 7305810
35012 7305810 5162004 3186690 -211196 -4258992 -5678899 -3081298 1663741 6273491
35004 6273491 9525676 10471661 9005024 6726082 4954406 3066433 985413 897165 3194446
34995 3194446 3562965 -1235509 -7141305 -7875265 -4131541 -1394174 -545063 1572940 3352627
34986 3352627 -282787 -6740435 -6167078 3346295 10680802 7417988 -316211 -3028875
34978 -3028875 -2488870 -5468387 -9571875 -7368698 -1096174 -272595 -4985782 -4532839 4392892
34969 4392892 10395647 4574141 -4943537 -4554395 5433247 12934335 12044777 8688642
34961 8688642 8862729 10854734 11485885 11967981 13098732 10871348 2852490 -5062563 -4984256
34952 -4984256 1671901 6023737 4870865 4911426 11252151 18114607 16441537 7008964
34944 7008964 -534792 -640616 2398208 2691120 1072937 1924772 5440424 7541194 6349243
34935 6349243 4741012 5756411 8372781 9731951 9928160 11686604 14998902 15273106
34927 15273106 9592756 2802414 2707539 9100045 12989691 9104854 3653331 4913717
34919 4913717 10776142 12561707 8395873 4542334 4068940 2869637 -1478482 -5201786
34911 -5201786 -5927417 -7255972 -11260765 -13173163 -9067360 -2989415 -218616 1322683
34903 1322683 5750325 9729338 6764986 -1401096 -6117240 -3908324 186698 1209074
34895 1209074 -732324 -4121313 -7782523 -8594987 -4421180 54068 -2180718 -9002524
34887 -9002524 -10418261 -3669539 1880022 -451543 -3772904 1074150 10322212 12945681
34879 12945681 7551434 3418976 5497907 7987995 4982203 -297960 -1075733 3155651
34871 3155651 6918478 6399967 3140614 1035497 2175279 5454182 7935765 7737940
34863 7737940 6067836 5789494 7624059 8783112 6260687 925077 -2729018 -1142115
34855 -1142115 4574897 10031070 12411393 12818616 13344969 13457227 11196476 7025538 3762409
34846 3762409 2513823 1256963 -1813750 -5821642 -8839291 -9682821 -7488823 -2404301
34838 -2404301 2326454 2431911 -1383605 -2976935 1211696 7155626 9391112 8544064
34830 8544064 8395605 8590573 5898168 1081708 -1394890 -367928 499833 -1336473 -4261455
34821 -4261455 -5867369 -5336113 -2316001 2373303 4892870 1928309 -3587383 -5220904
34813 -5220904 -2029307 540444 -493338 -2070275 -2105733 -3396300 -7246511 -9436779
34805 -9436779 -6882520 -2904098 -1317153 -631781 765443 -697428 -7265625 -12920971
34797 -12920971 -10852858 -4404259 -2269745 -5257288 -6651680 -4339127 -3076078 -4438289
34789 -4438289 -4056423 -899147 -502860 -5629305 -11337111 -12998598 -12145672 -10588923 -6166593
34780 -6166593 685864 3330325 -1637196 -7328949 -6120487 -1257194 -1051157 -5469807
34772 -5469807 -7206103 -3738746 583678 3591463 7521995 11548019 10648282 4360454
34764 4360454 -653471 -124231 1787286 -391823 -5499884 -8936151 -9502646 -8779262 -6950007
34755 -6950007 -3478019 278463 2656102 4074441 5151261 4797372 2956930 2463576
34747 2463576 4751664 6377073 3776744 -919822 -3329384 -3784222 -5312779 -6224501
34739 -6224501 -1649985 6997787 11204574 6740982 -161041 -2003638 -217116 -796469
34731 -796469 -3656193 -3206676 1743074 5393206 3260086 -2205488 -6095576 -6877296 -5656138
34722 -5656138 -3359898 -1223238 -971650 -1774688 210406 6234565 11497996 10928784 6356821
34713 6356821 3828768 5235632 7116207 6971810 5755746 3833451 -370582 -6101650
34705 -6101650 -9074342 -6817076 -1854090 2239633 4471190 4463914 1151356 -3843883 -5665232
34696 -5665232 -2579516 782399 271163 -1583004 -776153 781605 -829804 -3439103
34688 -3439103 -1957569 2069544 2133799 -2100546 -3564047 701404 4688934 3312527
34680 3312527 158634 892258 4519413 6200298 4587877 1734743 -813598 -1698424
34672 -1698424 928873 5637379 6933641 2600972 -2066431 -2227791 -1331487 -4679091
34664 -4679091 -9288139 -8501816 -4237271 -4973008 -11515966 -14607918 -9202506 -2047818
34656 -2047818 -490403 -1590171 1146826 6075179 6266912 1045614 -2906531 -1381295
34648 -1381295 2628536 4558932 3473769 343553 -4544925 -10159103 -13445511 -11937843
34640 -11937843 -6604310 -818121 2678513 3164280 1549203 -323865 -671762 932367
34632 932367 3324627 5136962 6095853 6624261 6641269 5633749 4137643 4220258 7235946
34623 7235946 11199619 12123795 8947252 5512831 5790055 8460786 8977898 6232450 3561606
34614 3561606 2847678 1815092 -1006079 -2724374 -834520 1727629 691284 -2548295
34606 -2548295 -3197612 -1356875 -2155943 -6787021 -9356223 -5588167 304399 1862990
34598 1862990 -141326 -66539 2646280 2319746 -3454620 -9005629 -8139854 -2325608 2395175
34589 2395175 3743204 4018470 4200069 2398698 -1238673 -2666825 725940 5939600
34581 5939600 8114288 6403656 3527698 1199085 -906285 -2606203 -3114424 -3569638
34573 -3569638 -6357985 -10908824 -12998152 -9940198 -4361260 -846564 -400298 -415746 871239
34564 871239 2347985 2373594 1118179 -42433 -230993 369841 804760 -197780 -3235682
34555 -3235682 -7107359 -9256879 -8191353 -5447394 -4412427 -6685881 -9998142 -10551294
34547 -10551294 -7428123 -3694224 -2758015 -4780869 -7476529 -9129951 -9337303 -7923988
34539 -7923988 -5282862 -3159800 -2765717 -2501968 -197762 2652506 2230586 -1571363 -4195277
34530 -4195277 -2907309 -548019 -585797 -1975797 -1998980 -1058246 -869232 -492180 1466358
34521 1466358 2692429 150562 -3850024 -3847786 406163 2824453 -584281 -6434535 -8879932
34512 -8879932 -6496292 -2515952 -770238 -2799074 -6924337 -9383437 -8206382 -5787485
34504 -5787485 -5269476 -5447485 -3062055 741399 1421745 -1356686 -2897849 -1342834 -240463
34495 -240463 -1269777 -962242 2033864 3023077 -754166 -4414259 -3539679 -2281732 -6145495
34486 -6145495 -11314555 -9549384 -891794 6888506 9785251 10211704 9283549 5257484
34478 5257484 41475 -1261996 1071755 922320 -3649076 -7297374 -6661609 -5359206
34470 -5359206 -6570520 -7650806 -5972852 -3633833 -2130542 1301422 7133053 9434619
34462 9434619 4306053 -2627527 -3604238 315958 2092428 -667604 -4276518 -5669244
34454 -5669244 -4382763 109751 6947257 11273626 8890316 2414376 -2287755 -3954542
34446 -3954542 -4678089 -3340775 2253309 7937758 6385938 -1328700 -5423245 -976463
34438 -976463 5615567 7180898 5789388 7066942 9936249 8589426 2082383 -4073099
34430 -4073099 -5472306 -3601093 -2686955 -4696148 -8019139 -9384462 -6766538 -1357464
34422 -1357464 3378399 4979988 3795936 1524988 -734176 -2487632 -3155755 -2177607
34414 -2177607 703797 5185996 9668151 11466028 9347850 5440079 2974231 2709551
34406 2709551 3341423 4273901 5180252 3788457 -1939994 -9129073 -11492913 -6984329 -728298
34397 -728298 1413514 -584470 -2809386 -3529294 -4734438 -8323431 -12622066 -13105357 -6804586
34388 -6804586 3497425 10543199 9735768 4077844 41267 -71371 1251151 2238314
34380 2238314 3711006 5701805 6454564 5376469 3560301 1371851 -875885 -526889
34372 -526889 4363530 9914628 9972154 5116743 2118734 3697559 5612273 5407119 6374815
34363 6374815 9854040 11386690 8946468 7554286 10212172 11382001 6285372 311283
34355 311283 1166906 6675466 8773443 5762580 2188433 -232990 -2933317 -4264536
34347 -4264536 -1693569 1569383 683012 -1799962 -57525 3385902 586264 -7235123
34339 -7235123 -9194551 -1298592 6946074 6844351 2474114 2819474 9080195 15610744
34331 15610744 18087397 15578630 9061682 2425842 764898 3666457 4424920 -324657
34323 -324657 -4854363 -2570097 4412864 8909435 8333560 5606778 3071784 554840
34315 554840 -1953975 -3813878 -5210199 -6575452 -7660031 -8532165 -9351022 -8430698 -4093971
34306 -4093971 731699 724452 -3435923 -4825110 -1057326 1477362 -1660206 -5129311 -2814184
34297 -2814184 1923469 2678348 1068550 2458586 5101675 3525335 -309345 68133
34289 68133 3197753 1520073 -4335154 -5013287 1586073 5716020 1897007 -1552820 3555990
34280 3555990 11257563 10981236 4665435 3650306 11526462 20113869 22040682 18623341
34272 18623341 14137090 9796734 6029235 4788030 5997234 5638762 1018302 -4477802
34264 -4477802 -5224504 -746573 3639946 3419919 -184379 -2630976 -1913925 -343683 -565704
34255 -565704 -1702761 -1043071 1562148 3619090 4263002 5416769 7481678 7255330 2896351
34246 2896351 -1735970 -1539779 2626275 5425697 4908721 4151979 4909601 4974794 3621452
34237 3621452 4396025 8972768 12626618 10649950 6057464 5134057 7301819 6213054
34229 6213054 879772 -1512407 3627083 10874916 12259128 7489998 1895269 -2224320
34221 -2224320 -6339118 -9842787 -9877133 -7198987 -6678059 -10348467 -14154759 -13598282 -9408304
34212 -9408304 -5549750 -4103747 -4162595 -3923890 -1993950 2025836 6583600 8662960 6518968
34203 6518968 1619955 -2627682 -3885159 -2961064 -3282377 -7102646 -11462002 -10264531
34195 -10264531 -2469122 4671858 4390785 -126150 -513120 4079320 5909295 580796
34187 580796 -7001018 -10524767 -9589259 -6465431 -1958355 1896798 1033382 -4346620 -7921878
34178 -7921878 -6008077 -2763768 -2121075 -765228 4643611 9124877 6052263 -2177645
34170 -2177645 -8054006 -9772825 -10063026 -8039291 -1725780 3957848 2127247 -4092741
34162 -4092741 -4678047 2216754 8312868 8914850 8131526 8668550 6972618 1861538 -1682997
34153 -1682997 -1254033 -641757 -1099623 1556586 6957390 7534992 1511391 -1868195 2682373
34144 2682373 6661051 2236916 -3255780 817060 9792014 10783596 3584188 65246
34136 65246 4395900 7823702 4242361 -1643764 -4719938 -7079712 -10768275 -11826626
34128 -11826626 -6975695 91847 3904405 4049882 3161985 2167784 804636 -319625
34120 -319625 -736579 -919794 -988275 -824617 -1221418 -2204577 -1664230 693541 528178 -4662863
34110 -4662863 -9005344 -5446072 2590559 5512910 2436571 1630468 5803000 8241629
34102 8241629 5914064 4594380 6611828 5492725 -692658 -2519468 5179437 11735297
34094 11735297 6248848 -4118057 -4896630 3142489 6962758 3020988 422333 2675885
34086 2675885 1686719 -6583423 -13563305 -10971529 -2402952 3819138 5419487 4300469
34078 4300469 939055 -3508192 -5083052 -2500656 -263873 -1660548 -3125738 -333373
34070 -333373 4260358 5135249 1836612 -1497593 -2452305 -1973366 -1598676 -2563584 -5768411
34061 -5768411 -9669535 -10411385 -6867459 -3081272 -2878773 -4772270 -5231253 -4163503 -3807348
34052 -3807348 -4914333 -7456214 -12232163 -17948426 -19621793 -14436124 -6934265 -3780506
34044 -3780506 -5248402 -6488287 -5352735 -3826411 -2936021 -1556263 104655 523182
34036 523182 -42185 -850008 -4057708 -11474510 -18444961 -17164589 -7178958 2965252
34028 2965252 6219853 4126156 1507579 -637013 -3546342 -6020083 -5515302 -2192990
34020 -2192990 1023573 1610853 -561945 -3128562 -2756261 1275784 5105633 4539104 931229
34011 931229 -743097 571820 1115100 -548011 -1083214 1034200 2227139 336282 -925234
34002 -925234 1517448 3726628 426889 -6115899 -8772129 -5477009 -1144795 -381358
33994 -381358 -2906946 -5941181 -7077586 -4821491 150875 4079932 3412468 -824525
33986 -824525 -4099403 -3332060 1169016 7396879 12678368 14267386 11772048 8131418
33978 8131418 5909298 4160173 1317181 -1268831 -1966038 -2326494 -3661845 -2916007 2444541
33969 2444541 7505622 4700693 -5029341 -12879155 -14479667 -14297370 -16010297 -16081079 -11008864
33960 -11008864 -4871010 -4144898 -8721593 -13102041 -14168875 -13401916 -12855107 -12597473 -11507683
33951 -11507683 -8343203 -2838982 3129269 7158146 9681944 12917772 15812825 14193305
33943 14193305 7719822 2070434 1156136 1580594 -1132128 -4805144 -4099074 1203650
33935 1203650 6474724 8529279 6901052 1509346 -5265573 -6498320 2293741 14665094
33927 14665094 18653926 11370378 1862497 -1690054 -1010312 -1521095 -3484895 -3621479
33919 -3621479 -1059035 2863239 7560824 11694803 11303042 4207627 -4797541 -7542706
33911 -7542706 -1716569 6300760 8446155 3087175 -4276628 -7348329 -5564516 -4019642
33903 -4019642 -6423451 -9501232 -7127742 519252 6319772 6115696 4486223 7118544
33895 7118544 11522096 10847863 4764387 178042 1050163 3479464 2777262 340695 110112
33886 110112 1705568 1310839 -2014737 -4662027 -3249916 1413460 5704778 6892433
33878 6892433 4806831 978074 -2710161 -4558394 -3395700 231209 3171227 1872916
33870 1872916 -3115818 -6456130 -4144598 867854 2319665 -749803 -3077461 -1287219
33862 -1287219 1669741 2012348 552171 -441115 -1644337 -3785102 -3903653 345546 5358520
33853 5358520 6261471 4792239 6015566 8691786 6664618 -189575 -4845145 -4495982
33845 -4495982 -4143723 -5623455 -2686474 6800478 12790990 6602051 -3988115 -4352537
33837 -4352537 5871868 12979712 9444119 2169352 -1019111 -1825884 -4218113 -6349993
33829 -6349993 -5831473 -5785241 -9047778 -11639951 -8406823 -1269818 3876772 5199827 4587758
33820 4587758 2577424 -680696 -1936923 1867134 8286259 12239676 12603156 11431518
33812 11431518 8934327 4719681 2028768 4242503 8028786 6688901 492304 -3106439
33804 -3106439 -759095 2075412 368025 -2770562 -1871951 1957038 2850089 -1492813
33796 -1492813 -7526822 -10737128 -9780615 -6733429 -5370900 -7907818 -11594571 -10364052
33788 -10364052 -2150640 7245716 10445493 7271677 4026916 4782845 7107861 6894051
33780 6894051 3754017 -287345 -4626096 -9466533 -12689822 -11054984 -5219893 -522978
33772 -522978 -910434 -4336407 -6622597 -7799370 -10829086 -15084802 -16009448 -12063082 -7183141
33763 -7183141 -4314602 -1298905 3461645 5901959 1994646 -4740131 -7370221 -5230513
33755 -5230513 -3286969 -2962553 -471673 5178273 9251272 8501911 5781558 4702428
33747 4702428 4313318 2069977 -1656090 -4957988 -7312803 -8798183 -9080197 -8741906 -8609542
33738 -8609542 -6888870 -1118391 6039754 8413258 5729087 5116777 9720784 12541429
33730 12541429 7252253 -815560 -1847406 4665209 11253173 14313106 15962357 16057994
33722 16057994 11800528 5414262 3258551 5718863 6116196 1846896 -1426238 125295
33714 125295 2079758 64357 -2572805 -1215192 1728350 1599776 51924 1810329
$$ [...]
##END NTUPLES=NMR SPECTRUM
##END=
