##TITLE=31Pdec_SR59H_x:TFAA-1:1'
 CDCl3, 124 sc
 3.06.2021
##JCAMPDX= 6.0         $$ Bruker NMR JCAMP-DX V2.0
##DATA TYPE= NMR SPECTRUM
##DATA CLASS= NTUPLES
##ORIGIN= UXNMR, Bruker Analytische Messtechnik GmbH
##OWNER= root
$$ XWIN-NMR		Version 3.5
$$ Thu Jun  3 12:57:32 2021 Russian Standard Time (UT+4h)  she@DPX200
##.OBSERVE FREQUENCY= 81.013821
##.OBSERVE NUCLEUS= ^31P
##.ACQUISITION MODE= SIMULTANEOUS
##.ACQUISITION SCHEME= undefined
##.AVERAGES= 124
##.DIGITISER RES= 16
##SPECTROMETER/DATA SYSTEM= spect
##.PULSE SEQUENCE= zgpg30
##.SOLVENT NAME= CDCl3
##.SHIFT REFERENCE= (INTERNAL, CDCl3, 0, 248.564)
##AUDIT TRAIL= $$ (NUMBER, WHEN, WHO, WHERE, WHAT)
$$ ##TITLE= Audit trail, XWIN-NMR		Version 3.5
$$ ##JCAMPDX= 5.01
$$ ##ORIGIN= Bruker BioSpin GmbH
$$ ##OWNER= she
$$ F:/spectra/data/she/nmr/P31/1/pdata/1/auditp.txt
$$ ##AUDIT TRAIL=  $$ (NUMBER, WHEN, WHO, WHERE, WHAT)
(   1,<2021-06-03 12:54:46.50 +0400>,<she>,<DPX200>,
      <continue with go, POWCHK disabled, PULCHK disabled
       configuration hash MD5:
       00 E9 B6 7A A2 85 ED C7 34 08 36 98 17 FE 4E 26
       data hash MD5: 32K
       10 FB D4 69 36 0D B8 E3 35 C3 75 0C 22 1B 46 5B>)
(   2,<2021-06-03 12:55:48.23 +0400>,<she>,<DPX200>,
      <Start of raw data processing
       efp BC_mod = 2 LB = 1 FT_mod = 6 PKNL = 1 PHC0 = -5888.339 PHC1 = 89.27251 SI = 64K 
       data hash MD5: 64K
       9C CA 42 22 7A D1 FB E5 F2 35 93 2F D3 AB 25 37>)
(   3,<2021-06-03 12:56:36.43 +0400>,<she>,<DPX200>,
      <pk PHC0 = 7.172357 PHC1 = 53.79998 
       data hash MD5: 64K
       C0 DF 24 9A F2 24 3B CC DC 3F 46 10 C5 93 AA 22>)
$$ ##END=
$$ 
$$ hash MD5
$$ D2 45 9A A6 78 01 59 DF B7 CC 14 C1 9D 23 8F E5
##$RELAX= 
##$RELAX= 
##$RELAX= 
##$RELAX= 
##$RELAX= 
##$RELAX= 
##$RELAX= 
##$RELAX= 
$$ Bruker specific parameters
$$ --------------------------
##$DU= <F:/spectra>
##$EXPNO= 1
##$NAME= <P31>
##$PROCNO= 1
##$TYPE= <nmr>
##$USER= <she>
##$AMP= (0..31)
100 100 100 100 100 100 100 100 100 100 100 100 100 100 100 100 100 100 
100 100 100 100 100 100 100 100 100 100 100 100 100 100 
##$AQSEQ= 0
##$AQ_mod= 1
##$AUNM= <au_zg>
##$AUTOPOS= <>
##$BF1= 81.014009
##$BF2= 200.13
##$BF3= 200.13
##$BF4= 200.13
##$BF5= 200.13
##$BF6= 200.13
##$BF7= 200.13
##$BF8= 200.13
##$BYTORDA= 1
##$CFDGTYP= 0
##$CFRGTYP= 5
##$CHEMSTR= <none>
##$CNST= (0..31)
1 1 145 1 1 1 1 1 1 1 1 1 1 1 1 1 1 1 1 1 1 1 1 1 1 1 1 1 1 1 1 1 
##$CPDPRG= <waltz16>
##$CPDPRG1= <>
##$CPDPRG2= <waltz16>
##$CPDPRG3= <>
##$CPDPRG4= <mlev>
##$CPDPRG5= <mlev>
##$CPDPRG6= <mlev>
##$CPDPRG7= <mlev>
##$CPDPRG8= <mlev>
##$CPDPRGB= <>
##$CPDPRGT= <>
##$D= (0..31)
0 1 0 0 0 0 0 0 0 0 0 0.03 2e-05 3e-06 0 0 0 0 0 0 0 0 0 0 0 0 0 0 0 0 
0 0 
##$DATE= 1622710321
##$DBL= (0..7)
120 120 120 11 120 120 24 19 
##$DBP= (0..7)
150 150 150 150 150 150 150 150 
##$DBP07= 0
##$DBPNAM0= <>
##$DBPNAM1= <>
##$DBPNAM2= <>
##$DBPNAM3= <>
##$DBPNAM4= <>
##$DBPNAM5= <>
##$DBPNAM6= <>
##$DBPNAM7= <>
##$DBPOAL= (0..7)
0.5 0.5 0.5 0.5 0.5 0.5 0.5 0.5 
$$ [...]
##$SUBNAM2= <"">
##$SUBNAM3= <"">
##$SUBNAM4= <"">
##$SUBNAM5= <"">
##$SUBNAM6= <"">
##$SUBNAM7= <"">
##$SUBNAM8= <"">
##$SUBNAM9= <"">
##$SW= 501.771253377433
##$SWIBOX= (0..15)
0 1 3 0 0 0 0 0 0 0 0 0 0 0 0 0 
##$SW_h= 40650.406504065
##$TD= 32768
##$TD0= 1
##$TE= 0
##$TE2= 300
##$TE3= 300
##$TEG= 300
##$TL= (0..7)
0 120 53 12 22 120 120 120 
##$TP= (0..7)
150 150 150 150 150 150 150 150 
##$TP07= 0
##$TPNAME0= <>
##$TPNAME1= <>
##$TPNAME2= <>
##$TPNAME3= <>
##$TPNAME4= <>
##$TPNAME5= <>
##$TPNAME6= <>
##$TPNAME7= <>
##$TPOAL= (0..7)
0.5 0.5 0.5 0.5 0.5 0.5 0.5 0.5 
##$TPOFFS= (0..7)
0 0 0 0 0 0 0 0 
##$TUNHIN= 0
##$TUNHOUT= 0
##$TUNXOUT= 0
##$USERA1= <user>
##$USERA2= <user>
##$USERA3= <user>
##$USERA4= <user>
##$USERA5= <user>
##$V9= 5
##$VALIST= <valist>
##$VCLIST= <CCCCCCCCCCCCCCC>
##$VD= 0
##$VDLIST= <DDDDDDDDDDDDDDD>
##$VPLIST= <PPPPPPPPPPPPPPP>
##$VTLIST= <TTTTTTTTTTTTTTT>
##$WBST= 1024
##$WBSW= 4
##$XGAIN= (0..3)
0 0 0 0 
##$XL= 0
##$YL= 0
##$YMAX_a= 25462
##$YMIN_a= -29648
##$ZGOPTNS= <>
##$ZL1= 120
##$ZL2= 120
##$ZL3= 120
##$ZL4= 120
##$ABSF1= 0
##$ABSF2= 0
##$ABSG= 0
##$ABSL= 0
##$ALPHA= 0
##$AQORDER= 0
##$ASSFAC= 0
##$ASSFACI= 0
##$ASSFACX= 0
##$ASSWID= 0
##$AUNMP= <proc_1d>
##$AZFE= 0.1
##$AZFW= 0.5
##$BCFW= 0
##$BC_mod= 2
##$BYTORDP= 0
##$COROFFS= 0
##$CY= -3
##$DATMOD= 1
##$DC= 0
##$DFILT= <>
##$DTYPP= 0
##$F1P= 0
##$F2P= 0
##$FCOR= 1
##$FTSIZE= 65536
##$FT_mod= 6
##$GAMMA= 0
##$GB= 0
##$INTBC= 1
##$INTSCL= 5.30512e-09
##$ISEN= 30
##$LB= 1
##$LEV0= 0
##$LPBIN= 0
##$MAXI= 10000
##$MC2= 0
##$MEAN= 0
##$ME_mod= 0
##$MI= 50
##$NCOEF= 0
##$NC_proc= -6
##$NLEV= 6
##$NOISF1= 182.463
##$NOISF2= 159.3651
##$NSP= 0
##$NTH_PI= 0
##$NZP= 0
##$OFFSET= 248.5645
##$PC= 4
##$PHC0= -5881.167
##$PHC1= 143.0725
##$PH_mod= 1
##$PKNL= yes
##$PPARMOD= 0
##$PSCAL= 0
##$PSIGN= 0
##$REVERSE= no
##$SF= 81.014009
##$SI= 65536
##$SIGF1= 159.3651
##$SIGF2= -187.1042
##$SINO= 113.3802
##$SIOLD= 16384
##$SREGLST= <1H.CDCl3>
##$SSB= 0
##$STSI= 65536
##$STSR= 0
##$SW_p= 40650.406504065
##$SYMM= 0
##$S_DEV= 0
##$TDeff= 32768
##$TDoff= 0
##$TI= <>
##$TILT= no
##$TM1= 0
##$TM2= 0
##$TOPLEV= 0
##$USERP1= <user>
##$USERP2= <user>
##$USERP3= <user>
##$USERP4= <user>
##$USERP5= <user>
##$WDW= 1
##$XDIM= 65536
##$YMAX_p= 120936097
##$YMIN_p= -411471403
$$ End of Bruker specific parameters
$$ ---------------------------------
##NTUPLES= NMR SPECTRUM
##VAR_NAME=  FREQUENCY,     SPECTRUM/REAL,   SPECTRUM/IMAG
##SYMBOL=    X,             R,               I
##VAR_TYPE=  INDEPENDENT,   DEPENDENT,       DEPENDENT
##VAR_FORM=  AFFN,          ASDF,            ASDF
##VAR_DIM=   65536,         65536,           65536
##UNITS=     HZ,            ARBITRARY UNITS, ARBITRARY UNITS
##FACTOR=    0.620285442955139, 1,           1
##FIRST=     20137.2065510759, 0,            0
##LAST=      -20513.1999529892, 0,           0
##MIN=       -20513.1999529892, -411471403,  0
##MAX=       20137.2065510759, 120936097,    0
$$ Real data points
##PAGE= N=1
##DATA TABLE= (X++(R..R)), XYDATA
$$ [...]
##PAGE= N=2
##DATA TABLE= (X++(I..I)), XYDATA
12989h275139l498625k062937M698768R156426N922302K90485q24509J03094k699096
12980B810769o489658m279499K003869L547195n60817j770640K753817M745423
12972B760459n65063n110830j078196N453146M117598k764927m464115N27195
12964a124733L595005J694749R36530K844941M45256o934504p961405K760012
12956c744149J2118639O118012p776818j0500914L04190P713859J940059o323652
12948a50774m501765L300522N675351K195158Q82923K893172J677703l867594
12940H104696o271365j643288L389997J126604o066250q755840k336276P741610
12932d710112J2259965P759787n23496m648801k342513J526703J799040q93877
$$ plain form
12989 -8275139 -11773764 -13836701 -9137933 18493 5940795 6231280 5406771 5509865 2810769
12980 2810769 -3678889 -7958388 -5954519 -2407324 -2968141 -4738781 -1984964 2760459
12972 2760459 2195396 -2915434 -3993630 1459516 5577114 2812187 -1651928 -1124733
12964 -1124733 2470272 4165021 5101551 7946492 8391748 1457244 -6504161 -3744149
12956 -3744149 8374490 14492502 6715684 -3785230 -3481040 4232819 6172878 -150774
12948 -150774 -4652539 -1352017 4323334 6518492 7401415 10294587 11972290 8104696
12940 8104696 1833331 190043 3580040 4706644 -1359606 -10115446 -12451722 -4710112
12932 -4710112 7549853 15309640 14786144 10137343 7794830 9321533 11120573 10226696
12924A0226696k393333j084256J082221K174740J730697m70939l720646m976015
12916B569165j871864K679844K753109k635021p324863n573572J005604O142507
12908b255091O257944K783439j138790l567356l903464k410257k09126J097467
12900c345234L88118j994298l912668k862893J128343M661595M580856J879718
12892E23537M5367K7541n04574k817725m947658m732761k519591J56125K343333
12883a2426406L256935K414513J094333J317849K673587K854386J927666K526678
12875E639541M690919M722716J255655j873039j680947n59724j086670j000281
12867A0108170J601967K514963k302074p914002o012621J877565N271270l62697
$$ plain form
12924 10226696 7833363 6749107 7831328 10006068 11736765 11265826 7545180 2569165
12916 2569165 697301 3377145 6130254 3495233 -3829630 -9403202 -8397598 -2255091
12908 -2255091 4002853 6786292 5647502 2080146 -1823318 -4233575 -4442701 -3345234
12900 -3345234 -2957116 -4951414 -8864082 -11726975 -10598632 -5937037 -1356181 523537
12892 523537 568904 596445 91871 -2725854 -7673512 -12406273 -14925864 -14769739 -12426406
12883 -12426406 -9169471 -6754958 -5660625 -4342776 -1669189 1185197 3112863 5639541
12875 5639541 10330460 15053176 16308831 14435792 12754845 12195121 11108451 10108170
12867 10108170 11710137 14225100 11923026 4009024 -2003597 -126032 5145238 4782541
12859D782541p427585p311119r65332M743660N747807K635357j621752l052587
12851b469010M9481L428256J291854m206958m473059K163336O463693K179545
12843D427138m110906l762239P17030J779827j05958K04017R07628l210995q254597
12834a1409055n040965M545714P953816J259072m281946J48546P931405Q540065
12826I646652K718973k058382l957161n730163o527369l600058Q99674K429182
12818f178652J240932Q91107J940888K670851L182849L394570N93218n054294
12810B681469o855668p46552O131698M733843j687032k971451J034361J248822
12802C569490l276483k500670O522072J1797502M043594q059607r777186p75553
$$ plain form
12859 4782541 -2645044 -9956163 -10921495 -6177835 -430028 2205329 583577 -2469010
12851 -2469010 -2419529 1008727 2300581 -1906377 -6379436 -4216100 2247593 4427138
12843 4427138 316232 -3446007 -2728977 -949150 -1055108 -851091 56537 -3154458 -11409055
12834 -11409055 -16450020 -11904306 -3950490 -2691418 -6973364 -6824818 1106587 9646652
12826 9646652 12365625 10307243 6350082 619919 -5907450 -9507508 -8607834 -6178652
12818 -6178652 -4937720 -4046613 -2105725 565126 3747975 7142545 7735763 2681469
12810 2681469 -4174199 -4920751 1210947 5944790 4257758 1286307 2320668 3569490
12802 3569490 293007 -2207663 4314409 16111911 20155505 12095898 2318712 1543159
12794A543159O101418K975940m959706q455740m500343K674461O455876L564300
12786E399365k586171n170993k049768J939649K303250O04047K78934J057695
12778A776008J197077J270984J629301k384l820191m827999J24677N723451M770314
12769G841238j421951n704812n761985m876349l637253Q66908P119668Q415657
12761B841121K535368m094575n035973j765875K10507p20376j687745l25696K460584
12752e582660L795453J838859j633439k212542J618511N137361K866615l434723
12744B393435o433202k838829K967125N443080L705984o8862l683448m859086
12736c373803k203176J970642L349834J540831L50861Q47764p91804n758665q177773
$$ plain form
12794 1543159 7644577 10620517 5660811 -2794929 -7295272 -4620811 1835065 5399365
12786 5399365 2813194 -2357799 -4407567 -2467918 -164668 439379 718313 1776008
12778 1776008 2973085 4244069 5873370 5870986 2050795 -2777204 -2652527 3070924 7841238
12769 7841238 6419287 714475 -5047510 -9923859 -13561112 -12694204 -5574536 2841121
12761 2841121 5376489 1281914 -3754059 -5519934 -5309427 -6029803 -7717548 -8043244 -5582660
12752 -5582660 -1787207 51652 -1581787 -3794329 -2175818 2961543 5828158 2393435
12744 2393435 -4039767 -6878596 -3911471 1531609 5237593 5168731 1485283 -3373803
12736 -3373803 -5576979 -3606337 -256503 1284328 1635189 2482953 1691149 -4067516 -12245289
12727a2245289k994056N391737Q057118L330545j891483k152528N66589J946254
12719H887J697847J931546K136918k13254m539737o313053k922347K053639L186017
12710b973537N62892p37508J466890L366288J660819j085068j002127O33678R3753
12701A986080k036305k004721M01218J636566O65168L43532K027665L394870K525642
12692H939715K35376k232494m138495l883423q23747J834484O76271j779419j90485
12683a362217M465256N525104J267488k358523j621395j66105j189790j934853
12675B624965k97191K29133k360869l158034J501350O143765L773576l014254
12667E442441o086636l634791n54052M87002R78832J323928O93800Q27080L256459
$$ plain form
12727 -12245289 -15239345 -9847608 -1790490 1540055 -351428 -2503956 -1937367 8887
12719 8887 1706734 3638280 5775198 5561944 1022207 -5290846 -8213193 -6159554 -2973537
12710 -2973537 -2410645 -3148153 -1681263 1685025 3345844 2260776 1258649 1892327 1986080
12701 1986080 -50225 -2054946 -1653728 -17162 648006 991538 3019203 6414073 8939715
12692 8939715 9175091 6942597 2804102 -1079321 -1903068 -68584 607687 -1171732 -1362217
12683 -1362217 3103039 8628143 9895631 7537108 5915713 5749608 4559818 2624965
12675 2624965 2327774 2556907 196038 -2961996 -1460646 4683119 8456695 5442441
12667 5442441 -644195 -4278986 -4833038 -4346036 -3367204 -2043276 -1349476 -522396 2734063
12658B734063M101842j134201q339735q222075K89493P548143O150004j44691
12650B982843l302582j256053K320301M198230L605688P00372l303416n573798
12642C71585l878297O94150M435252M515068J590651j006046r84404K76859J8212
12633F033030j533080j709063k30344L45380k43041Q37231L385846K853316j630523
12624H108752l927722m31398K992927O5260n297333n425982j586271q87141l305522
12615i694430j973152M242803Q276227O034548J501010q78494j373651j098500
12607E036361K6540K64776k293433m563204k021731K614592K484514j557710j782152
12598a791447K628544L379007k428575o515113k978270K499757K904966O6100
$$ plain form
12658 2734063 6835905 5701704 -2638031 -10860106 -10570613 -3022470 3127534 2982843
12650 2982843 -319739 -1575792 744509 4942739 8548427 9248799 5945383 371585
12642 371585 -3506712 -2812562 1622690 6137758 7728409 6722363 5737959 6014818 6033030
12633 6033030 4499950 2790887 2560543 2905923 2662882 3500113 6885959 9739275 8108752
12624 8108752 4181030 3749632 6742559 6807819 1510486 -3915496 -5501767 -6388908 -9694430
12615 -9694430 -11667582 -7424779 851448 6885996 8387006 7508512 6134861 5036361
12607 5036361 5062901 5327677 3034244 -1528960 -3550691 -936099 1548415 -9295 -1791447
12598 -1791447 837097 4216104 1787529 -4727584 -7705854 -5206097 -2301131 -2235031
12590b235031j839923l969988o775863m940857L268142R289539N946004r42314
12582b200291j967873J222796R91725k041309j170954L503598N553219L526963
12574G417874J411894m81143m678147p827946l792473M408750O569781O52695
12566C681285m170061k247864R21487k47181k217167j31542K661819J40527n802450
12557g411147p224889j029685O961762Q831462L005807m262696n481045l69515
12549f979946L798490K045907j183372Q93283O043056N678625j845468q292187
12541A58388p402799k661682l51127q85261q28439R88707L076876L884842K317451
12532a703044j364903l800936j475960L452367M873596J562739j163724n09765
$$ plain form
12590 -2235031 -4074954 -8044942 -14820805 -19761662 -16493520 -7203981 -1257977 -2200291
12582 -2200291 -4168164 -2945368 -1953643 -3994952 -5165906 -1662308 3890911 7417874
12574 7417874 8829768 8348625 3670478 -4157468 -7949941 -3541191 3028590 3681285
12566 3681285 -488776 -2736640 -1815153 -2062334 -4279501 -4411043 -1749224 -1608697 -7411147
12557 -7411147 -14636036 -15665721 -8703959 127503 3133310 -1129386 -6610431 -6979946
12549 -6979946 -3181456 -1135549 -2318921 -1425638 4617418 10296043 8450575 158388
12541 158388 -7244411 -9906093 -10257220 -11142481 -11970920 -10982213 -7905337 -4020495 -1703044
12532 -1703044 -3067947 -6868883 -8344843 -4892476 -18880 1543859 380135 -129630
12524a29630m41769l365448m220282J350985Q079835P371226k79351n918952m139194
12515a692580J263385L541476L80600n284597q503953o219843k94940L871684
12507a2938768L503155J566004J654487K423936O82817k250709k048880J620839
12499e787119M350600L588832J760751J628734K053911L34554l455997o447956
12491a973690o346692l625479p60986K59708p0940N19948K907066M688159K652682
12482a750224k853539p116099n500698J131213O237121M291542k164043m520602
12474a2245329J261932Q706975Q833567J914578l627515k995325K20949J454451
12466C524283R39170L702k288516n339772n149865m23527L835678L058818n04467
$$ plain form
12524 -129630 -571399 -3936847 -8157129 -6806144 1273691 8644917 8365566 2446614 -1692580
12515 -1692580 -429195 3112281 3492881 -1791716 -10295669 -16515512 -16810452 -12938768
12507 -12938768 -9435613 -7869609 -6215122 -3791186 -3108369 -5359078 -7407958 -5787119
12499 -5787119 -1436519 2152313 3913064 5541798 7595709 7930263 4474266 -1973690
12491 -1973690 -8320382 -11945861 -12706847 -12447139 -12518079 -11998131 -9091065 -4402906 -1750224
12482 -1750224 -4603763 -11719862 -17220560 -16089347 -9852226 -5560684 -7724727 -12245329
12474 -12245329 -10983397 -2276422 6557145 8471723 4844208 1848883 2069832 3524283
12466 3524283 4463453 4467155 2178639 -3161133 -8310998 -8734525 -4898847 -1840029 -2344496
12457b344496k154570j317557M47024L293535N930710L687403l921636q523350
12449d902937l438750N252494O927795K122208k01032J411966j61363n607999
12441A402382o068905J376519O956336L015850m278667n356735j231448R99842
12433c184826Q9927m87587o57711k145762k396521J509524N572807L862943j122705
12424A040089j669579K450219L396081j825833o526804n061183p83653P91390
12416h189273N58626K252342M592969L001454k487996o258737m452456K41168
12408a0741903K388070M29104k101054j473664J661912L637029K911687J718594
12400a570225K052219K460174O02103k908939n378732n176362k064923L355073
$$ plain form
12457 -2344496 -4499066 -5816623 -5369599 -2076064 3854646 7542049 3620413 -4902937
12449 -4902937 -8341687 -3089193 3838602 5960810 5759778 7171744 7010381 1402382
12441 1402382 -4666523 -3290004 3666332 6682182 2403515 -2953220 -4184668 -3184826
12433 -3184826 -3094899 -3582486 -4240197 -6385959 -8782480 -7272956 -1700149 2162794 1040089
12424 1040089 -629490 1820729 5216810 3390977 -3135827 -8197010 -8980663 -8189273
12416 -8189273 -7630647 -5378305 -785336 2216118 -271878 -6530615 -10983071 -10741903
12408 -10741903 -8353833 -7924729 -10025783 -11499447 -9837535 -6200506 -3288819 -1570225
12400 -1570225 481994 2942168 3544271 635332 -4743400 -9919762 -11984685 -8629612
12392h629612P922125O545688j185734p432397m703433L382375O447281K151644
12384D497937j035859K328458O118681K667538n169526q630515n650638j751769
12376f625693l15621J051880M267958O708634N147234J99265m574660n851231
12368G766k659425K404717M392283J082172l482253l454045J099692M333236K652661
12359F376804j219650l385635m147280n579967o438270l314326L375216P697057
12351f636051M318986m485904r954237o144963K968796P988932N356996P09116
12343e878329o1968J326208J53434k622545k058754K038204M346247K270268p46225
12334a233460j311100k40960R75619K707592M029406K213996j787266k488443
$$ plain form
12392 -8629612 -707487 5838201 4652467 -2779930 -7483363 -4100988 2346293 4497937
12384 4497937 3462078 5790536 11909217 14576755 9407229 776714 -4873924 -6625693
12376 -6625693 -6941314 -5889434 -1621476 5087158 10234392 10433657 5858997 7766
12368 7766 -2651659 -246942 4145341 5227513 1745260 -1708785 -609093 3724143 6376804
12359 6376804 5157154 1771519 -2375761 -7955728 -14393998 -17708324 -14333108 -6636051
12351 -6636051 -2317065 -6802969 -16757206 -22902169 -19933373 -11944441 -6587445 -5878329
12343 -5878329 -5940297 -4614089 -4460655 -7083200 -9141954 -7103750 -2757503 -487235 -1233460
12334 -1233460 -2544560 -2785520 -1809901 897691 4927097 7141093 5353827 2865384
12326B865384J863860N163112K191183l173619m243829k044926k519161n692382
12318e590378n445306K23591N940882P042146M727052J631312j919982n002454
12310A606863m772018j120147J624252P76613o37936Q34507L130220J935183k384032
12301I93505n116032l518836L41600K734930K122031J07618l62765J555382K820528
12292A677961J87001m170009m274504R82021N026215K601490k318251k330762
12284b618838K412463M784619J321221l439985l982578m52959L132723L602082
12276D758748K08046n154021p998573m774861K181754O305132M794984J527109
12268A848318L36450k95455k618039l857534l75624M782011M657431j423969o140744
$$ plain form
12326 2865384 4729244 9892356 12083539 8909920 4666091 2621165 102004 -5590378
12318 -5590378 -11035684 -10812093 -4871211 2170935 6897987 8529299 6609317 1606863
12310 1606863 -3165155 -4285302 -2661050 -1884437 -2522373 -1687866 1442354 3377537 993505
12301 993505 -4122527 -7641363 -7299763 -4564833 -2442802 -2335184 -2697949 -1142567 1677961
12292 1677961 1864962 -2305047 -6579551 -5597530 -571315 2030175 -288076 -2618838
12284 -2618838 -206375 4578244 5899465 2459480 -1523098 -1976057 1156666 4758748
12276 4758748 4966794 -187227 -8185800 -12960661 -10778907 -4473775 321209 1848318
12268 1848318 2184768 1889313 -728726 -4586260 -4961884 -179873 4477558 3053589 -3087155
12259c087155m092805J458809M231477L162296J513870P74675k12827j391226
12251B357114j038573O65075J057332j110432l657317l788788j065159K997273
12243c583475O269451O396899K328668l237310n246766k032204K175093K556153
12235E626509k47865k055427j594590j388207k514362k514550J23688K712703
12227a852101K043846q20745k286004j609323j427128k900903l495576j063873
12219a3411807K283626K960606J246143O22391J950857K151565O6184n03788K966668
12210C32445O040522L258670k546461l886303q82282j244948o146144o045876
12202a1120377L540761J1375139N463344p682707j0990835j241033P424188M891535
$$ plain form
12259 -3087155 -7179960 -5721151 -1489674 1672622 3186492 3961167 3748340 2357114
12251 2357114 1318541 1983616 3040948 1930516 -1726801 -5515589 -6580748 -3583475
12243 -3583475 2685976 9082875 11411543 8174233 2927467 895263 3070356 5626509
12235 5626509 5378644 3323217 1728627 340420 -2173942 -4688492 -4564804 -1852101
12227 -1852101 191745 -629000 -2915004 -4524327 -5951455 -8852358 -12347934 -13411807
12219 -13411807 -11128181 -8167575 -6921432 -6299041 -4348184 -2196619 -2130435 -2634223 332445
12210 332445 6372967 9631637 7085176 3198873 2316591 1071643 -5074501 -11120377
12202 -11120377 -7579616 3795523 9258867 1576160 -9414675 -10655708 -3231520 1660015
12194A660015k713050n598416l466012l89409L472610P800182P827055J908171
12186A0501146l164369j934711P92889j432008n461814m909922j928587k180047
12178i717423k830027K480978R708602Q479228n92210n731274k393520J032575
12170D36929j192074l650940j811116m78096l275423m473608K91101M565535J831145
12161g756547k432141l4406N214220L821304k875285m741979P31824N753529N560721
12152C241240L506734K095194o22077l781452k690010J926673K721783k472813
12144C925272o189152l274662Q59701j70288l256357k249561J059143R05914j471600
12135i861590J2366M750716N084451j556577p887057o931395j116503K441324
$$ plain form
12194 1660015 -1053035 -6651451 -10117463 -10506872 -7034262 765920 8592975 10501146
12186 10501146 7336777 5402066 6194955 4762947 -698867 -5608789 -7537376 -9717423
12178 -9717423 -12547450 -10066472 -357870 8121358 7529148 1797874 -595646 436929
12170 436929 -755145 -4406085 -6217201 -6695297 -9970720 -14444328 -14153227 -9587692 -7756547
12161 -7756547 -10188688 -10223094 -5008874 -1187570 -4062855 -8804834 -8073010 -2319481 3241240
12152 3241240 6747974 8843168 8221091 4439639 1749629 3676302 6398085 3925272
12144 3925272 -2263880 -5538542 -4678841 -4849129 -8105486 -10355047 -9295904 -8389990 -9861590
12135 -9861590 -9849224 -5098508 -14057 -1570634 -9457691 -16389086 -17505589 -15064265
12127a5064265J632021K13949J233368L623343N061540N185506M957922M361265
12119A1204649K175598j939828o069287p494012n311505j052187K800439L983886
12111a702247J210137l931378o273257j726633O408330R461571L940974l442574
12103C944923m640084q93952L84156k779299m671147j365377L661698N475193
12095h83889M255310K808198J354133j418359m590271n997509n417289l612267
12087a3501943J05662N595608Q514108M278130l923817o205479J799841J1436952
12079H099062J0577435p29582r817657p781781m54599J335401k316619k156941
12071c245281L951560O609370K51171o553608l940265L353290L720785k095408
$$ plain form
12127 -15064265 -13432244 -13218295 -11984927 -8361584 -3300044 1885462 6843384 11204649
12119 11204649 13380247 11440419 5371132 -2122880 -7434385 -8486572 -5686133 -1702247
12111 -1702247 -492110 -4423488 -10696745 -12423378 -6015048 3446523 7387497 3944923
12103 3944923 -695161 -1589113 -1204957 -3984256 -8655403 -10020780 -6359082 -883889
12095 -883889 3371421 6179619 7533752 6115393 1525122 -4472387 -9889676 -13501943
12087 -13501943 -13396281 -7800673 713435 4991565 1067748 -5137731 -3337890 8099062
12079 8099062 18676497 17946915 8129258 347477 -107122 1228279 -1088340 -3245281
12071 -3245281 706279 7315649 7566820 1013212 -2927053 426237 4147022 2051614
12063B051614k675805L942845O274206r10177p008434l233370K821648R88397
12055B250924l775514j113505N207931L410594m968748o794305K82562M029431
12047a470630j195698n708748k439185J460644r55980l792633l27138L680687
12039a0748681M77446m938537l152070L493499N842714L695859L552532M596623
12031B819385O68144n835260n910815K45220K742414j306396l590944R7974L111571
12022f958707J032630m83956K778404N058257J294554k913549p74012L758548
12014B792169K805639k352014m321296j630753J190266K542754M133230M503367
12006I663362P22403m292101m183938Q11640L423533J5928m530834m295268L41106
$$ plain form
12063 2051614 -624191 3318654 9592860 8682683 1674249 -1559121 1262527 2250924
12055 2250924 -1524590 -2638095 2569836 5980430 1011682 -5782623 -5500061 -1470630
12047 -1470630 -2666328 -8375076 -10814261 -9353617 -10309597 -14102230 -14429368 -10748681
12039 -10748681 -10271235 -15209772 -18361842 -14868343 -9025629 -5329770 -1777238 2819385
12031 2819385 3487529 -2347731 -8258546 -8013326 -5270912 -6577308 -10168252 -10070278 -6958707
12022 -6958707 -5926077 -6410033 -3631629 1426628 2721182 -192367 -966379 2792169
12014 2792169 5597808 3245794 -1075502 -2706255 -1515989 1026765 5159995 9663362
12006 9663362 10385765 6093664 1909726 2721366 6144899 6160827 1629993 -2665275 -2324169
11997b324169M549043M443132l64097o186323p015162n86974P217691Q044722
11989G777863J265593n687959p209025m759741j581748K061393N876581O796057
11981D539014L032672k306176m967171m398709k193216J271769N192391O062452
11973F233026J463780n184227p825523n129662r11706K098728M359984N255228
11965C59628K188384l740467o062122j198591M984536M259505k067838m549075
11957e826040P35777O279133L891694l754587p149314k620810M214332O714710
11949B484895M220218M21695j519634j084562m236n46753k725385l543527q04486
11940c101775L227156M395371J993637j190100l127489l644246k382491M58915
$$ plain form
11997 -2324169 2224874 6668006 6303909 117586 -6897576 -7484550 -266859 7777863
11989 7777863 9043456 3355497 -3853528 -8613269 -10195017 -8133624 -2257043 4539014
11981 4539014 7571686 5265510 298339 -4100370 -6293586 -5021817 170574 6233026
11973 6233026 7696806 2512579 -5312944 -10442606 -11354312 -9255584 -4895600 359628
11965 359628 2548012 -1192455 -7254577 -8453168 -3468632 790873 -1276965 -5826040
11957 -5826040 -5090263 1188870 5080564 1325977 -5823337 -8444147 -4229815 2484895
11949 2484895 6705113 7126808 5607174 4522612 4518376 3971623 1246238 -2297289 -3101775
11940 -3101775 125381 4520752 6514389 5324289 2196800 -1447446 -3829937 -3371022
11932c371022K223489R18834o25019J352752M438626L095206j452495k085384
11924D494987K110112L212997k449379p152227l784154K386823K064814l286952
11916b402979m306662J306853N932357L975811j228806l897220l050188j238752
11908d909586l69529p56036j624961j539043m4925J374058J514874J120295M45483
11899d789370k252462o795596q465314l474326M927300J0000223R512723O297896
11891D961074K878454o5533j649577j669443j996953l222753k375286J728095
11883a411922M267118J221703l040315k018494J971187J443857l394339m702009
11875e663214M7145M350243L465938N29842m83011l29312k55754R91284L019078
$$ plain form
11932 -3371022 -1147533 -228699 -853718 499034 4937660 8032866 6580371 4494987
11924 4494987 6605099 9818096 7368717 216490 -3567664 -1180841 883973 -2402979
11916 -2402979 -6709641 -5402788 529569 4505380 3276574 -620646 -3670834 -4909586
11908 -4909586 -5279115 -6035151 -7660112 -9199155 -9244080 -7870022 -6355148 -5234853 -4789370
11899 -4789370 -7041832 -13837428 -22302742 -25777068 -20849768 -10849545 -1336822 4961074
11891 4961074 7839528 7773995 6124418 4454975 2458022 -764731 -3140017 -1411922
11883 -1411922 2855196 4076899 1036584 -981910 989277 2433134 -961205 -5663214
11875 -5663214 -5616069 -1265826 2200112 2729954 2246943 1917631 1661877 2653161 5672239
11866E672239K704387k81195k611297l640896o099023q781340o105714K159393
11858a6983446Q158262O668234J781914p98847j243708j374806j05229K124840
11850a772786J196435l179807m495520L62737M745433K610451j377848Q0626M588893
11841B758614M738758P33588j204230k82453j359974m760492n112433j117314
11833e605936J630083l00140k756236n55937M986601P979323N044467j309949
11825I112276n358778l821394O67224K666775O80620j625713j474734n62792j116616
11816h33132k449041l514827m626450m489077n68295N053378O149196J983666
11808c294582l66343K276290L046949k883295q161427m283763M013258O186234
$$ plain form
11866 5672239 8376626 8095431 5484134 1843238 -4255785 -13037125 -19142839 -16983446
11858 -16983446 -8825184 -2156950 -375036 -1173883 -2417591 -3792397 -3897626 -1772786
11850 -1772786 -576351 -3756158 -8251678 -7888941 -3143508 -533057 -1910905 -1830279 2758614
11841 2758614 7497372 8230960 7026730 6744277 5384303 623811 -4488622 -5605936
11833 -5605936 -3975853 -4275993 -7032229 -7588166 -2601565 5377758 10422225 9112276
11825 9112276 3753498 -67896 599328 3266103 3946723 2321010 846276 283484 -833132
11816 -833132 -3282173 -6797000 -11423450 -15912527 -16480822 -11427444 -5278248 -3294582
11808 -3294582 -3660925 -1384635 1662314 -1220981 -9382408 -13666171 -9652913 -3466679
11800c466679K504068J293173L173127J148502m760957o310504j745935P32850
11792g432355k677978m945824p20403M670001M556048J173035K38676J421074
11784c717726N11001k895798n127596l537498J231032N998680O882060L220562
11776B564717l58933L21088K271266P3396l905600k145958M814705P259000J147592
11767A2041273n222831m200243P8137l6714l408792l853419j107519J17602p89330
11758f381836M9637L130802L909363k0653m644989m307953J252993O191429N003112
11749D181905p71267m075545j543796K010479J354779r45922J42049K259270l73757
11740B238195n189967l870478L144071N980564J385848k191864K63663K074202
$$ plain form
11800 -3466679 -962611 330562 3503689 4652191 -108766 -6419270 -8165205 -7432355
11792 -7432355 -10110333 -15056157 -15776560 -11106559 -6550511 -5377476 -5138800 -3717726
11784 -3717726 -3206725 -6102523 -11230119 -14767617 -13536585 -7537905 -655845 2564717
11776 2564717 2205784 2526872 4798138 4871534 965934 -1180024 3634681 10893681 12041273
11767 12041273 6818442 2618199 2696336 2659622 -749170 -4602589 -5710108 -5592506 -6381836
11758 -6381836 -6332199 -3201397 707966 687313 -3957676 -8265629 -7012636 -821207 4181905
11749 4181905 3410638 -664907 -2208703 -198224 1156555 210633 352682 2611952 2238195
11740 2238195 -2951772 -6822250 -3678179 2302385 3688233 1496369 1760032 3834234
11732C834234j688449m064235J224824O951449L318123n672370q475144l376205
11724g947773J709759K753415J839477q42458n953746q155421j683747Q131183
11716a0149311R951546L056468j904440L87501L465737J812049n78192R12942
11708F954300K788998k73840o214191q447012m626869J527581M948128L404319
11700F1414r87207l420497j653764Q50501j2083k282764r00415L798369O194463
11691A648017L765098l28156l117566m545737m076398o50583L272194L570180
11683d62951J104210N27502K018082J091451k382589k760661J472336M161888
11675D769268J426869k065188j270273J212323N08171k447550l573178k243973
$$ plain form
11732 3834234 2145785 -1918450 -693626 6257823 9575946 3903576 -4571568 -7947773
11724 -7947773 -6238014 -3484599 -1645122 -2487580 -8441326 -16596747 -18280494 -10149311
11716 -10149311 -197765 2858703 954263 1341764 4807501 6619550 6041358 6954300
11708 6954300 9743298 9469458 3255267 -5191745 -9818614 -8291033 -3342905 61414
11700 61414 -925793 -4346290 -6000054 -5149553 -5161636 -7444400 -8344815 -4546446 1648017
11691 1648017 5413115 5084959 1967393 -2578344 -6654742 -7305325 -4033131 -462951
11683 -462951 641259 1168761 3186843 4278294 1895705 -864956 607380 4769268
11675 4769268 6196137 4130949 2860676 4072999 4581170 2133620 -1439558 -3683531
11667c683531m01671J333061K497077J400990j292767j604841J371474K623060
11659B242852q91234m238400j817235L448145M361146j15337m801989o438638
11651h250690n889768l830059j68493K879180K488622K7169k08152K822685N546344
11642d583162M644631N09227l825601n141471k492100J184436J875674J73549
11634g654817O50750L855390M194560o45094m179975r04448L931816K140995m126645
11625b737468o146514k796677o47604r97698J924430Q399731J0009406L014960
11617A0022566m715934n585462k750496k454774l388806j455974Q16379j297415
11609a0809916m517120j323079P025717J0226702L286394o107714p700983j033418
$$ plain form
11667 -3683531 -4085202 -2752141 -255064 1145926 -146841 -1751682 -380208 2242852
11659 2242852 1351618 -2886782 -4704017 -1255872 3105274 2989937 -1812052 -8250690
11651 -8250690 -14140458 -17970517 -18139010 -15259830 -12771208 -12744039 -12952191 -10129506 -4583162
11642 -4583162 61469 570696 -3254905 -8396376 -10888476 -9704040 -7828366 -7654817
11634 -7654817 -7004067 -3148677 1045883 400789 -3779186 -4683634 -751818 1389177 -2737468
11625 -2737468 -8883982 -11680659 -12328263 -13325961 -11401531 -3001800 7007606 10022566
11617 10022566 5306632 -278830 -3029326 -5484100 -8872906 -10328880 -9512501 -10809916
11609 -10809916 -15327036 -16650115 -9624398 602304 3888698 -2219016 -9919999 -10953417
11601a0953417N868634O701773K109721l340435n777016l862839J133074N889387
11593b231118O887694L268045j900612m159988k267093M02959J90036j896221
11585a706298j732857J485121L445263R13891l042095l080955O75887K691023
11577c51020j02271m113900m445947j561836K75179l46301n97964J164563K436709
11568g642788J110611j63127K069267N485843M286173j722889n529400k586019
11560d692329K567332L110648k91502j576944R92038K882843R01072k350902k827315
11551a285059j49594K962854L776936J426195k037175k720059L37468K452832
11543D764398q49182o273690o249276r207M874566L548187K69779O47413L095293
$$ plain form
11601 -10953417 -5084783 1616990 3726711 386276 -5390740 -9253579 -8120505 -2231118
11593 -2231118 4656576 7924621 6024009 1864021 -403072 -113 189923 -1706298
11585 -1706298 -3439155 -1954034 1491229 2405120 -636975 -3717930 -3042043 -351020
11577 -351020 -453291 -4567191 -9013138 -10574974 -10299795 -10646096 -11244060 -10079497 -7642788
11568 -7642788 -6532177 -6695304 -4626037 859806 5145979 3423090 -2106310 -4692329
11560 -4692329 -2124997 985651 694149 -882795 109243 2992086 3893158 1542256 -1285059
11551 -1285059 -1434653 1528201 5305137 6731332 4694157 1974098 2311566 4764398
11543 4764398 3915216 -2358474 -8607750 -8616957 -3742391 -194204 75575 722988 3818281
11534C818281K575480j228879m381242m758171l417290j742338n60735l58536
11526a0053430L7025K517046N448355M190731j390826m617007j337602L208765
11518a996943K452765j003414j11044M503279N362741N5517n521083o240950l298777
11509e797909M9892K167621J769112j161071k703284P88399N679516N028092j81159
11500E639209j861725J764962K851691k440125o401353k052787N068453N390647
11492G958972l83138m118533l247030j978540j981348p70938J300156P60877j651892
11483d111414r24811L347556M878793L25379m730689l381815K871900O215380
11475D490279K629130l510132m942801P4605N659913M951007j520452o203539
$$ plain form
11534 3818281 6393761 5164882 783640 -3974531 -7391821 -9134159 -9694894 -10053430
11526 -10053430 -10016405 -7499359 -2051004 2139727 748901 -3868106 -5205708 -1996943
11518 -1996943 455822 -547592 -658636 3844643 9207384 9262901 3741818 -2499132 -5797909
11509 -5797909 -5748017 -3580396 -1811284 -2972355 -5675639 -4887240 792276 5820368 5639209
11500 5639209 3777484 5542446 8394137 5954012 -447341 -2500128 2568325 7958972
11492 7958972 7575834 3457301 210271 -1768269 -3749617 -4520555 -3220399 -2459522 -4111414
11483 -4111414 -5036225 -1688669 3190124 3515503 -1215186 -4597001 -1725101 4490279
11475 4490279 7119409 3609277 -1333524 -1258919 4400994 9352001 7831549 1628010
11467A628010m171866P40677K088063k33427j694604j207392j478638k443535
11459f772712j049462K067391K492124N9092K1947L600652M582445k77863m396323
11450C27291j307154M226635L153797l604626o970279m142280j565435k717111
11442a2599162k509516K639734P458639O127025J691459O15151K320074J322483
11434G065887k770443m783139k832465p67174r68813r72944P92891J513719o84140
11425d406621k526592o82740K330937J859746j290237j723065K387262O204772
11417B153462M569024j226044m902135k658893K311031L540987p20211m996905
11409a929684l683728J158520K813130K8569j219241K436898N936902L664296
$$ plain form
11467 1628010 -2543856 -1803179 284884 51457 -1643147 -2850539 -4329177 -6772712
11459 -6772712 -7822174 -5754783 -3262659 -3203567 -3181620 419032 5001477 4723614 327291
11450 327291 -979863 3246772 6400569 2795943 -4174336 -8316616 -9882051 -12599162
11442 -12599162 -15108678 -12468944 -5010305 1116720 2808179 3423330 5743404 7065887
11434 7065887 4295444 -487695 -3320160 -4087334 -5056147 -6029091 -5236200 -3722481 -4406621
11425 -4406621 -6933213 -7615953 -5285016 -3425270 -4715507 -6438572 -4051310 2153462
11417 2153462 6722486 5496442 594307 -2064586 246445 3787432 3067221 -1929684
11409 -1929684 -5613412 -4454892 -1641762 -1613193 -2832434 -395536 5541366 9205662
11401I205662j694300l480904p87138J980272K691028K489199J129125k084293
11393I448651l970438j155840K551184K06048o497375p901452p81486O320496
11385a780212N695033O24594j798403j057739o87424j123233j125041j628214
11377b880639k528917l62611M984408O419206l98879p967433o297661K102244
11369f930282O004583K294557j094575O97358K539526n50265m885199m550464
11361f474761m65307K068558J290768P9801R35016K887809K807539j158247o624286
11352d653110q195011l700455K132406L394820Q62721j33691J629839K372576
11344f289905Q81118O75351L179810M654483K557951p5868J43439J500632N26192
$$ plain form
11401 9205662 7511362 4030458 3243320 5223592 7914620 10403819 11532944 9448651
11393 9448651 5478213 4322373 6873557 7079605 582230 -7319222 -8100708 -1780212
11385 -1780212 3914821 4539415 2741012 1683273 995849 -127384 -1252425 -2880639
11377 -2880639 -5409556 -5772167 -787759 5631447 5232568 -2734865 -9032526 -6930282
11369 -6930282 -925699 1368858 274283 971641 3511167 2960902 -1924297 -6474761
11361 -6474761 -6940068 -4871510 -3580742 -3500941 -2565925 321884 3129423 1971176 -4653110
11352 -4653110 -12848121 -16548576 -14416170 -11021350 -10158629 -10292320 -8662481 -6289905
11344 -6289905 -5408787 -4733436 -1553626 3100857 5658808 5582940 5726379 7227011 7753203
11335G753203k230956l349814j661213N96890Q21879j322088l545905k950210
11327e888214L32696K336111M18223k231552j016633K526661K902557j64115j126726
11318a910992J935666M072200J961110r76965j418469j750368m191828n037408
11310g317054p27867M677763M659117O4585k656327j383283j49419j411764k411983
11301f656232m15250K907351M190076K667879K08570j229082j077405q3263N78769
11292A091413L88168k94290r06814r77600j50930R61227P03030j116013j727936
11283b029745R69757M468212M791739K389127M40697j435774n670235r430470
11275e506692o671471J030567M188731n17011m313574N9824O787880O464387M52329
$$ plain form
11335 7753203 5522247 2172433 511220 1108110 1929989 607901 -2938004 -5888214
11327 -5888214 -5555518 -3219407 -2801184 -5032736 -6049369 -3522708 -620151 -784266 -1910992
11318 -1910992 24674 4096874 6057984 5081019 3662550 1912182 -2279646 -7317054
11310 -7317054 -8044921 -3367158 1291959 1356544 -1299783 -2683066 -2832485 -4244249 -6656232
11301 -6656232 -7071482 -4164131 25945 2693824 2902394 1673312 595907 512644 1091413
11292 1091413 1479581 1185291 278477 -699123 -850053 111174 814204 -301809 -2029745
11283 -2029745 -1059988 3408224 8199963 10589090 11029787 9594013 3923778 -5506692
11275 -5506692 -12178163 -11147596 -6958865 -7475876 -11789450 -11729626 -4941746 1522641 1974970
11266A974970l142050k824821l217603m372351j844125L545546N611322K910566
11258a358546L96468J23147j326214m511695m581213j3187L623239K552056P57568
11249d338377K412767M272286J429411l760514m994254j709492R39873Q33756
11241d914544J347768M155001N218872J112938m411104m671792L79644L501538
11233A718321N7529n515001n949589q30858M060335N211954M194241K710562N82365
11224F239859o76047J524788M619670J805372p050834j1789237n005399O456828
11216c875000J0141228M429923j513770k121696j124777k520938l851200j457041
11208a893271K907325M289522R44468l548794l760576J743924P258396N088221
$$ plain form
11266 1974970 -1167080 -3991901 -7209504 -11581855 -13425980 -9880434 -4269112 -1358546
11258 -1358546 -962078 -838931 -2165145 -6676840 -11258053 -11271240 -7648001 -5095945 -4338377
11249 -4338377 -1925610 2346676 3776087 15573 -4978681 -6688173 -5748300 -4914544
11241 -4914544 -3566776 588225 5807097 6920035 2508931 -2162861 -1783217 1718321
11233 1718321 1775850 -3739151 -9688740 -10519598 -6459263 -1247309 2946932 5657494 6239859
11224 6239859 5563812 7088600 11708270 13513642 6462808 -5326429 -10331828 -3875000
11216 -3875000 6266228 10696151 9182381 7060685 5935908 3414970 -436230 -1893271
11208 -1893271 1014054 5303576 6248044 2699250 -1061326 682598 7940994 13029215
11200A3029215m121092j0066640n804609K187224L203000k125419l981081O34673
11192g044729L962195Q38811l453542k600829J037087J387196j818574l686330
11184a1378715j318200L524729O857773N404413m29433n238214l567726K691821
11176c453552N839600K589495j914622k320408k43909L4526j440171j800191o14811
11167c324043N21151J412107K555848K714616N03597k810089m784143m962625
11159h173581m362568l089562p19254J860070L027256K512750J645203J695792
11151e603894K426670K090648o25686m096988m629697j185528K746419L999352
11143d878704L712209L474655J162698m342235p818225m210737J970936K307821
$$ plain form
11200 13029215 8908123 -1158517 -6963126 -4775902 -1572902 -3698321 -7679402 -7044729
11192 -7044729 -3082534 -2243723 -5697265 -8298094 -7261007 -5873811 -7692385 -11378715
11184 -11378715 -12696915 -9172186 -2314413 3090000 2660567 -2577647 -6145373 -3453552
11176 -3453552 2386048 4975543 3060921 740513 496604 531130 -909041 -2709232 -3324043
11167 -3324043 -2802892 -1390785 1165063 3879679 4383276 1573187 -3210956 -8173581
11159 -8173581 -12536149 -15625711 -16344965 -14484895 -11457639 -8944889 -7299686 -5603894
11151 -5603894 -3177224 -1086576 -1712262 -5809250 -10438947 -11624475 -8878056 -4878704
11143 -4878704 -1166495 2308160 3470858 -871377 -8689602 -12900339 -10929403 -8621582
11135h621582j791352j052288N569497Q196775K594818k261791O53938M465129
11127G753144M98384o389664n525831K246886O336649K684220k258788k992979
11119B352021j195422j10700l60938k019048m582789m831996n96655L970856L226877
11110d147794o98816p39913L303474M126013o58692m142350j535461J985988J02712
11101b404839m284633m001220J190305M984876M078401J268244l30535q41822
11093c41223q96588K44783K391485L342441J715267j243164l879126o044894p244821
11084a1955840n087723J519145Q553593R716716L949007k622556l863820n31203
11076c22681K093309J366713r30337k535619k727780r01535K929428N829931M064973
$$ plain form
11135 -8621582 -10412934 -11465222 -5895725 2301050 4895868 2634077 3288015 7753144
11127 7753144 8251528 1861864 -3663967 -1417081 4919568 7603788 5345000 2352021
11119 2352021 1156599 1045899 684961 -1334087 -5916876 -10748872 -11345527 -7374671 -4147794
11110 -4147794 -4846610 -5586523 -2283049 1842964 1184272 -2958078 -4493539 -2507551 -2404839
11101 -2404839 -6689472 -10690692 -9500387 -4515511 -437110 831134 500599 -341223
11093 -341223 -1237811 -993028 1398457 4740898 6456165 5213001 1333875 -4711019 -11955840
11084 -11955840 -17043563 -15524418 -6970825 2745891 6694898 4072342 208522 -322681
11076 -322681 1770628 3137341 2207004 -328615 -3056395 -3957930 -1028502 4801429 8866402
11067H866402j367017m953925l816434r60691L17086J113689L119245M059036
11059F377391J182096l293397m787880k974203j421709j378890l53876K674999
11051c975469M586633K369364k311722m691538k311684K223410M043289J443830
11043A376113k175659k810137j248123j295780l030019k163137K415226N321085
11035c610431K532573j550790k19620N049590O571739K074058k426982k558741
11027E861396j846681m472047o962001k889341O237961J0861043N211341n120955
11019F880716j0054317o741801j072097J223777P56349R51538K278650K805501
11011b971684K068904J055350k55622k008770k305275L26061L093196J925921
$$ plain form
11067 8866402 7499385 2545460 -1270974 -2231665 -1914579 -800890 2318355 6377391
11059 6377391 7559487 4266090 -521790 -3495993 -4917702 -6296592 -6650468 -3975469
11051 -3975469 611164 2980528 668806 -4022732 -6334416 -4111006 -67717 1376113
11043 1376113 -799546 -3609683 -4857806 -6153586 -9183605 -11346742 -8931516 -3610431
11035 -3610431 -1077858 -2628648 -2848268 2201322 8773061 10847119 8420137 5861396
11027 5861396 4014715 -457332 -7419333 -10308674 -4070713 6790330 12001671 6880716
11019 6880716 -3173601 -9915402 -10987499 -9763722 -9007373 -8055835 -5777185 -2971684
11011 -2971684 -902780 152570 -103052 -2111822 -4417097 -4091036 -997840 928081
11003I28081j870029k807717K60608K120532l89054l181215j476741K787697M261989
10994F34151J771962j554983l412786l532563j598957J994045M357561K757952
10986A416382j359546l862662l014031p17106O41310L62142r34000j901947j296502
10977a0665960L58954R55747n5674k66489K231340N496026N912263K818125p97377
10968E986955j844131m30872K36970k407700o137646n485817M27247M638499J478109
10959c538386l955278k628152L806501M773743k074380o412559j841387L988042
10951g881856K659535j501373m21344L378714K338463k180418l046217n27518
10943g182014p53801l474029k801799J012614J772685q74387p68190L006169M444338
$$ plain form
11003 928081 -941948 -3749665 -3489057 -1368525 -1757579 -4938794 -6415535 -3627838 634151
10994 634151 2406113 851130 -2561656 -6094219 -7693176 -5699131 -1341570 1416382
10986 1416382 56836 -3805826 -6819857 -7536963 -6895653 -6533511 -7467511 -9369458 -10665960
10977 -10665960 -10307006 -9351259 -9406933 -9673422 -7442082 -1946056 3966207 6784332 5986955
10968 5986955 4142824 3711952 3948922 1541222 -4596424 -10082241 -9654994 -5016495 -3538386
10959 -3538386 -7493664 -10121816 -6315315 -1541572 -3615952 -10028511 -11869898 -7881856
10951 -7881856 -5222321 -6723694 -7145038 -3766324 -1427861 -3608279 -6654496 -7182014
10943 -7182014 -7935815 -11409844 -14211643 -13199029 -11426344 -12300731 -13068921 -10062752 -5618414
10934e618414K068341J300735L257692K145764k787749l786548J855563N299076
10926C734460P4421o751332n486696J700747O067311N930754N552860M931515
10918A5754040P83192m622621n407100k449094k778448p545766r048335k715557
10910a8029689N103552N996993J060301j918714P0508K529455J619724n78052
10902d145922p76596J1293p15530j478753R47545M727073L933891k304708o826047
10893f627754l760532L320915O696729M608873J317397l15352p78173p6099K169280
10884F555284L304775P1534n338908p127686m319975j769579j788392q77891K930359
10875h360479N406525K656885k216985l507131r28346J188018R24448P41974K745474
$$ plain form
10934 -5618414 -3550073 -2249338 1008354 3154118 366369 -3420179 -1564616 3734460
10926 3734460 3808881 -2942451 -8429147 -6728400 -661089 5269665 10822525 15754040
10918 15754040 16537232 11914611 6507511 4058417 1279969 -6265797 -15314132 -18029689
10910 -18029689 -12926137 -6929144 -5868843 -7787557 -7717049 -5187594 -3567870 -4145922
10902 -4145922 -4922518 -4911225 -5626755 -7105508 -6157963 -1430890 2503001 198293 -6627754
10893 -6627754 -10388286 -7067371 -370642 4238231 5555628 5240276 4462103 4386004 6555284
10884 6555284 9860059 9931593 4592685 -2535001 -6854976 -8624555 -10412947 -11290838 -8360479
10875 -8360479 -2953954 -297069 -2514054 -6021185 -6949531 -5761513 -4837065 -4095091 -1349617
10866a349617N272197N015323J050100l902862n958030l800607K39626K996133
10858d37737L410801K121785j46961k271478k623987j347435q99538k103441k102216
10849f400207Q03602L245745J888890m59866P58819L732202K960878j436191m104062
10840I89810l419829k668379k427222M457K738705k9743o790894p349048K409279
10831a6542864J2396471J1348973J652810n700206n939502l011148p81158Q07675
10823e768949K181945K749317K639664J880682p48980m590343n337073o76956
10815g670693M687845M525272k10526l127947j535800J331686K564704K761581
10807C326122K542215P18336k533024m285006k535310R74639K993084K266308
$$ plain form
10866 -1349617 3922580 8937903 9988003 6085141 127111 -3673496 -3433870 -437737
10858 -437737 2973064 5094849 4947888 2676410 52423 -1295012 -2194550 -4297991 -6400207
10849 -6400207 -5596605 -2350860 -461970 -921836 -163017 3569185 6530063 5093872 989810
10840 989810 -2430019 -5098398 -7525620 -7521163 -4782458 -4812201 -11603095 -18952143 -16542864
10831 -16542864 -4146393 7202580 8855390 3155184 -2784318 -5795466 -6576624 -5768949
10823 -5768949 -3587004 -837687 1801977 3682659 2933679 -1656664 -6993737 -7670693
10815 -7670693 -2982848 1542424 1331898 -1796049 -3331849 -2000163 564541 3326122
10807 3326122 5868337 6586673 4053649 -231357 -2766667 -1792028 1201056 3467364
10799C467364k4383k036510k779193k602547k451368k387279j474180L78784J597130
10790h312182J014933k13905l0587J830022L533415L006167l82137m999352p321641
10781a1875267m559945K026156P459021P686130L272368j917552m641224m334862
10773f885175k362811k08813J646477L132373L252890Q74021k558987l391056
10765f501081o89888J507149l44283l716672l471011P66088M647380N240096L122927
10756E60705j73168k432661l14003N956027R223097L386504o360736q911009k663648
10747a728892K945674K250815J80511J379063K222354r21646l879902k029508
10739D18469J089004k53125m470408o093343m467171k433357k22052K782136L777080
$$ plain form
10799 3467364 3442981 1406471 -1372722 -3975269 -6426637 -8813916 -10288096 -9909312 -8312182
10790 -8312182 -7297249 -7511154 -7541741 -5711719 -2178304 827863 445726 -4553626 -11875267
10781 -11875267 -16435212 -14409056 -6950035 736095 4008463 2090911 -2550313 -6885175
10773 -6885175 -9247986 -9456799 -7810322 -4677949 -1425059 -551038 -3110025 -6501081
10765 -6501081 -7190969 -5683820 -6028103 -9744775 -13215786 -12449698 -7802318 -2562222 560705
10756 560705 387537 -2045124 -2359127 3596900 12819997 16206501 9845765 934756 -1728892
10747 -1728892 1216782 3467597 3648108 5027171 7249525 6327879 2447977 418469
10739 418469 1507473 1254348 -3216060 -9309403 -13776574 -16209931 -16431983 -13649847 -9872767
10730i872767P24113k387826j077154J906466J272480j389787n58302L069598
10722h313179L650673M96215r33711J383370L213343K014540N31146N56748l10137
10713B289008l093282m378581j896126J529350K575211J925848J398481L68379
10705G18288j877702l425733k554041q57915p62151j977326k845335l030302k361739
10696a8973956O70206O070022R820715P977575K436269j113114p47439J08541
10688F248819q61525j326967N80391J792022r80435m823168m143531M40713K469624
10679f04057m51504k949779n35143L392541L275649o4622j767275j005698j117785
10670a827673k982486l655104j600170J089660K093784J233610m03340r86804
$$ plain form
10730 -9872767 -9148654 -11536480 -12613634 -10707168 -9434688 -10824475 -11382777 -8313179
10722 -8313179 -4662506 -4166291 -5100002 -3716632 -503289 1511251 2042397 2599145 2289008
10713 2289008 -804274 -5182855 -7078981 -5549631 -2974420 -1048572 349909 718288
10705 718288 -1159414 -4585147 -7139188 -7997103 -8759254 -10736580 -13581915 -16612217 -18973956
10696 -18973956 -18303750 -12233728 -2413013 5564562 8000831 6887717 6140278 6248819
10688 6248819 5387294 4060327 4640718 6432740 5452305 629137 -3514394 -3073681 -604057
10679 -604057 -1055561 -4005340 -4540483 -1147942 2127707 2063085 295810 -709888 -1827673
10670 -1827673 -4810159 -8465263 -10065433 -8975773 -6881989 -5648379 -6051719 -7038523
10662g038523J305955N080857N179546p75035p371552p708016k760326J021278
10654a3065816J593219K083067K765233K16274m594680n143977R02658P079345
10646h164677O759340J663408j648251l08078K777492L278504J55831l034087
10638A479482k196262R03663k34935o376217q707156j720675N891171L095835
10630g865094n113116m147115O771599J2285529M517352n326951n079439J085458
10622b871777K140707k408520m459963r05379L597856M654934K518811q7115q68524
10613A311030k9909l43426k710026l131337J108729M825140J855770l960080m200058
10604e274167k5139N43016k159011o20383L885968K299461l827359k451268O481924
$$ plain form
10662 -7038523 -5732568 -651711 4527835 3752800 -3618752 -11326768 -14087094 -13065816
10654 -13065816 -11472597 -9389530 -6624297 -6408023 -11002703 -16146680 -15244022 -8164677
10646 -8164677 -1405337 258071 -1390180 -1698258 1079234 4357738 4513569 1479482
10638 1479482 -716780 186883 -48052 -6424269 -15131425 -16852100 -10960929 -7865094
10630 -7865094 -12978210 -17125325 -10353726 1931803 6449155 1122204 -3957235 -2871777
10622 -2871777 -731070 -3139590 -7599553 -8504932 -4907076 -252142 2266669 2179554 1311030
10613 1311030 1281121 937695 -1772331 -4903668 -3794939 1030201 2885971 -1074109 -5274167
10604 -5274167 -5299306 -4756290 -6915301 -7535684 -3649716 -1350255 -5177614 -7628882 -1146958
10595a146958P493922m266476j2332986n103290N226200L643553l747344k990238
10587a3223617L642257M474044k66745j373883J613443J504231k126738l254412
10579i011420p06193J831763L103833K767869j500290p325156o085071L347227
10571a3577438Q844437K677956n542867m543414J040826J317934j473411j83137
10563a1439114K560521J259251j37206K996159M472612r73447m845801N98271
10555e508754N770399q57577j0984877r268627Q43588M170312k72756p11617N029351
10546a1790558Q000620N373072J926617j752498o962385q308868k453945J925883
10538a4042062j979751m922482K295477J0064379O117762j845254p65848L124232
$$ plain form
10595 -1146958 6346964 2080488 -10252498 -15355788 -10129588 -6486035 -10233379 -13223617
10587 -13223617 -9581360 -5107316 -5374061 -6747944 -5134501 -3630270 -5757008 -9011420
10579 -9011420 -9717613 -7885850 -4782017 -2014148 -3514438 -10839594 -16924665 -13577438
10571 -13577438 -4733001 -2055045 -7597912 -12141326 -11100500 -9782566 -11255977 -11439114
10563 -11439114 -8878593 -7619342 -7756548 -4760389 -287777 -1261224 -6107025 -5508754
10555 -5508754 261645 -595932 -11580809 -20849436 -20005848 -15835536 -16108292 -16819909 -11790558
10546 -11790558 -3789938 1583134 3509751 1757253 -5205132 -13514000 -15967945 -14042062
10538 -14042062 -16021813 -20944295 -18648818 -8584439 -2466677 -4311931 -5077779 -1953547
10530a953547k301595r378088m192508N502645L347416n026127l037923N009206
10522a2030521L026214n087971l689703L324172J224511m552305Q19797R330613
10514g635193L636538p380907l892605N087813k040548j4970147q437831P407003
10506b8225877L426430j1846824o866722J0393997N264276j4860090j1449201
10499e4164011R430163O227141j4446690o651488J9203540N580169l5748775k8444512
10491i9014463K0317483P362819p3799152p0846809R1837646K44206409J86182178
10484C06246111j7843541j29975267p2670643Q158985J204618l2461710j5643655
10477D7014898J3155774k089547k7166337j2071972J5398997R437173r272129
$$ plain form
10530 -1953547 -4255142 -13633230 -17825738 -12323093 -8975677 -14001804 -17039727 -12030521
10522 -12030521 -9004307 -14092278 -17781981 -14457809 -13233298 -17785603 -16965806 -7635193
10514 -7635193 -3998655 -11379562 -15272167 -10184354 -12224902 -27195049 -35632880 -28225877
10506 -28225877 -24799447 -36646271 -43512993 -33118996 -27854720 -42714810 -54164011
10499 -54164011 -44733848 -38506707 -52953397 -59604885 -40401345 -34821176 -70569951 -99014463
10491 -99014463 -78696980 -71334161 -145133313 -215980122 -124142476 120063933 306246111
10484 306246111 288402570 158427303 85756660 93915645 95120263 62658553 47014898
10477 47014898 60170672 58081125 30914788 18842816 34241813 43678986 34406857
10470C4406857j509707J4410920K935245j8516229j3761263N294168N192984p275373
10462B1177602m731116O432094K878259p567682k882580Q077126K753608j0513361
10454A5623950q095178M276128L685125o647698n926885L688190L374291m592368
10446E385555k053595Q702840Q591972k601812o488574M52925L213308k979958
10438A2222661o744522l170213O56060J962033M022724M036314k147471p181113
10430C656473j970975O942138P186141J196169o83103j25593m852247j0006989
10422A342014n403246M455379O774015J626686j209687o15701j729290j959764
10414C280406K716814M830235k787155j0167926m608169O260993O684448J14284
$$ plain form
10470 34406857 32897150 47308070 50243315 31727086 17965823 23259991 28452975 21177602
10462 21177602 16446486 22878580 25756839 18189157 15306577 23383703 26137311 15623950
10454 15623950 7528772 11804900 15490025 8842327 2915442 6603632 9977923 5385555
10446 5385555 3331960 12034800 20626772 18024960 11536386 11989311 15202619 12222661
10438 12222661 5478139 2307926 2963986 4926019 8948743 12985057 10837586 3656473
10430 3656473 1685498 8627636 15813777 17009946 16326843 16201250 11349003 1342014
10422 1342014 -4061232 394147 7168162 8794848 7585161 6969460 5240170 3280406
10414 3280406 5997220 10827455 8040300 -2127626 -6735795 -474802 6209646 6323930
10406F323930J508243Q929011P360527l122272p622778l055041p77335l321824
10398F222461j771078L363368J646598n592191n603285J751143K753259m529068
10390a758793o067869K221400O851287J236141l734485j085744R12950k557673
10382c982786k748161L979009O182937k255546q970097l294543N676898N074508
10374c37781j021732j538788J932255Q17616l147917j549530M551096N959245
10366E664464Q55819k746532p6668M051053L406527j374380m677054k994511J319439
10357C428157L025794N81382k030514j615065m81077j138835p69232K807480M351928
10348H160018q60416o424902l145939M806152M965307l080095o563110l11690
$$ plain form
10406 6323930 7832173 16761184 24121711 20999439 13376661 10321620 9544285 6222461
10398 6222461 4451383 7814751 9461349 3869158 -1734127 17016 2770275 -1758793
10390 -1758793 -7826662 -5605262 1246025 2482166 -1252319 -2338063 -1425113 -3982786
10382 -3982786 -6730947 -2751938 3430999 1175453 -7794644 -11089187 -5412289 -337781
10374 -337781 -1359513 -2898301 -966046 -148430 -3296347 -4845877 -294781 5664464
10366 5664464 6520283 3773751 3697083 7748136 11154663 9780283 5103229 2108718 3428157
10357 3428157 6453951 7035333 5004819 3389754 2908677 1769842 1000610 3808090 8160018
10348 8160018 7299602 874700 -2271239 2534913 7500220 4420125 -2142985 -2454675
10340b454675N844317M437494J160935K118822K998926j121080n861921n828645
10332A294173l846021l887438k935988K081559O612638N711657K447013J601346
10324I078939J309777j532718l687927j320246K053642J229968j741586j787676
10316C602173M11925J179896J059369J918795J186421l098046n495215k75820
10308D89498P562272P774062J18753n154739k537592J733762K84335m950788o787688
10299a468125k771206K798381M686872J919950k059909l257819j402510n5578
10291a609944j829738m667484m384077o6754M647661N337046J072315m339973
10283e840948n228125K34346O982270Q009217K840337j866119j264922J545775
$$ plain form
10340 -2454675 3389642 7827136 8988071 11106893 14105819 12984739 7122818 1294173
10332 1294173 -2551848 -6439286 -9375274 -7293715 -681077 5030580 7477593 9078939
10324 9078939 10388716 8855998 5168071 3847825 5901467 7131435 5389849 3602173
10316 3602173 4014098 5193994 6253363 8172158 9358579 6260533 765318 489498
10308 489498 8051770 15825832 15944585 10789846 8252254 9986016 10270351 5319563 -1468125
10299 -1468125 -4239331 -1440950 3245922 5165872 3105963 -151856 -1554366 -1609944
10291 -1609944 -3439682 -8107166 -12491243 -12557997 -7910336 -2573290 -1500975 -5840948
10283 -5840948 -11069073 -10834727 -3852457 4156760 6997097 5130978 3866056 5411831
10275E411831O48198m340517q266300p245340k500244K015843L593169K493631
10267h189729J055258R84779J219487n73300m069970n418170j394664O264787
10259a0121522J1465493Q894482n51630q995316q167193J361990R417077P433965
10251A0737346j318496o360462l372463J892942K905155K30307j708644j516571
10243A489114j349491k516485l299295j363928K409962L630737j89860m488066
10235e677312k308562M597050N617050l395217j1380949o618587N360114R273487
10227d532926K701912j700019K646952O451522R62871p680084q812717l336154
10219a3298643J07889m77891L57488M419797O797473M111376o52174k969273k341219
$$ plain form
10275 5411831 6060029 1719512 -6546788 -13792128 -16292372 -14276529 -10683360 -8189729
10267 -8189729 -7134471 -6149692 -4930205 -5503505 -9573475 -14991645 -16386309 -10121522
10259 -10121522 1343971 10238453 9686823 691507 -7475686 -6113696 3303381 10737346
10251 10737346 9418850 3058388 -314075 1578867 4484022 4714329 3005685 1489114
10243 1489114 139623 -2376862 -5676157 -7040085 -4630123 -999386 -1189246 -5677312
10235 -5677312 -7985874 -3388824 2228226 -1166991 -12547940 -19166527 -13806413 -4532926
10227 -4532926 -1831014 -3531033 -884081 5567441 6530312 -1149772 -9962489 -13298643
10219 -13298643 -13190754 -13668645 -13311157 -8891360 -2093887 2017489 1365315 -1603958 -3945177
10210c945177j491336k082919k487709P7705N020829P519004M497743k48389r75276
10201E884475J368853J067158k456783l782744j324294l0194j795476j454339
10193b523344L329104O033162J236771n858217o729412j371729L814862N568091
10185C499288M571337R04717m185522n499934l56749M848568K200250n447308
10177E34647p479922k47077Q388907R695086L351939m515344p738233m253519
10169b263516K106918M382151M92556l335334j187261L490006L248859j664209
10161E270170m223024j734207J630703K836217K723222Q34008m142742p988859
10153d794512m058494M983682P747659L95369o630152l948938K960427L318903
$$ plain form
10210 -3945177 -5436513 -7519432 -10007141 -9929436 -4908607 2610397 7108140 6859751 5884475
10201 5884475 7253328 8320486 5863703 2080959 756665 726471 -1069005 -2523344
10193 -2523344 805760 6838922 8075693 2217476 -4511936 -5883665 -2068803 3499288
10185 3499288 8070625 8975342 4789820 -710114 -1066863 3781705 5981955 534647
10177 534647 -6945275 -7192352 1196555 10891641 14243580 9728236 1990003 -2263516
10169 -2263516 -156598 4225553 4718109 1382775 195514 3685520 6934379 5270170
10161 5270170 1047146 -687061 943642 3779859 6503081 7337089 3194347 -4794512
10153 -4794512 -8853006 -3869324 3878335 4273704 -2356448 -6305386 -3344959 -26056
10145b6056k071767l449315J630514M879977N34935o380647p679681k281865M144173
10136a0699732O427934M320639J408193R60380K256852J628394j887399m134097
10128B81164j670538K405352K609577p49447k757965k246392k595251l793014
10120h516514r75528O255815R850223L741288o611352j0840460o458166N08813
10112a3045881M693705N159677K387917j738572k284464L338979Q844484N437717
10104A2793562m861571j0300307n517592J791179L595984K263551L036280L749165
10096F550251O2741m749257m343336l60389O8327l581115m286908J016232O647012
10087b976442O617417J969625k238898k863896k34669K696084K311991j442514
$$ plain form
10145 -26056 -2097823 -5547138 -3916624 963353 1498288 -4882359 -12562040 -14843905 -10699732
10136 -10699732 -4271798 48841 1457034 2417414 4674266 6302660 4415261 281164
10128 281164 -1389374 1015978 3625555 2876108 118143 -2128249 -4723500 -8516514
10120 -8516514 -9492042 -3236227 6613996 10355284 3743932 -7096528 -13554694 -13045881
10112 -13045881 -8352176 -3192499 -804582 -2543154 -4827618 -1488639 7355845 12793562
10104 12793562 7931991 -2368316 -7885908 -6094729 -2498745 -235194 2801086 6550251
10096 6550251 6612992 1863735 -2479601 -2839990 -2771663 -6352778 -10639686 -9623454 -2976442
10087 -2976442 3640975 5610600 3371702 507806 273137 2969221 5281212 3838698
10079C838698l619545p25578L196128K093549k256657k725781J389452K798835
10071C989101k055735o938023m736472K950130Q555786P132727j39236p716648
10063A041630r494511m085708K963193N340230L625579K614304K791513Q54447
10055E650677k443687k823351p64617p32340j595074K447360R570341R784654
10047A9093963O18563p417647o650662k992625l681725m665919K01263O266592
10039G71803N683144J295860J220206M386733L264479k321774n669456n327397
10031C303598n469124n532197r84752N673707O174312K07982k944300Q42999M405389
10022E677614J869960k039820r03303K754068K353512k216759n322736m039458
$$ plain form
10079 3838698 219153 -506425 2689703 4783252 2526595 -199186 1190266 3989101
10071 3989101 1933366 -5004657 -9741129 -6790999 1764787 8897514 8758278 1041630
10063 1041630 -8452881 -12538589 -9575396 -4235166 -609587 2004717 4796230 5650677
10055 5650677 3206990 383639 -380978 -1113318 -2708392 -261032 9309309 19093963
10047 19093963 19712526 12294879 5644217 2651592 -1030133 -5696052 -5494789 771803
10039 771803 6454947 7750807 8971013 13357746 16622225 14300451 8630995 3303598
10031 3303598 -2165526 -7697723 -8682475 -3008768 3165544 3373526 429226 1272225 5677614
10022 5677614 7547574 5507754 4604451 7358519 9712031 7495272 2172536 -1866922
10014a866922p72370J161195Q94643m34187j337193j420907j564084j913846p78498
10005h032169K422382M633756K914286n13670j001004J530380K762370P97677
9997E514008j854771l176148l732668l339608m73430L717777N169931K376841
9989D201932j400526k856473k436396k116064k256517k085779j276894r5748Q10217
9980i512248R07415R12697J945195K611469M2819m389853m922655j62516L477291
9971i090386J947839P85180M944802Q158259K916472m465269k271366O125963
9963I051494N870887m808425j0269634k172237P464041N987967j256690k890627
9955F976776m07179k128544o581483n677641K43568L285780J428047j44991L09392
$$ plain form
10014 -1866922 -2639292 -1478097 -583454 -1017641 -2354834 -3775741 -5339825 -7253671 -8032169
10005 -8032169 -5609787 -976031 1938255 1424585 423581 1953961 4716331 5514008
9997 5514008 3659237 483089 -3249579 -6589187 -7062617 -3344840 1825091 4201932
9989 4201932 2801406 -55067 -2491463 -4607527 -6864044 -8949823 -10226717 -10322465 -9512248
9980 -9512248 -8604833 -7692136 -5746941 -3135472 -3092653 -7482506 -12405161 -12567677 -9090386
9971 -9090386 -7142547 -6357367 -1412565 6745694 9662166 5196897 2925531 9051494
9963 9051494 14922381 10113956 -155678 -2327915 5136126 11124093 9867403 6976776
9955 6976776 6569597 4441053 -2140430 -7818071 -7574503 -4288723 -2860676 -3005667 -2696275
9946b696275n63143k760241k255672J008743K810688K492486L147495L917207
9938E101288O25678m922462n116472J354144N801038K147095l802031l226903
9930b038625K880568O217504L426632p24748j683183p30995r01884j740077j066618
9921C638574M81297J95393j987767k895942j078505O89817k19677k063084j689678
9912d929572M59998J854719K519367L820869L967385O4552n520749o477751j280671
9903e521853M342005M946097J003711l697855n608813k155494N510094J0256945
9895I074837N893810l226533o754159k886705L31005r07829j448706R87192J185714
9886B248626j888598j318531L925502M805106o74327j420834N571254N694894
$$ plain form
9946 -2696275 -3259418 -6019659 -8275331 -7266588 -4455900 -1963414 1184081 5101288
9938 5101288 5726966 804504 -4311968 -2957824 2843214 4990309 1188278 -2038625
9930 -2038625 841943 7059447 10486079 9761331 8078148 7347153 6445269 4705192 3638574
9921 3638574 4119871 4315264 2327497 -568445 -1646950 -957133 -1176810 -3239894 -4929572
9912 -4929572 -4469574 -2614855 -95488 3725381 7692766 7757318 2236569 -4241182 -5521853
9903 -5521853 -1179848 3766249 4769960 1072105 -4536708 -6692202 -1182108 9074837
9895 9074837 14968647 11742114 4987955 2101250 2432255 1524426 75720 1062912 2248626
9886 2248626 360028 -958503 2966999 7772105 7097778 5676944 11248198 16943092
9878A6943092o305048q853572J3332035L4530439J8472155k3895178m3120023
9871A103900k0188129R067044R709062n943709q037218K941309O067958o28554
9863e908337j199776O332224P424062j274085o091751p71364L918746J23624m846933
9854b293590l133759R24533P62174p59144J572426M624611K205556l838647n887173
9845e823013j757649K793543K494076j217906l434354k356135n09037o8133M34338
9836i444270K910231N287566M210826J259648R69874K260862j042642q576161
9828b164066j0396498j178855R700458J0039782J367352m980019m187133j066631
9820b865610L56139O41911m13654l586402n083982n74042N693022M924850k473764
$$ plain form
9878 16943092 10638044 1784472 15116507 49646946 68119101 44223923 1103900
9871 1103900 -19084229 -10017185 -308123 -6251832 -14289050 -11347741 -5279783 -5908337
9863 -5908337 -7108113 -775889 6648173 5374088 -717663 -1489027 2429719 2553343 -2293590
9854 -2293590 -5427349 -4502816 -3740642 -4499786 -2927360 1697251 3902807 64160 -5823013
9845 -5823013 -7580662 -4787119 -2293043 -3510949 -6945303 -9301438 -9810475 -9878608 -9444270
9836 -9444270 -6534039 -1246473 2964353 4224001 5193875 7454737 6412095 -2164066
9828 -2164066 -12560564 -13739419 -4038961 6000821 7368173 2388154 -1798979 -2865610
9820 -2865610 -2509471 -1867560 -2281214 -5867616 -10951598 -11525640 -5832618 -907768 -3381532
9811c381532o577355k844647K091207K114363j20094m03329Q0515k84771Q12590
9802h513053L858524M053163r78291n750057m542804M80950L658048L550209J726545
9793b456766j183276l481993j599833L549123M642151j752444q031248n522636
9785a5836922K856126P525425O193756M360042M135632J888056k768119m295723
9777D058273k693M998968M691154l95248n141986n975365l169942L14817R61430
9768C39408k178328n797238n701837j809949K323793M279519M276227K661661
9760a606744n01045l282408k877596M56933L225127L086359J074348p65464j444479
9751b634969o13963J287171K220301L86363k945692m802976m448266l250755j206818
$$ plain form
9811 -3381532 -9958887 -12803534 -10712327 -8597964 -8718058 -9121387 -9040872 -9325643 -8513053
9802 -8513053 -4654529 -601366 -1579657 -7329714 -11872518 -11391568 -7733520 -4183311 -2456766
9793 -2456766 -3640042 -7122035 -8721868 -5172745 -530594 -2283038 -10314286 -15836922
9785 -15836922 -12980796 -5455371 738385 5098427 9234059 11122115 8353996 4058273
9777 4058273 4055580 9054548 13745702 13350454 8208468 2233103 -936839 -622022 339408
9768 339408 -1838920 -7636158 -13337995 -15147944 -12824151 -8544632 -4268405 -1606744
9760 -1606744 -2107789 -5390197 -8267793 -7810860 -4585733 -1499374 -425026 -1190490 -2634969
9751 -2634969 -3248932 -1961761 258540 644903 -2300789 -7103765 -11552031 -14802786 -16009604
9742a6009604K693482O559371O388696K078903j279362j55962K737270K921970
9734E934764L33296j873081k342583k063362j369628J98884J507949L90169k878662
9725b162254m879004k850695J883235N077823L836461m79625l558573k614232
9717e746864N70265J942186M17966j009303j82209O32798j428255m199159k747224
9708a1749799K714713N757594K669814j668362p73409L647529M401450n1891l658787
9699A288852k646855n44833o32832p2021L524578N494031R75976n770360o730682
9690e114146k145358J145381J481173L028291N184346K182854m798460o341533
9682e377452n4998L681545j945300q147031m210346N045864O937367M78687m013445
$$ plain form
9742 -16009604 -13316122 -6756751 -368055 1710848 431486 275524 3012794 5934764
9734 5934764 6268060 4394979 2052396 -10966 -1380594 -1181710 326239 716408 -2162254
9725 -2162254 -7041258 -9891953 -8008718 -2930895 905566 425941 -3132632 -5746864
9717 -5746864 -5176599 -3234413 -2816447 -3825750 -4007959 -3375161 -4803416 -9002575 -11749799
9708 -11749799 -9035086 -3277492 -607678 -2276040 -3049449 598080 4999530 4947639 1288852
9699 1288852 -1358003 -1902836 -2535668 -2607689 916889 6410920 7386896 1616536 -5114146
9690 -5114146 -7259504 -6114123 -4632950 -1604659 3579687 5762541 964081 -5377452
9682 -5377452 -5432450 -1750905 -3696205 -11843236 -16053582 -11007718 -4070351 -3591664 -7605109
9673g605109j937389J317729K450305M522917P490494N584475k012534p112553
9665B698335m035250K120339L774132J418865N00805K267962L186359J004403
9657A2935950k769271n064330l675058O77919L538917Q10359n183881p200952
9649e930347k254369M309957O002924L035662L08536K58271P85577p35283l488332
9640B292596l629806Q78643N807364M026267m421540r771921m983712L399288
9632f402821M370698q34695j467438M314217O126611q48477p150200m247471K324390
9623c815186L288598J60450j55891J686237L69308l064978l322336p49076L53051
9614e249823N17045K855239M598453R33573m442488l368372K560581L074755l999715
$$ plain form
9673 -7605109 -9542498 -8224769 -5774464 -1251547 6238947 11823422 9810888 2698335
9665 2698335 -1336915 783424 4557556 5976421 6477226 8745188 11931547 12935950
9657 12935950 10166679 5102349 1427291 2105210 5644127 6454486 1270605 -5930347
9649 -5930347 -8184716 -3874759 2128165 5163827 5472363 5730634 6516211 5780928 2292596
9640 2292596 -1337210 -458567 5348797 9375064 4953524 -4818397 -9802109 -6402821
9632 -6402821 -2032123 -2866818 -4334256 -20039 6106572 5258095 -1892105 -6139576 -3815186
9623 -3815186 -526588 -366138 -522029 1164208 1533516 -1531462 -4853798 -5602874 -5249823
9614 -5249823 -4732778 -1877539 2720914 3654487 -788001 -4156373 -1595792 1478963 -2520752
9605b520752q330251l179168M400862N271067J595823J254038M854268O079972
9597I425859J976362l582947n652658l262085M73472J036646k984857o877431
9589i447639m421409L272534P979681N388691O00289o28092l39943k929416o284998
9580f810302n111536J28500M339803N621317N501525L529844j244632n060115
9572H94404l558284r7244j246032m414010o10465Q765924J0220361j204140j1643988
9563b893474q197700J443629K093658m038585k027886R277234J3570081K794344
9555A2021301r954452j0431294k555835J830411J421848K151597L644653J611407
9547b60364j235641R94284N431125M022269k392506n003484j825438j60392k897674
$$ plain form
9605 -2520752 -10851003 -14030171 -9629309 -4358242 -2762419 -1508381 3345887 9425859
9597 9425859 11402221 7819274 2166616 -1095469 -621997 414649 -2570208 -9447639
9589 -9447639 -13869048 -10596514 -2616833 2771858 3372147 2744055 2404112 -525304 -6810302
9580 -6810302 -11921838 -11793338 -7453535 -1832218 3669307 7199151 5954519 894404
9572 894404 -2663880 -2761124 -4007156 -8421166 -9031631 -265707 9954654 8750514 -2893474
9563 -2893474 -11091174 -9647545 -7553887 -11592472 -13620358 -4343124 9226957 12021301
9555 12021301 2066849 -8364445 -10920280 -9089869 -7668021 -5516424 -1871771 -260364
9547 -260364 -1496005 -501721 4929404 8951673 6559167 1555683 -269755 -430147 -3327821
9538c327821l569916J474114N956985L718424k066580m825450l307481J11705
9530e836020L813368N388794J707104m978725o774531q29373N200720L623011
9522A314348k454013m624064j273498K176434K343470J273293K013691M998081
9514E767742P812529O407449q46441q708488r109298k031657L104810M00264m289638
9505a492728l046697K217964M206548J724866o62051j034482r76059n59126Q87369
9496A265604J268631q64203k010977Q65166L600483O77276m773580m811274R42618
9487c840256M865829K911648j009040k639913k436841k055619j668163j702813
9479g575168k519012k354759Q5646K191880J231261n74227m8039Q92679l77976
$$ plain form
9538 -3327821 -6897737 -5423623 533362 4251786 2185206 -2640244 -5947725 -5836020
9530 -5836020 -2022652 3366142 5073246 94521 -6680010 -7509383 -2308663 1314348
9522 1314348 -1139665 -5763729 -7037227 -4860793 -2517323 -1244030 769661 5767742
9514 5767742 13580271 19987720 19141279 10432791 1323493 -708164 2396646 2796910 -1492728
9505 -1492728 -4539425 -2321461 1885087 3609953 2947902 1913420 937361 378235 1265604
9496 1265604 2534235 1670032 -340945 524221 4124704 4801980 28400 -4782874 -3840256
9487 -3840256 1025573 3937221 2928181 288268 -2148573 -4204192 -5872355 -7575168
9479 -7575168 -10094180 -12448939 -12363293 -10171413 -8940152 -9514379 -9562418 -8669739 -9047715
9470i047715n12092L797549O839658J519122o593655n449802L795179P383789
9462A732033J360760j765405N271410J0770671K524806j1327877j3176170j208627
9454e818399R284173P374700k108354q613408p846315j978999M916475Q742698
9446C952571P056505J488162l457701m987607m168419l649745m491631n035210
9438a3293075k560518K957188P122411N613610M23029j831047J319477M913586
9430D664661L800380n58860l165969k375299n98836L4977j66316m9992M19739
9421B004485o9924k436322m977501m457503q25221J596261L39214p94426K176282
9412g444655N915186M343019j376774m312627k161808Q70865J906051J805002
$$ plain form
9470 -9047715 -9559807 -5762258 1077400 2596522 -3997133 -9446935 -5651756 1732033
9462 1732033 3092793 1327388 6598798 17369469 19894275 8566398 -4609772 -5818399
9454 -5818399 3465774 10840474 8732120 118712 -7727603 -9706602 -4790127 3952571
9446 3952571 11009076 12497238 9039537 4051930 -116489 -3766234 -8257865 -13293075
9438 -13293075 -15853593 -12896405 -5773994 -160384 262645 -1568402 -248925 4664661
9430 4664661 8465041 7906181 4740212 2364913 1766077 1801054 1634738 1584746 2004485
9421 2004485 1934561 -501761 -5479262 -9936765 -10761986 -9165725 -8826511 -9620937 -7444655
9412 -7444655 -1529469 2813550 1436776 -2875851 -5037659 -4166794 -2260743 -455741
9404d55741L95435k834800l932570P96662N870450K779276m965702n157377L199871
9395d304496P182501J159780m061520l47233M176797Q51363l668927l11754M979277
9386E655788J728896n791881n823352L69946J671999k785540l149944K563924
9378e560164N172591R14058k896759j551891L40466o47247q53885J776270L015818
9369b90743O61545j149532N5880P13012j345690k576397o86625R86370k02778
9360c834958j813648j591598j051413q22231J328343M828673N130724J544103
9352C717995k50297K620738M885385J605767l688343m589211j037223K173470
9344E438281K587588J120877j193782l302189l349179j331891l46479k204033
$$ plain form
9404 -455741 -60306 -2895106 -6827676 -6031014 -160564 2618712 -2346990 -7504367 -4304496
9395 -4304496 2878005 4037785 -23735 -370968 3805829 4657192 988265 676511 5655788
9386 5655788 7384684 1592803 -4230549 -3860603 -2188604 -4974144 -8124088 -5560164
9378 -5560164 -387573 526485 -2370274 -3922165 -3581699 -4228946 -5082831 -3306561 -290743
9369 -290743 370802 -778730 -722850 -9838 -1355528 -3931925 -4618550 -3632180 -3834958
9360 -3834958 -5648606 -7240204 -8291617 -9113848 -7785505 -2956832 2173892 3717995
9352 3717995 3467698 6088436 10973821 12579588 8891245 4302034 3264811 5438281
9344 5438281 8025869 9146746 7952964 4650775 1301596 -30295 -376774 -2580807
9336b580807l999576j849776L718908Q289536Q043381K767437l710427n988633
9328D690043k701150Q64276n07061l749824j757280M663253O746440J339671l692611
9319E895757j632066L066435K809337j172650k173146N41185J215324k726602
9311E823574o804748n833882k65058M567797L966210r87865l764525j01996N209396
9302A808903L883599l389580o763605j673088M249009L261549j041677j277557
9294i42447J246815M76835k550306j808033K087663K517018j170452k199470J600387
9285g41990L647047p2200l705412q21724N066568N479023r51822p123076o844900
9276f068486j171179M267941N020697Q59661m505172o280340k646104L345633
$$ plain form
9336 -2580807 -6580383 -8430159 -4711251 3578285 11621666 14389103 10678676 4690043
9328 4690043 1988893 2853169 2346108 -1403716 -3160996 1502257 8248697 9588368 5895757
9319 5895757 4263691 7330126 10139463 8966813 6793667 7334852 8550176 5823574
9311 5823574 -981174 -6815056 -7080114 -2512317 1453893 466028 -3298497 -3400493 1808903
9302 1808903 5692502 2302922 -4460683 -6133771 -1884762 1376787 335110 -942447
9294 -942447 304368 781203 -1769103 -3577136 -1489473 1027545 -142907 -2342377 -741990
9285 -741990 2905057 2832857 -872555 -1694279 3372289 8851312 7899490 776414 -6068486
9276 -6068486 -7239665 -2971724 2048973 2908634 -1596538 -7876878 -10522982 -7177349
9268g177349O402787L997108j062299l339158p82341K388828P51863m317746n278904
9259h417211R58529P193257N289237j792103m070742M37837L018738j395852n486182
9250d264492r21684P608102Q089115j426112r753350p933912j66289M066445K862273
9241a839904J317795J549414J86861m155899p009301m323048J319240M227804
9233h727038L068293J238560J067202J452396J249194J393704K521558L239104
9225F502973K305015N07873j027361k517633m029601m204094k360065l02186Q6251
9216e038828k24780P74022K379955K014618m04701j742056k0494K719066L221321
9207C678123J186102q62049j133248m99417p39474j920137k335782q78494J380761
$$ plain form
9268 -7177349 -774562 3222546 2160247 -1178911 -1961252 427576 1179439 -3138307 -8417211
9259 -8417211 -7458682 -265425 5023812 3231709 -839033 -401196 2617542 1221690 -4264492
9250 -4264492 -5186176 2421926 10511041 9084929 -668421 -8602333 -8768622 -4702177 -1839904
9241 -1839904 -522109 1027305 1214166 -2941733 -9951034 -14274082 -12954842 -8727038
9233 -8727038 -5658745 -4420185 -3352983 -1900587 -651393 742311 3263869 6502973
9225 6502973 8807988 9315861 8288500 5770867 1741266 -2462828 -4822893 -5125079 -5038828
9216 -5038828 -5263608 -4489586 -2109631 -95013 -499714 -2241770 -2262264 456802 3678123
9207 3678123 4864225 4002176 2868928 2369511 1630037 -290100 -2625882 -3504376 -2123615
9198b123615K451262J633925l12707k587459m583296n071913l060152J98390J967505
9189a1488060J578114J317422K676642L769811K324223m75422j548874l53808
9181b199952P10213K7150j250358j050166J297103M481691N797015L002234k842234
9172G972696p172316o403431j995058J680382K415676R66356j539793l558032
9164g633520j962785M179255R066381N431078m285020q555711k009347O282817
9156E13148N370392k186784n390364j715248P97426k148397m928726k872298j8076
9147a2578927p10707j090798L829975J0058515R737450L213647j987256k490315
9139G981584j539831r81973R66917L246496J449743l897601o088873k607614L51652
$$ plain form
9198 -2123615 327647 1961572 1648865 -938594 -5521890 -10593803 -13653955 -13455565 -11488060
9189 -11488060 -9909946 -8592524 -5915882 -2146071 178152 -297270 -1846144 -2199952
9181 -2199952 -1489739 -1462589 -2712947 -3763113 -2466010 2015681 7812696 10814930 7972696
9172 7972696 800380 -5603051 -7598109 -5917727 -3502051 -2535695 -4075488 -7633520
9164 -7633520 -9596305 -5417050 3649331 9080409 4795389 -3760322 -5769669 513148
9156 513148 5883540 3696756 -1693608 -3408856 -2611430 -4759827 -9688553 -12560851 -12578927
9147 -12578927 -13289634 -14380432 -10550457 -491942 9245508 12459155 10471899 7981584
9139 7981584 6441753 5459780 6426697 9673193 11122936 7225335 1136462 -1471152 -1119500
9130a119500j868714m461266j557617L233197K434824k895463m833051j132495
9122a2200085K224304J498164M64851K779216N440527L858160p16991l095573
9114B52573j414905J092977J004711j137120j982743K90667L376508L119095j347926
9105C253837n938055o221951k495065J351138K763985K243990J180054L83563
9097c478504J92782r811j553544l866356l706299L55736M459669L986311J59514
9088c460502j962039j082301n42610j789978k012974N93118L487199L415555L41483
9079c013049l327437m867235k525604K293233M655789J701047k236497r88785
9071h308538L781788M706268O44418j327620J939852L748555j485766q356483
$$ plain form
9130 -1119500 -2988214 -7449480 -9007097 -5773900 -3339076 -6234539 -11067590 -12200085
9122 -12200085 -9975781 -8477617 -8012766 -5233550 206977 4065137 3348146 252573
9114 252573 -1162332 -69355 935356 -201764 -2184507 -1893840 1482668 4601763 3253837
9105 3253837 -2684218 -8906169 -11401234 -10050096 -7286111 -5042121 -3862067 -3478504
9097 -3478504 -3285722 -3295533 -4849077 -8715433 -12421732 -12065996 -7606327 -3620016 -3460502
9088 -3460502 -5422541 -6504842 -7047452 -8837430 -10850404 -10257286 -6770087 -3354532 -3013049
9079 -3013049 -6340486 -11207721 -13733325 -11440092 -6784303 -5083256 -7319753 -8308538
9071 -8308538 -4526750 179518 823936 -503684 1436168 5184723 3698957 -4657526
9063d657526q039792q83920N240073N881966L046109l29204k935119l512939j853432
9054h043784m23776r70624j169584J367159M085479L262202O10235O30117K843264
9045B190688K521941j318919m275497l189538M40454L946779N769685M137571
9037A0223164j526119p180654p104658j617950K595965J477909j357593o26327
9029e116263L400243O296672N318423J431309k444105l436061q82070K159279
9021F727427J588718k385957m916062k904326P63696J393310j168500k889750
9013c791444j234733J892447K924177Q54482j852924k225267k60448J187082K99555
9004b207073j113774k66678K298722L164178P37387k503092l119860p80601J587093
$$ plain form
9063 -4657526 -12697318 -13581238 -8341165 -2459199 586910 257706 -2677413 -6190352 -8043784
9054 -8043784 -8467560 -9438184 -10607768 -9240609 -5155130 -1892928 -1282693 -652576 2190688
9045 2190688 4712629 3393710 -881787 -4071325 -3630871 315908 6085593 10223164
9037 10223164 8697045 1516391 -5588267 -7206217 -4610252 -3132343 -4489936 -5116263
9029 -5116263 -1716020 4580652 9899075 11330384 8886279 5450218 4568148 6727427
9021 6727427 8316145 5930188 1014126 -1890200 -1126504 266806 -901694 -3791444
9013 -3791444 -5026177 -3133730 -209553 644929 -1207995 -3433262 -3693710 -2506628 -2207073
9004 -2207073 -3320847 -3587525 -1288803 1875375 2612762 109670 -3010190 -3790791 -2203698
8995b203698J259308j099980k088234R7968K794165K232745p65033j722683M62359
8986a033083J681292l86484k084429R6692L571803M192281K705468J646081j10488
8977A0279133l518791m253354O73876M709532p4962q720952q647264Q20003O596157
8968b136622K089757l501729j644747K116634j89285m428159k491486K814952
8960g370685L059805q21276j069405K393523K226786k401147l757452J382225
8952f357626O746711O906127L949662J370767r93989l313381l895199l245714
8944A167358l679688l536929J056484P393413P647951J512497j880818J447817
8936A1128085L541312j727409p588641n494707O47465J516765k241852k790817
$$ plain form
8995 -2203698 -944390 -2044370 -4132604 -4034636 -1240471 992274 227241 -1495442 -1033083
8986 -1033083 648209 261725 -1822704 -1726012 1845791 6038072 8743540 10389621 10279133
8977 10279133 6760342 2506988 3180864 7890396 7815434 -905518 -9552782 -8732779 -2136622
8968 -2136622 -46865 -3548594 -5193341 -3076707 -3265992 -7694151 -10185637 -7370685
8960 -7370685 -4310880 -5132156 -6201561 -3808038 -1581252 -3982399 -7739851 -6357626
8952 -6357626 389085 7295212 11244874 12615641 11621652 8308271 4413072 1167358
8944 1167358 -2512330 -6049259 -4992775 2400638 10048589 11561086 9680268 11128085
8936 11128085 14669397 12941988 5353347 -141360 506105 2022870 -218982 -3009799
8928c009799N37737J308553j063050j8530N485315P583911J837358n579612o869463
8919B12420k286057K586564L834897Q38721m084908n728556r22709N282418M611562
8910D344352j937061m416989O53264M381414J85495m883677j830252M867268M309920
8901E673734l011012o290905j828862K263563K57510k719101m39166M293149M696093
8892B895003r657m773483n765784l292375L21605K889022L656613L750905L917659
8883C589508K203413k898813p423663n155622K859328P457952L014942m668862
8875a021817o146684m95472M826606M171837o18613l945752k489662K317504N754369
8866B352316M152204j064491m770150m153523j196998J384453L191557L674261
$$ plain form
8928 -3009799 -2472062 -1163509 -2226559 -2245089 3240226 10824137 12661495 7081883 212420
8919 212420 -2073637 512927 4347824 5186545 1101637 -4626919 -5549628 -267210 4344352
8910 4344352 2407291 -2009698 -1356434 3024980 3210475 -1673202 -3503454 1363814 5673734
8901 5673734 2662722 -3628183 -5457045 -3193482 -2935972 -5655073 -6094239 -1801090 2895003
8892 2895003 2885346 -1888137 -7653921 -10946296 -10624691 -7735669 -4079056 -328151 3589508
8883 3589508 5792921 2894108 -4529555 -9685177 -6825849 632103 3647045 -1021817
8875 -1021817 -7168501 -7663973 -2837367 1334470 715857 -3229895 -5719557 -3402053 2352316
8866 2352316 6504520 5440029 669879 -3483644 -4680642 -3296189 -104632 3569629
8858C569629R74245l688596m616330R14342P029372O284919J4311l990906k684516
8849C806470m42094o32838q95683J294893L537828K132211k305363n701353n395160
8840d601089k367092L03171L16553j588306k251256K140L012787M004874L461885
8831B93667L050410J727512j785542m215958j215940M553804N328305l77675m933326
8822B425257l001118P89296J35920k927730k671642J48580L25594k029401j719845
8813h525089J910704L213351l93653l820415j859321L650558P252921O550513
8805G979569K581373k898647p254519p038119j869773L514233M210618Q52415
8797G7150k120783k279447n18640J974865M755063O553340N589587J858650k448957
$$ plain form
8858 3569629 4543874 855278 -3761052 -2846710 4182662 10467581 10481892 6490986 3806470
8849 3806470 3364376 2731538 1835855 3130748 6668576 8800787 6495424 794071 -4601089
8840 -4601089 -6968181 -6665010 -6348457 -7936763 -10188019 -10185879 -7173092 -3168218 293667
8831 293667 3344077 5071589 3286047 -929911 -2145851 2407953 7736258 7358583 2425257
8822 2425257 -575861 213435 349355 -2578375 -5250017 -5101437 -4775843 -6805244 -8525089
8813 -8525089 -6614385 -3401034 -3794687 -7615102 -9474423 -5823865 1429056 7979569
8805 7979569 10560942 7662295 407776 -6630343 -8500116 -4985883 -775265 77150
8797 77150 -2043633 -4323080 -4841720 -2866855 1888208 8441548 14031135 15889785 13440828
8788A3440828m712780l348924J061244M912217L976844j357634n535683m905116
8780C530996k538412k703351l834080k044552J162621J327996m73386O12002L181910
8771a778256K96039p637165j0000455j077379R832609J0390798J616246n204322
8763c561885m015727J151997M316854L408538o50215m652623m087461J370990
8755f719532N241903K361316l082371l809877o46341K99134r34803R85237N277512
8746a027822M785932j537772n724831l182238J020197J833714J568123L009628
8738G44931L283474J74413k392137j125067M81266j242056l095520r90771K160726
8729b000741J413805j585903j910132J34884O56613m31358l84324K24764j061040
$$ plain form
8788 13440828 8728048 5379124 6440368 11352585 15329429 13971795 8436112 3530996
8780 3530996 992584 -1710767 -5544847 -7589399 -6426778 -5098782 -5572168 -4960166 -1778256
8771 -1778256 -1482217 -9119382 -19119837 -20197216 -10364607 26191 1642437 -3561885
8763 -3561885 -7577612 -6425615 -2108761 1299777 649562 -4003061 -8090522 -6719532
8755 -6719532 -1477629 883687 -2198684 -6008561 -6654902 -6355768 -7290571 -6305334 -1027822
8746 -1027822 3758110 2220338 -3504493 -6686731 -5666534 -3832820 -2264697 744931
8738 744931 4028405 4202818 1810681 685614 1166880 -75176 -3170696 -4161467 -2000741
8729 -2000741 -586936 -2172839 -4082971 -3948087 -3291474 -3722832 -4107156 -3882392 -4943432
8720d943432k651664r38288K632072K748322j418216m459158k191198L084444
8712h137118N798696L348730j215567k167743J917191M803127K94600p133155
8704b491239o592680K659746Q193954K765068m223408j925283M510029L427594
8696F323781l382908m434583J370291L492369j559729m855984j076205L190446
8688i32522J881665j102873p79045J95440j639508k741199J230060O839802P013128
8679I964948L75689p928026j1743501p848657J467186Q139246O005747Q4695J089825
8670c92848Q708813R727197k107560j3993484j0755762L411755J0927079N082516
8662A0607706l159130k920222K489306L247654k430584p397349o154027q66074
$$ plain form
8720 -4943432 -7595096 -8533384 -5901312 -3152990 -4571206 -9030364 -11221562 -8137118
8712 -8137118 -2338422 1010308 -205259 -2373002 -455811 4347316 4641916 -2491239
8704 -2491239 -9083919 -6424173 1769781 4534849 311441 -1613842 2896187 6323781
8696 6323781 2940873 -1493710 -123419 3368950 1809221 -3046763 -4122968 -932522
8688 -932522 949143 -153730 -932775 -737335 -2376843 -5118042 -3887982 2951820 9964948
8679 9964948 10340637 2412611 -9330890 -17179547 -15712361 -7573115 -1567368 -1482673 -392848
8670 -392848 8315965 18043162 15935602 1942118 -8813644 -5401889 5525190 10607706
8662 10607706 7448576 4528354 7017660 10265314 7834730 437381 -5716646 -6582720
8654f582720L236476M498698M721015M423904J738167l492884p729885p803724
8646f990953m493904r5363M382505O866667L439469n142437j0236321n463566
8638a7733903L128906N203703J755385K360515P882669Q316233K69624n995766
8630E187366k810918K724045R54850n019943n943456j559390J255958J204963
8622d006525K928164O480082O106600K8403o162372p344098m588327j715133l58059
8613h631265J87882R57954K122771K634467J462443l25398m93489Q58463J459521
8604B33349J060332J755625L284909K523072r86663l868122m663133n117313m338072
8595a0116016J122601Q743681R815359K191717m829154l991324l62173j305159
$$ plain form
8654 -6582720 -3346244 1152454 5873469 10297373 12035540 8542656 812771 -6990953
8646 -6990953 -11484857 -11580220 -7197715 -331048 3108421 -2034016 -12270337 -17733903
8638 -17733903 -14604997 -9401294 -7645909 -5285394 2597275 10913508 11183132 5187366
8630 5187366 2376448 5100493 6055343 1035400 -4908056 -6467446 -5211488 -4006525
8622 -4006525 -1078361 5401721 11508321 11536724 5374352 -1969746 -6558073 -8273206 -8631265
8613 -8631265 -8443383 -7485429 -5362658 -2728191 -1265748 -1591146 -2084635 -1226172 233349
8604 233349 1293681 3049306 6334215 8857287 7870624 4002502 -660631 -5777944 -10116016
8595 -10116016 -8993415 -249734 9565625 11757342 6928188 2936864 2574691 1269532
8587A269532m278276l230787k5461K89699l21432K345216M903341K028897k542950
8578D37779j950468Q17170j862641p069312m904463L815379P376859J849770l478597
8569d968524k246337J25185j686273l679613j311871J977336J596598l38690m6500
8560a0578689J255314J080427O23455J349805J565985J61546r90917j100806j622047
8551h255927j466325K268980O758695M825826k875977o129140n93860M392799
8543a074929N92967n485154l371999M030510N538343K7653k583439K016362O365454
8534F055768M035513p80211r02830L077643M792611J319625m022985o738743n827366
8525A009025l399019j422349J81760K167939L555302K189302j944999n639957
$$ plain form
8587 1269532 -3008744 -6239531 -6264992 -5975293 -6296725 -3951509 951832 2980729 437779
8578 437779 -1512689 -695519 -2558160 -9627472 -14531935 -10716556 -3339697 -1489927 -4968524
8569 -4968524 -7214861 -7089676 -8775949 -12455562 -13767433 -11790097 -10193499 -10532189 -10578689
8560 -10578689 -9323375 -8242948 -7619493 -6269688 -4703703 -4542157 -5533074 -6633880 -8255927
8551 -8255927 -9722252 -7453272 -694577 4131249 1255272 -4873868 -5467728 -1074929
8543 -1074929 -481962 -5967116 -9339115 -5308605 229738 257391 -2326048 -309686 6055768
8534 6055768 10091281 9311070 8408240 11485883 16278494 17598119 13575134 6836391 1009025
8525 1009025 -2389994 -3812343 -3630583 -1462644 2092658 4281960 2336961 -3302996
8517c302996n678674k080694K289233M115247J756594l007266n385449k187412
8509a3481417L903521P352437O751588N152947L726986K41065m992521p227207
8501A427399m120296K73396J578417Q85702J000147J131363n02577k369267k335572
8492c031288j716670k398896k767628p50552J870846K545972K503466L599589
8484a45161L657197L61130k944089j623531K073062K078811j310871j757413K292246
8475B681381M664665J476125k666233k066652J695363L065817O18738k324264
8467G144940l096295k221577j604458k524358m625423n645309l506494M27271
8459a5651703K157711K36055k071750j240763K124493N055728O120924N465362
$$ plain form
8517 -3302996 -8981670 -11062364 -8773131 -4657884 -2901290 -5908556 -11294005 -13481417
8509 -13481417 -9577896 -2225459 4526129 9679076 13406062 13647127 8654606 1427399
8501 1427399 -2692897 -2419501 -841084 44618 1044765 2176128 1673551 -695716 -3031288
8492 -3031288 -4747958 -7146854 -9914482 -10665034 -8794188 -6248216 -3744750 -145161
8484 -145161 3512036 3873166 929077 -694454 1378608 3457419 2146548 389135 2681381
8475 2681381 7346046 8822171 6155938 4089286 5784649 8850466 9469204 7144940
8467 7144940 4048645 1827068 222610 -2301748 -6927171 -12572480 -16078974 -15651703
8459 -15651703 -13493992 -13257937 -15329687 -16570450 -14445957 -9390229 -3269305 2196057
8451B196057L085382l35347k496311k125105j247600k014399k615971N2713M372623
8442a127958M991101N50381l769721l404813m77668K37401j443592j776022O28875
8433e592016L339797M492114M680964M152707J929325j237449k605921j653492
8425G506029j155491k235536k055932P50579K084811j879737p667020q399681
8417a3051978l382488J592447L162095L892717N816034O142145K407078k303502
8409D274548l109000N9113K953418K646635r7578k976516m188954l034043m92049
8400c964426J348519J867358K780043M743060M655862p08593q797787j2251782
8392a0327746p023944K481285P968557N869002l7111l811657l221337k05466K494683
$$ plain form
8451 2196057 5281439 4946092 2449781 324676 -922924 -2937323 -5553294 -5500581 -1127958
8442 -1127958 3863143 4413524 643803 -2761010 -3238678 -3001277 -4444869 -6220891 -5592016
8433 -5592016 -2252219 2239895 6920859 11073566 13002891 11765442 9159521 7506029
8425 7506029 6350538 4115002 2059070 2809649 4894460 3014723 -4652297 -13051978
8417 -13051978 -16434466 -14842019 -11679924 -7787207 -1971173 4170972 6578050 4274548
8409 4274548 1165548 1224661 4178079 6824714 6727136 3750620 -438334 -3472377 -3964426
8400 -3964426 -2615907 -748549 2031494 6774554 11430416 10721823 1924036 -10327746
8392 -10327746 -17351690 -14870405 -6901848 -1032846 -1069957 -4881614 -8102951 -8308417 -5813734
8383e813734L521061K563361q0069l087034m513748l376350m25598K602858L894751
8374d714502K429992n38721j541588J323434N044950N001786J504135o48685L51627
8365H212428Q56904j499611l591836k594254j290818k943978m732418k036591
8357i620174L259107M841505J275938k325229j817814J362214L251085J637330
8349A863962k286413m168708l84993N955328O797325M92856m159593j005274K801265
8340E905755j699087q870777o141109M904239R516022K429858m984296l659724
8332b599119Q79994R35445j262149j359247j737936m174459l516514K357950N472511
8323e003524L83688m807977j060360N856800M793328j861270k742775K791845
$$ plain form
8383 -5813734 -2292673 270688 190619 -2896415 -7410163 -10786513 -11212111 -8609253 -4714502
8374 -4714502 -2284510 -2823231 -4364819 -3041385 2003565 7005351 8509486 7860801 8212428
8365 8212428 9069332 7569721 3977885 1383631 92813 -2851165 -7583583 -9620174
8357 -9620174 -6361067 -1519562 -243624 -2568853 -4386667 -3024453 226632 1863962
8349 1863962 -422451 -4591159 -4976152 979176 7776501 8269357 4109764 3104490 5905755
8340 5905755 4206668 -4664109 -10805218 -5900979 3615043 6044901 1060605 -2599119
8332 -2599119 -1719125 -783680 -2045829 -3405076 -5143012 -9317471 -12833985 -10476035 -5003524
8323 -5003524 -4619836 -9427813 -10488173 -4631373 161955 -1699315 -4442090 -1650245
8315a650245M320462j052176m138677P5255M438774K416626j709753j390559J476475
8306B786182J061966k409112l636858o99685K579068K250500q42228k400296j00360
8297a410823L186373K972892l62129j913599J1506J068573j557028l837523j611314
8288c453072K132208K387157L85821J87893Q09797p15623j611968K626727Q370876
8279A1119816P260631p69341o806931o126462l469823l430388l782122j450445
8271g455065J775770L038057K575785J247291j364324m034932l607506K14285
8263g610639L665884L936799J761529j304856l959315l813743r4290K818081M69579
8254d130971l680141k476002L033101M520587J90626k021109J875050M818217
$$ plain form
8315 -1650245 2670217 1618041 -2520636 -2445381 1993393 4410019 2700266 1309707 2786182
8306 2786182 3848148 1439036 -2197822 -2897507 -318439 1932061 1089833 -1310463 -1410823
8297 -1410823 1775550 4748442 4386313 2472714 2484220 3552793 1995765 -1841758 -3453072
8288 -3453072 -1320864 1066293 1452114 1640007 2449804 1734181 122213 2748940 11119816
8279 11119816 18380447 17611106 10804175 4677713 1207890 -2222498 -6004620 -7455065
8271 -7455065 -5679295 -2641238 -65453 1181838 -182486 -4217418 -7824924 -7610639
8263 -7610639 -3944755 -7956 1753573 448717 -3510598 -7324341 -7418631 -4600550 -4130971
8254 -4130971 -7811112 -10287114 -7254013 -2733426 -2542800 -4563909 -2688859 2129358
8246B129358O85460n218460m810780K37269K393794Q6626j910029r69602J168537
8237f207827K759145L124610J125112k626358l932088j93638M248010K928893
8229A225859l430532p191116l671307L044578N431210J483046l271179k654949
8221i034390K292355M517216R02826k629970J57925N472922M652165k015380n228173
8212i12504j181366L020472J594854j120779N24182L482692J886902k482156l110100
8203A702197R94592M459114L191120j903040p024351p857961k577748M480383
8195d535694N753602J22200m789992l336271N81119J096583l88098M38467K528735
8186b529349K532561J727935K653452K689397j379242n711697m378621M53916
$$ plain form
8246 2129358 2814818 -2403642 -7214422 -6977153 -4583359 -4496733 -6406762 -7376364 -6207827
8237 -6207827 -3448682 -324072 801040 -1825318 -5757406 -5951044 -1703034 1225859
8229 1225859 -2204673 -9395789 -13067096 -10022518 -4591308 -3108262 -6379441 -9034390
8221 -9034390 -6742035 -2224819 -1321993 -3951963 -3794038 1678884 6331049 4315669 -912504
8212 -912504 -2093870 926602 2521456 1400677 1924859 5407551 7294453 4812297 1702197
8203 1702197 2696789 7155903 10347023 8443983 1419632 -6438329 -9016077 -4535694
8195 -4535694 1217908 1340108 -3449884 -6786155 -6205036 -5108453 -5496551 -5058084 -2529349
8186 -2529349 3212 1731147 4384599 7073996 5694754 -16943 -4395564 -3941648
8178c941648J367192k873675o347428n257535j127010L882840P841798O961598
8170E06132J49222n908800m084942K193044L617946p28542l242968j375193p80005
8161i654106l568966l967409R94078N845003O034065M789412N930629O907371
8153A3310077L963160j454306n648514p019666m602945J795255P225510M289132
8145A1857703n980765j2689170q862930j70957M518968M347580L050363J442548
8137b486660l06447O81443M211704L991295k334071o490889j606341N138312K552788
8128C351134o361129q496050r96878N172097K922529j658443j066337K778283
8120d354794M298732K835210L96385k693018n210925l812505J154675L912447
$$ plain form
8178 -3941648 -2574456 -5448131 -11795559 -17053094 -18180104 -14297264 -6455466 506132
8170 506132 655354 -5253446 -9338388 -7145344 -3527398 -4255940 -7498908 -8874101 -9654106
8161 -9654106 -13223072 -17190481 -16196403 -10351400 -4317335 472077 6402706 13310077
8153 13310077 17273237 15818931 10170417 3150751 -1452194 343061 7568571 11857703
8145 11857703 5876938 -6812232 -15675162 -15846119 -11327151 -6979571 -3929208 -2486660
8137 -2486660 -2793107 -2111664 2100040 6091335 3757264 -2733625 -4339966 798346 3351134
8128 3351134 -3009995 -11506045 -12502923 -7330826 -4408297 -6066740 -7133077 -4354794
8120 -4354794 -56062 2779148 3175533 482515 -4728410 -8540915 -7386240 -3473793
8112c473793J646114p55822R07133K665206m93108m828069k954808L924724O972875
8103C610452K490614l518882m704693k140236m49940q76557j179896L55097L164858
8094c249183N031837L493684j391242n294291l504472K476349N397678J164919
8086D125279n557725p182234k412215L389349N574358M491504K594879N56828
8078E580023k348363n652111p109455m810753L86035M852154N425923K853562
8070h22985Q34518J183247J699434O5672k186202k024608J56756J045692n68676
8061f17152k324070k058661k64314J741816L431841M146418L149165J414140P77652
8052I396835N97728j667485n549303o915361m028830l84147J025049K022287M198468
$$ plain form
8112 -3473793 -1827679 -2583501 -1676368 988838 495730 -4332339 -7287147 -3362423 3610452
8103 3610452 6101066 2582184 -2122509 -4262745 -4712685 -5589242 -6769138 -6414041 -3249183
8094 -3249183 1782654 5276338 3885096 -1409195 -4913667 -2437318 2960360 4125279
8086 4125279 -1432446 -8614680 -11026895 -7637546 -2063188 2428316 5023195 5580023
8078 5580023 3231660 -2420451 -9529906 -14340659 -13954624 -9102470 -3676547 -822985
8070 -822985 11533 1194780 2894214 2959886 773684 -1250924 -1094168 -48476 -617152
8061 -617152 -2941222 -4999883 -5264197 -3522381 -90540 4055878 7205043 8619183 9396835
8052 9396835 9994563 8327078 2777775 -4137586 -8166416 -8550563 -7525514 -5503227 -1304759
8043a304759M125651p44612n172213k637123L253926K642304n003767q529491
8035a3370084j459108P914583Q488763J518988l427045k739008o91549J19928
8027c644532J522957L301516K135468j474634k203215J638565M645688K577948
8019H499761j177278j450674P00235N70167k571152n237186n295025l420968l13461
8010i695581L348753N108925L136346j3930k60904J455533M2885n465805r122688
8001a1466466n926645J029455M457209K015679j496174o93187L746479N774221
7993b559429J318558n515200n783078K980773J1514248R328874j078581o816513
7985C389652j893599N372913N272475k61531l311882k719749l173242n062086
$$ plain form
8043 -1304759 2820892 2076280 -3095933 -5733056 -2479130 163174 -4840593 -13370084
8035 -13370084 -14829192 -6914609 1574154 3093142 -333903 -3072911 -3764460 -3644532
8027 -3644532 -2121575 1179941 3315409 1840775 -362440 1276125 5921813 8499761
8019 8499761 7322483 5871809 6572044 7142211 4571059 -666127 -5961152 -9382120 -9695581
8010 -9695581 -6346828 -1237903 1898443 1884513 1623609 3079142 3122027 -2343778 -11466466
8001 -11466466 -17393111 -16363656 -11906447 -9890768 -11386942 -12080129 -8333650 -2559429
7993 -2559429 -1240871 -6756071 -12539149 -9558376 1955872 11284746 10206165 3389652
7985 3389652 1496053 6868966 12141441 11879910 8568028 5848279 2675037 -2387049
7977b387049m107420k24212J627654K18825K25K473300K954576r08777m055766
7968d408644j900674K111486K156758p19995q13860K959454N510397K883975l002244
7959D776653p147747o349795j462494L334856M215999K065239J606048M601531
7951E640290O410839K182156n657335r889852p445216k087558J494429K520551
7943f831696K451012J838663N03002j091075k165023k437730j825002j76351J983328
$$ plain form
7977 -2387049 -6494469 -6718681 -5091027 -4872202 -4871977 -2398677 555899 -352878 -4408644
7968 -4408644 -6309318 -4197832 -2041074 -2761069 -3574929 -615475 4894922 7778897 4776653
7959 4776653 -2371094 -8720889 -10183383 -6848527 -2632528 -567289 1038759 5640290
7951 5640290 12051129 14233285 8575950 -1313902 -8759118 -10846676 -9352247 -6831696
7943 -6831696 -4380684 -2542021 -2039019 -3130094 -5295117 -7732847 -9557849 -9734200 -7750872
$$ [...]
##END NTUPLES=NMR SPECTRUM
##END=
