##TITLE=31Pdec_SR59H_AcCl:Ac2O-1:1'
 , 124 sc
 3.06.2021
##JCAMPDX= 6.0         $$ Bruker NMR JCAMP-DX V2.0
##DATA TYPE= NMR SPECTRUM
##DATA CLASS= NTUPLES
##ORIGIN= UXNMR, Bruker Analytische Messtechnik GmbH
##OWNER= root
$$ XWIN-NMR		Version 3.5
$$ Thu Jun  3 13:07:12 2021 Russian Standard Time (UT+4h)  she@DPX200
##.OBSERVE FREQUENCY= 81.013821
##.OBSERVE NUCLEUS= ^31P
##.ACQUISITION MODE= SIMULTANEOUS
##.ACQUISITION SCHEME= undefined
##.AVERAGES= 124
##.DIGITISER RES= 16
##SPECTROMETER/DATA SYSTEM= spect
##.PULSE SEQUENCE= zgpg30
##.SOLVENT NAME= CDCl3
##.SHIFT REFERENCE= (INTERNAL, CDCl3, 0, 248.564)
##AUDIT TRAIL= $$ (NUMBER, WHEN, WHO, WHERE, WHAT)
$$ ##TITLE= Audit trail, XWIN-NMR		Version 3.5
$$ ##JCAMPDX= 5.01
$$ ##ORIGIN= Bruker BioSpin GmbH
$$ ##OWNER= she
$$ F:/spectra/data/she/nmr/P31/1/pdata/1/auditp.txt
$$ ##AUDIT TRAIL=  $$ (NUMBER, WHEN, WHO, WHERE, WHAT)
(   1,<2021-06-03 13:05:16.32 +0400>,<she>,<DPX200>,
      <continue with go, POWCHK disabled, PULCHK disabled
       configuration hash MD5:
       00 E9 B6 7A A2 85 ED C7 34 08 36 98 17 FE 4E 26
       data hash MD5: 32K
       3E 1E B8 9F 62 1B D4 32 B0 0D CD 76 E3 93 07 84>)
(   2,<2021-06-03 13:05:25.18 +0400>,<she>,<DPX200>,
      <Start of raw data processing
       efp BC_mod = 2 LB = 1 FT_mod = 6 PKNL = 1 PHC0 = -5881.167 PHC1 = 143.0725 SI = 64K 
       data hash MD5: 64K
       A5 08 A6 06 4C ED 60 CD 7B E8 CA 24 09 21 ED CF>)
(   3,<2021-06-03 13:06:13.85 +0400>,<she>,<DPX200>,
      <pk PHC0 = -0.2242488 PHC1 = -41.00001 
       data hash MD5: 64K
       68 1A E6 A0 F2 D1 9B 4E CD 75 F6 95 6A 8E 0F 05>)
$$ ##END=
$$ 
$$ hash MD5
$$ E9 77 7B 77 55 AE 55 05 D6 71 D3 53 3B CE 2E F0
##$RELAX= 
##$RELAX= 
##$RELAX= 
##$RELAX= 
##$RELAX= 
##$RELAX= 
##$RELAX= 
##$RELAX= 
$$ Bruker specific parameters
$$ --------------------------
##$DU= <F:/spectra>
##$EXPNO= 1
##$NAME= <P31>
##$PROCNO= 1
##$TYPE= <nmr>
##$USER= <she>
##$AMP= (0..31)
100 100 100 100 100 100 100 100 100 100 100 100 100 100 100 100 100 100 
100 100 100 100 100 100 100 100 100 100 100 100 100 100 
##$AQSEQ= 0
##$AQ_mod= 1
##$AUNM= <au_zg>
##$AUTOPOS= <>
##$BF1= 81.014009
##$BF2= 200.13
##$BF3= 200.13
##$BF4= 200.13
##$BF5= 200.13
##$BF6= 200.13
##$BF7= 200.13
##$BF8= 200.13
##$BYTORDA= 1
##$CFDGTYP= 0
##$CFRGTYP= 5
##$CHEMSTR= <none>
##$CNST= (0..31)
1 1 145 1 1 1 1 1 1 1 1 1 1 1 1 1 1 1 1 1 1 1 1 1 1 1 1 1 1 1 1 1 
##$CPDPRG= <waltz16>
##$CPDPRG1= <>
##$CPDPRG2= <waltz16>
##$CPDPRG3= <>
##$CPDPRG4= <mlev>
##$CPDPRG5= <mlev>
##$CPDPRG6= <mlev>
##$CPDPRG7= <mlev>
##$CPDPRG8= <mlev>
##$CPDPRGB= <>
##$CPDPRGT= <>
##$D= (0..31)
0 1 0 0 0 0 0 0 0 0 0 0.03 2e-05 3e-06 0 0 0 0 0 0 0 0 0 0 0 0 0 0 0 0 
0 0 
##$DATE= 1622710912
##$DBL= (0..7)
120 120 120 11 120 120 24 19 
##$DBP= (0..7)
150 150 150 150 150 150 150 150 
##$DBP07= 0
##$DBPNAM0= <>
##$DBPNAM1= <>
##$DBPNAM2= <>
##$DBPNAM3= <>
##$DBPNAM4= <>
##$DBPNAM5= <>
##$DBPNAM6= <>
##$DBPNAM7= <>
##$DBPOAL= (0..7)
0.5 0.5 0.5 0.5 0.5 0.5 0.5 0.5 
$$ [...]
##$SUBNAM2= <"">
##$SUBNAM3= <"">
##$SUBNAM4= <"">
##$SUBNAM5= <"">
##$SUBNAM6= <"">
##$SUBNAM7= <"">
##$SUBNAM8= <"">
##$SUBNAM9= <"">
##$SW= 501.771253377433
##$SWIBOX= (0..15)
0 1 3 0 0 0 0 0 0 0 0 0 0 0 0 0 
##$SW_h= 40650.406504065
##$TD= 32768
##$TD0= 1
##$TE= 0
##$TE2= 300
##$TE3= 300
##$TEG= 300
##$TL= (0..7)
0 120 53 12 22 120 120 120 
##$TP= (0..7)
150 150 150 150 150 150 150 150 
##$TP07= 0
##$TPNAME0= <>
##$TPNAME1= <>
##$TPNAME2= <>
##$TPNAME3= <>
##$TPNAME4= <>
##$TPNAME5= <>
##$TPNAME6= <>
##$TPNAME7= <>
##$TPOAL= (0..7)
0.5 0.5 0.5 0.5 0.5 0.5 0.5 0.5 
##$TPOFFS= (0..7)
0 0 0 0 0 0 0 0 
##$TUNHIN= 0
##$TUNHOUT= 0
##$TUNXOUT= 0
##$USERA1= <user>
##$USERA2= <user>
##$USERA3= <user>
##$USERA4= <user>
##$USERA5= <user>
##$V9= 5
##$VALIST= <valist>
##$VCLIST= <CCCCCCCCCCCCCCC>
##$VD= 0
##$VDLIST= <DDDDDDDDDDDDDDD>
##$VPLIST= <PPPPPPPPPPPPPPP>
##$VTLIST= <TTTTTTTTTTTTTTT>
##$WBST= 1024
##$WBSW= 4
##$XGAIN= (0..3)
0 0 0 0 
##$XL= 0
##$YL= 0
##$YMAX_a= 12846
##$YMIN_a= -15236
##$ZGOPTNS= <>
##$ZL1= 120
##$ZL2= 120
##$ZL3= 120
##$ZL4= 120
##$ABSF1= 0
##$ABSF2= 0
##$ABSG= 0
##$ABSL= 0
##$ALPHA= 0
##$AQORDER= 0
##$ASSFAC= 0
##$ASSFACI= 0
##$ASSFACX= 0
##$ASSWID= 0
##$AUNMP= <proc_1d>
##$AZFE= 0.1
##$AZFW= 0.5
##$BCFW= 0
##$BC_mod= 2
##$BYTORDP= 0
##$COROFFS= 0
##$CY= -3
##$DATMOD= 1
##$DC= 0
##$DFILT= <>
##$DTYPP= 0
##$F1P= 0
##$F2P= 0
##$FCOR= 1
##$FTSIZE= 65536
##$FT_mod= 6
##$GAMMA= 0
##$GB= 0
##$INTBC= 1
##$INTSCL= 5.30512e-09
##$ISEN= 30
##$LB= 1
##$LEV0= 0
##$LPBIN= 0
##$MAXI= 10000
##$MC2= 0
##$MEAN= 0
##$ME_mod= 0
##$MI= 50
##$NCOEF= 0
##$NC_proc= -6
##$NLEV= 6
##$NOISF1= 182.463
##$NOISF2= 159.3651
##$NSP= 0
##$NTH_PI= 0
##$NZP= 0
##$OFFSET= 248.5645
##$PC= 4
##$PHC0= -5881.391
##$PHC1= 102.0725
##$PH_mod= 1
##$PKNL= yes
##$PPARMOD= 0
##$PSCAL= 0
##$PSIGN= 0
##$REVERSE= no
##$SF= 81.014009
##$SI= 65536
##$SIGF1= 159.3651
##$SIGF2= -187.1042
##$SINO= 113.3802
##$SIOLD= 16384
##$SREGLST= <1H.CDCl3>
##$SSB= 0
##$STSI= 65536
##$STSR= 0
##$SW_p= 40650.406504065
##$SYMM= 0
##$S_DEV= 0
##$TDeff= 32768
##$TDoff= 0
##$TI= <>
##$TILT= no
##$TM1= 0
##$TM2= 0
##$TOPLEV= 0
##$USERP1= <user>
##$USERP2= <user>
##$USERP3= <user>
##$USERP4= <user>
##$USERP5= <user>
##$WDW= 1
##$XDIM= 65536
##$YMAX_p= 387667733
##$YMIN_p= -127614962
$$ End of Bruker specific parameters
$$ ---------------------------------
##NTUPLES= NMR SPECTRUM
##VAR_NAME=  FREQUENCY,     SPECTRUM/REAL,   SPECTRUM/IMAG
##SYMBOL=    X,             R,               I
##VAR_TYPE=  INDEPENDENT,   DEPENDENT,       DEPENDENT
##VAR_FORM=  AFFN,          ASDF,            ASDF
##VAR_DIM=   65536,         65536,           65536
##UNITS=     HZ,            ARBITRARY UNITS, ARBITRARY UNITS
##FACTOR=    0.620285442955139, 1,           1
##FIRST=     20137.2065510759, 0,            0
##LAST=      -20513.1999529892, 0,           0
##MIN=       -20513.1999529892, -127614962,  0
##MAX=       20137.2065510759, 387667733,    0
$$ Real data points
##PAGE= N=1
##DATA TABLE= (X++(R..R)), XYDATA
$$ [...]
15041 -12157991 -16534996 -12955865 -3107200 4397078 3984603 -1072523 -4706328 -6086612
15033 -6086612 -7744501 -8590950 -4748614 2714032 6577020 2233508 -6187268 -10952268
15025 -10952268 -9155360 -3759834 1116775 3214757 2285266 -23102 -1229345 -559812
15017 -559812 619737 1678436 3829218 7114650 9015169 8109128 6484584 6029817 5022655
15008 5022655 1581171 -1992528 -2316797 -612852 -801057 -2724356 -1956251 3120193 8105045
14999 8105045 7958957 2905815 -2438127 -4135619 -2253597 -178497 -698569 -2092962
14991 -2092962 553957 8546478 16040872 16337961 10326487 4892346 3649452 3653149 1692258
14982 1692258 -741874 -626811 1996419 4946934 6930995 7546845 6428278 4606090
14974 4606090 5027963 9320176 14887175 17244027 14865217 10191736 6109801 3023148
14966 3023148 -147868 -3320080 -5108444 -5485230 -6825630 -10414002 -12875464 -9278139
14958 -9278139 -342304 6861689 7093972 2570175 -1696310 -4201185 -5074960 -2194800
14950 -2194800 4965219 10454068 7972434 908231 -1105443 4011684 8047896 5397298
14942 5397298 1099050 2251872 7977328 12970856 15782254 17662616 16911481 10808144
14934 10808144 1614378 -4794291 -5918975 -4266130 -2515078 -817394 958265 1354773
14926 1354773 -1258628 -6332238 -10290401 -8595488 -734715 7058222 7539133 1524623
14918 1524623 -3030774 -2243157 -1113019 -4318776 -8195609 -6971248 -2057200 1155095
14910 1155095 2041803 3495524 4729202 2620465 -1361972 -2749595 -1665965 -1741592 -2127792
14901 -2127792 1601683 8183619 10561967 7164452 5547444 11146977 18852251 20264810
14893 20264810 14511577 7510280 4173150 5114128 8075858 9503806 7292933 3996073
14885 3996073 4220006 7627494 9014276 6858218 5872169 8081602 7990114 1833070 -4257781
14876 -4257781 -2392824 4886529 8322016 5463348 2549263 3594646 5400621 4736657
14868 4736657 3908285 6375480 11135510 14068656 12359663 6425261 -165625 -2374962
14860 -2374962 1854764 8485523 11432608 9679284 7321843 6839551 6295922 3830932
14852 3830932 918529 -369764 -69526 1318725 4233262 7975494 9690345 7441952
14844 7441952 2735071 -1415007 -3515876 -3778981 -2820960 -1156854 1046959 3983777
14836 3983777 7006094 8208903 7088685 6496237 9065058 12639765 12926311 10025673
14828 10025673 7748717 6457785 2213728 -5399529 -10343551 -8307145 -3155295 -1152871
14820 -1152871 -2324611 -1839000 2641977 9057184 14307752 15880557 12136682 4555083
14812 4555083 -2128006 -5149910 -6750460 -8883010 -8528111 -3163276 2443563 1469865
14804 1469865 -4864336 -9499709 -10711668 -12949374 -16117273 -13334702 -3001916 5266158
14796 5266158 3088277 -4204300 -5010925 2000942 6506876 837654 -11037711 -19647042
14788 -19647042 -19785909 -12679775 -2937731 4174967 5514511 2881575 1629719 4675922
14780 4675922 9127538 10255143 7342617 3604061 1207237 -1008272 -4246888 -6317445
14772 -6317445 -3592963 3810609 10759328 12184921 8530286 4642910 3589512 3481302
14764 3481302 1149480 -2708330 -3917396 -199064 5344264 7117575 3318008 -1585784
14756 -1585784 -1839301 2154616 3421601 -2893693 -12198466 -15093380 -8962875 -1065428
14748 -1065428 976198 -2161639 -4745916 -4270537 -2523852 -677759 1893821 4427186
14740 4427186 4814810 3333993 2578087 2904185 1661247 -1708256 -3464192 -753373 3903151
14731 3903151 5944460 4327949 1067447 -2650903 -6472826 -8249609 -5265213 1552236
14723 1552236 7432921 8530144 5142814 106129 -3993302 -5685129 -4778925 -2562368
14715 -2562368 -621207 871797 2489710 3422397 2103918 -671476 -1586229 1024323
14707 1024323 4591306 5375734 2902289 -17345 -774950 717467 2503997 2468359 428630
14698 428630 -1060001 996162 6300301 10984189 11623103 8145668 2428366 -3574128
14690 -3574128 -7181706 -5619988 -92287 3235035 77382 -5580243 -5978333 367318
14682 367318 7582763 11197098 12630462 13487542 10964594 2926282 -6131018 -9099707
14674 -9099707 -4801167 1510058 5271102 6368996 6168455 4928394 3172958 2416073
14666 2416073 3058968 3882999 4734828 7207091 11131326 12952684 10035869 4826174 2041968
14657 2041968 2910971 4933787 6322694 7273064 7208174 4735269 1036994 -718447 -766937
14648 -766937 -3133444 -8156502 -9678601 -4332216 1086095 -1353861 -7458249 -5877635
14640 -5877635 4275911 11234696 8574935 4815680 9018969 16164352 15901497 9027106
14632 9027106 4558275 4550051 3151055 -856842 -1809797 1883053 4628146 3334658 1290655
14623 1290655 508951 -875437 -1506655 3172799 10563145 10805748 2107736 -3839273 1355809
14614 1355809 9839090 9925399 3440973 609526 3715138 6592250 6382489 5412281 3972409
14605 3972409 867626 -943459 1501596 3485897 -1305533 -8801026 -9092598 -2330252
14597 -2330252 871868 -4104683 -9684986 -8784345 -3844201 145214 2677481 3922550
14589 3922550 2164591 -678175 1364054 8608924 12791243 8864578 3032533 3349614
14581 3349614 8193398 10308924 7723185 4392825 3170058 3604236 4511122 4441984 1636054
14572 1636054 -3237953 -6544156 -6246754 -4181572 -2106244 495133 2811570 1952288
14564 1952288 -1378970 -1531532 4312933 11691810 15464190 15808850 14226632 9418064
14556 9418064 1764160 -3668401 -3972915 -3220389 -4983851 -5359062 86778 7278748 9003765
14547 9003765 5600709 2761208 1794568 9320 -1539221 827981 5249380 5277551 -269422
14538 -269422 -5083422 -4288804 -275116 1617169 -955786 -6459205 -11066135 -10898621 -5642885
14529 -5642885 298605 2481609 993372 -1508917 -3621718 -4547813 -3120151 -703962
14521 -703962 -1267819 -5108773 -7146657 -5467719 -5712173 -11382189 -16147722 -13339887 -7212734
14512 -7212734 -5757315 -7577112 -6285826 -3534590 -5832362 -11272435 -11974105 -8339288
14504 -8339288 -7980280 -10691211 -8031951 643231 5422515 2335232 -588182 1717411
14496 1717411 3273379 -24030 -1986681 1416137 2691627 -4290121 -11645872 -8800307
14488 -8800307 651512 4751933 1134531 -1766512 986049 5169746 5756415 3380052
14480 3380052 1627116 2348443 3805100 1718498 -5446586 -11482570 -8275624 1438666
14472 1438666 4969995 -2395659 -9158219 -4482024 5064134 5736773 -2768369 -8890200
14464 -8890200 -7883670 -6367586 -8565765 -9782804 -6153522 -1510963 -618379 -2118139
14456 -2118139 -1799631 1654253 6615245 10612723 11135397 7457896 2110417 -2124154
14448 -2124154 -5492330 -8180560 -6555796 1819648 11194937 12668000 6091956 61244
14440 61244 -631631 -356228 -3577398 -7470513 -7217861 -3182287 1232781 4574750 6228084
14431 6228084 4011585 -2702288 -9838354 -12563844 -10852626 -7894266 -4659867 213546
14423 213546 6023914 9546193 9614428 8909946 9641879 9952637 7096138 2724114 1584110
14414 1584110 4617791 6855353 4323001 223689 698017 6090147 10691527 10642375 7615960
14405 7615960 4458067 1945935 829754 2091348 3453266 729161 -4975472 -6730899
14397 -6730899 -1724064 3575940 2491148 -2520138 -4632437 -2344826 1186747 4432861
14389 4432861 6867000 5716377 362324 -2947081 1455080 8348956 7018512 -3398132
14381 -3398132 -11908237 -9948469 -614619 7781565 10811751 8601347 3334526 -1198259
14373 -1198259 -1908271 -229148 -24095 -1123992 424285 5015244 7792895 5953724
14365 5953724 2705088 1756651 2284182 1629307 -924655 -5157760 -10938748 -16133892 -16902603
14356 -16902603 -12226954 -5533149 -540001 1895043 2433869 2149542 3025297 5804862
14348 5804862 7333099 4393279 -23254 245520 4928218 7079840 3608584 -844811
14340 -844811 -2702638 -4682605 -8476767 -9475478 -4390398 1762110 2612795 -256430 -1283180
14331 -1283180 -31741 566650 1543102 5538563 9140982 6121656 -1415897 -3149440
14323 -3149440 5767053 17439001 21172265 16097120 9866400 7787510 7795585 5587174
14315 5587174 912156 -2790720 -3341177 -2264712 -1958228 -2089811 -624668 2189671 3376191
14306 3376191 1380094 -1682306 -3272350 -3853528 -5127927 -6457040 -5515677 -1885982
14298 -1885982 2261147 5072242 6666935 7416940 6375774 3087607 377173 2849171
14290 2849171 10825916 17320788 14566017 3985344 -4171447 -3000656 3220786 6485929
14282 6485929 5868203 5314037 4252649 -1364567 -9243980 -10681774 -2786953 6340753
14274 6340753 8307330 4550390 1756116 2161651 3079055 2312647 -557168 -5558815 -10998951
14265 -10998951 -13083190 -10308141 -6023574 -3868072 -3500597 -3605776 -5408825 -9332660
14257 -9332660 -11630005 -9098738 -4652607 -3459020 -5422625 -6053706 -3312862 669065
14249 669065 3382871 3584793 723176 -3424332 -4416541 -651899 2778730 445196 -5149457
14240 -5149457 -7036195 -3914409 -601805 851936 3479177 7980851 9870181 6526336
14232 6526336 1482408 -1257453 -2269665 -2902760 -1221000 3883964 8203854 6922629
14224 6922629 1715856 -1805242 -2642159 -5222668 -11190695 -15306739 -12144615 -3797630
14216 -3797630 2483311 3139188 1568681 2473851 5949081 8654875 8693194 6943387 4556284
14207 4556284 1695347 -1176382 -2916992 -3213453 -3017410 -3122004 -3528345 -4144774 -4645094
14198 -4645094 -3966442 -1840136 -388511 -1739142 -4286723 -4243603 -1020299 2093358 2939061
14189 2939061 2726039 2664910 2108205 1001992 359090 -688249 -3993585 -7425924 -5954169
14180 -5954169 336130 4839872 3759168 999632 419418 -141399 -2276476 -1639352 3720985
14171 3720985 6105295 -1475735 -12329844 -13949762 -6236635 -978894 -3977833 -8755381
14163 -8755381 -9041200 -6635052 -4086032 135629 4762716 3358593 -5409863 -12964580
14155 -12964580 -12571495 -9026779 -9788078 -12797439 -11415788 -6747857 -5675496 -8817400
14147 -8817400 -9605162 -5364878 -1163382 -1115872 -2990054 -4131392 -6457035 -11281548 -13890345
14138 -13890345 -8987285 446130 5398571 2315778 -2431775 -1668973 2806830 3461523
14130 3461523 -2034477 -8224010 -10461364 -10681131 -11951822 -12106268 -7774493 -1797138
14122 -1797138 -447276 -3947698 -5758709 -2245755 2339376 2569140 -1068406 -4526588
14114 -4526588 -5850692 -5217194 -2243871 3027951 7929613 9118006 6369220 2642451
14106 2642451 923612 1950500 3847760 3228823 -1566354 -7380592 -8620544 -4249356
14098 -4249356 -114952 -2022505 -8154090 -11026430 -6308712 2582466 8648742 8350418
14090 8350418 3965139 -156415 -2437906 -4135491 -5094231 -2417191 4658910 11306965
14082 11306965 12286081 8877153 6244069 5231159 2399417 -2225380 -4222057 -2757323
14074 -2757323 -2429745 -4625485 -4406374 -150871 1213932 -5011818 -11865141 -10383637
14066 -10383637 -3801615 -2323634 -6489505 -6532963 1524115 9618251 10400200 7390405
14058 7390405 7644137 10900481 11482669 6729546 -1125864 -8325087 -11195694 -7644767
14050 -7644767 -619732 2972219 315889 -3344402 -2314833 1422074 2314226 484496
14042 484496 1013496 5318488 9138511 9265146 7157304 5081699 3241069 1914592 2263036
14033 2263036 3526523 3296185 2164117 4093102 9992818 14905919 14568277 11242493
14025 11242493 9512352 9478440 8350644 6149366 4963468 4488180 3598420 4837062 11002362
14016 11002362 17665800 16460868 7556945 1522642 4969731 11030949 9929192 3595060
14008 3595060 1970660 7712370 13201140 12686542 9277718 7576648 6311810 2684644
14000 2684644 -650347 1636020 9465343 16268694 15909529 8328797 -1398762 -7757405
13992 -7757405 -8679076 -6171640 -3429372 -1392585 997023 3426512 3324224 -582379
13984 -582379 -5614233 -7619446 -5053025 464587 6231383 9819203 9994808 8189836
13976 8189836 7693378 9122340 7978632 -20371 -11443098 -16957576 -12395494 -4773900
13968 -4773900 -4051190 -10802468 -16292985 -14443394 -8753685 -5405476 -4310377 -1623633
13960 -1623633 2003071 2165646 -870637 -1437233 2018532 3335270 -1466418 -6570928
13952 -6570928 -4714585 1149410 2188488 -2329284 -3794164 2319281 9652517 10638815
13944 10638815 6705278 4355765 5443409 6511250 5643204 5004519 6456815 8035529
13936 8035529 6216063 618604 -4784513 -5977486 -4156910 -4490178 -8407610 -10289002
13928 -10289002 -5309327 2313348 4518484 1230867 -97062 3130087 4883689 1640870
13920 1640870 -971898 2152122 6309457 4568101 -396522 -442859 4708829 6966900
13912 6966900 2553612 -2679334 -2595355 739810 1115474 -3273027 -8550645 -10279472 -7409686
13903 -7409686 -2195833 2215612 4291765 4560704 3685187 1291745 -2508852 -6117669
13895 -6117669 -8443103 -10143185 -11102682 -8906036 -2570779 4131860 6453384 4438917
13887 4438917 1615649 -610563 -3179124 -4936280 -2803551 2980026 7842629 8373664
13879 8373664 5753610 2732099 203069 -1950550 -3232481 -3304212 -2666866 -1640613 -139323
13870 -139323 1193554 1314696 432373 -332231 -733365 -963689 -47428 2706196 5033275
13861 5033275 3672607 -737886 -3828305 -3165689 -747472 918106 1990420 3186094
13853 3186094 3554508 2485036 1695944 2883636 4684406 4032323 88136 -4469987 -6041025
13844 -6041025 -3687448 -287059 344928 -2193011 -4756760 -5648775 -7216963 -11195296
13836 -11195296 -14324375 -12730045 -8562169 -6965597 -7545732 -5077173 1061805 4869416
13828 4869416 2913886 -824112 -2014310 -1634369 -944658 2703363 9498988 12171970
13820 12171970 4626821 -7846430 -14464645 -13133076 -11285169 -13259594 -14578497 -10276452
13812 -10276452 -2408106 3473366 4591126 1221669 -5139602 -11196409 -12919048 -10037681
13804 -10037681 -6809548 -5918733 -4445038 1150085 8451975 11218279 7076739 -149206
13796 -149206 -5518181 -7477262 -6951598 -4593257 -550855 4060861 7006318 6673717 3726324
13787 3726324 644206 -634676 -334306 314631 1173059 2731905 3702431 1277523 -4791849
13778 -4791849 -9890576 -8656262 -1380734 5699260 7359981 5151658 4612487 7514311
13770 7514311 9474068 6436952 1223833 329580 4537439 6859376 2042667 -5305893
13762 -5305893 -6430831 -706992 3208010 -637255 -7545279 -9213578 -4686547 166807
13754 166807 1649263 1423811 1310371 326788 -1610117 -1463079 2651918 7775378 9475642
13745 9475642 7012816 2739130 -1646448 -5236761 -5897981 -1981840 4005311 6820063
13737 6820063 4371089 -200867 -2829961 -2550718 -821571 439529 -607296 -4122866
13729 -4122866 -6264529 -1921741 7808184 14184882 10603998 1429760 -3459620 -1431287
13721 -1431287 1093254 -423199 -2183807 716242 5823083 6939522 3378986 333050
13713 333050 823801 2202720 1313329 -1136144 -3098919 -4578450 -5866914 -4995960 -399454
13704 -399454 5018578 6025331 1633058 -3139322 -3002688 1980513 7372361 9274511
13696 9274511 7238591 3710381 1754338 2352690 3303496 2119921 276321 1864229
13688 1864229 6675575 8202739 2066727 -6415502 -8325048 -3444592 -147795 -2491117
13680 -2491117 -4471438 -380373 5520083 5487561 235821 -2663025 -527828 1488401
13672 1488401 -279775 -2279859 85249 5312508 8302468 7226876 4730019 3723737
13664 3723737 4365385 4485701 1667065 -4253474 -10007702 -11540594 -8553764 -4887962
13656 -4887962 -3684855 -4023161 -3353678 -1298735 436637 359632 -1976759 -5945194 -9412470
13647 -9412470 -9956805 -7731130 -5298628 -3576762 -736069 2962654 2821171 -3784803
13639 -3784803 -11120323 -10781272 -3025338 3173170 2214467 -1476920 -1190221 2791075 5658008
13630 5658008 5992573 6011985 5942832 3754111 277479 -725707 1113721 1039924 -3760042
13621 -3760042 -9085102 -9144638 -4592290 -1335142 -2565150 -5714223 -7044048 -5736383
13613 -5736383 -2901063 379862 2911954 3735151 3673764 4334064 4786894 2114886 -3374946
13604 -3374946 -6872204 -5599984 -3384051 -4744570 -7100802 -4454856 2170107 4636991
13596 4636991 -438901 -6060519 -4886999 200214 1101455 -3235798 -6190078 -4028412
13588 -4028412 -311602 1204038 1689840 2579949 1436040 -3142408 -6706090 -4443955
13580 -4443955 1153556 3735259 2560693 2504512 5192518 6753804 5457684 5064348 8020594
13571 8020594 11239243 12070210 12791413 14758464 13745317 7167087 1052062 2192067
13563 2192067 6869796 6162419 471745 -1035030 4454335 9107466 7730417 5450484
13555 5450484 7408099 9624508 6902739 2795914 3598514 7089675 5619309 -1973354
13547 -1973354 -8921906 -9916861 -5858689 -168342 4175456 4678070 1411049 -1550456
13539 -1550456 -991309 448513 -1523242 -5464094 -6053039 -1880409 3667280 7761853
13531 7761853 9171745 5982763 -1471675 -7059967 -5222519 218152 1130652 -1892796
13523 -1892796 -381442 7608450 13510211 11325853 5752502 3302991 3506174 3767807
13515 3767807 5317582 8377458 8024942 1461005 -5950115 -8245120 -7386354 -7669810 -6874893
13506 -6874893 -1127863 5370180 4780503 -1793965 -5063067 -1059513 4181283 4968443
13498 4968443 3725432 5186972 8150769 7308686 1025983 -5962178 -7507263 -2661288
13490 -2661288 3088597 4016102 1097489 -73661 1493549 157839 -6510342 -11684483
13482 -11684483 -8607915 -1102562 2711278 3585175 8641072 17059100 18945566 10605860
13474 10605860 1138388 -802796 1445463 460053 -2649608 -1693423 2577682 2824735
13466 2824735 -3182603 -8992051 -9176495 -6579028 -6922039 -10394958 -12387427 -10524061
13458 -10524061 -7305110 -5918628 -6131191 -5357820 -2470176 744631 1732051 -74666
13450 -74666 -2956796 -4997576 -6001028 -7155960 -8978766 -10203157 -9392353 -7361255 -6586281
13441 -6586281 -7620630 -7711660 -4559136 -138405 1532908 -328038 -2859500 -3875550
13433 -3875550 -3394478 -1096199 3556814 7765480 6626354 387362 -3644772 128318
13425 128318 8311381 13805600 15194163 16090714 17584720 17136621 14302084 11949599 10994900
13416 10994900 8532004 2679985 -4173867 -8381234 -8641688 -5783933 -1639518 1055686
13408 1055686 384097 -1942286 -1816694 1900952 5101233 2915712 -4494140 -11517787
13400 -11517787 -12160220 -5829915 1353808 2114352 -3967081 -9414084 -7439285 227751
13392 227751 6324553 6745399 2963047 -2318545 -7347351 -9687119 -7189997 -1670417
13384 -1670417 1938614 1350361 -684842 -376120 3076638 7681534 10559066 9717386 6167054
13375 6167054 3631822 3708196 2722960 -3167794 -11269967 -15178579 -13260342 -9331350 -5635420
13366 -5635420 -978114 4024468 6049410 4580192 2601270 752359 -2979923 -6515019
13358 -6515019 -4101141 3711253 8178257 4777379 132647 861551 2710196 -1369260
13350 -1369260 -8056925 -8142451 -1065334 4667570 4639184 2967328 3002525 2335024 -345945
13341 -345945 -898744 3628046 9369242 11009809 8937657 6845806 5169258 1609440
13333 1609440 -3090347 -4529385 -767734 3863677 3099278 -3825419 -10588844 -10145161
13325 -10145161 -1964616 7963370 13779137 14519545 12010430 6949357 -237905 -6217895
13317 -6217895 -6363052 -590761 5055020 4759089 -190013 -2944516 531747 6731220
13309 6731220 9461112 7638097 5359796 4718440 2817455 -2110339 -5843563 -3787443
13301 -3787443 1386113 3351712 1920851 2598186 6185765 6157334 -1042399 -9575728 -12059716
13292 -12059716 -8608030 -3837352 156711 2829597 1831024 -3122946 -6276206 -2351767
13284 -2351767 4907578 7098125 2869462 -938419 677589 5825003 10745122 13815923
13276 13815923 13586620 8606819 1296230 -2566975 -462531 4129281 6965545 7514137
13268 7514137 6983531 5771928 4812600 6099033 9603005 12199872 11603900 9264987 7871928
13259 7871928 8140795 9520140 11965845 15300294 18171949 18912321 16713513 11943383
13251 11943383 6476224 3040642 2416369 2290353 1129150 1290876 4608405 6999175
13243 6999175 3298462 -3279403 -3579340 4386850 12005713 12531950 9745659 9612886 10283609
13234 10283609 7220172 2814114 2382401 3815929 438855 -6762672 -9023839 -3166098
13226 -3166098 3551514 5020708 4829155 8191443 11954624 9760726 3178962 -152735
13218 -152735 1761551 2754014 -1496894 -7229154 -8713432 -5749828 -2076554 -24062
13210 -24062 44981 -1942965 -4434913 -3702637 1454350 6307684 5652665 1183746 -1264465
13201 -1264465 -765141 -1740943 -5024421 -5135978 699291 6663554 6213475 1822235 1397929
13192 1397929 7154318 13382827 14613488 11343991 7334676 4817642 3230039 623947
13184 623947 -3727559 -6934295 -4400271 3710583 10344913 9463722 3962278 1171749
13176 1171749 2199591 1615948 -2611579 -5557812 -3575526 -180812 -256916 -2786874 -3486953
13167 -3486953 -1786820 -907191 -2238714 -3281546 -1307766 3031482 6156504 5002641
13159 5002641 293615 -3746969 -3997085 -2269425 -2695571 -5894675 -8713623 -9764504
13151 -9764504 -11330605 -14316852 -15092490 -10384296 -2990398 772930 -1341061 -4981357
13143 -4981357 -4374797 1395329 7611097 9013111 5442419 1702341 1464326 3124088
13135 3124088 3433744 3005362 4587010 7172141 6548410 1938332 -2452695 -3478153 -2352118
13126 -2352118 -730428 1939062 5256940 6568333 5400271 5086119 7119321 8004663
13118 8004663 5180568 2129583 3299834 7102716 8607019 6826775 4668106 3490677
13110 3490677 2615870 3192713 7541911 14300723 18201462 15786062 9050424 3040127
13102 3040127 1448294 4108346 7145647 6411378 2364589 237286 3495715 8761901
13094 8761901 9663881 4554330 -1846233 -3462508 2158761 12130907 19522445 18409073
13086 18409073 9988573 1839118 -797772 -258718 -754420 -1391846 816449 4174016
13078 4174016 4137915 511786 -2418070 -2367507 -1055582 -27920 1289200 3431101 6329802
13069 6329802 10366807 14698214 15898266 12216045 7578151 6660435 7517843 4705969
13061 4705969 -1253572 -3905021 -567496 4212909 5942971 5133907 3694049 2081926
13053 2081926 1759137 4902796 9497099 9925267 4779851 -891039 -3287373 -4371795
13045 -4371795 -6086205 -6019790 -2814082 -496726 -2487659 -5591823 -5083518 -2167103 -1124811
13036 -1124811 -2098331 -2215186 -1537626 -2197137 -3087048 -1053443 3126513 5086588 3353550
13027 3353550 1025661 509451 585513 -456255 -2201991 -3696713 -4914548 -5738478 -5729675
13018 -5729675 -5509145 -6166602 -6748082 -4607137 785821 6201246 7893288 5282891 736814
13009 736814 -2998392 -4153755 -1797880 3971888 11201402 16229903 15901334 10277968
13001 10277968 2686818 -3435798 -7032201 -8287592 -6851796 -3239221 -448768 -943785
12993 -943785 -2663593 -1699989 1211945 1223009 -2876459 -6217762 -5118837 -2170919 -1229131
12984 -1229131 -1801419 -2329344 -4990095 -11982973 -19630617 -21784277 -18071821 -13860463
12976 -13860463 -12484181 -11989258 -9581652 -5246874 -616139 2327689 1264020 -4383668
12968 -4383668 -11065663 -13826999 -11710212 -7926554 -5112468 -3500165 -3204007 -4360816
12960 -4360816 -4742296 -1255455 5082077 9120944 7884327 3925338 1037950 -571409
12952 -571409 -3067732 -6998406 -10241769 -10039492 -5688577 -213978 1422422 -2230266
12944 -2230266 -6547353 -6492673 -3447342 -2362583 -3296210 -1411215 4364100 8973195 9317438
12935 9317438 8477768 8916262 7780403 3488575 990494 4053985 7058848 2435395
12927 2435395 -6497232 -8900226 -2150688 4493869 3676650 -644394 -1276566 1482455
12919 1482455 2645915 1323562 389023 -137105 -3031771 -7586304 -9000548 -5412910
12911 -5412910 -1277522 -1374122 -4256875 -4547143 -500554 3629290 3264597 -469266 -2080518
12902 -2080518 1426393 7044314 10085484 10210793 10700409 12548552 12854817 9950007 6460667
12893 6460667 4954464 3795515 771816 -1984879 -1400863 232851 -1715952 -5586153
12885 -5586153 -4766446 1180247 4256484 316195 -3768294 -1127260 3286252 246733
12877 246733 -8503128 -12342508 -7669795 -1722896 208711 1367080 4369345 5086344
12869 5086344 1046303 -2191887 67331 3086769 913027 -2467457 347422 6266933
12861 6266933 5244331 -2969008 -6559570 1313585 12556209 15806924 10739311 4935871
12853 4935871 1898778 -960558 -4923990 -7063289 -5078827 -992212 1114057 -674632
12845 -674632 -4493325 -6734089 -6158608 -5711624 -8454022 -12056498 -10636048 -2813271 5745880
12836 5745880 9350207 7930427 3619312 -3452251 -11846125 -15677601 -10964678 -2938996
12828 -2938996 -681441 -5163801 -8645389 -5979768 -301258 3598921 5269691 5626384
12820 5626384 3877176 944885 780058 3903612 4253941 -2176208 -9400823 -8596857 -715293
12811 -715293 5147528 4892718 3336758 4364485 4936348 1864028 -1974840 -2504518 -692454
12802 -692454 401136 659059 539495 -2313985 -8748916 -13574978 -11265476 -4049458 1474785
12793 1474785 3815785 6192004 8184088 5598941 -881342 -4637202 -2712681 484615
12785 484615 1715397 4176151 10330427 15866321 15931128 12302612 9182814 6649338 3929838
12776 3929838 4325652 9642310 13364930 7778917 -3736536 -9930015 -7137068 -3332287
12768 -3332287 -5257830 -9363925 -9112465 -5014427 -2531499 -3906856 -6728128 -8415526
12760 -8415526 -8357423 -6881439 -5057377 -4683631 -6164099 -6976884 -4146756 1861968 6883745
12751 6883745 6863789 1804806 -3926663 -5740441 -3800237 -2731084 -5255279 -8019414
12743 -8019414 -6381258 -1799528 -346843 -3786469 -6534452 -3541136 2071628 2554261
12735 2554261 -4380608 -12074643 -12461408 -5495301 919317 484012 -4559738 -8021599
12727 -8021599 -8408545 -8175983 -6128156 1642169 11826389 13856071 4740939 -4371812
12719 -4371812 -3890026 -197645 -4185731 -12180156 -12011680 -4340827 -1908057 -7219215
12711 -7219215 -7748140 1977943 9473578 4141761 -5451531 -5548637 1863283 4837969 1005940
12702 1005940 -1815056 -394366 940403 329176 481760 1312120 -97426 -2379982 -1260119
12693 -1260119 2103826 2272014 -1030459 -2676967 -1636658 -2522373 -6540075 -8877134
12685 -8877134 -7213707 -5514421 -6450159 -6424985 -1646390 5783263 11046743 12117497 9876013
12676 9876013 6325123 4399380 6047470 9118011 9399320 6411339 3652221 3044965
12668 3044965 3371629 4074363 5492737 5189686 231 -7296494 -9578272 -5356807 -953979
12659 -953979 -616787 -1103553 801934 2177078 -203601 -3964854 -6081074 -8076416 -10647333
12650 -10647333 -8751633 675931 10571851 11692839 5954921 3116800 5709606 6928720
12642 6928720 4118319 4045961 10638729 16236663 11965717 1060016 -5942432 -5993251 -5355034
12633 -5355034 -7658121 -8597855 -4558484 734157 2427320 2088063 3782547 6451702
12625 6451702 6291478 4351301 4964861 7365693 6010113 228512 -3399752 -771039
12617 -771039 3978306 5792215 5817931 6925277 7618500 5610103 2730152 849478 -2411910
12608 -2411910 -7890916 -9677962 -3143065 5943455 8639791 5833410 5029686 7117247
12600 7117247 6708901 3943328 4446549 7477476 6026860 419680 -352079 5675458 8564470
12591 8564470 2770311 -3110056 -168472 7296584 10459780 9393372 8676510 7131000
12583 7131000 1792375 -3734825 -4495983 -2941998 -3529728 -3583846 894177 4953895 882966
12574 882966 -8440122 -12927085 -9981387 -5695715 -3035363 702597 5267538 6700827
12566 6700827 5760514 7527339 11615752 11748248 6234825 369578 -2586471 -4375386
12558 -4375386 -5106394 -2740830 -15796 -2066104 -5778647 -2182473 8149628 13527502
12550 13527502 8983495 3983041 6340886 9836846 6055134 -1537487 -5167243 -6063436
12542 -6063436 -9497254 -13236121 -12371503 -10688661 -15194843 -22070510 -20016429 -7323601
12534 -7323601 4865606 7317962 1906624 -4921956 -9421704 -9556543 -4546617 1827148
12526 1827148 3587081 596131 -1103835 1258306 3005746 -374924 -6539570 -10060474
12518 -10060474 -8979081 -5147760 -1282786 382865 -705837 -2235209 -1374626 1492875
12510 1492875 4048916 6077455 8349316 8846510 5500563 1846183 3475763 8917478
12502 8917478 11163896 8731228 7022242 7397594 4606882 -1535566 -2543822 4295083
12494 4295083 7842444 -1415101 -15907785 -21568935 -17369850 -12596736 -10014902 -5464796
12486 -5464796 -1247336 -4600068 -12198267 -11227854 501447 9583519 7738325 3883173
12478 3883173 7278027 11389094 6327822 -2485867 -2245006 6355354 10346612 4293746
12470 4293746 -4198763 -8496162 -10213786 -10940765 -7904367 -1294412 3251660 3131115
12462 3131115 2009851 1794910 -331947 -3622522 -1618190 6646049 12036034 8644726
12454 8644726 3810300 6504098 12480955 11165092 2828763 -2273837 -189339 2303399
12446 2303399 285994 -2339582 -1382105 464764 -889546 -4519663 -7600325 -9769346
12438 -9769346 -10477692 -6770998 1684671 9012118 9435626 5008357 2817430 5926562
12430 5926562 10647302 11629067 6597520 -2666415 -10969050 -12571636 -6828325 -264189
12422 -264189 277162 -3890562 -5171785 -96696 6001377 6085830 12136 -6201941 -7566489
12413 -7566489 -4133588 790754 3705324 2548605 -2068478 -6561148 -7229012 -4411298
12405 -4411298 -2214457 -2995717 -4022268 -1755774 2197196 2956966 -111650 -1969481
12397 -1969481 578264 3994153 3640338 935951 569270 2728537 3243340 697931 -2010922
12388 -2010922 -3697721 -6934137 -12119202 -14577432 -10884131 -4197817 363721 2371623
12380 2371623 4072435 4719779 2042387 -2243006 -3723216 -1772481 135323 756479
12372 756479 2663742 6439771 8444177 6840618 5309066 7152165 9350803 7085897
12364 7085897 1802047 -530036 1566196 3272294 1726261 976500 5655416 13258515
12356 13258515 16959239 14701601 11333837 11414329 13444802 12967225 9116039 5582450
12348 5582450 5532100 7601654 7793513 4581882 920719 535093 2900230 3643088 525294
12339 525294 -3027248 -2464519 1261447 2826082 13565 -3595125 -4309786 -2983882 -1945393
12330 -1945393 -716087 2044161 4874170 5402593 4128225 2735556 261560 -5005951
12322 -5005951 -10956556 -13387815 -11797821 -9200784 -6813510 -3854552 -2170159 -4827027
12314 -4827027 -9165688 -8056206 -774916 3910912 -227473 -7552680 -8778682 -3817487
12306 -3817487 83561 -251992 -1470081 -1107085 -690185 -1422989 -2393649 -3521764 -5601330
12297 -5601330 -7190193 -5909777 -3012836 -2309901 -4390253 -6207959 -6445544 -6701191 -7131292
12288 -7131292 -5737405 -2598297 -171404 1096100 2633637 3116728 -144034 -4536003
12280 -4536003 -3754484 1932112 4149105 -1509890 -8663743 -9679799 -5530204 -990140
12272 -990140 3544215 8767154 10578876 5549943 -1470744 -3318161 -1447237 -2812566
12264 -2812566 -7731856 -9465810 -5483811 -848997 410567 -242642 -1292102 -3791952
12256 -3791952 -6492322 -5036085 1096083 6332897 6523725 4156564 3871564 6928714
12248 6928714 11516294 14158949 10346268 -533392 -10351250 -9499729 -518226 3745030
12240 3745030 -1577983 -6247411 -1363976 6477170 6001311 -1116737 -3893946 999558
12232 999558 6416250 6956695 4487985 2018451 503218 1706016 6577827 10806821
12224 10806821 9343518 5054416 4990225 8277613 6870878 -579303 -5553188 -3421773
12216 -3421773 -620219 -3058850 -6402070 -4787852 -1480579 -2297006 -4327778 -953778
12208 -953778 5490841 6361206 1011817 -1487300 3558546 9520831 9222918 5493870 5579515
12199 5579515 9739115 11625391 8173420 3478422 2415918 4579044 6197737 5403210
12191 5403210 3386178 1660958 533352 208509 1402628 3993776 6303605 6712389
12183 6712389 5201123 2632899 -288762 -2377886 -1885864 1145449 3828061 4036786
12175 4036786 3869384 6519957 10464018 10507989 5063658 -1160498 -2954001 -236226 3281998
12166 3281998 4328253 1700379 -3576414 -8133553 -8638685 -5634713 -2743388 -1355363
12158 -1355363 534470 3094010 2783729 -1416797 -4203325 -887289 4828564 5316439
12150 5316439 -92827 -4003079 -1009305 5567630 8362957 4362533 -2920745 -7803237
12142 -7803237 -7577043 -4032459 -692956 938448 1566732 1181529 -1419251 -5438142 -7449170
12133 -7449170 -5839808 -3141980 -1728585 -237955 2655281 3994718 410526 -5769850
12125 -5769850 -8850763 -6999640 -2806792 2159096 8298387 13792027 14753461 10680879
12117 10680879 5650878 3025946 2597469 3603288 6307554 9106435 8194895 2688298
12109 2688298 -2748597 -2892768 2119590 7485036 8825249 5555354 749306 -1594662
12101 -1594662 -511088 719184 -1035542 -4047818 -4296932 -1881805 -705080 -1668761
12093 -1668761 -998996 3283094 7934106 9872954 10607506 12045410 11801102 7087781 756024
12084 756024 -1412271 1334464 3676571 1526650 -2928809 -4743199 -2674754 -290641
12076 -290641 -930369 -3137966 -2664557 1104879 3343363 338419 -4573808 -5275235 -1480820
12067 -1480820 1740336 2494463 4176830 7876134 8922549 4313263 -1562737 -2868960
12059 -2868960 -9840 2993695 5305500 8605126 12322870 14492042 15453945 16264883
12051 16264883 15429244 11751955 8185327 7657054 7290884 3005519 -1791497 319625
12043 319625 8477541 12657092 7335853 -991079 -3466714 72817 4180482 6714714
12035 6714714 8954615 10187922 8248884 4225009 1706472 1769823 2606592 3619809 5914664
12026 5914664 8539942 7968691 2587189 -4630774 -9061271 -8734660 -5347790 -2155648
12018 -2155648 -977616 -607723 1165474 3447687 2217749 -3738174 -9293688 -8892239
12010 -8892239 -4404953 -2574789 -5058048 -6190411 -1847904 4521952 7425479 6706399
12002 6706399 5819115 5984173 6314547 7558514 11032662 14698442 14707892 10934101 7131553
11993 7131553 5167638 2825792 -1565601 -5806946 -7166829 -6584384 -7152245 -9628706
11985 -9628706 -11433162 -9779688 -4762479 469662 2250848 -454816 -5255370 -8821617
11977 -8821617 -9556473 -7445384 -2928670 2406544 5445027 4317943 923370 -1367685
11969 -1367685 -1540512 -407418 1896009 4674703 4772266 199279 -5554447 -7451096 -5874894
11960 -5874894 -4285997 -1492088 6249938 15597781 17532873 10631443 4208077 4542301
11952 4542301 6562291 4200576 339691 -356253 -516670 -3703021 -6013875 -3407193
11944 -3407193 -1218776 -5775961 -11585582 -8767325 112420 3323905 -1331386 -4002547
11936 -4002547 436720 5516730 5346368 2253379 -838444 -4897929 -7910062 -4033056
11928 -4033056 5449423 9910709 3704994 -5726097 -9407184 -8130877 -6575963 -4674302
11920 -4674302 -1718207 -1451788 -5558475 -8508191 -6096045 -2951783 -4354958 -6909882
11912 -6909882 -5315204 -2338239 -3116324 -4814371 -1740838 3320038 3177615 -1012609
11904 -1012609 -1396625 3290632 5917486 2665198 -2224758 -4273289 -3522354 -463897
11896 -463897 5391583 11336779 12532731 9206627 7193530 9616615 13016769 13110814 9703075
11887 9703075 4741235 15078 -2154647 -246612 3374890 4463602 2484961 520200
11879 520200 -253980 -1579251 -3504165 -3536289 -1312608 30835 -1770070 -5591862 -8991330
11870 -8991330 -9624500 -5315377 3235762 10381447 10577440 5191530 97772 -2444944
11862 -2444944 -4359057 -5362887 -2700435 2392568 4652515 2629700 406877 -54321
11854 -54321 -1754238 -5474894 -6496876 -2423570 1446420 -624659 -6538072 -10095362
11846 -10095362 -9384856 -6588846 -2582895 2608528 5658280 2264087 -5689289 -9992973
11838 -9992973 -5371339 3721026 8029876 4253523 -1506564 -1481882 4710063 10726507
11830 10726507 11848049 9303974 6217731 3314810 359734 -1912901 -3790978 -6963141
11822 -6963141 -10252855 -9204307 -3542599 -301564 -4336318 -10178002 -9784800 -4431034
11814 -4431034 -1280017 -1493684 -629155 1401315 648184 -1410374 1001203 6782437 8255136
11805 8255136 4354725 3068271 7692314 11087847 8187982 4360025 5332421 7529967
11797 7529967 5268585 209569 -3139730 -4689300 -4962518 -799137 7875008 13272115
11789 13272115 9613165 2319552 -490601 -244410 -3129310 -8278210 -10493083 -10724228
11781 -10724228 -13343523 -15696489 -11409533 -2990250 37675 -3872931 -6056765 -2471471
11773 -2471471 -130604 -4500877 -9920401 -8825914 -3427676 -1126435 -3029783 -4074832
11765 -4074832 -1942203 685222 1960795 3437363 6088262 7842664 6761216 4364452
11757 4364452 4034915 6888601 10365208 10844801 7100578 1073298 -4208677 -6863545
11749 -6863545 -6659825 -4485625 -1829033 -57413 438859 370959 1035667 3743050 8476936
11740 8476936 12191190 10422802 2947167 -4034624 -4769266 -1334195 357437 312955 3651125
11731 3651125 10078565 12196810 7017063 1522071 2070015 4953034 3506387 -1085414
11723 -1085414 -3169440 -2370704 -2291847 -2702307 -1034632 434288 -2795127 -8455188 -9382314
11714 -9382314 -4809426 -1856138 -4160156 -6560712 -4035075 724442 2745282 2466933
11706 2466933 3131180 4156183 2417723 -1385576 -2419810 1690448 7024721 7696752
11698 7696752 2919051 -1868792 -1404144 3120580 6005293 4673818 2267680 1954499
11690 1954499 2534766 2192337 3032215 7862839 14698232 18724407 18534780 16623322 14691092
11681 14691092 12182071 8885623 5751577 3580628 3136346 4898313 6416657 3068491
11673 3068491 -4795876 -9059915 -3728644 5369079 7669635 2725711 -135358 3285073
11665 3285073 6462337 3828585 -286510 609119 4512317 4299242 -1223071 -5553213
11657 -5553213 -3556739 1786834 3129127 -2267920 -8996423 -9875814 -4900078 -783033
11649 -783033 -910256 -363684 5618947 12715775 12973797 6376192 154670 -1965484 -2592511
11640 -2592511 -3155407 -1330806 2596330 3745518 -444056 -6619294 -10755515 -12141608
11632 -12141608 -10968703 -7254528 -3303749 -1759761 -449520 4596434 10413975 9198575
11624 9198575 893714 -4933194 -3145453 -216081 -2587348 -6692292 -7323366 -7768840
11616 -7768840 -12659785 -16927433 -12255390 -1256659 4805661 1475144 -4469337 -6312390
11608 -6312390 -5409408 -6264221 -9523012 -12131165 -10966093 -5313399 1698877 4541728
11600 4541728 1053443 -4047635 -4420568 227792 4855616 6075140 4769893 2697065
11592 2697065 299806 -2060689 -3380612 -2616875 1082484 7326060 12862184 14000376
11584 14000376 12009156 12034576 14605722 13572291 6112890 -1178412 -1819666 531129
11576 531129 -1178521 -5512627 -6359821 -5156367 -8884047 -16803125 -19537932 -12708787
11568 -12708787 -2474170 4489244 8145272 9730293 7488696 1744582 -2464008 -1935697
11560 -1935697 797742 3010671 5338662 6903159 3668958 -3972613 -8271200 -4182102
11552 -4182102 2844113 4767381 1968565 209549 664086 56291 -1767401 -1634599 366163
11543 366163 553738 -1703961 -2463318 508856 4162676 4411024 1077334 -2589584 -3472056
11534 -3472056 -1157612 1752308 2281462 1114569 2451624 7948531 12873610 11528744
11526 11528744 5174760 779903 2190913 6148954 7437527 4671781 -49779 -4543820
11518 -4543820 -8048134 -10846843 -13433881 -15218501 -14112988 -8935472 -2304060 778926
11510 778926 -1854453 -6856904 -8773954 -5666037 -865493 769920 -1732010 -4200109
11502 -4200109 -2319527 2535085 4516074 831714 -4595489 -6706450 -5888747 -5910705 -7144519
11493 -7144519 -6086111 -1584351 2552871 2815882 987229 1432652 4754991 6707683
11485 6707683 3714305 -2359735 -6502541 -7065491 -7531478 -10454438 -12287847 -8105725
11477 -8105725 -272440 3181142 59338 -2022938 3327848 11606628 14187571 10656308
11469 10656308 7588965 7607575 7261979 4962770 3292496 2836244 1172865 -559880 2266503
11460 2266503 8566453 10224867 4320119 -565960 3712915 12516084 15161796 9810340
11452 9810340 4012305 2981188 4857683 6566455 7396047 6681234 3868766 1283108
11444 1283108 1756967 3468891 2045771 -2518331 -6303419 -8283345 -10516863 -11621393
11436 -11621393 -7464193 83796 2776878 -2158978 -6713457 -3387606 4092607 7052825
11428 7052825 4020345 55398 -2562440 -5740931 -9204828 -9704094 -6995644 -5075260
11420 -5075260 -6320479 -8605232 -9268366 -8422880 -7322100 -6389569 -5763753 -5429932 -4358805
11411 -4358805 -1646163 1542250 3356642 4041530 4742470 4491544 1879553 -1003606 -724593
11402 -724593 1351138 100721 -5046860 -8202447 -5956298 -2994463 -4540265 -7488052
11394 -7488052 -4953660 2622587 7393694 5107000 245875 -1558268 -1159567 -2496792
11386 -2496792 -5017619 -4210980 1048743 5837417 5118978 -158526 -4691194 -5145440 -2766486
11377 -2766486 -376 3201130 8308896 14329511 16853472 12066202 1561047 -7762501
11369 -7762501 -9633019 -4517303 988062 1382467 -2236383 -5027303 -5183091 -5053346 -6150732
11360 -6150732 -6968545 -6702515 -6933180 -7198475 -3120172 6829959 15996764 16511037 9707750
11351 9707750 3645121 1465812 -642461 -3722605 -2741057 3851780 8998073 6948662
11343 6948662 2289646 2559936 6593977 7676833 4935467 3258278 3504109 1494289
11335 1494289 -3018900 -4827947 -2390143 -413845 -461967 2934546 11829200 17716559
11327 17716559 12023438 -896338 -8879180 -7445976 -2787552 -640592 44245 1522222
11319 1522222 2453627 1627909 1452090 4150679 7651527 8527712 6987111 5976989 6457433
11310 6457433 6164119 2944969 -2386608 -6933476 -8765760 -8624869 -8373122 -8137150 -6294702
11301 -6294702 -2624716 495241 1285965 862257 568503 -356446 -1721134 -139867 5622922
11292 5622922 9742385 5997474 -2067924 -5011294 -1498345 44027 -4150033 -6273385
11284 -6273385 381304 9818236 11894686 6727413 2226767 1251979 199367 -1648569
11276 -1648569 -482017 4127990 7554842 7607206 7093352 7525038 6429508 2834467 -48651
11267 -48651 141960 1696579 2469823 2673739 2723675 2348275 2735664 5261231 7627333
11258 7627333 6332897 3340495 4008672 7327834 5688472 -2818486 -9561362 -7560727
11250 -7560727 -1661477 -383477 -3268219 -3529649 697675 5269230 7816407 9504400
11242 9504400 10102116 7675217 3056975 -524674 -2085026 -2777580 -2058476 1178276 4262454
11233 4262454 2839755 -2289201 -5200122 -2732099 1723527 3624338 3044856 3377611
11225 3377611 6547909 10935845 12978644 10539851 5410939 1705263 1035261 1147071
11217 1147071 492844 1082235 4251552 6930147 6074762 4015801 4512811 5661275 2547273
11208 2547273 -3924522 -6974291 -3399267 2210312 4132675 1986306 -1116665 -3076871
11200 -3076871 -3413155 -2113780 188055 2355879 3732580 3746235 1287378 -3207693 -5949488
11191 -5949488 -3259221 3359180 8591990 9624375 8224792 6847164 5809956 4515875
11183 4515875 2817308 1022957 319325 2083782 4768630 3846034 -1743879 -5649198
11175 -5649198 -1425494 7946206 13209740 10434046 3949822 -1479161 -5190586 -7118823
11167 -7118823 -6025902 -2685851 223187 2549901 6326808 10464429 10997968 7448957
11159 7448957 3719685 1835863 198113 -1206463 126686 3615640 5038980 3166352
11151 3166352 1134377 34904 -2286901 -4726817 -2881958 2241064 3762979 454610
11143 454610 -179457 4917489 7477230 1277272 -6346089 -5689052 -324655 -555595 -6032428
11134 -6032428 -7006280 -1078129 3283888 995804 -2530347 -1677612 777260 -54807 -2922300
11125 -2922300 -3777004 -3126950 -4900814 -9957932 -14680657 -15425515 -12061610 -7527143 -5220850
11116 -5220850 -6336708 -9001573 -10460582 -10056162 -8988357 -7413487 -3925797 1120915
11108 1120915 3805723 668239 -5871276 -9147038 -6763584 -4544959 -8331531 -13971906
11100 -13971906 -11892542 -2197709 2840832 -4202909 -14018365 -13409395 -3971827 2289053
11092 2289053 1772242 1117394 1772538 -2739637 -11560984 -12935482 -2373049 8025027
11084 8025027 6902202 -285150 -2336987 -140837 -1795304 -6786813 -7536453 -2815160
11076 -2815160 1875629 4744556 7900445 9138952 4102241 -4271016 -8312354 -7118619
11068 -7118619 -5992080 -4987210 1463643 12309176 17619595 11984944 1977857 -3456836
11060 -3456836 -3404524 -2430590 -3528972 -7094062 -12364833 -16960157 -18250838 -16641730 -14556792
11051 -14556792 -12480703 -9871790 -8706783 -10812330 -12910753 -10583983 -6096414 -5110543
11043 -5110543 -6502444 -3954289 2199923 4289829 205913 -2838497 -730974 1137126
11035 1137126 -1156740 -2093661 3315132 9473837 8370029 1899218 -2443594 -3695832
11027 -3695832 -6471125 -10762235 -11576351 -7985273 -4745396 -4359024 -4062161 -1978212 -723423
11018 -723423 -2710238 -5762967 -5829107 -2040182 2559610 4580675 4108426 4890469 9616339
11009 9616339 15220865 15856970 11383782 8611957 11411867 14262507 10573314 3514816
11001 3514816 1599274 5529625 7644548 4794171 3090181 6600889 9319185 4616559
10993 4616559 -3056429 -4033939 1786708 4715420 -2595 -5389574 -3378640 4460919
10985 4460919 11042966 13318424 12642509 9822296 5856347 4858304 9747806 16303263
10977 16303263 17592433 13415478 9093470 5879193 400298 -5987920 -6382219 145178
10969 145178 4760494 1463608 -4119478 -4545751 -2100830 -2823328 -4703327 -1145971 6904480
10960 6904480 11472353 9125825 4076635 108707 -3134522 -5454199 -4620377 -906027
10952 -906027 2352085 3654351 4126247 3453325 364477 -2624970 -741351 5506443 9357862
10943 9357862 6094905 -1576932 -7597095 -8537850 -4900401 126720 2577859 1155631
10935 1155631 -1238868 -1509406 -243372 1033614 3280316 6271684 5166557 -2852152
10927 -2852152 -11246502 -11011291 -3425394 1927073 1125221 -458868 1181381 3002123
10919 3002123 1820860 -582579 -1745390 -1723041 -298784 3018691 5184005 2318042
10911 2318042 -2845199 -3194154 2118644 6770846 7944819 9283019 11415763 9248484
10903 9248484 2514764 -248577 6178655 15199428 17696938 13387480 7752972 3959918
10895 3959918 3068627 6347055 12085674 15300146 14855411 15109275 16847602 14188756 5610206
10886 5610206 -158479 3555615 10390628 10621543 5785078 4459839 7898088 9454972
10878 9454972 6023826 1406995 -784648 -569511 1358382 4205517 5500293 3621757
10870 3621757 526037 -1831321 -5029884 -9896458 -12103295 -7333287 1764343 8670229
10862 8670229 10570932 8627172 3990395 -1694120 -4906885 -4008978 -1541807 657057
10854 657057 4248733 8637200 8390153 1675545 -4797389 -5375805 -3617322 -3925383 -2334438
10845 -2334438 5165988 11962661 9891623 3772843 4276097 9936536 10023168 3648923 1361352
10836 1361352 6528991 9488785 4220495 -2002827 -1709317 720163 -2452147 -9697392
10828 -9697392 -13683233 -12114292 -8645596 -6489621 -6071984 -6481188 -5896198 -2896766 813048
10819 813048 1713319 -792855 -4328394 -7908871 -11638640 -12628109 -7541133 415667 3930657
10810 3930657 2116610 1499879 5046078 8041704 7330187 6300029 6844890 4652932 -2115833
10801 -2115833 -6948798 -4213347 2081011 5484959 7173514 11297937 15548980 15052438
10793 15052438 11914863 11666747 12499883 7733019 -1455432 -5511523 -573038 5589832
10785 5589832 5184515 641121 -1478388 -867357 -1621350 -3618044 -2381326 3312701 9176028
10776 9176028 11353643 10420677 8312625 4987857 307447 -3487136 -4015331 -2037422
10768 -2037422 150300 2551590 6657230 11177916 12194350 8630790 4501938 3875216
10760 3875216 6032308 7660409 7527472 6473431 4863538 3100467 2899815 4498148
10752 4498148 4097875 -1393942 -7679840 -6565885 2562396 10039766 7916322 491506
10744 491506 -1750804 3858395 9851994 9878202 6458206 5397618 7228800 8405113 8213101
10735 8213101 9198195 11247461 10742154 7279580 6393927 12032797 19711863 21672783 17083105
10726 17083105 12526714 12939043 16312315 17601602 14208089 7170430 146004 -2544050
10718 -2544050 62754 3580244 3423536 1149873 1646251 5075496 7072149 6491831 6316055
10709 6316055 6246189 2149622 -4677262 -5805072 2076457 10358131 10105624 4403199 1824783
10700 1824783 2501163 -393105 -7504040 -10770144 -5006716 4934117 10931148 10902438 8904241
10691 8904241 8839749 10533694 11277859 9824034 7905817 7310002 6946348 5144390 3416297
10682 3416297 4010755 4724057 1534766 -3670214 -4367704 696985 5807543 7996283 10524682
10673 10524682 14032463 13180229 6723247 2073046 3744830 5781507 2782814 -180586
10665 -180586 2601047 6098738 3703749 570276 5311772 13531214 13234555 4201069
10657 4201069 -1422241 2245899 7771028 7539951 3587366 1885200 4812838 10984335
10649 10984335 16208323 14729396 5716850 -3108543 -4948041 -3739490 -6299142 -9049251
10641 -9049251 -3790134 6453919 10516398 6965513 5253519 8517315 9367864 5093279
10633 5093279 2760739 4889973 3821210 -3565301 -8358218 -4487890 326161 -2680349
10625 -2680349 -9230490 -9961693 -4626868 802724 4680666 8381833 9819021 6870839
10617 6870839 3178775 2964343 3905209 2066500 -308272 658132 2069342 -1290308 -6556389
10608 -6556389 -5386144 3459362 11618464 12143360 7034493 2372261 923552 1682353
10600 1682353 3001929 3559390 2432341 715695 1786543 7250731 12950758 12520662
10592 12520662 6562087 4415630 12363000 23130985 24384531 16385929 11287030 13188552
10584 13188552 11075723 -1904387 -14097665 -11557534 525361 6456852 3897391 3735991
10576 3735991 9402501 12591047 9983032 8885802 13026156 15781837 11747232 4278768
10568 4278768 -1912991 -5770540 -5104653 2653446 12256267 13831467 7219732 2677306
10560 2677306 4671393 6344342 3396887 1291552 3609048 4835079 1004484 -2735849
10552 -2735849 -1600772 1017371 1173376 1075631 2730915 3649361 3976924 8595476 16638248
10543 16638248 18672683 11028672 3822255 6998651 15953853 18933193 13061522 5946704
10535 5946704 5176387 11298312 18471912 19765552 14574544 9923679 10262387 10062443 4135321
10526 4135321 -346630 6010650 17448881 20528446 15517795 13682200 15737203 12031661
10518 12031661 3713621 3247766 11936489 17159204 14778642 14145454 18172656 19364844
10510 19364844 17996971 22066783 27583549 23297008 15702964 21203908 32872970 28252963
10502 28252963 12151564 12789166 30487753 34865573 22140101 24332067 46681765 53607669
10494 53607669 39425848 47456146 85482643 98584151 79750563 122218525 270133077
10487 270133077 387667733 304191157 60369734 -123453331 -127614962 -52942719 -33316524
10480 -33316524 -58794439 -52755614 -18502271 -11838001 -31057301 -29855122 -7335845
10473 -7335845 -3523233 -22507168 -29800482 -17712306 -13351601 -24616324 -30134765 -23375063
10465 -23375063 -21774406 -29521990 -30259870 -20168727 -14473613 -17831643 -17967289 -11099852
10457 -11099852 -6999904 -7669033 -5799211 -4196453 -12481743 -25011887 -25811731 -15091933
10449 -15091933 -8129304 -8850165 -7528428 -3614738 -6695812 -14115122 -11770602 61963
10441 61963 4620418 -3550146 -10249391 -6284458 -327646 -736352 -2858768 -1820928 -2030205
10432 -2030205 -6423564 -9634018 -8466847 -7741673 -10589363 -13239108 -13098696 -12476124 -12329123
10423 -12329123 -11638815 -12922051 -18100246 -20431847 -12670885 -1520221 -189685 -7730351
10415 -7730351 -10777207 -5517241 -1706172 -3649766 -4089771 -226778 699441 -3365942
10407 -3365942 -4167994 819144 1973391 -5888994 -13961043 -13932476 -9819579 -7872171 -6193470
10398 -6193470 -2259442 -258598 -2911592 -5189082 -3477720 -2182019 -4413183 -5140511
10390 -5140511 -761724 3218750 1534021 -1932572 -2008206 -1216723 -3293125 -5174112 -3531441
10381 -3531441 -2528060 -6621238 -11434917 -10279650 -4902406 -1438639 190758 4390036
10373 4390036 10253888 11903398 7328015 620218 -3801684 -4550330 -2424587 -402344
10365 -402344 -2513271 -8663130 -12574525 -8736688 486564 8087436 10577471 9584877
10357 9584877 7688193 6541767 7605504 11051742 14378539 14449667 10608352 4886588
10349 4886588 325176 -605654 2007727 4713984 4051785 660601 -2346139 -4072348
10341 -4072348 -5296730 -4619850 -414995 3952377 3117268 -1496058 -2416632 2866923 8329846
10332 8329846 9196547 8498732 10226543 12195095 10587844 6760609 4447692 3731566 2396002
10323 2396002 487601 -599347 -1428093 -3470416 -6457298 -9189621 -11115885 -11447390
10315 -11447390 -9063203 -4692391 -790492 1383824 1761298 -836969 -6288769 -8983455
10307 -8983455 -2815324 8457597 13272649 7435439 -242439 -1501560 -103745 -3482245
10299 -3482245 -9459703 -9554677 -2000452 6351095 9693660 8587874 6438550 5709773 7033748
10290 7033748 8197979 5197582 -2226886 -7885397 -5758312 2228424 8603723 9019460
10282 9019460 5292147 1526446 421939 1823131 2236487 -2169968 -9804632 -13993773
10274 -13993773 -11747883 -8106537 -8031577 -8712483 -5450296 -851726 -854804 -4384493 -5066731
10265 -5066731 -2129305 -1345440 -4730366 -7429031 -6761751 -6600517 -9148119 -9251210 -2392004
10256 -2392004 6403918 7964723 1112016 -6293368 -8011130 -6242183 -6705054 -10512934
10248 -10512934 -13313966 -11146095 -5154973 -278603 51378 -2623984 -3993101 -2560281
10240 -2560281 -1794656 -5208158 -9916318 -8227732 2330050 13087148 12709929 1463994
10232 1463994 -7977416 -6028292 2328579 5611607 1240271 -3333511 -2656103 870718
10224 870718 3338437 4589800 5236055 4255732 2037348 888130 396963 -2519653 -6775432
10215 -6775432 -6383852 104764 5637191 4624886 871462 34452 200470 -2742202 -5479161
10206 -5479161 -2079154 4636107 6165563 1824287 -147290 4317299 9476222 9224498
10198 9224498 4720276 1708 -3623459 -6211644 -7828973 -10642015 -16750577 -22423659
10190 -22423659 -21140503 -14253760 -10711087 -12967153 -12283607 -3918901 2134368 -4999091
10182 -4999091 -19117860 -24199972 -16295095 -6726585 -4366587 -6056012 -6165236 -5001032
10174 -5001032 -3816650 -453746 4778163 6010888 332368 -6202509 -6640099 -2391755
10166 -2391755 1000494 2539729 3855176 2801119 -3360239 -10571750 -11288825 -4605680
10158 -4605680 3214204 7676115 9221004 8062849 3091052 -3128439 -5078880 -2007094
10150 -2007094 977098 1442522 3222096 8821294 14132134 14295002 9902751 3968501
10142 3968501 -2352364 -7394162 -7572197 -2992556 101097 -2510013 -6557321 -6143953
10134 -6143953 -2782330 -1470296 -1583847 1106750 5904746 8159867 7300298 6558078 5585169
10125 5585169 1008557 -5578823 -8017170 -5343175 -3716245 -6079970 -6789866 -466561
10117 -466561 9176140 13868447 10677521 3579254 -2228310 -4252654 -2759973 289881
10109 289881 2953982 4906873 6467909 6660525 4605314 2166088 1959345 3108274 2485142
10100 2485142 -336871 -3266448 -5841937 -8230340 -7148013 516888 9828113 11280024
10092 11280024 4149792 -1340653 1389768 6093977 4062250 -3152307 -7797128 -7398315
10084 -7398315 -5187382 -2921753 -318465 947881 -628598 -1964167 765311 5098932
10076 5098932 4927393 -688781 -6865200 -10473046 -12798761 -14543266 -13661488 -9571180
10068 -9571180 -5346463 -3976287 -4996412 -5723330 -3947183 543700 5279114 6644538
10060 6644538 4042707 1320211 1948474 4511489 5443064 4020799 1504855 -2199337
10052 -2199337 -6920840 -9424465 -7024353 -2538046 -784446 -1447847 -676005 1402985
10044 1402985 989736 -1755198 -2180486 444498 625251 -4362658 -8882543 -6505673 809347
10035 809347 5544632 4350709 957079 154107 1810290 1401906 -4225304 -11901352 -14313430
10026 -14313430 -8625714 -824566 1835968 566892 1868836 5894486 5536286 -1353319
10018 -1353319 -6681817 -3360636 4675715 9516074 11089545 14612476 19429843 18593574
10010 18593574 9378290 -2536836 -10369891 -12328157 -9523470 -3437543 2362867 3027514
10002 3027514 -1508422 -4745149 -1819120 2880865 792207 -8773175 -16259652 -13278664
9994 -13278664 -3236883 2713613 -654263 -6808203 -6603052 126349 5763863 5878912
9986 5878912 3619617 2427937 316045 -4807760 -8939132 -7302098 -3355661 -5228141
9978 -5228141 -13248890 -18408455 -15349604 -9877918 -9210766 -10749034 -7200192 693322
9970 693322 4318804 -353203 -7344967 -9244845 -5853883 -1969379 -854190 -2808482
9962 -2808482 -6986250 -11410235 -13220294 -11689584 -9505693 -8863680 -8133063 -4996121 -1068383
9953 -1068383 67482 -1469553 -1941226 -7701 947048 -1938261 -6158734 -6770767 -2977834
9944 -2977834 819243 883869 -996721 -228618 3768372 6110971 3157787 -1715902 -2439302
9935 -2439302 587058 404589 -6037053 -12184064 -10451129 -2942062 1631597 -135404
9927 -135404 -3443000 -4088052 -3818736 -4907786 -5103861 -2077861 1002053 -571794 -5291681
9918 -5291681 -6647755 -2129642 3230057 3580481 -735339 -4973456 -6575712 -7183399 -8728734
9909 -8728734 -10190537 -9163268 -5267850 -864549 1177793 -164089 -3447124 -6070231
9901 -6070231 -6860818 -7585798 -10570058 -14350125 -14084815 -8167430 -1945091 -1596005 -6317505
9892 -6317505 -10772195 -13308150 -15833908 -16755527 -12121283 -4861373 -3813636 -10002917
9884 -10002917 -13221333 -8092664 -3910376 -9729294 -19060770 -21863592 -23666641 -35490020
9876 -35490020 -48468277 -39419843 -5719288 24698205 27929186 13375220 6075766 12339958
9868 12339958 18593894 16525958 12015645 10781660 10332736 8364493 7549265 8632463
9860 8632463 7671293 3463786 415433 888494 1190286 -1441321 -3498578 -698826 5414853
9851 5414853 10011334 11035316 9687691 7367316 5026301 4010701 5205492 7870474
9843 7870474 10230445 10703845 8904008 6659240 7069160 10476835 12494196 8877780 1516966
9834 1516966 -3682239 -4173529 -2305528 -81809 2788399 4845308 1994242 -6484679
9826 -6484679 -14408290 -14520230 -6487907 3023561 7265793 5060121 588190 -1269986
9818 -1269986 275767 1766991 522352 -1708444 -2105296 -1954515 -4565367 -8739105 -9393843
9809 -9393843 -5898348 -4723251 -10613137 -18847768 -20467317 -13236554 -3459967 2149818
9801 2149818 2656199 1049417 -215923 -640548 -986020 -2547804 -5655231 -7947606 -5905869
9792 -5905869 305050 5130811 3367398 -3086294 -7422035 -7143226 -7093809 -11192963 -15298101
9783 -15298101 -12885216 -5227728 49774 -178316 -1574118 -986584 -1174265 -4100207 -5965443
9774 -5965443 -3483850 134829 769932 472898 2958142 5833682 4296533 -54330 -1541944
9765 -1541944 -32621 -506135 -3426957 -3583206 387001 3135597 1792240 858483 4106775
9756 4106775 7650967 5932784 157825 -4304127 -5923141 -7565806 -10775262 -13761346
9748 -13761346 -14564095 -13178798 -10628516 -7729935 -4595320 -765655 3185024 4386416
9740 4386416 536806 -5572388 -7762568 -4234832 -369227 -1393954 -5111193 -5068036 910454
9731 910454 8643464 13094722 12893610 9502673 4626008 -459702 -4329744 -5625491 -4329902
9722 -4329902 -2477676 -2525619 -4442627 -5522961 -4082023 -1972468 -1855195 -3411898 -4367474
9713 -4367474 -3875034 -2436139 12226 2954810 3802399 1088997 -2221179 -2487094 -897258
9704 -897258 -736436 -944133 1858625 6221190 7524421 6227405 6845443 8582621 5880796
9695 5880796 -125663 -734737 5798515 8940251 1493989 -8638682 -10704317 -7148607
9687 -7148607 -7173314 -10430486 -9092692 -2851574 491958 -1090787 -919149 3884701 7248975
9678 7248975 4596706 -310736 -2725236 -3576654 -4696584 -4111646 -799589 1433294 -363729
9669 -363729 -3335992 -4024067 -3960976 -5101198 -3984476 3201068 12321587 14701011 8256664
9660 8256664 -329141 -4679584 -4816042 -3327983 -630396 3114447 4787529 882191
9652 882191 -7488886 -14755417 -16240993 -12023601 -5604837 -236924 2860900 3729078 2527388
9643 2527388 -379336 -3704018 -5426489 -4303458 -1267484 1185115 1530647 846365 1086655
9634 1086655 2026047 1588442 -358211 -966950 903280 1387051 -3196117 -9039293 -7896546
9625 -7896546 1525249 10211405 9658643 1983409 -4352376 -5221141 -2407395 2599936 9841564
9616 9841564 16208427 15959324 8225355 -234589 -2355347 1915510 7423635 10030131
9608 10030131 8869836 5192072 2031843 3307685 9829965 16568097 16822841 9698281
9600 9698281 1286978 -2519801 -2611981 -4291827 -9243660 -12609597 -9390710 -1774193 2942096
9591 2942096 1552741 -1467357 -1265066 -145745 -3861693 -11766574 -15577635 -9401581
9583 -9401581 2442664 10191231 9474232 4801532 2792184 4470409 5418565 2408363
9575 2408363 -2078658 -2903975 1148294 5889058 7262211 6200738 6239652 7988596 8836775
9566 8836775 7761445 7327965 9767021 13205920 13646372 9920899 5210076 3591830 5907862
9557 5907862 9443976 11381453 11713168 12134539 12933733 12711800 11012155 9003975 7153347
9548 7153347 4806486 2841332 3262421 4403394 886722 -7903013 -13601684 -9139340
9540 -9139340 -194126 1447716 -5155844 -9030709 -4718045 -804783 -5692806 -13486487
9532 -13486487 -12741580 -3816996 2583966 1983006 979060 4661492 8616108 7281017
9524 7281017 3080631 1980754 4644696 7314941 8462495 9424657 9998136 7939975 2508192
9515 2508192 -4540522 -10703338 -13009868 -8520200 1603431 9986371 9892182 4069592
9507 4069592 1814795 6411789 10714501 7477383 -804956 -6168719 -5660090 -2981559
9499 -2981559 -1866421 -2513854 -3799604 -4916893 -4917640 -3868166 -4052489 -6793994 -8810486
9490 -8810486 -5740596 863841 4489161 2228424 -2050541 -4283555 -5114703 -5754991 -3564193
9481 -3564193 3939577 13200383 16943060 11633404 305732 -10594454 -15103014 -10642968
9473 -10642968 -159552 9592430 14028948 13946919 11822934 8036896 3131982 159077
9465 159077 642981 946244 -2704447 -7830109 -9513740 -8662952 -10259842 -14206343 -14802434
9456 -14802434 -10136912 -5287865 -4010034 -3379696 -49036 3390305 2597673 -1531468
9448 -1531468 -4120536 -2177372 3714877 10881499 15028673 12450852 5101801 400187
9440 400187 2237945 5241588 2510699 -3806505 -5659545 -1492330 1195864 -3263856
9432 -3263856 -10987074 -14258343 -10817584 -4480430 363493 1510287 -1622901 -7371013
9424 -7371013 -11097109 -8741210 -2159925 1740422 -957545 -6039479 -6847238 -3751423
9416 -3751423 -3464924 -8145501 -10666824 -4863731 3973606 5760101 624061 -1383245
9408 -1383245 3702928 7513917 3186354 -3507369 -4072977 -987802 -1784518 -4619986 -1631550
9399 -1631550 5276454 5094384 -3863980 -8834396 -1642511 7957465 6831083 -1568333
9391 -1568333 -2861682 6404791 13955490 9392868 -2704784 -10571341 -9778453 -5611934
9383 -5611934 -4278452 -5906368 -5995749 -1880419 3206247 3459793 -1888436 -6577879 -4855684
9374 -4855684 1171537 4700438 3025374 -485006 -2106545 -1381994 711408 3254545
9366 3254545 4647535 3685038 1561710 -192257 -3011820 -8387061 -12448052 -9341735
9358 -9341735 -881958 3572530 -372193 -5652354 -3913698 2892775 6468938 4049534
9350 4049534 330458 -372723 1949115 5952619 10345771 12395389 9944036 5442860
9342 5442860 3706641 5075347 5039273 1596708 -1419213 -323938 2924256 4030952 2421207
9333 2421207 780224 119763 -1354787 -4521585 -7186821 -6895021 -4644897 -4105271 -6832197
9324 -6832197 -9641807 -8225747 -2753214 2282046 3879555 3522491 3477449 3201740 1516596
9315 1516596 -396815 -986263 -1111872 -1948421 -2350808 -1575150 -2214355 -6309842 -10579821
9306 -10579821 -10258376 -6237267 -3479725 -3611046 -4380607 -5203583 -6959192 -6969612 -1484597
9297 -1484597 6155151 7404557 642457 -5676387 -4851705 -235722 1649653 -194869
9289 -194869 -3329626 -6395634 -7227792 -2605627 5290335 8226073 2962835 -3181077 -3493888
9280 -3493888 -1727262 -3556033 -5235470 -485794 6809029 7979639 4106791 3429173
9272 3429173 6230072 4831471 -1249699 -3006675 2500385 6278458 1951490 -4171152
9264 -4171152 -3752849 1386517 4512638 4480174 4031114 2987625 -105687 -3449099 -4746695
9255 -4746695 -5037897 -5302319 -3559213 -927 5302 -6124788 -11871814 -10005781 -3523707
9246 -3523707 -963062 -3783052 -6176970 -5485339 -4606433 -4602282 -2931721 280211 1704007
9237 1704007 1902342 5589240 12400176 14695387 8697434 1565256 1793784 7160688 8687176
9228 8687176 3898292 -776228 -380347 2325359 2732771 1201200 608682 642490 -1037728
9219 -1037728 -3400272 -2435758 2418984 6103578 4236198 -1027805 -4000678 -2583815
9211 -2583815 406574 1898526 1501875 247154 -570639 730396 4528650 7810052 6841515
9202 6841515 2554716 94613 1961036 4812356 4649532 2104260 490449 1188882 3147862
9193 3147862 4749384 4188972 298633 -4910426 -6772234 -3212805 2613147 6815363
9185 6815363 9295286 11531504 12791638 11745786 9616890 8518203 8444325 8599737 9429084
9176 9429084 10444584 8777171 3472843 -1424543 -2144229 -991606 -2370103 -5542840
9168 -5542840 -6675228 -5962131 -6600369 -7942329 -6222986 -1800397 878525 931733 2132567
9159 2132567 5366455 6654426 4565576 3069111 4245666 4372837 920636 -2210957
9151 -2210957 -935408 2239249 2574153 527075 -185631 899893 1388942 954325 1232527
9142 1232527 2106527 2240329 2367015 4190017 6494066 5808059 1150660 -4135276 -5319739
9133 -5319739 -91254 9189638 15969087 14662609 7195187 1668877 2173093 3256954
9125 3256954 -1803780 -10426774 -13699081 -8342693 -36606 5183801 7390760 9111220
9117 9111220 9809777 7177234 1785029 -2450130 -2486767 232475 953568 -3067550 -8707541
9108 -8707541 -10198397 -6538260 -2880650 -3065184 -4234697 -2104190 1519979 1388515 -2528384
9099 -2528384 -4388649 -732324 5183446 8274218 7061247 3071320 -1770340 -5567886
9091 -5567886 -6874186 -6195704 -5416108 -5231178 -5049942 -5331538 -7265867 -9727969 -9394745
9082 -9394745 -4885280 1318685 5617805 6036374 2481178 -2974560 -6116731 -4131863
9074 -4131863 431094 2320588 410012 -1814282 -2918231 -5759624 -11078766 -13786325
9066 -13786325 -9706087 -2818330 -977000 -5525633 -9473492 -6511674 1295870 6471055
9058 6471055 5372361 2395286 4090358 10358860 14195588 10794177 3519967 -1662048
9050 -1662048 -4229862 -7095608 -9306882 -7138036 -1735754 1045477 -736221 -2966832
9042 -2966832 -3302388 -4524258 -7709181 -8735097 -5334428 -1786416 -2319053 -4956614 -6148647
9033 -6148647 -6439135 -7068541 -6121864 -3029042 -1690039 -3582689 -3130465 3501061 10170725
9024 10170725 9134637 3314639 1465502 4311087 4868841 714343 -3596100 -5663423
9016 -5663423 -7458531 -8152140 -3943128 3571425 7371067 5309019 2638074 2374916 1137667
9007 1137667 -2849651 -5500931 -4178764 -2367346 -3386857 -5603543 -7127896 -9024859
8999 -9024859 -10616270 -8134069 -1820895 1962501 -237681 -3876379 -4198475 -2712572
8991 -2712572 -1811415 11987 2582229 1037016 -5401679 -8926033 -4904812 -1158844
8983 -1158844 -6265381 -14526333 -13567417 -3149518 5336455 6648617 7009229 10558741
8975 10558741 11885510 6232454 -1615333 -4118407 -918950 2813454 3800535 2235350
8967 2235350 -895245 -4174500 -5329030 -3556857 -1348334 -1846080 -4754026 -6132179
8959 -6132179 -2475413 5078717 11031705 11109123 7055004 3403479 98839 -6737431 -15652986
8950 -15652986 -18328712 -11472530 -3746690 -4092427 -8646720 -7996529 -3194389 -3549104 -9929406
8941 -9929406 -12219202 -5394722 2718357 3928910 632147 -1190357 -2034853 -5229153
8933 -5229153 -9029403 -9343612 -6698953 -4573997 -3618209 -2605041 -2450036 -4403163 -6503474
8924 -6503474 -6300982 -5021389 -4984434 -5255847 -3995839 -2491500 -2223020 -640719 4563825
8915 4563825 9231971 7431089 1356203 -745086 2871267 4504455 -788518 -7157677
8907 -7157677 -6939525 -2063483 6268 -1741036 -1363100 3529253 8180728 8883938 8012504
8898 8012504 7865305 5631117 -509694 -5134266 -2247073 4436843 5299882 -1720687 -8772725
8889 -8772725 -9808136 -7231824 -4940507 -2472406 127047 -1021779 -6559102 -9832861
8881 -9832861 -6460993 -2231274 -3722272 -6228388 -821095 9810718 13752079 7675706
8873 7675706 1210373 1460560 3441222 311133 -5434957 -7035628 -3844104 -662140
8865 -662140 -329725 -1750236 -2768846 -1629722 2065287 5572786 5000936 767079 -2422014
8856 -2422014 -2565211 -3025407 -6132718 -8895912 -8203496 -6022752 -5737987 -6794284 -6688659
8847 -6688659 -5457562 -4640765 -3950077 -2078668 645448 2527665 2268596 -153471 -2646868
8838 -2646868 -1878279 1892925 2629248 -3601006 -10421008 -8542383 -607898 1265462 -5803415
8829 -5803415 -10469597 -5104054 2766184 4046432 2408728 5371942 9947081 8631907
8821 8631907 3292962 1235106 1960968 -572597 -5957867 -9107848 -11253019 -17225894
8813 -17225894 -23402868 -20678756 -9481194 -57162 3003179 4899313 7863448 6573289
8805 6573289 -103931 -4267954 -1284173 2613230 714376 -4309722 -6352215 -4243292
8797 -4243292 814460 8646464 15641079 14438066 4156147 -5927350 -8885737 -9072775
8789 -9072775 -11857595 -12503245 -4788173 5644137 7919728 2497706 -175408 3761426
8781 3761426 7329358 5600256 2354490 1181861 -794153 -5834564 -9611674 -7730800
8773 -7730800 -2845836 208896 2249980 6860018 12399853 13195722 8198022 2996569
8765 2996569 2206671 4129810 4742730 3508284 2580219 2598576 2473827 2275681 3114478
8756 3114478 4185455 2974051 -738304 -3674536 -3260690 -885605 636440 875212 1097093
8747 1097093 1477634 1238217 349108 -780556 -1849769 -1217757 3585931 11055443 14066034
8738 14066034 7363100 -4835216 -13188466 -14005224 -10941498 -7324911 -3082801 620211
8730 620211 643774 -2224532 -2761056 642481 3225419 2301826 2362106 7103985 11841371
8721 11841371 9972701 3240627 -776555 1060449 5557452 9445121 11497892 10040975
8713 10040975 4825899 766186 3366177 10228492 13323750 10289858 6881532 6785776
8705 6785776 6300354 2588636 368657 4617393 11362203 12356573 6374926 -380104 -3684360
8696 -3684360 -4877649 -5302837 -3441409 783201 3885407 3453645 1206881 -842243 -3850849
8687 -3850849 -9090247 -14262831 -15804941 -12875533 -6837867 632804 6355113 5881647
8679 5881647 -827409 -6379135 -3577492 5372450 12396532 14840964 16652756 18465724
8671 18465724 14627342 3170085 -8322519 -11966554 -9613237 -8024626 -8094247 -5488404
8663 -5488404 221491 3937369 2485499 -1812616 -5667087 -8469046 -10589817 -11769628
8655 -11769628 -12106389 -11700442 -9026080 -2788647 4388480 7670377 6271171 4755997
8647 4755997 6739324 10031231 9814859 4782526 -1596396 -4963926 -4025463 -887044 1988598
8638 1988598 4530912 7750690 10341100 9564325 6319938 5479280 8654636 10439083 5818645
8629 5818645 -1898748 -5581544 -4296477 -3109155 -4307691 -4993888 -3274679 -1080686
8621 -1080686 -220271 -613280 -2764851 -6927354 -9613818 -6580717 28829 3377545 1887723
8612 1887723 1292828 4838590 7912297 5769221 878929 -1702705 -1736689 -2007052 -2516193
8603 -2516193 -1000873 2771261 6808513 9665988 11042553 11047628 10440712 9996882 8919850
8594 8919850 6031398 2588857 976900 942792 918828 2290172 7121107 12231039 12270606
8585 12270606 8890253 8736303 10952345 6456013 -6292977 -14981508 -10259917 -397729
8577 -397729 428612 -7476314 -11290238 -4954363 3935444 6271020 1785627 -4038050 -6919712
8568 -6919712 -5954329 -3195704 -2066623 -3491606 -4374663 -2381831 139552 324429 -255625
8559 -255625 802264 1370842 -1454493 -4735806 -2922972 3568909 8490873 7624542 1995741
8550 1995741 -5204111 -10314822 -9839371 -4405399 -232183 -1866513 -5918034 -6976893
8542 -6976893 -6181099 -7447011 -8867258 -6047482 -1309000 -381420 -1534238 2032206 9242176
8533 9242176 11118555 5228782 -65872 1096050 3966877 2649069 -791537 -1949012
8525 -1949012 -1812746 -3294313 -5545067 -6841004 -8421577 -10904967 -11238509 -7430171 -2346378
8516 -2346378 751274 2285927 2917815 1028658 -2681224 -3272072 1326689 6003460 5836108
8507 5836108 3128276 2149742 1587966 -1726300 -5389643 -4397344 741246 4938721 6041640
8498 6041640 6065610 6397309 6894933 8512935 11873913 14257792 12697969 9063814 7465437
8489 7465437 7659054 5838402 1145953 -3577937 -6967243 -9820428 -10736567 -6675268 1097883
8480 1097883 6767219 7380696 5960766 5242485 2942498 -3407567 -10412253 -11846379 -6412354
8471 -6412354 865857 4615260 4094628 2341537 2249791 3815255 4325642 1352255 -3845839
8462 -3845839 -6651703 -4105651 958559 2769400 -55062 -2332244 798479 6664564
8454 6664564 7939818 2294534 -4771009 -7908300 -8456582 -9811857 -10131638 -5256631 2769366
8445 2769366 6568073 3531563 -791597 -1428996 -728341 -3097591 -7593381 -10213332 -10439077
8436 -10439077 -10628673 -10560425 -7293170 -307432 6768503 10052252 9030856 6528356 6487160
8427 6487160 10723235 16372574 18142330 14782990 11089525 11161111 12457005 10211040 5354431
8418 5354431 3105217 4730906 5968378 3863306 208693 -2903603 -6222406 -9961778
8410 -9961778 -11330722 -8278399 -2857427 1783686 5278420 8198967 8752214 5011803
8402 5011803 -584833 -2668959 635944 5236354 5863344 1707798 -3554595 -6190649
8394 -6190649 -5786769 -4491494 -3803393 -3008752 -1204970 194366 -1108972 -4379732 -5898064
8385 -5898064 -4142667 -2360520 -3577731 -5377069 -3464740 891048 2015325 -1120435
8377 -1120435 -2418474 2226726 8161018 8629285 4626714 2601754 4317306 5109880 2001264
8368 2001264 -2425665 -5353323 -7445057 -9220029 -8758511 -5884675 -4197527 -5489718
8360 -5489718 -6039123 -2419834 2304588 2641422 -1492511 -5367252 -6044040 -4233329 -1175675
8351 -1175675 2100641 3522910 1874236 -907098 -2466209 -3420292 -4761853 -4435577 -871558
8342 -871558 2571569 1953974 -559950 -164791 2301163 2090900 -752276 -1639792 150821
8333 150821 815714 -173952 531149 2368281 871470 -3132338 -3227252 1280513 3001070
8324 3001070 -1058440 -4249145 -2470160 -1708102 -6286931 -8906025 -1936049 8614636
8316 8614636 11135426 5371403 502621 -270386 -2098146 -6931475 -10275495 -9833055 -8130127
8307 -8130127 -5728304 -517108 4973004 4246521 -2551790 -6455639 -1774155 5893605
8299 5893605 7723582 2816496 -2656523 -3700992 -165035 5254787 9383831 10170905
8291 10170905 7991095 5044894 3321954 3777392 6091953 7541567 4331590 -3064297
8283 -3064297 -8358703 -7011290 -2636463 -1125574 -1499290 715527 3381137 -366755
8275 -366755 -10171260 -17036531 -15606386 -10088262 -5721109 -2272349 636991 -369322
8267 -369322 -5920776 -10001908 -8233385 -4773187 -5258865 -7631861 -6320017 -1862101 365475
8258 365475 -1130599 -2742491 -2221751 -1007215 -566679 -900608 -2359662 -5037964 -6677612
8249 -6677612 -4819295 -953459 738451 -1034385 -3115528 -2394102 164722 691837 -3026922
8240 -3026922 -8159725 -8512772 -1298025 8204276 11777796 8261788 4466334 5202188 7376870
8231 7376870 6476977 3772396 2898050 3438123 2793406 1249882 335393 -1009233 -3645149
8222 -3645149 -4437739 -720485 3953828 4487188 2454606 3009542 5323942 3830046 -1403881
8213 -1403881 -3792430 -1031980 1235157 -638408 -2181303 1054022 5627608 6093200
8205 6093200 3988053 4708993 8322284 9670920 6436928 1579369 -2197806 -5457896
8197 -5457896 -8329725 -7860850 -1805480 6695530 10925277 7429919 -310525 -5946363
8189 -5946363 -7118393 -6409939 -5642080 -2622096 4170566 10794894 12122489 9312769 7878789
8180 7878789 8723146 6991078 1023493 -3629457 -2217433 2220348 3858954 2090490
8172 2090490 144334 -1077023 -2933790 -4823071 -4597513 -2222849 469229 2495065
8164 2495065 3305005 1660568 -1818024 -3370696 -1217441 554554 -2249910 -6844274
8156 -6844274 -7611073 -5087196 -4210952 -5062160 -3063368 1507183 2412664 -2140453 -5580505
8147 -5580505 -2674839 3520473 8035776 10771479 12412687 9922342 2102211 -5406408
8139 -5406408 -7243631 -6512134 -9091421 -13144148 -11977705 -5538151 -1016603 -1849559 -3382975
8130 -3382975 -1024572 3425149 5984913 6189488 5729805 4811212 2719498 241036 -447243
8121 -447243 2203114 7303308 11082518 9619809 3621660 -1447743 -2193675 -1571740 -3189401
8112 -3189401 -4785641 -2554316 879523 -468320 -6284071 -10474104 -10863209 -10931861 -11604654
8103 -11604654 -9401862 -4393168 -1843462 -3045483 -2282261 3324160 8394155 8216795
8095 8216795 5919264 5498105 4722563 1236811 -926602 1610879 3848440 196947 -4717246
8086 -4717246 -2417665 5352959 8631109 3997446 -1820785 -2992343 -717308 2351398
8078 2351398 5779035 7795528 5194016 -912354 -5001015 -4760060 -3683085 -4593633 -5727983
8069 -5727983 -4935494 -3127682 -1994724 -2233586 -4577918 -8345806 -9287510 -4255805 2241057
8060 2241057 2481251 -3350229 -7664605 -7671118 -8440797 -11491269 -9903252 -221204 8989988
8051 8989988 7935999 -695113 -6310642 -4742949 -882056 119160 -2564403 -7766079
8043 -7766079 -13014055 -14071387 -9349686 -3896068 -3956735 -8426182 -10554010 -7416967 -2792915
8034 -2792915 -875803 -1860159 -4151777 -6870857 -9363227 -11175814 -12746318 -13857270
8026 -13857270 -12504164 -8302043 -5364106 -7471789 -11372018 -9942697 -2152955 5247463
8018 5247463 7103531 6056274 7210960 10717829 12641148 10418959 4643167 -2485248
8010 -2485248 -7806949 -8026697 -2831954 3415899 5425112 2333396 -2132655 -4351937
8002 -4351937 -3929520 -2368834 -764114 285408 11958 -1536289 -2287177 105402 4507067
7993 4507067 5918028 793676 -7693683 -11884690 -7781712 677696 6499038 7271099
7985 7271099 6168275 6145124 5776892 2253260 -3006760 -4706761 -810208 3174357 491681
7976 491681 -7022124 -10072163 -4304476 3406012 4711592 1268118 578849 3608772 4331251
7967 4331251 809157 -1672638 -216346 733600 -2497841 -6393066 -6399784 -4036866 -2978398
7958 -2978398 -2699121 -1192701 -53163 -1391701 -2831369 -879270 3370781 6840619
7950 6840619 9784435 13022419 12848091 5485064 -4813149 -8909749 -4055290 3617487
7942 3617487 7866797 8151590 6424153 3757895 1659578 2253215 5227014 7416185 6388336
7933 6388336 2450039 -2320978 -4609573 -1151163 6767706 11721498 7721598 -1576032
7925 -1576032 -6990698 -5315609 -1596081 -543165 -1440698 -2048757 -2131008 -1956736 -1757602
7916 -1757602 -3296576 -7684542 -11671978 -10963288 -7029922 -5133725 -5677811 -3842907 1661416
7907 1661416 6383147 8107915 10103483 14061887 16407568 14544229 10755783 7172627
7899 7172627 3081147 -6785 2373788 9434941 13098963 8926402 2673452 829372
7891 829372 1111510 -1522764 -5562543 -6841148 -6575728 -7810930 -8108438 -3879782 1328103
7882 1328103 1258878 -2581324 -3169023 566016 2542267 -468434 -5054518 -7853919 -9495505
7873 -9495505 -11049404 -12023428 -12389892 -11984574 -8599605 -1749543 3118525 476079 -6245941
7864 -6245941 -8380303 -4244413 -219822 302316 839327 3671219 6337770 8488115 13591258
7855 13591258 20312453 20701115 12014963 2603522 -81036 -127826 -4368953 -9400659 -7077138
7846 -7077138 800427 3767526 -1887985 -8417508 -8769850 -5247394 -3047442 -2147461 -150146
7837 -150146 1848715 1546945 592932 2210489 5097773 4789014 1129832 -480508 3014914
7828 3014914 7337667 6945557 3127404 1657382 3791745 4797015 1955753 -1235701
7820 -1235701 -1236107 -163737 -1516334 -3881978 -3741843 -1934919 -1847631 -2655614 -255939
7811 -255939 5292308 8985335 8268762 6028635 5103378 4725024 3706365 2315774 -362847
7802 -362847 -5770095 -10968044 -10099727 -3107885 2901103 3966219 4525288 8293434 10820673
7793 10820673 7333232 1908932 1085892 3096308 2119400 -507736 806440 4120893
7785 4120893 2222760 -3291385 -2028632 7920971 13924934 6438244 -6260348 -9407435
7777 -9407435 -1666504 5710188 6236215 4748037 6429970 8186544 4746102 -2024325
7769 -2024325 -4858604 -610982 5559182 6200224 191326 -6123054 -6611616 -2467516 388506
7760 388506 -151818 -301110 2548462 5241303 4161410 1195171 91596 -205722 -3066354
7751 -3066354 -6497805 -4387943 3823349 10710812 10568622 6523369 4425167 3970441 1003928
7742 1003928 -3984738 -5821493 -3035920 -612995 -2300402 -4510214 -1414058 6297599
7734 6297599 11693585 10157595 4360803 8124 -858480 -753888 -2256520 -4389658 -3780065
7725 -3780065 932157 6196635 6147632 -766727 -8726094 -10453265 -5982384 -2342824 -3667139
7716 -3667139 -5731992 -3366004 646682 -201646 -4820009 -4777780 2650640 8760548 5218281
7707 5218281 -3658362 -6794956 -1673559 3508578 2706453 -244289 718444 4489593 5780881
7698 5780881 3969972 3489785 6354587 9217139 8773018 6410722 5562709 6726710 7340543
7689 7340543 5557774 2222994 -648620 -1952552 -2034399 -2213501 -3896818 -7254242 -10482490
7680 -10482490 -11135669 -8647414 -5055763 -2789119 -2042877 -758402 2850315 7832876
7672 7832876 10559942 7854643 922602 -4398437 -3117163 2866841 6203183 2560397
7664 2560397 -4486365 -8667308 -8589442 -7054734 -5044386 -1296914 2497642 1709340 -4122892
7655 -4122892 -9011436 -8518066 -6050296 -7042577 -10020411 -8803217 -2241385 3778331 4574652
7646 4574652 2371010 2237416 5642252 9796131 11210885 8572469 3750267 779422
7638 779422 2267488 6313363 8521109 7129401 4321149 2683688 2829393 4516742 7173746
7629 7173746 8682780 6564198 1504409 -2714440 -3683306 -2259150 610964 5562658
7621 5562658 11669436 14828775 11932675 4860787 -1536133 -3859056 -1658079 2888900
7613 2888900 5432300 2435100 -4487283 -9739449 -10552436 -9358655 -8171367 -5429743
7605 -5429743 -1219992 -290659 -5039967 -10001376 -9321210 -6042243 -6772495 -9729402 -6742914
7596 -6742914 2944009 9540256 5916155 -2906790 -7061004 -3464827 3591969 9379650
7588 9379650 12075682 11660241 9270506 6886175 5551664 4438005 2336872 -1056068
7580 -1056068 -5306574 -8871282 -8977168 -4492953 1284390 3635268 2096228 149896
7572 149896 -227901 -9165 378769 1474988 1755887 -831236 -3853290 -2233101 3894933
7563 3894933 8539458 8205320 5208320 1594385 -3319018 -7290675 -4993447 2561562
7555 2561562 6208917 1648493 -3027148 472769 7616939 8329838 1864173 -4464963
7547 -4464963 -7274529 -8668684 -8885787 -6697053 -4933967 -6363363 -6055738 2035672 12188150
7538 12188150 12059907 1471149 -5793119 -1994879 4190399 2649586 -3254402 -4553690
7530 -4553690 -1499266 -1328333 -5898032 -10197931 -10939286 -9372259 -6566912 -2009611 3081680
7521 3081680 5767720 5304822 3958713 3586066 3461434 1591393 -2788159 -7535113 -8493377
7512 -8493377 -3840905 2699749 5767578 5229275 5394663 7508559 8098783 5632224 2977140
7503 2977140 1332719 -1946765 -6365744 -5916873 1285092 7067781 3417483 -5948797
7495 -5948797 -11099881 -9301288 -5690626 -3521757 -1704362 -577601 -2131465 -4492480
7487 -4492480 -3441952 -6604 368781 -2722638 -3110869 1636481 4960517 460968 -8494647
7478 -8494647 -13055178 -10097889 -4828343 -3125509 -4695685 -4550245 109611 5748164
7470 5748164 6309482 1121638 -3465294 -2083778 2566248 3781195 -46218 -4470287
7462 -4470287 -5942305 -5309673 -4736170 -5273617 -7367214 -9752180 -8085632 790190 12820776
7453 12820776 19364368 16698546 9194016 2832425 -162082 -78398 1769255 2169566 -1521088
7444 -1521088 -6621141 -7301959 -2604592 2562271 5316297 7766186 10429672 9454281 3681507
7435 3681507 -1939059 -4239293 -6998409 -13010423 -16859423 -12397210 -3079540 2446954
7427 2446954 2163877 1027805 1722461 2377150 2470311 3860745 5719155 4735197 1235939
7418 1235939 -317796 1949672 4674102 4320854 1152272 -2250770 -3005969 959833 7889156
7409 7889156 11462898 7987248 2969284 4314368 9918226 9959324 2271192 -3576984 -880848
7400 -880848 4135295 2591229 -3856339 -7509943 -7142900 -7624790 -9951464 -10181370 -7639369
7391 -7639369 -6350360 -7308840 -6134556 -685916 4520281 4553166 723401 -2060337 -1598208
7382 -1598208 809361 3392093 4602779 2452478 -3480548 -9697407 -11148821 -6555119
7374 -6555119 149604 4044908 3696997 1144654 -1144092 -2139597 -1756343 -162146 1753254
7365 1753254 2292478 660462 -1542373 -1940054 -587562 488 -1449461 -2938648 -2001296
7356 -2001296 965783 3744249 5422036 6594199 7374542 7343111 6965113 6987589 6817110
7347 6817110 5577354 4220304 4027491 3532240 393464 -3390182 -2258465 5093202 12265625
7338 12265625 12358242 6048685 -360479 -2590172 -851846 3104828 7277740 8932544
7330 8932544 7054612 4857942 5898628 8100635 6211799 436769 -2588839 914211
7322 914211 6539067 8377942 6645042 5021653 4171385 2486849 759462 1156054 2661901
7313 2661901 1939510 -1669179 -5625337 -8173015 -9391133 -8910354 -6261616 -3104842 -1463463
7304 -1463463 -216075 2739933 5489478 4109955 -374013 -2550045 -998373 -267829
7296 -267829 -2702992 -4559834 -3380177 -2831912 -5352530 -5910121 121977 7363332 6817711
7287 6817711 -689240 -6113891 -6356655 -7535990 -12704466 -15719257 -11874149 -6834951
7279 -6834951 -8212396 -13507638 -14210147 -9109088 -5458819 -7120481 -9037252 -5586368
7271 -5586368 1556754 7219422 9826754 10620304 9187128 4741419 192148 -162335 3156808
7262 3156808 5494654 5350645 6043357 8633690 8700678 3854731 -337779 2397466 9016985
7253 9016985 11128973 7461179 4734347 5730557 4880612 -1098010 -5997675 -3347482 3118383
7244 3118383 5430104 3653374 3913026 6367103 4428109 -3247346 -8758029 -6399159
7236 -6399159 -1156438 -908318 -5326216 -8214892 -7276319 -5124526 -2470337 2585002 7862366
7227 7862366 6679292 -2353636 -10313227 -8262757 250040 3475438 -2372773 -8543408
7219 -8543408 -7505857 -3745174 -5049540 -9075820 -7577834 -1027863 1668659 -1545056
7211 -1545056 -2094708 3943045 7596391 1282667 -7703160 -7836740 -1059827 1404301 -2956338
7202 -2956338 -6053541 -3989849 -1870354 -2706326 -2484228 776844 2693127 1031666 13012
7193 13012 1966622 2714614 -25756 -1242071 2854304 7626584 7271729 3522820 1249562
7184 1249562 654644 -278614 -477357 1246646 2558757 2381946 4068238 8021280 7339525
7175 7339525 -1749463 -11069725 -11076814 -5112676 -2924959 -4338242 -1431645 5294726 6235435
7166 6235435 -878180 -6363198 -3836041 641039 -797842 -7128388 -13190296 -17011148
7158 -17011148 -17447585 -12237924 -3956940 -803602 -5308450 -8708428 -3309902 5444737
7150 5444737 7058328 1486797 -2077123 751721 5369236 7317058 7625970 7991173 7189745
7141 7189745 4539434 2296287 2314584 3339976 3255196 1912961 922769 2301890 7198839
7132 7198839 13890811 17512509 14409838 6738600 284498 -2184357 -2709107 -3253664 -2361908
7123 -2361908 1736833 6978080 8792959 5320385 44298 -1270847 3576799 10576311
7115 10576311 13454840 10475235 6072215 5140386 7430687 9079419 8011736 5396491
7107 5396491 2619735 -362822 -3470502 -5714296 -6730771 -7240933 -7123488 -4879346 -549343
7098 -549343 2306506 164399 -4800475 -5321696 2601710 13329604 16547363 8860615
7090 8860615 -2325380 -7421550 -4175465 3006764 9458949 12336128 9550736 2202821
7082 2202821 -3269925 -1211279 5154149 7442774 3893371 666570 556502 -1261337
7074 -1261337 -6919538 -9986502 -6126625 -2041785 -5133809 -9997088 -5874731 5415644
7066 5415644 10720300 5049087 -1432022 813043 7808787 10612804 8858834 8273007
7058 8273007 9619819 8158666 2349469 -3673671 -6391798 -6618029 -6372233 -6101001 -5956831
7049 -5956831 -6539048 -7046786 -5308281 -1309311 1246469 -952456 -5959636 -7969728 -3948361
7040 -3948361 2773781 6616051 6215987 4837872 4808072 4351863 1100114 -3705105 -6740104
7031 -6740104 -6866452 -5575693 -4212762 -3069622 -2465692 -2432766 -1901064 -205666 1526181
7022 1526181 2492489 3977330 6084426 4871617 -2663005 -11966807 -14864515 -10188007
7014 -10188007 -4755814 -2866578 -1143803 3757028 8665253 9368879 7377626 6074740
7006 6074740 4253056 -722731 -6375404 -8062422 -6784250 -7798790 -11989861 -14643505
6998 -14643505 -13318442 -11270065 -11454528 -12017597 -10166485 -6691116 -3787015 -1140330
6990 -1140330 2719476 6524030 6475621 618313 -7961767 -12694416 -9022484 751212 8895808
6981 8895808 9873515 5613948 1727227 364956 -129606 -96272 2315311 6883709 10765533
6972 10765533 13199112 16424317 20415750 21191713 16781759 10599464 5717135 27449
6964 27449 -8469996 -15273868 -14394252 -8098828 -5177768 -9039659 -13321344 -11246613 -4475587
6955 -4475587 497100 1220474 597848 1062309 1467734 43730 -2429897 -3732930 -3106799
6946 -3106799 -1639570 -146000 1901153 4621755 5971879 3562899 -1598429 -5152647
6938 -5152647 -4307773 -1098717 792061 799404 795407 1105507 442255 -684087 -91283 2010246
6928 2010246 2538689 416738 -1284532 -44624 2091160 1776302 -588806 -2041900 -1705357
6919 -1705357 -1052849 -446577 1254682 3646275 4347249 2333667 -529615 -2061546 -2082335
6910 -2082335 -1442837 -370460 1188026 2546516 2534505 655508 -1991060 -2957704 -753617
6901 -753617 2440324 2217833 -2154086 -5434389 -3169517 1068208 44621 -5896337 -7872125
6892 -7872125 -727217 9263960 12845803 9526010 5717289 4332444 2720800 -8141
6884 -8141 -435327 2739285 5131765 2626720 -2595831 -5097500 -2911644 1594800 5771450
6875 5771450 8618724 9641551 8573404 6201125 3567173 463011 -3704084 -7806424
6867 -7806424 -9519657 -8149981 -5538211 -3795942 -3179485 -2504549 -841394 1440300 2722991
6858 2722991 1278162 -2959486 -7797060 -10519797 -9937254 -6227676 113203 7443072
6850 7443072 11831138 9670646 2570476 -2554109 -362882 6823323 11609071 9814651
6842 9814651 4593769 2311796 5791917 12130204 16144350 15004893 9543816 1978390
6834 1978390 -6089943 -12567464 -13598629 -6835885 3545357 8837056 5178586 -2018687
6826 -2018687 -5954269 -7259228 -10005674 -12048855 -7374667 1928786 5010494 -2934273
6818 -2934273 -12938228 -14677916 -9708810 -5280661 -1387309 6010972 12888528 10536206
6810 10536206 1026409 -2772371 4128253 11013833 7835545 -172329 -1899704 3249742
6802 3249742 7572041 8426227 9517597 11549809 11068759 7874950 5309702 3348748 -757484
6793 -757484 -4900991 -3475014 2476027 4788520 399522 -3890840 -2522458 558045
6785 558045 -200312 -2598912 -1768815 736234 396214 -1287001 939758 6533991 9281769
6776 9281769 6679601 2623965 400679 -770925 -1225774 852865 4366417 4075038 -2248369
6767 -2248369 -9764978 -13151669 -13410877 -14098992 -14175457 -9944747 -2485006 2457791 2241875
6758 2241875 203970 -399688 -900804 -3236537 -5035295 -2403691 4040412 9440291 10514085
6749 10514085 8221229 4950694 2159572 1134176 2790367 5317366 4908193 985718
6741 985718 -1645377 1406469 7861617 11421624 9694018 6105192 4127488 3131092 921116
6732 921116 -2441842 -4913530 -4914144 -2625287 -237507 -888151 -5074476 -8142472 -4697963
6723 -4697963 3566183 8275686 4757362 -1653353 -2944855 1207832 4933049 5727907
6715 5727907 6804504 10081397 12452726 10830416 6635982 2783345 -597442 -4569226
6707 -4569226 -7792506 -7630306 -3919089 658911 3406824 3329301 1196584 -283593 2328779
6698 2328779 9295936 15717542 16257210 11781105 8487267 10085644 13884523 15652850
6690 15652850 15012098 13687878 11341905 6753970 1511896 -1419937 -2194006 -3260369
6682 -3260369 -4260896 -2208166 2359854 4109921 112355 -5723939 -8358601 -8075227
6674 -8075227 -7717931 -7112575 -4881975 -2865028 -3228043 -3215929 1239984 7953442 10899577
6665 10899577 9559779 8890114 9856122 7950743 2889254 1427501 6679021 12202115
6657 12202115 11841532 8650919 8029171 8443521 6377107 4882525 8341621 12745441 10868455
6648 10868455 4761671 3124535 7213572 9713595 8219547 9036919 14560167 17057910
6640 17057910 10505722 505470 -4049836 -2965068 -1684533 -1209440 1552394 6123947
6632 6123947 7954450 4756623 -1480953 -7928872 -12493898 -13281327 -10279204 -6524214
6624 -6524214 -4467788 -2751583 341804 2504256 500820 -4119744 -6803796 -6320514
6616 -6320514 -4956839 -3335178 93694 4292527 5135485 1088841 -3984578 -5190438
6608 -5190438 -1562248 3990237 7493656 6261383 673460 -5722309 -9355157 -9865212
6600 -9865212 -8997222 -7395230 -4578157 -892174 3069402 7689943 12052495 12266910 6374030
6591 6374030 -331260 -296939 5934565 10046876 7574805 3091841 1510317 698916 -2639168
6582 -2639168 -5185581 -1739072 5289448 8222946 5231042 2477015 4264679 7137210
6574 7137210 6417438 3586436 2937434 4119312 3157373 -74008 -539639 4440375 10221773
6565 10221773 10087741 3291049 -4890011 -9535265 -9303258 -4415434 4043732 11969956
6557 11969956 13888488 9569502 5829201 8345652 13995825 15069490 9361234 1845752
6549 1845752 -2703022 -4132844 -3932673 -2531164 -926545 -1244619 -3816284 -6342570 -7249861
6540 -7249861 -7364736 -7350897 -6343747 -4275837 -2776105 -2581354 -2714168 -3064933 -4659583
6531 -4659583 -6434611 -5320243 -823709 4107495 7894063 11545947 13729063 10453033
6523 10453033 2771189 -1247663 2858849 8578057 7549172 1437280 -2200592 -1970393
6515 -1970393 -2339944 -3701298 -1720696 3716774 7383955 7442250 7565948 9000672 8263947
6506 8263947 5063371 4881190 10059430 14989076 14418242 10768565 8755528 8092164 6475099
6497 6475099 5089100 5728386 6252341 4344539 2720626 5323239 10888265 15247991 17493380
6488 17493380 18779174 17618957 12263215 5989110 3819539 4746528 3274829 -1395982
6480 -1395982 -3938875 -1758083 550825 -1758875 -6435686 -7570682 -3819031 -164390
6472 -164390 -1696705 -7183536 -9860819 -5519267 963141 393680 -8503601 -16121083 -14397187
6463 -14397187 -7546506 -4945426 -7251102 -7253890 -2624476 991398 270344 -770275 1379832
6454 1379832 4055757 4058391 2764492 1793459 -656008 -4634774 -4812690 2457283 12046121
6445 12046121 15408255 10784905 3764743 -117379 522279 3859477 6092494 3980930
6437 3980930 -397694 -189967 7216874 14877872 14450213 6686803 -1121113 -5133115 -6594884
6428 -6594884 -6218028 -3904109 -2694117 -5827248 -10151512 -9337634 -3777911 -241480 -1081751
6419 -1081751 -1426464 1123149 1910756 -2160651 -6466548 -5667047 -1094271 3381744 7301535
6410 7301535 10485886 9567483 3835818 -182046 3057421 9008536 9399743 4516280 1088808
6401 1088808 396512 -2115048 -5978837 -4676069 2567984 7562284 5712132 3223057
6393 3223057 6230708 10346926 8323347 2183562 -905582 -1031973 -4468626 -11640144
6385 -11640144 -15383872 -12149584 -6854705 -4422104 -3732207 -3028410 -4318945 -7722471
6377 -7722471 -7527155 -252218 7606014 7084025 -320241 -4702415 -2132594 779303 -1654299
6368 -1654299 -5544766 -4561876 -330104 270881 -4417191 -8976758 -9008438 -5848643 -2429082
6359 -2429082 795272 3520563 3071754 -2080593 -8332299 -10493396 -8742491 -8128541 -10706173
6350 -10706173 -12339740 -9414511 -4946685 -4143962 -6309702 -6165747 -2527212 -153699
6342 -153699 -1757889 -3405009 -782449 4185124 6777312 6146824 4242035 1033311 -3901847
6333 -3901847 -7159395 -5167734 -1401890 -3241988 -10699582 -14857524 -10000462 -1389065
6325 -1389065 2563479 712649 -2461515 -4386554 -5102431 -3772600 -28734 3298772
6317 3298772 3918348 4718891 9383989 14936468 14719921 8392432 2735587 1778959 2129829
6308 2129829 -138808 -3671130 -5687626 -6581786 -6979681 -4485401 2067728 8096902 7918404
6299 7918404 2388072 -2529855 -3891667 -4072654 -5184567 -5847204 -4790642 -3753920 -4364924
6290 -4364924 -4723528 -1891540 3578637 8225548 10165337 10496693 10267327 8701568 5508725
6281 5508725 2737750 2343320 3172611 2567007 268909 -1636936 -2406812 -3563864 -5810543
6272 -5810543 -7950863 -9925261 -13765164 -19438996 -22628061 -19747322 -13218464 -8465353
6264 -8465353 -7241472 -7514475 -8513234 -11241682 -14186540 -13489245 -8825709 -5064607 -5935101
6255 -5935101 -9044970 -9264694 -4675025 2528304 8614291 10172620 6089864 -173785
6247 -173785 -2597776 871748 5826546 7320827 5631175 3527706 805458 -4266705
6239 -4266705 -9777783 -11292070 -8128646 -4359065 -2731591 -1236501 2700617 7475210
6231 7475210 9013344 5820489 520580 -3105951 -3583980 -2527634 -2481173 -4053142 -5681278
6222 -5681278 -6412622 -7298830 -8585214 -7450896 -1791482 4541150 4505863 -3045867 -10800912
6213 -10800912 -11609860 -6535586 -1576405 676170 2093093 3569252 3461862 1570784
6205 1570784 238840 234614 -670722 -3155486 -3900682 -573875 3402791 2700663 -2548093
6196 -2548093 -6579657 -4817361 1785742 8856641 12598106 12049333 9766087 9894019 13381724
6187 13381724 16032252 13848592 8639280 4556473 1104475 -4548927 -9501320 -7487648
6179 -7487648 -588438 677652 -6606130 -10679892 -1774216 11633715 13669262 3428325
6171 3428325 -5398120 -5389025 -3128006 -4545837 -5002950 662371 8091154 10546807 9013650
6162 9013650 7982689 6741758 2384161 -2535046 -3009711 32322 1312504 -112782
6154 -112782 -185188 2538169 4570345 3576001 2056404 3631030 8657087 14155149 15956691
6145 15956691 11535067 3124171 -3137345 -3975252 -3344424 -6587055 -11986901 -12861671 -7348638
6136 -7348638 -893295 1680160 1766029 2896438 4955935 5014343 1766854 -2822246 -5360638
6127 -5360638 -4098970 -1283574 -1643753 -6396800 -9998050 -6298032 2860892 9543678
6119 9543678 10136067 8736099 9119541 9173357 6459912 3988718 5227746 6805502 2356311
6110 2356311 -7437018 -14313571 -12495981 -4829891 1969153 4052490 1244918 -4342233
6102 -4342233 -7918914 -4422421 4523081 9124184 2312301 -9375135 -12070187 -2119980
6094 -2119980 9318862 11718957 8400749 8919302 13776814 15023616 9949905 5212568
6086 5212568 6099113 9394777 10072883 8867718 8904900 9315005 6871069 1346636 -4367849
6077 -4367849 -7424327 -5915433 448506 7986514 10612051 6720143 1475053 -443871
6069 -443871 -642899 -2467615 -5066293 -6247336 -7018077 -8183387 -6395420 544615 7998304
6060 7998304 10500822 10139846 11867698 13758067 10551250 4699494 4033375 8800738 11157626
6051 11157626 8653210 7663310 10316009 8656970 -2072789 -13098474 -13125174 -4019918
6043 -4019918 2624701 1355069 -2140529 -661778 5941478 12157604 12963245 8143938
6035 8143938 2232575 -310529 -150329 -1167713 -3621022 -3416265 660318 3916733 2493387
6026 2493387 -1410054 -4017036 -5176759 -5594433 -3355745 2441486 8294978 10779762
6018 10779762 10879032 9840931 5147556 -4036029 -11554830 -11152005 -5878528 -3649651 -5444436
6009 -5444436 -5523958 -2483556 -1631170 -4829572 -5821290 239480 8041259 8087787 -942916
6000 -942916 -10189552 -10878707 -4047555 1036352 -2405987 -10927676 -15426105 -12603043 -8070261
5991 -8070261 -6905655 -6160108 -997480 5755373 6701105 962185 -4470037 -4672913 -1882113
5982 -1882113 617469 3632207 8135896 10985037 8632279 2579766 -2218148 -2973732
5974 -2973732 -879757 1230137 1216600 -926614 -2470656 -447990 3785966 4594508 -1078243
5965 -1078243 -8648251 -10697173 -6022930 -596027 772778 214861 2283459 6413405
5957 6413405 7641428 4201744 269613 -220227 1170301 1096436 352299 1876588 4701639
5948 4701639 4966606 2507201 1241580 2594719 3898819 4348030 6665846 10866742 12605477
5939 12605477 10789929 10247543 12498619 10962104 1840822 -6859707 -6007333 55142
5931 55142 107192 -5868518 -7154846 -506984 4630324 2162815 -915202 3133676 9825132
5922 9825132 9586381 1766906 -6152562 -9415105 -9039020 -6636658 -2777551 508420 908263
5913 908263 -712349 -1637096 -1241548 -541033 666394 2745345 3712576 1521708 -1903654
5904 -1903654 -2331037 1416650 6421530 9328271 8594501 4232561 -1753244 -5508205 -4908570
5895 -4908570 -2491901 -2131253 -3595535 -3472783 -809104 1741501 2369903 2136167 1969606
5886 1969606 1041062 -731157 -1521969 -376968 1389171 2942396 5408214 8767623 9945832
5877 9945832 6793334 2175276 962950 3836913 7015135 7585549 5988884 3347988
5869 3347988 -22728 -2499319 -1208374 3565809 6972741 5509158 2023427 1346027
5861 1346027 2794220 1508219 -3354368 -6698834 -4831223 -519982 1104244 -1669040
5853 -1669040 -7165262 -12629767 -14386122 -9487252 -472736 4619766 806687 -7517783
5845 -7517783 -12362005 -11805592 -9686188 -7962895 -5015975 -947336 1122041 189246 -661838
5836 -661838 924722 3216485 3445340 1450966 -1192180 -3425548 -4809675 -5178206 -5161686
5827 -5161686 -5745493 -6975237 -8172475 -8790271 -7600613 -2658837 5104627 9726665 5710839
5818 5710839 -4450569 -12051986 -11941675 -7322926 -4540571 -6319252 -10664178 -13608194
5810 -13608194 -12655822 -9614541 -9096779 -11785521 -11784098 -5153860 1824135 -6384 -8527638
5801 -8527638 -12248536 -7012718 -1362328 -2205887 -4636810 -1826912 3110102 3160174 -367232
5792 -367232 -531539 3267629 4407326 -552168 -7383314 -10426588 -8154524 -2306426 4121138
$$ [...]
##END NTUPLES=NMR SPECTRUM
##END=
