##TITLE=31Pdec_SR59H.AcCl:Ac3O.1:1
 , 124 sc
 4.06.2021
##JCAMPDX= 6.0         $$ Bruker NMR JCAMP-DX V2.0
##DATA TYPE= NMR SPECTRUM
##DATA CLASS= NTUPLES
##ORIGIN= UXNMR, Bruker Analytische Messtechnik GmbH
##OWNER= root
$$ XWIN-NMR		Version 3.5
$$ Fri Jun  4 14:11:34 2021 Russian Standard Time (UT+4h)  she@DPX200
##.OBSERVE FREQUENCY= 81.013821
##.OBSERVE NUCLEUS= ^31P
##.ACQUISITION MODE= SIMULTANEOUS
##.ACQUISITION SCHEME= undefined
##.AVERAGES= 124
##.DIGITISER RES= 16
##SPECTROMETER/DATA SYSTEM= spect
##.PULSE SEQUENCE= zgpg30
##.SOLVENT NAME= CDCl3
##.SHIFT REFERENCE= (INTERNAL, CDCl3, 0, 248.564)
##AUDIT TRAIL= $$ (NUMBER, WHEN, WHO, WHERE, WHAT)
$$ ##TITLE= Audit trail, XWIN-NMR		Version 3.5
$$ ##JCAMPDX= 5.01
$$ ##ORIGIN= Bruker BioSpin GmbH
$$ ##OWNER= she
$$ F:/spectra/data/she/nmr/P31/1/pdata/1/auditp.txt
$$ ##AUDIT TRAIL=  $$ (NUMBER, WHEN, WHO, WHERE, WHAT)
(   1,<2021-06-04 14:09:33.34 +0400>,<she>,<DPX200>,
      <continue with go, POWCHK disabled, PULCHK disabled
       configuration hash MD5:
       00 E9 B6 7A A2 85 ED C7 34 08 36 98 17 FE 4E 26
       data hash MD5: 32K
       26 29 55 83 9C 6F EB 6E F0 F4 FE 66 0A B7 8D 5E>)
(   2,<2021-06-04 14:10:24.93 +0400>,<she>,<DPX200>,
      <Start of raw data processing
       efp BC_mod = 2 LB = 1 FT_mod = 6 PKNL = 1 PHC0 = -5957.593 PHC1 = 271.6747 SI = 64K 
       data hash MD5: 64K
       B8 4C A9 82 95 6B D7 6A 20 C0 0D 7A 1E F7 97 F2>)
(   3,<2021-06-04 14:10:58.76 +0400>,<she>,<DPX200>,
      <pk PHC0 = 76.64155 PHC1 = -195.4 
       data hash MD5: 64K
       12 06 E3 60 29 71 1E A4 9D 48 60 A4 E8 F3 66 22>)
$$ ##END=
$$ 
$$ hash MD5
$$ 73 54 B0 61 57 E8 3F 08 63 65 8F 24 C1 3B 27 C7
##$RELAX= 
##$RELAX= 
##$RELAX= 
##$RELAX= 
##$RELAX= 
##$RELAX= 
##$RELAX= 
##$RELAX= 
$$ Bruker specific parameters
$$ --------------------------
##$DU= <F:/spectra>
##$EXPNO= 1
##$NAME= <P31>
##$PROCNO= 1
##$TYPE= <nmr>
##$USER= <she>
##$AMP= (0..31)
100 100 100 100 100 100 100 100 100 100 100 100 100 100 100 100 100 100 
100 100 100 100 100 100 100 100 100 100 100 100 100 100 
##$AQSEQ= 0
##$AQ_mod= 1
##$AUNM= <au_zg>
##$AUTOPOS= <>
##$BF1= 81.014009
##$BF2= 200.13
##$BF3= 200.13
##$BF4= 200.13
##$BF5= 200.13
##$BF6= 200.13
##$BF7= 200.13
##$BF8= 200.13
##$BYTORDA= 1
##$CFDGTYP= 0
##$CFRGTYP= 5
##$CHEMSTR= <none>
##$CNST= (0..31)
1 1 145 1 1 1 1 1 1 1 1 1 1 1 1 1 1 1 1 1 1 1 1 1 1 1 1 1 1 1 1 1 
##$CPDPRG= <waltz16>
##$CPDPRG1= <>
##$CPDPRG2= <waltz16>
##$CPDPRG3= <>
##$CPDPRG4= <mlev>
##$CPDPRG5= <mlev>
##$CPDPRG6= <mlev>
##$CPDPRG7= <mlev>
##$CPDPRG8= <mlev>
##$CPDPRGB= <>
##$CPDPRGT= <>
##$D= (0..31)
0 1 0 0 0 0 0 0 0 0 0 0.03 2e-05 3e-06 0 0 0 0 0 0 0 0 0 0 0 0 0 0 0 0 
0 0 
##$DATE= 1622801187
##$DBL= (0..7)
120 120 120 11 120 120 24 19 
##$DBP= (0..7)
150 150 150 150 150 150 150 150 
##$DBP07= 0
##$DBPNAM0= <>
##$DBPNAM1= <>
##$DBPNAM2= <>
##$DBPNAM3= <>
##$DBPNAM4= <>
##$DBPNAM5= <>
##$DBPNAM6= <>
##$DBPNAM7= <>
##$DBPOAL= (0..7)
0.5 0.5 0.5 0.5 0.5 0.5 0.5 0.5 
##$DBPOFFS= (0..7)
$$ [...]
##$SUBNAM2= <"">
##$SUBNAM3= <"">
##$SUBNAM4= <"">
##$SUBNAM5= <"">
##$SUBNAM6= <"">
##$SUBNAM7= <"">
##$SUBNAM8= <"">
##$SUBNAM9= <"">
##$SW= 501.771253377433
##$SWIBOX= (0..15)
0 1 3 0 0 0 0 0 0 0 0 0 0 0 0 0 
##$SW_h= 40650.406504065
##$TD= 32768
##$TD0= 1
##$TE= 0
##$TE2= 300
##$TE3= 300
##$TEG= 300
##$TL= (0..7)
0 120 53 12 22 120 120 120 
##$TP= (0..7)
150 150 150 150 150 150 150 150 
##$TP07= 0
##$TPNAME0= <>
##$TPNAME1= <>
##$TPNAME2= <>
##$TPNAME3= <>
##$TPNAME4= <>
##$TPNAME5= <>
##$TPNAME6= <>
##$TPNAME7= <>
##$TPOAL= (0..7)
0.5 0.5 0.5 0.5 0.5 0.5 0.5 0.5 
##$TPOFFS= (0..7)
0 0 0 0 0 0 0 0 
##$TUNHIN= 0
##$TUNHOUT= 0
##$TUNXOUT= 0
##$USERA1= <user>
##$USERA2= <user>
##$USERA3= <user>
##$USERA4= <user>
##$USERA5= <user>
##$V9= 5
##$VALIST= <valist>
##$VCLIST= <CCCCCCCCCCCCCCC>
##$VD= 0
##$VDLIST= <DDDDDDDDDDDDDDD>
##$VPLIST= <PPPPPPPPPPPPPPP>
##$VTLIST= <TTTTTTTTTTTTTTT>
##$WBST= 1024
##$WBSW= 4
##$XGAIN= (0..3)
0 0 0 0 
##$XL= 0
##$YL= 0
##$YMAX_a= 8807
##$YMIN_a= -9600
##$ZGOPTNS= <>
##$ZL1= 120
##$ZL2= 120
##$ZL3= 120
##$ZL4= 120
##$ABSF1= 0
##$ABSF2= 0
##$ABSG= 0
##$ABSL= 0
##$ALPHA= 0
##$AQORDER= 0
##$ASSFAC= 0
##$ASSFACI= 0
##$ASSFACX= 0
##$ASSWID= 0
##$AUNMP= <proc_1d>
##$AZFE= 0.1
##$AZFW= 0.5
##$BCFW= 0
##$BC_mod= 2
##$BYTORDP= 0
##$COROFFS= 0
##$CY= -3
##$DATMOD= 1
##$DC= 0
##$DFILT= <>
##$DTYPP= 0
##$F1P= 0
##$F2P= 0
##$FCOR= 1
##$FTSIZE= 65536
##$FT_mod= 6
##$GAMMA= 0
##$GB= 0
##$INTBC= 1
##$INTSCL= 5.30512e-09
##$ISEN= 30
##$LB= 1
##$LEV0= 0
##$LPBIN= 0
##$MAXI= 10000
##$MC2= 0
##$MEAN= 0
##$ME_mod= 0
##$MI= 50
##$NCOEF= 0
##$NC_proc= -7
##$NLEV= 6
##$NOISF1= 182.463
##$NOISF2= 159.3651
##$NSP= 0
##$NTH_PI= 0
##$NZP= 0
##$OFFSET= 248.5645
##$PC= 4
##$PHC0= -5880.951
##$PHC1= 76.27472
##$PH_mod= 1
##$PKNL= yes
##$PPARMOD= 0
##$PSCAL= 0
##$PSIGN= 0
##$REVERSE= no
##$SF= 81.014009
##$SI= 65536
##$SIGF1= 159.3651
##$SIGF2= -187.1042
##$SINO= 113.3802
##$SIOLD= 16384
##$SREGLST= <1H.CDCl3>
##$SSB= 0
##$STSI= 65536
##$STSR= 0
##$SW_p= 40650.406504065
##$SYMM= 0
##$S_DEV= 0
##$TDeff= 32768
##$TDoff= 0
##$TI= <>
##$TILT= no
##$TM1= 0
##$TM2= 0
##$TOPLEV= 0
##$USERP1= <user>
##$USERP2= <user>
##$USERP3= <user>
##$USERP4= <user>
##$USERP5= <user>
##$WDW= 1
##$XDIM= 65536
##$YMAX_p= 254190428
##$YMIN_p= -268570550
$$ End of Bruker specific parameters
$$ ---------------------------------
##NTUPLES= NMR SPECTRUM
##VAR_NAME=  FREQUENCY,     SPECTRUM/REAL,   SPECTRUM/IMAG
##SYMBOL=    X,             R,               I
##VAR_TYPE=  INDEPENDENT,   DEPENDENT,       DEPENDENT
##VAR_FORM=  AFFN,          ASDF,            ASDF
##VAR_DIM=   65536,         65536,           65536
##UNITS=     HZ,            ARBITRARY UNITS, ARBITRARY UNITS
##FACTOR=    0.620285442955139, 1,           1
##FIRST=     20137.2065510759, 0,            0
##LAST=      -20513.1999529892, 0,           0
##MIN=       -20513.1999529892, -268570550,  0
##MAX=       20137.2065510759, 254190428,    0
$$ Real data points
##PAGE= N=1
##DATA TABLE= (X++(R..R)), XYDATA
$$ [...]
$$ plain form
12995 5368295 2948678 3103567 5843807 7145061 4471489 518014 -903700 146383
12987 146383 1932534 5162724 10326196 13161642 8725066 -426380 -6107548 -5368749
12979 -5368749 -3452691 -3996708 -2843091 4038057 11915986 12901725 7072611 1464298
12971 1464298 -407850 -1166634 -1854347 1073429 8507189 14374543 12776213 5747257
12963 5747257 -147024 -2228837 -2539260 -2250854 -119861 3611357 6004309 5344744 3404792
12954 3404792 2350941 1497593 -1100139 -4970598 -7012223 -5161839 -1300061 433272
12946 433272 -1500299 -3725041 -1810119 3954590 8744959 9451970 7973537 6963793
12938 6963793 5534062 2067604 -1485805 -2339721 -2116778 -4416039 -7927972 -7641005 -3507753
$$ packed form
12995E368295k419617J54889K740240J301254k673572l953475j421714J050083
12987A46383J786151L230190N163472K835446m436576r151446n681168P38799
12979e368749J916058n44017J153617O881148P877929R85739n829114n608313
12971A464298j872148p58784o87713K927776P433760N867354j598330p028956
12963E747257n894281k081813l10423K88406K130993L731218K392952o59565j939952
12954C404792j053851q53348k597732l870459k041625J850384L861778J733333
12946D33272j933571k224742J914922N764709M790369P07011j478433j009744
12938F963793j429731l466458l553409q53916K22943k299261l511933K86967M133252
$$ plain form
12929 -3507753 -1869171 -5855915 -9961530 -8181220 -3054959 -1370769 -3692365 -3898907
12921 -3898907 1633700 9301844 13141380 10933072 5019830 -300474 -1951421 -608956
12913 -608956 256291 -768305 -948417 1555226 3176232 -464437 -7284080 -10914157 -9198927
12904 -9198927 -5492010 -2195449 1101768 2928203 133142 -5395586 -6703343 -1535391
12896 -1535391 3721623 3578746 1166783 1536065 2578317 -788556 -6932383 -9173909
12888 -9173909 -5706043 -1601136 -1411876 -4971007 -9996857 -13944395 -13831567 -9137499
12880 -9137499 -4401875 -4131671 -5935588 -4122050 776084 2689341 210768 -1387908
12872 -1387908 193310 428827 -3024465 -4919857 -957682 4532695 5320538 2586297
$$ packed form
12929c507753J638582l986744m105615J780310N126261J684190k321596k06542
12921c898907N532607P668144L839536k208308n913242n320304j650947J342465
12913f08956Q65247j024596j80112K503643J621006l640669o819643l630077J715230
12904i198927L706917L296561L297217J826435k795061n528728j307757N167952
12896a535391N257014j42877k411963L69282J042252l366873o143827k241526
12888i173909L467866M104907J89260l559131n025850l947538J12828M694068
12880i137499M735624K70204j803917J813538M898134J913257k478573j598676
12872a387908J581218K35517l453292j895392L962175N490377P87843k734241
$$ plain form
12864 2586297 1166498 859217 -1292967 -3172452 29941 6902000 10861470 10058213
12856 10058213 9183158 10744935 11519954 9467452 7614853 8162917 8452902 6369993 4723021
12847 4723021 6018240 7189720 4495439 368819 -77921 2750671 3950024 2337907
12839 2337907 1715968 3404276 3297687 -1308232 -6604493 -7450729 -4462578 -2027854 -1405103
12830 -1405103 -277913 1612428 1299210 -1801462 -3411739 -250415 4630951 5774635
12822 5774635 2582607 -1195613 -3916009 -7171162 -10384840 -9778720 -5114051 -2657869
12814 -2657869 -7188792 -14224639 -15210282 -8799605 -1881503 9781 -2012981 -4983537
12806 -4983537 -8549034 -12189471 -12626456 -7951398 -1648552 1299352 650093 -245650 -397854
$$ packed form
12864B586297j419799l07281k152184j879485L202393O872059L959470q03257
12856A0058213q75055J561777P75019k052502j852599N48064K89985k082909j646972
12847D723021J295219J171480k694281m126620m46740K828592J199353j612117
12839B337907o21939J688308j06589m605919n296261q46236K988151K434724O22751
12830a405103J127190J890341l13218l100672j610277L161324M881366J143684
12822E774635l192028l778220k720396l255153l213678O06120M664669K456182
12814b657869m530923p035847r85643O410677O918102J891284k022762k970556
12806d983537l565497l640437m36985M675058O302846K947904o49259q95743j52204
$$ plain form
12797 -397854 -1774031 -4107241 -3618147 1178542 5724988 4684283 -592961 -3413440
12789 -3413440 -642056 3199141 2475532 -1763481 -3876895 -1984100 296362 824646
12781 824646 2724705 8565356 14772172 15919297 12028567 7281006 3402779 -890199
12773 -890199 -5169917 -7307647 -7809961 -8923276 -9509275 -6416051 -1218225 765109 -712400
12764 -712400 63772 4689157 7212844 4488120 2241252 5276677 8860861 7053719
12756 7053719 3188073 3332009 4708523 939873 -4926994 -4225875 2055498 3894177
12748 3894177 -1203446 -4298095 -403494 3997842 3706188 3967275 9618559 14516763
12740 14516763 10948353 2676941 -1024105 586134 1289202 -46869 932393 4014688
$$ packed form
12797c97854j376177k333210M89094M796689M546446j040705n277244k820479
12789c413440K771384L841197p23609m239013k113414J892795K280462N28284
12781H24646J900059N840651O206816J147125l890730m747561l878227m292978
12773h90199m279718k137730n02314j113315n85999L093224N197826J983334j477509
12764g12400P76172M625385K523687k724724k246868L035425L584184j807142
12756G053719l865646J43936J376514l768650n866867P01119O281373J838679
12748C894177n097623l094649L894601M401336k91654K61087N651284M898204
12740A4516763l568410q271412l701046J610239P03068j336071R79262L082295
$$ plain form
12732 4014688 3819246 -357954 -2932828 -1876872 -2165987 -6599210 -10277025 -8449625
12724 -8449625 -4438069 -4642714 -8934233 -11083351 -7601984 -1920116 865891 629961
12716 629961 1588613 5512445 7964405 3689315 -5164981 -10260978 -7645324 -2546592
12708 -2546592 -702475 135994 4646265 10002888 9262464 3040827 -532154 1877557
12700 1877557 4434389 2093963 -2427153 -4851188 -5816180 -6937947 -6178778 -2078542
12692 -2078542 1983516 2609658 1502879 1258644 342908 -2525348 -3265835 1754832 7898890
12683 7898890 7315190 88175 -6504521 -8766983 -9532114 -10488435 -8941231 -3949599 468670
12674 468670 859635 -1425536 -3490502 -4357550 -3584442 -471596 3623208 5753332 5403237
$$ packed form
12732D014688j95442m177200k574874J055956k89115m433223l677815J827400
12724h449625M011556k04645m291519k149118L481367N681868K786007k35930
12716F29961R58652L923832K451960m275090q854296n095997K615654N098732
12708b546592J844117Q38469M510271N356623p40424o221637l572981K409711
12700A877557K556832k340426m521116k424035r64992j121767P59169M100236
12692b078542M062058O26142j106779k44235r15736k868256p40487N020667O144058
12683G898890n83700p227015o592696k262462p65131r56321J547204M991632M418269
12674D68670L90965k285171k064966q67048P73108L112846M094804K130124l50095
$$ plain form
12665 5403237 4489577 2965939 -826103 -4839317 -4453146 -809964 -1329666 -8321787 -13589637
12656 -13589637 -9632929 -646270 4014523 2794437 1112835 922039 -775589 -4328078
12648 -4328078 -6204627 -5582102 -5307010 -5571699 -3113698 1924944 4391976 1388563 -3997829
12639 -3997829 -7935400 -9686917 -8607504 -3176119 4317931 7912355 6384159 6058817
12631 6058817 10864994 14985561 11317630 2963079 -764082 2672690 7113717 7611956
12623 7611956 5264241 2072957 -2177727 -6359490 -7253243 -4792467 -3180714 -4252964
12615 -4252964 -4391202 -1208772 1220564 -1590166 -6425133 -5715745 2122600 10586643
12607 10586643 13350692 10372637 5090292 -228510 -4284264 -5308632 -3118285 -975572
$$ packed form
12665E403237r13660j523638l792042m013214L86171L643182n19702o992121n267850
12656a3589637L956708Q986659M660793j220086j681602j90796j697628l552489
12648d328078j876549O22525K75092k64689K458001N038642K467032l003413n386392
12639c997829l937571j751517J079413N431385P494050L594424j528196l25342
12631F058817M806177M120567l667931q354551l727161L436772M441027M98239
12623G611956k347715l191284m250684m181763q93753K460776J611753j072250
12615d252964j38238L182430K429336k810730m834967P09388P838345Q464043
12607A0586643K764049k978055n282345n318802m055754j024368K190347K142713
$$ plain form
12599 -975572 -2241723 -5782094 -7622728 -7071872 -7859806 -11962640 -15327146 -12419645 -3447441
12590 -3447441 5657679 9606113 7631004 1998933 -4075203 -7218093 -6168310 -3939400
12582 -3939400 -4526891 -6950626 -6532358 -3069859 -2516625 -7650225 -12378292 -10264978 -4378306
12573 -4378306 -2290897 -4442017 -5022397 -2755608 -2243189 -4205543 -3229066 2136915 5245264
12564 5245264 1736241 -2980923 -2217608 1903108 3251240 1759264 1522564 2481235 1752273
12555 1752273 910176 3805159 8116840 7392027 1958863 -381358 3518192 7048592
12547 7048592 4181934 -1919855 -4975492 -4415119 -3002785 -516349 4137493 7775153
12539 7775153 6158973 793346 -2857340 -2869331 -1677227 -397148 2346927 5951728
$$ packed form
12599i75572j266151l540371j840634N50856p87934m102834l364506K907501Q972204
12590c447441R105120L948434j975109n632071o074136l142890J049783K228910
12582c939400n87491k423735M18268L462499N53234n133600m728067K113314N886672
12573d378306K087409k151120n80380K266789N12419j962354R76477N365981L108349
12564E245264l509023m717164P63315M120716J348132j491976k36700R58671p28962
12555A752273q42097K894983M311681p24813n433164k340221L899550L530400
12547G048592k866658o101789l055637N60373J412334K486436M653842L637660
12539G775153j616180n365627l650686j1991J192104J280079K744075L604801
$$ plain form
12531 5951728 7357129 6049831 5212643 6619007 8243707 8277008 7633509 6683966 3409744
12522 3409744 -2370708 -6117912 -3530465 3346441 8272650 8123130 5112218 2250621
12514 2250621 -351419 -3870297 -7427036 -7830486 -2780717 5694599 11599646 10359396
12506 10359396 4224239 281584 1982928 5034070 3912899 101058 -78156 5010796
12498 5010796 9511728 8048129 2752865 -258047 953533 2675162 1301405 -2527689
12490 -2527689 -5993462 -7910973 -8998824 -9472438 -8105452 -3946057 1967086 7265778
12482 7265778 10407415 11677251 12065773 11672974 9625531 5593691 1234044 -348445
12474 -348445 2486310 7171020 8398994 3883361 -2133902 -3399937 417042 3138399
$$ packed form
12531E951728J405401j307298q37188J406364J624700L3301o43499r49543l274222
12522C409744n780452l747204K587447O876906M926209j49520l010912k861597
12514B250621k602040l518878l556739m03450N049769Q475316N905047j240250
12506A0359396o135157l942655J701344L051142j121171l811841j79214N088952
12498E010796M500932j463599n295264l010912J211580J721629j373757l829094
12490b527689l465773j917511j087851m73614J366986M159395N913143N298692
12482G265778L141637J269836L88522l92799k047443m031840m359647j582489
12474c48445K834755M684710J227974m515633o017263j266035L816979K721357
$$ plain form
12466 3138399 316432 -4979270 -6792119 -4129606 -976592 -32517 -152483 286556 939313
12457 939313 1038012 771613 426245 149385 731705 2369684 2665467 -1196550 -7626045
12448 -7626045 -11065763 -8758617 -4470332 -3456590 -5706008 -6582042 -3256217 1683125
12440 1683125 3364166 521328 -2468866 -422504 5601880 8403607 3750065 -3264047
12432 -3264047 -4913650 -1841973 -1522455 -6128003 -8956508 -5096531 874837 1867464
12424 1867464 -2152326 -6191076 -7878422 -8414488 -8945311 -10163239 -12595669 -13762820
12416 -13762820 -9045109 441320 5745336 1691303 -4226243 -2101736 5343629 7305086
12408 7305086 1920408 -1957615 144283 2495560 753010 -1041825 528946 1420408
$$ packed form
12466C138399k821967n295702j812849K662513L153014R44075j19966M39039O52757
12457I39313R8699k66399l45368k76860N82320J637979K95783l862017o429495
12448g626045l439718K307146M288285J013742k249418q76034L325825M939342
12440A683125J681041k842838k990194K046362O024384K801727m653542p014112
12432c264047j649603L071677L19518m605548k828505L859977N971368R92627
12424A867464m019790m038750j687346n36066n30823j217928k432430j167151
12416a3762820M717711R486429N304016m054033n917546K124507P445365J961457
12408G305086n384678l878023K101898K351277j742550j794835J570771Q91462
$$ plain form
12400 1420408 -1745786 -4277963 -1055752 4271244 5019657 2114812 1588683 4167149
12392 4167149 4584958 374304 -4712930 -6181050 -3257710 2064728 6841195 8229431
12384 8229431 5767872 2394287 1173253 2137425 4086188 7033698 10078762 9579392
12376 9579392 3533835 -3908743 -6462361 -3334613 699708 1840395 333054 -1999216
12368 -1999216 -3526986 -2669077 538492 3172896 2847440 1533731 2587812 5114311
12360 5114311 5439916 3442688 2654282 3980302 4284719 2306832 1260053 3476756 6394366
12351 6394366 6369113 3363403 -601307 -4731110 -8288603 -8571122 -3722749 3353203 7116115
12342 7116115 5509725 1647936 -760544 -1377335 -1798937 -2211484 -1462349 283881 1222160
$$ packed form
12400A420408l166194k532177L222211N326996P48413k904845n26129K578466
12392D167149M17809m210654n087234j468120K923340N322438M776467J388236
12384H229431k461559l373585j221034R64172J948763K947510L045064m99370
12376I579392o045557p442578k553618L127748M034321J140687j507341k332270
12368a999216j527770Q57909L207569K634404l25456j313709J054081K526499
12360E114311L25605j997228p88406J326020L04417j977887j046779K216703K917610
12351F394366k5253l005710l964710m129803l557493k82519M848373P075952L762912
12342G116115j606390l861789k408480o16791m21602m12547P49135J746230R38279
$$ plain form
12333 1222160 726765 492230 1529583 1879051 -301157 -2724306 -1507853 2565519 4345553
12324 4345553 1817217 -852804 93190 2395909 2243354 1057652 3109007 7925285
12316 7925285 9853265 5379032 -2490308 -7632316 -6507806 -809003 3689703 1847920
12308 1847920 -5251730 -10646196 -9384069 -4157955 -682556 -190935 -236748 -324378 -1637661
12299 -1637661 -2645386 -414998 4135589 7197622 7707330 7052383 4326038 -1688840
12291 -1688840 -6371584 -3152556 5037936 6762879 -1794576 -9816584 -6838639 2126365
12283 2126365 4291179 -2726481 -9330333 -8642191 -3991592 -1037597 -102166 837020 1331378
12274 1331378 740137 1762056 7198768 14419801 16994472 12558252 6377197 5143276
$$ packed form
12333A222160m95395k34535J037353L49468k180208k423149J216453M073372J780034
12324D345553k528336k670021R45994K302719j52555j185702K051355M816278
12316G925285J927980m474233p869340n142008J124510N698803M498706j841783
12308A847920p099650n394466J262127N226114L475399M91621m5813q7630j313283
12299a637661j007725K230388M550587L062033N09708o54947k726345o014878
12291a688840m682744L219028Q190492J724943q557455q022008K977945Q965004
12283B126365K164814p017660o603852O88142M650599K953995R35431R39186M94358
12274A331378n91241J021919N436712P221033K574671m436220o181055j233921
$$ plain form
12266 5143276 8538375 9873348 5558506 480694 1075545 5724927 7065273 3150822
12258 3150822 288758 3090447 7488928 7314853 3120317 -314460 -1606951 -2355589
12250 -2355589 -1792422 1717168 4981203 2563064 -4278656 -7454108 -2822606 4253172
12242 4253172 6901363 5567964 5102684 6657217 7028181 4226038 -392684 -4759991
12234 -4759991 -7542312 -7479760 -4368254 -702387 212810 -1965661 -4542143 -5178954 -3565681
12225 -3565681 -524918 2118250 1646497 -2367294 -5506953 -3089919 2605513 4440987
12217 4440987 845000 -1517125 1497663 4012531 -881795 -9176146 -10838095 -4763198
12209 -4763198 -402717 -3793443 -9823336 -10971392 -7000295 -2323980 620660 1257247
$$ packed form
12266E143276L395099J334973m314842n077812N94851M649382J340346l914451
12258C150822k862064K801689M398481j74075m194536l434777j292491p48638
12250b355589N63167L509590L264035k418139o841720l175452M631502P075778
12242D253172K648191j333399m65280J554533L70964k802143m618722m367307
12234d759991k782321O2552L111506L665867R15197k178471k576482o36811J613273
12225c565681L040763K643168m71753m013791l139659K417034N695432J835474
12217D440987l595987k362125L014788K514868m894326q294351j661949O074897
12209d763198M360481l390726o029893j148056L971097M676315K944640O36587
$$ plain form
12201 1257247 -1034253 -4390024 -4336393 -526178 767675 -4248953 -9807005 -8635771
12193 -8635771 -3124085 -1164521 -3705364 -4622103 -1751079 448110 -207311 -55584 3090011
12184 3090011 5942630 5728776 4352730 3832393 2795467 353846 -1303246 -1082846 -1372224
12175 -1372224 -3382026 -4260062 -1802571 1804803 3791771 4556044 4858204 3364892 273200
12166 273200 -629834 2505860 5399283 3221387 -2299988 -5541436 -4609029 -2232772 -682159
12157 -682159 254631 1089319 1707521 2176327 2295981 1225085 -838105 -2084019 -1663542
12148 -1663542 -934020 -818584 -328077 950265 1821794 2422385 4726204 8329750 9673777
12139 9673777 7705893 5982805 6478638 6278433 3945337 3575069 7369703 9485326 4033867
$$ packed form
12201A257247k291500l355771N3631L810215J293853n016628n558052J171234
12193h635771N511686J959564k540843r16739K871024K199189o55421J51727L145595
12184C090011K852619k13854j376046n20337j036926k441621j657092K20400k89378
12175a372224k009802q78036K457491L607374J986968P64273L02160j493312l091692
12166B73200r03034L135694K893423k177896n521375l241448R32407K376257J550613
12157f82159R36790Q34688O18202M68806J19654j070896k063190j245914M20477
12148a663542P29522J15436M90507J278342Q71529O00591K303819L603546J344027
12139I673777j967884j723088M95833k00205k333096l70268L794634K115623n451459
$$ plain form
12130 4033867 -4819776 -8127477 -4587225 -185018 2219996 4742679 7051558 5570305
12122 5570305 593713 -3254340 -4484564 -5670432 -6257123 -2131874 5809048 10230096
12114 10230096 7497074 2541034 258223 -1377482 -5317755 -8607137 -7188502 -3313726
12106 -3313726 -2456315 -5434197 -8496547 -9372802 -8979330 -8456211 -8021310 -7649584 -6283223
12097 -6283223 -2103753 3838177 6525749 2827733 -3288544 -4922827 -612184 4591683
12089 4591683 5640423 2191390 -2659423 -5678646 -5730413 -4734262 -5978026 -9893218 -12579845
12080 -12579845 -10441997 -5018222 -889610 -19960 -893477 -2188265 -3956660 -5489153
12072 -5489153 -5488498 -4828398 -5958760 -8697490 -9629484 -6960359 -3073095 -626036 813126
$$ packed form
12130D033867q853643l307701L540252M402207K405014K522683K308879j481253
12122E570305m976592l848053j230224j185868n86691M125249P940922M421048
12114A0230096k733022m956040k282811j635705l940273l289382J418635L874776
12106c313726Q57411k977882l062350q76255L93472N23119M34901L71726J366361
12097f283223M179470N941930K687572l698016o116277j634283M310643N203867
12089D591683J048740l449033m850813l019223n1767R96151j243764l915192k686627
12080a2579845K137848N423775M128612Q69650q73517j294788j768395j532493
12072e489153O55O60100j130362k738730r31994K669125L887264K447059J439162
$$ plain form
12063 813126 1783254 -119332 -5949249 -10105282 -5201489 7227595 16558829 16014041
12055 16014041 10688948 8828807 9925268 7828245 2660815 1233777 5233507 7330472
12047 7330472 2445161 -3910350 -3695756 2206197 6492706 6020882 3740816 2180732
12039 2180732 1332367 2262713 6665517 12138528 13081185 7681511 165793 -4724354 -5831726
12030 -5831726 -3778686 622211 4965996 6228396 4751718 3989009 5107543 5397067
12022 5397067 3373148 1595741 2345511 3975513 4008558 2874153 2020474 1004399 -727274
12013 -727274 -1304464 1347277 5909579 8574812 6919001 1785422 -3481287 -5009515
12005 -5009515 -1455604 4137544 7406977 7727681 7417511 6074450 487749 -8198569
$$ packed form
12063H13126R70128j902586n829917m156033M903793J2429084R331234n44788
12055A6014041n325093j860141J096461k097023n167430j427038L999730K096965
12047G330472m885311o355511K14594N901953M286509m71824k280066j560084
12039B180732q48365R30346M402804N473011R42657n399674p515718m890147j107372
12030e831726K053040M400897M343785J262400j476678p62709J118534K89524
12022E397067k023919j777407P49770J630002L3045j134405q53679j016075j731673
12013g27274n77190K651741M562302K665233j655811n133579n266709j528228
12005e009515L553911N593148L269433L20704l10170j343061n586701q686318
$$ plain form
11997 -8198569 -12507604 -7555007 2027597 8228979 9123097 7474119 3570599 -3727770
11989 -3727770 -10440643 -9692283 -1773836 4503927 3348822 -323036 1315880 7380881
11981 7380881 9632265 4029046 -4141964 -7550261 -5380779 -2332049 -1501576 -1622856
11973 -1622856 -959718 -515533 -1779911 -3546465 -3378531 -1121079 1396966 3352563 4993989
11964 4993989 5268942 2650120 -1315954 -2607644 -103911 2485456 1634143 -1500678
11956 -1500678 -3248393 -1921013 1452891 4805411 5953754 4027443 1405824 1818917
11948 1818917 5077909 6594892 3924542 367124 -445837 199156 -143107 267254 3939680
11939 3939680 8019231 7421820 3032434 1066566 4151183 8142991 8551125 5638066
$$ packed form
11997h198569m309035M952597R582604O201382Q94118j648978l903520p298369
11989c727770o712873P48360P918447O277763j155105l671858J638916O065001
11981G380881K251384n603219q171010l408297K169482L048730Q30473j21280
11973a622856O63138M44185j264378j766554J67934K257452K518045J955597J641426
11964D993989K74953k618822l966074j291690K503733K589367q51313l134821
11956a500678j747715J327380L373904L352520J148343j926311k621619M13093
11948A818917L258992J516983k670350l557418q12961O44993l42263M10361L672426
11939C939680M079551n97411m389386j965868L084617L991808M08134k913059
$$ plain form
11931 5638066 2114740 -323183 -1156340 -1193612 -3120601 -8346181 -13182381 -12563867 -8060159
11922 -8060159 -6955259 -11706669 -15700330 -12539307 -4952046 -637949 -2815358 -8695912
11914 -8695912 -14147563 -15780480 -11208595 -1915412 5798473 6959482 3817800 1978466
11906 1978466 2340701 1202311 -2838636 -6816952 -7878817 -5550971 26833 7479825
11898 7479825 11954052 8887880 1174650 -2537757 1301195 6587564 6246841 950984
11890 950984 -4068983 -6760480 -8490070 -9529426 -9019678 -7884464 -7660292 -7423846 -5457199
11881 -5457199 -2987605 -2728187 -4444896 -5399138 -4628882 -3589825 -3285421 -4054589 -7171802
11872 -7171802 -12693937 -16526478 -14276925 -7932079 -3878616 -3969192 -3844380 -1104408 850522
$$ packed form
11931E638066l523326k437923q33157l7272j926989n225580m836200O18514M503708
11922h060159J104900m751410l993661L161023P587261M314097k177409n880554
11914h695912n451651j632917M571885R293183P713885J161009l141682j839334
11906A978466L62235j138390m040947l978316j061865K327846N577804P452992
11898G479825M474227l066172p713230l712407L838952N286369l40723n295857
11890I50984n019967k691497j729590j039356N09748J135214K24172K36446J966647
11881e457199K469594K59418j716709r54242P70256J039057L04404p69168l117213
11872g171802n522135l832541K249553O344846M053463r0576J24812K739972J954930
$$ plain form
11863 850522 -339609 -1130626 1788191 5159177 4068103 -49265 -1724329 66178
11855 66178 964760 -1749156 -5630536 -6898796 -4574283 -333106 3547020 5790375 6760614
11846 6760614 6996702 5104895 -245936 -5509231 -3826307 5644905 14070931 12977637
11838 12977637 4711537 -1937305 -3552821 -3771500 -5356682 -7067200 -7688228 -7335330
11830 -7335330 -5132374 -911798 1673324 -462652 -3437214 -1126234 4471165 5394717
11822 5394717 415378 -3041875 -1130242 1319352 900366 1690736 6474125 10318853
11814 10318853 8942655 6108491 6117734 5922526 2227964 -84427 4434618 10951271 10807688
11805 10807688 5106412 1886150 2449746 1101470 -2775270 -3509532 -670955 -906377
$$ packed form
11863H50522j190131p91017K918817L370986j091074m117368j675064J790507
11855F6178Q98582k713916l881380j268260K324513M241177L880126K243355R70239
11846F760614K36088j891807n350831n263295J682924R471212Q426026j093294
11838A2977637q266100o648842j615516k18679j585182j710518o21028L52898
11830g335330K202956M220576K585122k135976k974562K310980N597399R23552
11822E394717m979339l457253J911633K449594m18986P90370M783389L844728
11814A0318853j376198k834164R243j95208l694562k312391M519045O516653j43583
11805A0807688n701276l220262N63596j348276l876740p34262K838577k35422
$$ plain form
11797 -906377 -5728780 -7646090 -2638913 2591871 1346368 -2779543 -2707665 1124490 3384439
11788 3384439 2870941 2160844 1641971 492524 1132173 6104106 11855831 11873901 5731118
11779 5731118 -469322 -2763399 -3228253 -4526263 -5504567 -4006741 -363324 3706571
11771 3706571 6835421 7413591 4214892 -956280 -4055853 -3865623 -3634973 -5902294 -8434902
11762 -8434902 -7835571 -4939447 -3548814 -5102559 -7528084 -8561816 -7354006 -3288820
11754 -3288820 3657684 10944938 14470876 12595540 7677112 3270036 1336693 2120535
11746 2120535 4503839 5977082 4388350 530276 -2668210 -3736271 -3331719 -1450697
11738 -1450697 2701381 7317156 8379140 5375136 2884754 3814538 4808418 2003060
$$ packed form
11797i06377m822403j917310N007177N230784j245503m125911P1878L832155K259949
11788C384439n13498p10097n18873j149447O39649M971933N751725J8070o142783
11779E731118o200440k294077m64854j298010r78304J497826L643417M069895
11771C706571L128850N78170l198699n171172l099573J90230K30650k267321k532608
11762h434902N99331K896124J390633j553745k425525j033732J207810M065186
11754c288820O946504P287254L525938j875336m918428m407076j933343P83842
11746B120535K383304J473243j588732l858074l198486j068061M04552J881022
11738a450697M152078M615775J061984l004004k490382R29784R93880k805358
$$ plain form
11730 2003060 -2206007 -2881442 -184057 2234504 4422980 9303458 15331558 16697944
11722 16697944 11834328 5812174 2751754 1405861 183657 797289 3793063 5493257
11714 5493257 3303063 209528 216042 2577056 4140817 4217716 3315008 83221 -6036655
11705 -6036655 -11257987 -10944101 -5453627 1030556 5991555 9252195 9747779 6102122
11697 6102122 271439 -3160970 -2033094 1339713 3295765 2271048 -567515 -2686188
11689 -2686188 -2747192 -2531053 -4674030 -7898142 -7605515 -2878314 923635 -426638 -3747580
11680 -3747580 -3702934 -936569 232292 -436609 229305 1877593 861951 -2704269 -4294024
11671 -4294024 -2146573 561088 1908297 3985785 7466840 8700263 5192517 -209596
$$ packed form
11730B003060m209067o75435K697385K418561K188476M880478O028100J366386
11722A6697944m863616o022154l060420j345893j222204O13632K995774J700194
11714E493257k190194l093535O514K361014J563761P6899r02708l231787o119876
11705f036655n221332L13886N490474O484183M960999L260640M95584l645657
11697F102122n830683l432409J127876L372807J956052j024717k838563k118673
11689b686188o1004K16139k142977l224112K92627M727201L801949j350273l320942
11680c747580M4646K766365J168861o68901O65914J648288j015642l566220j589755
11671d294024K147451K707661J347209K077488L481055J233423l507746n402113
$$ plain form
11663 -209596 -3664968 -5225768 -6223710 -5162687 -168573 6576647 10689797 10902468 9473405
11654 9473405 7978936 5527559 1194625 -3886143 -7305969 -7269948 -3905470 447871
11646 447871 2711137 1834787 -76912 -32501 2705444 6091575 7410625 5548639 1742487
11637 1742487 -1383054 -1799270 506542 3976582 6959709 8331663 7198084 3167658
11629 3167658 -2638556 -7369866 -7940277 -3464016 3244534 7152256 5363544 198259
11621 198259 -3293486 -3033681 -1677813 -2567794 -5891426 -9336277 -10406798 -7548909 -1688855
11612 -1688855 2368503 -611008 -9402284 -15914059 -14256386 -7503049 -2642865 -1684645
11604 -1684645 -1357725 783847 4105799 7195249 8655696 6999248 3243486 1890966
$$ packed form
11663b09596l455372j560800r97942J061023M994114O745220M113150K12671j429063
11654I473405j494469k451377m332934n080768l419826L6021L364478M353341
11646D47871K263266q76350j911699M4411K737945L386131J319050j861986l806152
11637A742487l125541m16216K305812L470040K983127J371954j133579m030426
11629C167658n806214m731310n70411M476261O708550L907722j788712n165285
11621A98259l491745K59805J355868q89981l323632l444851j070521K857889N860054
11612a688855M057358k979511q791276o511775J657673O753337M860184R58220
11604a684645L26920K141572L321952L089450J460447j656448l755762j352520
$$ plain form
11596 1890966 5490290 10011231 9890608 5930824 3352247 3511200 3159377 1266022 623331
11587 623331 2184459 3313176 2831897 2982050 4984033 6861647 6966249 5978284 4638403
11578 4638403 3134865 2962232 5267442 7265716 4931250 -537900 -3888803 -3577365
11570 -3577365 -2798313 -2630416 -980846 570596 -3148640 -10945117 -13420343 -6316367
11562 -6316367 1239791 -1273224 -10655989 -14663771 -8915895 -1364637 -442532 -5358290
11554 -5358290 -9363255 -8083105 -2867514 1661923 2154619 -612883 -3509100 -5413361
11546 -5413361 -7628962 -9578002 -7643616 -360975 8223358 12793630 11953230 7456961
11538 7456961 1549085 -2724851 -2278043 1858735 4422573 2933070 1114210 2003454
$$ packed form
11596A890966L599324M520941j20623l959784k578577J58953l51823j893355o42691
11587F23331J561128J128717m81279J50153K001983J877614J04602r87965j339881
11578D638403j503538j72633K305210J998274k334466n469150l350903L11438
11570c577365P79052J67897J649570J551442l719236p796477k475226P103976
11562f316367P556158k513015r382765m007782N747876P551258R22105m915758
11554e358290m004965J280150N215591M529437M92696k767502k896217j904261
11546e413361k215601j949040J934386P282641Q584333M570272q40400m496269
11538G456961n907876m273936M46808M136778K563838j489503j818860Q89244
$$ plain form
11530 2003454 2204198 -2021040 -7025055 -6566799 -1658434 1210586 216047 -426966 1099041
11521 1099041 1455936 -974127 -2724886 -1006843 2245711 4535175 6510960 8638034
11513 8638034 8104143 2886407 -3402690 -4566320 761099 7291995 8859898 4642762
11505 4642762 -659194 -2255213 -322209 1003167 -478732 -2117725 -840100 1496371
11497 1496371 187909 -5545653 -11125664 -12385860 -9978010 -7045978 -4987029 -3226729
11489 -3226729 -1605426 -919731 -1317076 -1533696 -326980 1586608 1658799 -1746772 -6932162
11480 -6932162 -10304054 -10399028 -9032373 -7949139 -6257641 -2584258 1862392 4364715
11472 4364715 3956797 1933609 -115683 -1202680 -654286 1396162 3718170 5454042
$$ packed form
11530B003454K00744m225238n004015M58256M908365K869020r94539o43013J526007
11521A099041L56895k430063j750759J718043L252554K289464J975785K127074
11513H638034n33891n217736o289097j163630N327419O530896J567903m217136
11505D642762n301956j596019J933004J325376j481899j638993J277625K336471
11497A496371j308462n733562n580011j260196K407850K932032K058949J760300
11489c226729J621303O85695l97345k16620J206716J913588P2191l405571n185390
11480f932162l371892r4974J366655J083234J691498L673383M446650K502323
11472D364715m07918k023188k049292j086997N48394K050448K322008J735872
$$ plain form
11464 5454042 7140809 9095297 9942325 8382707 5481225 3536207 3490297 4863905 6969493
11455 6969493 8402942 6855578 2031074 -2275658 -2055821 1191768 1680089 -3096786
11447 -3096786 -8679390 -8995810 -3791188 937447 -492303 -7477235 -13853486 -14145158
11439 -14145158 -8626809 -2141469 1053676 100997 -3725040 -8454138 -11239287 -9440664
11431 -9440664 -3437069 3227723 7587732 9629975 10349160 9729489 7846300 5729579
11423 5729579 3683499 779564 -2753964 -4973386 -5304722 -5513171 -6201147 -5438831 -2599762
11414 -2599762 -47199 1193944 3556163 7934092 10885725 10584622 11043319 15267750
11406 15267750 18345140 13924226 4596945 -1557136 -2980532 -5153223 -9413355 -9818313
$$ packed form
11464E454042J686767J954488Q47028j559618k901482j945018m5910J373608K105588
11455F969493J433449j547364m824504m306732K19837L247589M88321m776875
11447c096786n582604l16420N204622M728635j429750o984932o376251k91672
11439a4145158N518349O485340L195145r52679l826037m729098k785149J798623
11431i440664O003595O664792M360009K042243P19185o19671j883189k116721
11423E729579k046080k903935l533528k219422l31336k08449o87976P62316K839069
11414b599762K552563J241143K362219M377929K951633l01103M58697M224431
11406A5267750L077390m420914r327281o154081j423396k172691m260132m04958
$$ plain form
11398 -9818313 -3374610 3907954 5065610 1233230 -1179295 1126478 6023655 9578178
11390 9578178 9528192 6838965 4936596 5633980 6002644 2257831 -3688538 -5805192 -2380060
11381 -2380060 1819776 2821814 1954326 1380959 200681 -2205103 -3341914 -1474125
11373 -1474125 1131134 1918217 1837525 2545277 3072643 2443024 2528171 4842352 7102890
11364 7102890 6347493 3145227 -324824 -3706976 -6686790 -6733800 -2799345 1034903 81311
11355 81311 -4317778 -6817241 -5279893 -1834375 1703836 4750163 5396391 2148540 -1945958
11346 -1945958 -1959842 1715927 3729035 2100809 1090946 4004586 7994071 8818568 6895766
11337 6895766 5451471 5571302 6071346 5927830 4315381 704192 -2714758 -1806216 3201506
$$ packed form
11398i818313O443703P282564J157656l832380k412525K305773M897177L554523
11390I578178m9986k689227j902369O97384L68664l744813n946369k116654L425132
11381b380060M199836J002038q67488n73367j180278k405784j136811J867789
11373a474125K605259P87083q0692P07752N27366o29619Q5147K314181K260538
11364G102890p55397l202266l470051l382152k979814m7010L934455L834248r53592
11355H1311m399089k499463J537348L445518L538211L046327O46228l247851m094498
11346a945958j3884L675769K013108j628226j009863K913640L989485Q24497j922802
11337F895766j444295J19831N00044j43516j612449l611189l418950R08542N007722
$$ plain form
11328 3201506 5577334 718247 -5958123 -5607195 1138830 4740045 533778 -5297632
11320 -5297632 -6058589 -3959476 -4307684 -5728483 -3135943 2319419 3865463 -302454
11312 -302454 -3842450 -1665140 3023113 4348122 2279107 1302268 2999609 4377143
11304 4377143 2983534 -24684 -2410902 -3685770 -4497265 -5244802 -6396563 -8531966
11296 -8531966 -10601798 -9415159 -3110998 4884540 7706222 2261146 -6826809 -12238144
11288 -12238144 -11702354 -8236176 -3834178 2584265 9957751 12854913 8160385 554758
11280 554758 -3197411 -3047460 -3839773 -6638855 -7878493 -6542422 -5721129 -6165092 -4572968
11271 -4572968 -227601 2628980 1832251 1125509 3475332 5829570 4886568 3422062 5749395
$$ packed form
11328C201506K375828m859087o676370L50928O746025L601215m206267n831410
11320e297632p60957K099113l48208j420799K592540N455362J546044m167917
11312c02454l539996K177310M688253J325009k069015r76839J697341J377534
11304D377143j393609l008218k386218j274868q11495p47537j151761k135403
11296h531966k069832J186639O304161P995538K821682n445076r087955n411335
11288a2238144N35790L466178M401998O418443P373486K897162m694528p605627
11280E54758l752169J49951p92313k799082j239638J336071Q21293m43963J592124
11271d572968M345367K856581p96729p06742K349823K354238r43002j464506K327333
$$ plain form
11262 5749395 10548167 13510564 14172998 14737222 14520930 11280582 6681118 5114593 7590778
11253 7590778 11048706 12933384 12685747 10159232 6702747 6201905 10432646 14754199
11245 14754199 13241646 6964171 2295292 2153782 4105774 6033414 7809771 7837163
11237 7837163 4166299 -518338 -1000844 2505395 4204563 1615614 -1109881 -336575
11229 -336575 2153370 3477268 3769842 3770298 2987339 2282195 3508809 4639564 617393
11220 617393 -8133493 -13331471 -8781912 1554115 9231593 11284566 10618914 9773085
11212 9773085 8586554 6229455 2425042 -1898900 -3737223 -612387 4699922 6196374
11204 6196374 3394702 3123912 9328167 16108421 15597887 8592310 1954560 -1268074
$$ packed form
11262E749395M798772K962397O62434N64224k16292l240348m599464j566525K476185
11253G590778L457928J884678k47637k526515l456485n00842M230741M321553
11245A4754199j512553o277475m668879j41510J951992J927640J776357K7392
11237G837163l670864m684637m82506L506239J699168k588949k725495P73306
11229c36575K489945J323898K92574M56p82959p05144J226614J130755m022171
11220F17393q750886n197978M549559J0336027P677478K052973o65652q45829
11212I773085j186531k357099l804413m323942j838323L124836N312309J496452
11204F196374k801672k70790O204255O780254n10534p005577o637750l222634
$$ plain form
11196 -1268074 -3260618 -5167164 -5367170 -3355029 -655686 1608764 2471160 2322
11188 2322 -5522611 -9209018 -7095852 -2646767 -2430408 -6324882 -7864122 -4311259 -322616
11179 -322616 -310099 -2761404 -4502663 -5808460 -8023477 -9607114 -8148934 -4425563 -1566494
11170 -1566494 -1212991 -2376952 -3086305 -1833900 1346052 4028972 3037428 -1720369 -6339358
11161 -6339358 -7195635 -4853934 -2266978 -586105 987550 2162552 1417567 -690388
11153 -690388 -1036997 1450115 2922422 -678706 -7035307 -9215711 -4580207 1694383
11145 1694383 3817299 2606769 2257317 2921183 1514643 -1495284 -2024436 268457 250807
11136 250807 -4682168 -9592221 -8382776 -1768614 4639332 7518682 7572055 6302033 4822578
$$ packed form
11196a268074j992544j906546k00006K012141K699343K264450Q62396k468838
11188B322n524933l686407K113166M449085K16359l894474j539240L552863L988643
11179c22616J2517k451305j741259j305797k215017j583637J458180L723371K859069
11170a566494L53503j163961p09353J252405L179952K682920r91544m757797m618989
11161f339358q56277K341701K586956J680873J573655J175002p44985k107955
11153f90388l46609K487112J472307l601128o356601k180404M635504O274590
11145A694383K122916j210530l49452O63866j406540l009927n29152K292893j7650
11136B50807m932975m910053J209445O614162O407946K879350N3373j270022j479455
$$ plain form
11127 4822578 4525355 5503265 5192928 1510486 -3528151 -6005172 -5020452 -2916191 -1695510
11118 -1695510 -1823639 -3370239 -5425141 -5449117 -2317289 877479 302840 -3079594 -4919740
11109 -4919740 -3859372 -2619619 -2675621 -2025379 597391 2975249 2789618 1030316 4519
11100 4519 -81530 -627201 -2092034 -3676528 -4814124 -5724894 -6757741 -7766433 -8088213
11091 -8088213 -7446767 -7157091 -9198262 -12873737 -13969953 -9668185 -3234898 -654503
11083 -654503 -2879883 -4952326 -3336590 -359543 352601 -490224 390574 3444529 5625126
11074 5625126 4428930 506109 -3400476 -4812041 -3516161 -2285692 -4417341 -9243117
11066 -9243117 -11671906 -8288569 -2458006 -303007 -2264055 -2542779 2164089 7352354
$$ packed form
11127D822578k97223R77910l10337l682442n038637k477021R84720K104261J220681
11118a695510j28129j546600k054902k3976L131828L194768n74639l382434j840146
11109d919740J060368J239753n6002O50242K622770K377858j85631j759302j025797
11100D519q6049n45671j464833j584494j137596r10770j032847j008692l21780
11091h088213O41446K89676k041171l675475j096216M301768O433287K580395
11083f54503k225380k072443J615736K977047P12144q42825Q80798L053955K180597
11074E625126j196196l922821l906585j411565J295880J230469k131649m825776
11066i243117k428789L383337N830563K154999j961048k78724M706868N188265
$$ plain form
11058 7352354 6923017 1765883 -2112171 -2751174 -4336547 -9119933 -12386583 -9041633
11050 -9041633 -1583241 3456440 4952822 7078748 10131241 8588872 981672 -4855451
11042 -4855451 -1877029 5229310 5990154 -1236725 -7947891 -8424339 -6233206 -5908489 -5591836
11033 -5591836 -2349771 1161539 1418459 1349580 5976711 12857290 14225909 8593924 3178411
11024 3178411 3192467 5185575 4094132 1271561 1060374 3537904 5605260 6369521 6558399
11015 6558399 4975987 769277 -2604466 -1402392 1501283 -18346 -5203502 -6416210
11007 -6416210 -559941 6245173 8040569 6680940 6284710 6008602 3595811 1285566
10999 1285566 2075000 3581517 1867192 -1309249 -1500482 272265 -628252 -3496102 -2571949
$$ packed form
11058G352354m29337n157134l878054o39003j585373m783386l266650L344950
11050i041633P458392N039681J496382K125926L052493j542369p607200n837123
11042d855451K978422P106339P60844p226879o711166m76448K191133L24717L16653
11033e591836L242065L511310K56920o8879M627131O880579J368619n631985n415513
11024C178411J4056J993108j091443k822571k11187K477530K067356P64261J88878
11015F558399j582412m206710l373743J202074K903675j519629n185156j212708
11007f416210N856269O805114J795396j359629l96230k76108k412791k310245
10999A285566P89434J506517j714325l176441j91233J772747r00517k867850R24153
$$ plain form
10990 -2571949 3252481 8043120 7766573 5317810 4326904 3842592 2396386 2157532 4744664
10981 4744664 6535164 2700192 -5856895 -13068759 -14225541 -9677297 -3221007 1193156
10973 1193156 1961609 525414 -667186 -901357 -962708 -1018139 -791263 -963271 -1652105
10964 -1652105 -541187 3757381 7282868 4428665 -3779940 -10076690 -10381880 -7802299
10956 -7802299 -6258052 -5858036 -6486601 -9772137 -14088894 -13357420 -5539732 2177594 1873488
10947 1873488 -4614141 -8576111 -5470922 1406567 6619863 8023929 7429044 8349715
10939 8349715 11906928 14039916 9826857 1465090 -2991948 -1018672 284276 -4454965
10931 -4454965 -9497426 -6153860 4288296 12773001 14447805 11636539 7449696 3465746
$$ packed form
10990b571949N824430M790639k76547k448763r90906m84312j446206k38854K587132
10981D744664J790500l834972q557087p211864j156782M548244O456290M414163
10973A193156P68453j436195j192600k34171o1351n5431K26876j72008o88834
10964a652105J110918M298568L525487k854203q208605o296750l05190K579581
10956g802299J544247M00016o28565l285536m316757P31474P817688P717326l04106
10947A873488o487629l961970L105189O877489N213296J404066n94885R20671
10939H349715L557213K132988m213059q361767m457038J973276J302948m739241
10931d454965n042461L343566J0442156Q484705J674804k811266m186843l983950
$$ plain form
10923 3465746 2040287 3983857 4961137 686164 -5315977 -5809074 -904926 2148936
10915 2148936 272147 -1686897 402418 4516449 7690882 10317051 12484854 11523675
10907 11523675 6525051 1246104 -427467 1163165 3458683 4740067 3705105 -335443
10899 -335443 -5026212 -6080602 -2575287 1839759 4163275 5050594 5490751 4471281 1803028
10890 1803028 -423126 -1299387 -2639044 -5050027 -6020182 -4304013 -2736212 -3779379
10882 -3779379 -5402351 -4729965 -3199042 -4325953 -7980034 -10510123 -9826224 -7352881
10874 -7352881 -5351719 -4875041 -6151619 -8672819 -10740757 -10761750 -9265589 -8240156 -8254427
10865 -8254427 -7589875 -4788540 -1037440 991335 404607 -865047 -712133 405845 588908
$$ packed form
10923C465746j425459J943570R77280m274973o002141m93097M904148L053862
10915B148936j876789j959044K089315M114031L174433K626169K167803r61179
10907A1523675m998624n278947j673571J590632K295518J281384j034962m040548
10899c35443m690769j054390L505315M415046K323516Q87319M40157j019470k668253
10890A803028k226154q76261j339657k410983r70155J716169J567801j043167
10882c779379j622972O72386J530923j126911l654081k530089O83899K473343
10874g352881K001162M76678j276578k521200k067938k0993J496161J025433j4271
10865h254427O64552K801335L751100K028775n86728j269654J52914J117978J83063
$$ plain form
10856 588908 -283043 -466311 291590 -357642 -3925235 -8472463 -10950812 -10504819 -7982820
10847 -7982820 -4097190 -57224 1750880 160057 -2795956 -4224950 -3509721 -1654355
10839 -1654355 519674 1789978 654825 -1795656 -2088764 -94979 -845853 -6760033
10831 -6760033 -11995845 -10071577 -3829957 -1022051 -2268315 -1348077 3284996 5890530
10823 5890530 3627458 1170076 2197136 3465551 1435482 -1260041 -822249 873294
10815 873294 -526170 -5016950 -9070357 -10889929 -11027073 -9844140 -7781848 -6396869
10807 -6396869 -6313356 -5955240 -4565002 -3938206 -4583460 -3217026 2264473 7869951 8004320
10798 8004320 3409864 85048 772527 2052117 606982 -1793589 -1780700 -72189 -550255
$$ packed form
10856E88908q71951j83268P57901o49232l567593m547228k478349M45993K521999
10847g982820L885630M039966J808104j590823k956013j428994P15229J855366
10839a654355K174029J270304j135153k450481k93108J993785p50874n914180
10831f760033n235812J924268O241620K807906j246264R20238M633073K605534
10823E890530k263072k457382J027060J268415k030069k695523M37792J695543
10815H73294j399464m490780m053407j819572j37144J182933K062292J384979
10807f396869Q3513L58116J390238O26796o45254J366434N481499N605478J34369
10798H004320m594456l324816O87479J279590j445135k400571J2889J708511m78066
$$ plain form
10789 -550255 -4347856 -7658388 -6501888 -1996551 1124605 738204 -534151 -254310 -464741
10780 -464741 -4511771 -11196685 -15206738 -13043885 -6182591 1155338 5051571 3519427
10772 3519427 -2023762 -7093643 -8275290 -6388415 -3487013 1069269 7705342 12140007
10764 12140007 9825272 4146358 3318502 8219733 10548664 5686583 172362 1688649
10756 1688649 7681650 10128175 7285582 3881105 2303122 682378 -1144304 -424227
10748 -424227 3014080 5500410 5193231 4557974 5500379 6031534 4139254 1746772 1802472
10739 1802472 3429715 3131787 132661 -2223923 -795165 3403811 6278290 4801961
10731 4801961 -335538 -5538485 -7415582 -5673601 -3219938 -2885689 -4059589 -3640167
$$ packed form
10789e50255l797601l310532J156500M505337L121156l86401j272355K79841k10431
10780d64741m047030o684914m010053K162853O861294P337929L896233j532144
10772C519427n543189n069881j181647J886875K901402M556282O636073M434665
10764A2140007k314735n678914q27856M901231K328931m862081n514221J516287
10756A688649N993001K446525k842593l404477j577983j620744j826682P20077
10748d24227L438307K486330l07179o35257R42405N31155j892280k392482N5700
10739A802472J627243k97928k999126k356584J428758M198976K874479j476329
10731D801961n137499n202947j877097J741981K453663L34249j173900M19422
$$ plain form
10723 -3640167 -537158 2528027 2839495 1462227 1146680 2036926 2315533 1952562 2210495
10714 2210495 2025386 -776376 -4394999 -4037696 624168 3728338 1141487 -4334073
10706 -4334073 -8039949 -8948724 -7198300 -1650969 5712826 8210061 2912338 -3662251
10698 -3662251 -4239886 -806770 828868 1851969 6830984 12437467 10450495 1754614
10690 1754614 -3112843 636613 5524394 4147758 -292876 -777433 2592590 4076547
10682 4076547 903595 -4233005 -7142774 -5822731 -2009740 -166189 -2521231 -5189113
10674 -5189113 -2784042 3588906 7754747 7551300 6539336 6295208 3996182 -492136
10666 -492136 -2273311 525163 2781868 583454 -2337852 -1139601 2148433 2709553
$$ packed form
10723c640167L103009L065185L11468j377268l15547Q90246K78607l62971K57933
10714B210495j85109k801762l618623L57303M661864L104170k586851n475560
10706d334073l705876r08775J750424N547331P363795K497235n297723o574589
10698c662251n77635L433116J635638J023101M979015N606483j986972q695881
10690A754614m867457L749456M887781j376636m440634m84557L370023J483957
10682D076547l172952n136600k909769J320043L812991J843551k355042k667882
10674e189113K405071O372948M165841k03447j011964k44128k299026m488318
10666d92136j781175K798474K256705k198414k921306J198251L288034N61120
$$ plain form
10658 2709553 1355588 3047328 8850499 14321504 15327744 12031480 7489581 4702316
10650 4702316 4713972 6222544 7387870 7999291 8576745 8178019 5743990 2912893 2054353
10641 2054353 1974105 -405006 -4249425 -5157032 -1594444 3422673 7383591 10338138 11514849
10632 11514849 9032059 4101021 862007 944964 2327510 3764868 5614405 6465103
10624 6465103 4487902 2025984 2854610 5255978 4762384 3293954 6884348 13641097
10616 13641097 13941978 5426581 -2123741 -1436308 2036020 610216 -3249330 -2660111
10608 -2660111 1851408 4347487 3420620 2926160 4905080 7373786 8037242 6665477 4917507
10599 4917507 5303833 8203303 9969789 7793380 5528704 8759279 14763243 15245704
$$ packed form
10658B709553j353965J691740N803171N471005J006240l296264m541899k787265
10650D702316J1656J508572J165326O11421N77454l98726k434029k831097q58540
10641B054353q0248k379111l844419r07607L562588N017117L960918K954547J176711
10632A1514849k482790m931038l239014Q2957J382546J437358J849537Q50698
10624F465103j977201k461918Q28626K401368m93594j468430L590394O756749
10616A3641097L00881q515397p550322O87433L472328j425804l859546N89219
10608b660111M511519K496079r26867m94460J978920K468706O63456j371765j747970
10599D917507L86326K899470J766486k176409k264676L230575O003964M82461
$$ plain form
10591 15245704 9418575 5251958 6056045 5831694 1364921 -1209348 2820948 8455320
10583 8455320 9440377 7129241 5108963 2543120 -1233040 -2557314 385279 3763507
10575 3763507 5167069 7201221 9738474 7296418 -490640 -4905102 -1105222 3829529
10567 3829529 2926349 652323 4125838 10804864 13445108 10975824 6978596 3408635
10559 3408635 2126219 5952694 12524501 14631725 11698680 11762626 16911024 18140801
10551 18140801 11595365 7314728 12465700 18250563 14892768 8225257 8589421 13372899
10543 13372899 14137646 12314616 14078179 17257156 16758582 16026871 20080864 23825725
10535 23825725 20080706 12915218 10759469 12678569 13287292 14307551 19180381 23148382
$$ packed form
10591A5245704n827129m166617Q04087k24351m466773k574269M030296N634372
10583H455320R85057k311136k020278k565843l776160j324274K942593L378228
10575C763507J403562K034152K537253k442056p787058m414462L799880M934751
10567C829529r03180k274026L473515O679026K640244k469284l997228l569961
10559C408635j282416L826475O571807K107224k933045O3946N148398J229777
10551A8140801o545436m280637N150972N784863l357795o667511L64164M783478
10543A3372899P64747j823030J763563L178977m98574p31711M053993L744861
10535B3825725l745019p165488k155749J919100O08723J020259M872830L968001
$$ plain form
10527 23148382 20665118 15899104 14819933 14469432 10677101 7587163 8936343 9800124
10519 9800124 7336128 8026602 13779385 14888259 8286248 6438029 15077200 20790704
10511 20790704 15785603 13818997 23549747 29519556 21317241 16408059 28054223 37236569
10503 37236569 27156375 17742380 29655503 42823614 33458633 22960073 39563144
10496 39563144 60571000 52534434 40539381 65784038 100598391 94852174 87644997
10489 87644997 157567067 254190428 212578046 -10015969 -231914333 -268570550 -161983260
10482 -161983260 -85557494 -96300085 -108457706 -72226130 -40695847 -53014319 -68329680
10475 -68329680 -49710508 -26087832 -30549626 -43604899 -37614998 -25605834 -28558295
$$ packed form
10527B3148382k483264m766014j079171l50501l792331l089938J349180Q63781
10519I800124k463996O90474N752783J108874o602011j848219Q639171N713504
10511B0790704n005101j966606R730750N969809q202315m909182J1646164R182346
10503C7236569j0080194r413995J1913123J3168111r364981j0498560J6603071
10496C9563144K1007856q036566j1995053K5244657L4814353n746217p207177
10489H7644997O9922070R6623361m1612382k22594015k21898364l6656217J06587290
10482a61983260P6425766j0742591j2157621L6231576L1530283j2318472j5315361
10475f8329680J8619172K3622676m461794j3055273N989901J2009164k952461
$$ plain form
10468 -28558295 -35681951 -30992775 -25104616 -30469535 -34677787 -25664129 -16841482 -21619779
10460 -21619779 -27164973 -18400411 -6562550 -9195591 -19763883 -20825391 -12880130 -8346908
10452 -8346908 -8669267 -7096720 -4800491 -7148951 -11662482 -13410799 -14604149 -17595548
10444 -17595548 -17367432 -11405025 -7291757 -10227803 -13025072 -8825467 -3586212 -4975590
10436 -4975590 -8434327 -5883769 -219051 308355 -4310708 -8283050 -10584061 -13644966
10428 -13644966 -15939532 -14119656 -9207510 -4698802 -2082052 -2190122 -6014782 -10828467
10420 -10828467 -11327257 -7513010 -4990694 -5353799 -4155064 -643631 -399249 -5152033
10412 -5152033 -9270597 -9827023 -10667619 -13007791 -12164694 -7658255 -6016189 -9103440 -10653222
$$ packed form
10468b8558295p123656M689176N888159n364919m208252R013658Q822647m778297
10460b1619779n545194Q764562J1837861k633041j0568292j061508P945261M533222
10452h346908l22359J572547K296229k348460m513531j748317j193350k991399
10444a7595548K28116N962407M113268k936046k797269M199605N239255j389378
10436d975590l458737K550558N664718N27406m619063l972342k301011l060905
10428a3644966k294566J819876M912146M508708K616750j08070l824660m813685
10420a0828467m98790L814247K522316l63105J198735L511433K44382m752784
10412e152033m118564n56426q40596k340172Q43097M506439J642066l087251j549782
$$ plain form
10403 -10653222 -9104473 -11627142 -19156743 -20484809 -10038335 682019 105421 -5892045
10395 -5892045 -5686269 -1649504 -3942851 -10962696 -11207436 -2635213 3413323 -1085021
10387 -1085021 -10557463 -14941876 -11979909 -7520610 -7588204 -12245317 -16059799 -14551582
10379 -14551582 -9806387 -7276558 -7720306 -7083897 -4460921 -3829480 -6417166 -8057095
10371 -8057095 -6511429 -4759862 -4372407 -2652761 532404 538191 -3576688 -5801514 -2935133
10362 -2935133 -319980 -2732480 -6552644 -6629910 -4405159 -3308266 -2243220 202168
10354 202168 816863 -2585198 -5671951 -3959584 -105212 937474 -386456 -853907 -346194
10345 -346194 153895 1978888 5125253 5816854 2665857 334028 2024733 3674517 1106343
$$ packed form
10403a0653222J548749k522669p529601j328066J0446474J0720354n76598n997466
10395e892045K05776M036765k293347p019845k44740Q572223O048536m498344
10387a085021r472442m384413K961967M459299o7594m657113l814482J508217
10379a4551582M745195K529829m43748O36409K622976O31441k587686j639929
10371h057095J545666J751567L87455J719646L185165N787m114879k224826K866381
10362b935133K615153k412500l820164p7266K224751J096893J065046K445388
10354B02168O14695l402061l086753J712367L854372J042686j323930m67451N07713
10345c46194N00089J824993L146365O91601l150997k331829J690705J649784k568174
$$ plain form
10336 1106343 -2627154 -3272583 -3253653 -6352779 -9247443 -6263873 647880 4275434 2430063
10327 2430063 -773340 -2361752 -3350414 -5172547 -7878413 -10784221 -11712038 -7837282
10319 -7837282 -158027 5925008 7098953 5404281 2902413 -1313460 -5672926 -4480453
10311 -4480453 3226505 9405043 7530026 1771467 -513563 239475 -554196 -2126448
10303 -2126448 -471992 3701619 6607561 7866152 8563305 6291216 -690232 -7470378
10295 -7470378 -8021740 -4148358 -1934559 -1994057 -585626 2007815 2047449 -162704 -810731
10286 -810731 159005 -821380 -3945668 -5434473 -3887288 -1917238 -1601089 -2625401 -4125775
10277 -4125775 -4676504 -2315360 1822873 2794150 -1306151 -5491343 -5271679 -3336780 -3668133
$$ packed form
10336A106343l733497o45429J8930l099126k894664K983570O911753L627554j845371
10327B430063l203403j588412r88662j822133k705866k905808r27817L874756
10319g837282P679255O083035J173945j694672k501868m215873m359466J192473
10311d480453P706958O178538j875017n758559k285030P53038p93671j572252
10303b126448J654456M173611K905942J258591O97153k272089o981448o780146
10295g470378n51362L873382K213799n9498J408431K593441L9634k210153o48027
10286h10731R69736r80385l124288j488805J547185J970050L16149j024312j500374
10277d125775n50729K361144M138233R71277m100301m185192K19664J934899l31353
$$ plain form
10268 -3668133 -4382860 -3081495 -3621770 -9126977 -13401708 -9282658 -1465078 -14505
10260 -14505 -4143089 -4551063 -260490 243744 -4575287 -5429703 1608518 7631025 5619956
10251 5619956 1944494 5425135 13172807 15876718 11667937 6463450 3783613 1655769
10243 1655769 -1635072 -4663244 -5879848 -5723344 -5362367 -5355407 -5467722 -4980187 -3863311
10234 -3863311 -3536318 -4835091 -5739072 -3735422 -144621 1071606 -1160096 -4072876
10226 -4072876 -5841086 -7602092 -9941589 -10914240 -8817699 -4203254 1510223 6663874
10218 6663874 8583751 5784193 1374639 361206 2666480 2938458 -1171704 -4772237
10210 -4772237 -2554504 3326986 5672986 1096790 -6360676 -10043224 -7223702 -870270
$$ packed form
10268c668133p14727J301365n40275n505207m274731M119050P817580J450573
10260a4505m128584m07974M290573N04234m819031q54416P038221O022507k011069
10251E619956l675462L480641P747672K703911m208781n204487k679837k127844
10243A655769l290841l028172j216604J56504L60977O960j12315M87535J116876
10234c863311L26993j298773r03981K003650L590801J216227k231702k912780
10226d072876j768210j761006k339497r72651K096541M614445N713477N153651
10218F663874J919877k799558m409554j013433K305274K71978m110162l600533
10210d772237K217733N881490K346000m576196p457466l682548K819522O353432
$$ plain form
10202 -870270 3845614 4133567 769897 -4257371 -9440404 -12891320 -12469097 -8589891 -4816970
10193 -4816970 -3395561 -2093975 1923001 6949822 8722916 6335686 2869910 803831
10185 803831 -110847 -682827 -745010 44663 1525479 2865950 2367053 -921535 -4637523
10176 -4637523 -5013510 -2641019 -2450624 -5747310 -7084768 -2861209 1999595 1502146 -1706368
10167 -1706368 -1103141 2446380 2273826 -2707763 -6419997 -5572107 -3559292 -3219893 -2720375
10158 -2720375 -806855 -83579 -2295497 -5154901 -6499358 -7634813 -10111457 -12432059
10150 -12432059 -12183160 -9166991 -5137003 -2316268 -2420280 -5039377 -7325809 -7403410 -6856593
10141 -6856593 -7331865 -6961051 -3959347 -1305418 -2687616 -5547350 -3956088 2417834
$$ packed form
10202h70270M715884K87953l363670n027268n183033l450916M22223L879206L772921
10193d816970J421409J301586M016976N026821J773094k387230l465776k066079
10185H03831r14678n71980o2183P89673J480816J340471m98897l288588l715988
10176d637523l75987K372491J90395l296686j337458M223559M860804m97449l208514
10167a706368O03227L549521j72554m981589l712234Q47890K012815L39399M99518
10158b720375J913520P23276k211918k859404j344457j135455k476644k320602
10150a2432059K48899L016169M029988K820735j04012k619097k286432p7601N46817
10141f856593m75272L70814L001704K653929j382198k859734J591262O373922
$$ plain form
10133 2417834 7857026 8615069 6037302 2340953 -1206388 -2588023 -1089321 -76013
10125 -76013 -2047119 -2850344 2113546 8100472 6538399 -696113 -3046577 1920394 4755638
10116 4755638 41125 -5194650 -4044944 -434203 -571364 -2505786 -1809933 -377409
10108 -377409 -1617066 -2883221 -616072 1971738 101409 -3856695 -4259109 -1069636
10100 -1069636 2169880 5493058 10270145 13255260 10720743 5908320 4530490 5115463
10092 5115463 2090169 -3205480 -3728408 1013170 2976126 -2193354 -8855311 -10396648
10084 -10396648 -7967574 -6400914 -6659951 -6692110 -6294300 -6999906 -8899143 -10390594 -9918174
10075 -9918174 -6489398 -218677 6322486 9198617 7023936 2350523 -1709148 -4432002
$$ packed form
10133B417834N439192P58043k577767l696349l547341j381635J498702J013308
10125g6013j971106q03225M963890N986926j562073p234512k350464M966971K835244
10116D755638m714513n235775J149706L610741j37161j934422O95853J432524
10108c77409j239657j266155K267149K587810j870329l958104m02414L189473
10100a069636L239516L323178M777087K985115k534517m812423j377830N84973
10092E115463l025294n295649n22928M741578J962956n169480o661957j541337
10084a0396648K429074J566660k59037l2159L97810p05606j899237j491451M72420
10075i918174L428776O270721O541163K876131k174681m673413m059671k722854
$$ plain form
10067 -4432002 -6222422 -6688600 -5602028 -4034023 -2793156 -1144753 1071122 1320691
10059 1320691 -3151866 -10990073 -17204235 -18577404 -16747460 -14955815 -13603820 -11050974
10051 -11050974 -7631788 -5846675 -6185590 -5744228 -2683351 326826 -265486 -3273902
10043 -3273902 -3842195 142815 5346295 7033717 3921687 -1232004 -4342713 -3346077
10035 -3346077 -165618 1085963 -975319 -3154406 -2401583 -423277 -794025 -3371473
10027 -3371473 -5289471 -5905124 -6280872 -5056907 -359265 4662724 4522559 251743 -1254132
10018 -1254132 1406368 867502 -6969114 -14688446 -13450529 -6102397 -2642419 -5626163
10010 -5626163 -8105706 -5374590 -1069794 29050 -961441 -353117 1879496 2768206 1136192
$$ packed form
10067d432002j790420m66178J086572J568005J240867J648403K215875K49569
10059A320691m472557p838207o214162j373169J829944J791645J351995K552846
10051a1050974L419186J785113l38915M41362L060877L010177n92312l008416
10043c273902n68293L985010N203480J687422l112030n153691l110709R96636
10035c346077L180459J251581k061282k179087P52823J978306l70748k577448
10027c371473j917998o15653l75748J223965M697642N021989j40165m270816j505875
10018a254132K660500n38866p836616p719332J237917P348132L459978k983744
10010e626163k479543K731116M304796J098844r90491O08324K232613Q88710j632014
$$ plain form
10001 1136192 -1288099 -2643559 -2589331 -1500957 205322 1659479 1640995 -267212 -3188307
9992 -3188307 -6057651 -8479777 -9677093 -7695630 -1828866 4463667 6105067 2838150
9984 2838150 -23851 992848 2953369 2279819 1143983 3113109 5321269 1521417
9976 1521417 -7879360 -15249341 -15644866 -11487613 -6603059 -1661196 2669965 3758574
9968 3758574 1036629 -2260498 -3599269 -3639226 -3096659 -1714344 -1312413 -4304265 -7851768
9959 -7851768 -5976586 434514 3110191 -755696 -3116512 2159288 8916762 8577288
9951 8577288 3850292 3408192 7331547 7943952 3172847 -782657 -308530 921701 -221380
9942 -221380 -1350769 -212580 772534 -860649 -2767967 -1203567 3215181 6107253 4567192
$$ packed form
10001A136192k424291j355460N4228J088374J706279J454157j8484j908207k921095
9992c188307k869344k422126j197316J981463N866764O292533J641400l266917
9984B838150k862001J016699J960521o73550j135836J969126K208160l799852
9976A521417r400777p369981l95525M157253M884554M941863M331161J088609
9968C758574k721945l297127j338771l9957N42567J382315M01931k991852l547503
9959g851768J875182O411100K675677l865887k360816N275800O757474l39474
9951H577288m726996m42100L923355O12405m771105l955504M74127J230231j143081
9942b21380j129389J138189R85114j633183j907318J564400M418748K892072j540061
$$ plain form
9933 4567192 -4728 -3821160 -4549005 -3160241 -1908717 -1229695 -385311 -538987 -3553280
9924 -3553280 -7075695 -5532841 1545059 6923730 5218528 712545 678231 4670208 6580481
9915 6580481 4706831 2922911 2948258 2342058 591166 889214 4099632 6005190 3175577
9906 3175577 -1702858 -2905545 1385941 6768047 7144982 1726534 -2960089 -223272
9898 -223272 7666091 11459941 7162898 981890 -752420 -548010 -3636585 -8547668 -10521602
9889 -10521602 -9839663 -9433667 -8217073 -4720627 -3292605 -7395331 -10537075 -5065744
9881 -5065744 2925952 1142171 -7081025 -4468395 12800745 25479109 17826637 158550
9873 158550 -7490327 -3958658 -4149964 -13175908 -19548421 -14796742 -6049876 -3990929 -7628694
$$ packed form
9933D567192m571920l816432p27845J388764J251524O79022Q44384j53676l014293
9924c553280l522415J542854P077900N378671j705202m505983l4314L991977J910273
9915F580481j873650j783920K5347o06200j750892K98048L210418J905558k829613
9906C175577m878435j202687M291486N382106L76935n418448m686623K736817
9898b23272P889363L793850m297043o181008j734310K04410l088575m911083j973934
9889a0521602O81939M05996J216594L496446J428022m102726l141744N471331
9881e065744P991696j783781q223196K612630J7269140J2678364p652472j7668087
9873A58550p648877L531669j91306r025944o372513M751679Q746866K058947l637765
$$ plain form
9864 -7628694 -7796287 -953233 6669925 7347039 240151 -8680592 -12960211 -11108206 -6471767
9855 -6471767 -2946575 -1818317 -2178688 -2473685 -1399403 753871 1362221 -1510740 -4982144
9846 -4982144 -3595809 2878121 7493856 4751288 -1737073 -3871104 307822 4525963
9838 4525963 2687153 -3795653 -8106482 -5831494 544725 4859528 4322092 1989582
9830 1989582 1445121 1191497 -2594970 -8984964 -12430964 -10372066 -6218417 -3473542 -1523134
9821 -1523134 541981 806609 -1051258 -476512 5766208 12887411 13110909 6205157 -274273
9812 -274273 -1131206 996522 1243949 -735436 -1814861 -370002 2288158 4233561 4774238
9803 4774238 4238863 3028775 1220735 -977414 -2661151 -2765934 -1317169 608068 2279799
$$ packed form
9864g628694j67593O843054P623158O77114p106888q920743m279619J852005M636439
9855f471767L525192J128258l60371k94997J074282K153274O08350k872961l471404
9846d982144J386335O473930M615735k742568o488361k134031M178926M218141
9838D525963j838810o482806m310829K274988O376219M314803n37436k332510
9830A989582n44461k53624l786467o389994l446000K058898M153649K744875J950408
9821a523134K065115K64628j857867N74746O242720P121203K23498o905752o479430
9812b74273q56933K127728K47427j979385j079425J444859K658160J945403N40677
9803D774238n35375j210088j808040k198149j683737j04783J448765J925237J671731
$$ plain form
9794 2279799 3529112 3366696 219408 -5335352 -9649136 -9506855 -5712959 -1801958 -38818
9785 -38818 -227816 -1706915 -4374436 -7322946 -8061450 -4533577 1989448 6893155 6195510
9776 6195510 828555 -4036552 -4607908 -2308349 -1008482 -1938424 -3257226 -3451112 -2603912
9767 -2603912 -883981 1641368 3889306 4697817 4416425 3496145 869371 -3331491 -5330047
9758 -5330047 -2429810 1248586 -546070 -6291023 -8161699 -4131742 -1159488 -3856954
9750 -3856954 -7574531 -7105571 -5296086 -7042183 -10474771 -11012981 -9728828 -10372512 -11550056
9741 -11550056 -9558549 -6471682 -7248169 -10125556 -8283813 -1150325 4096029 3571804
9733 3571804 1532972 1860296 1962843 -1151244 -4814658 -5233295 -3544560 -2931447 -3271137
$$ packed form
9794B279799J249313j62416l147288n554760m313784J42281L793896L911001J763140
9785c8818j88998j479099k667521k948510p38504L527873O523025M903707o97645
9776F195510n366955m865107n71356K299559J299867r29942j318802j93886Q47200
9767b603912J719931K525349K247938Q08511k81392r20280k626774m200862j998556
9758e330047K900237L678396j794656n744953j870676M029957K972254k697466
9750c856954l717577M68960J809485j746097l432588n38210J284153o43684j177544
9741a1550056J991507L086867p76487k877387J841743P133488N246354n24225
9733C571804k038832L27324J02547l114087l663414m18637J688735O13113l39690
$$ plain form
9724 -3271137 -2897996 -2710806 -4270229 -6129835 -6176642 -5736003 -7215415 -9164366 -8131442
9715 -8131442 -4738229 -3297414 -5015228 -5986124 -3438475 -58993 539206 -333456 1227195
9706 1227195 5047747 6620751 3725342 -412828 -2039953 -1772727 -2095886 -2570210 -1188884
9697 -1188884 939478 627442 -1724839 -1942259 1313763 4003058 2926738 578749 696537
9688 696537 2333604 2301704 963914 1024719 2017786 773005 -2892317 -5271089 -4062820
9679 -4062820 -1079736 861771 706738 -1377783 -4037299 -3960999 1242768 8478426 11015701
9670 11015701 6370502 -736661 -4672908 -4824202 -3383795 -816576 3148071 6362468
9662 6362468 5950477 2457872 -653180 -1427642 -935050 -511583 66126 1011986 974442
$$ packed form
9724c271137L73141J87190j559423j859606m6807M40639j479412j948951J032924
9715h131442L393213J440815j717814r70896K547649L379482N98199q72662J560651
9706A227195L820552J573004k895409m138170j627125K67226l23159m74324J381326
9697a188884K128362l12036k352281k17420L256022K689295j076320k347989J17788
9688F96537J637067l1900j337790O0805R93067j244781l665322k378772J208269
9679d062820K983084J941507j55033k084521k659516P6300N203767P235658K537275
9670A1015701m645199p107163l936247j51294J440407K567219L964647L214397
9662F362468m11991l492605l111052p74462M92592M23467N77709R45860l7544
$$ plain form
9653 974442 -1668336 -6418462 -10222744 -9636269 -3924118 3500000 7278179 4862877 -729246
9644 -729246 -3701161 -1420371 3010555 4689671 2762461 980263 2374990 5319444
9636 5319444 6320398 5091796 4170858 4180405 2957068 60216 -1439379 341580 2618512
9627 2618512 1898144 -918279 -2473245 -2071802 -1354098 -268611 2632347 6341840 7752403
9618 7752403 6215009 4398426 4022824 3808785 2482310 972457 433760 344061 -207837
9609 -207837 -950125 -1029213 -129639 1167309 1342328 -824916 -3764149 -3805569 -676006
9600 -676006 209995 -5101853 -11835958 -11824144 -5094235 171373 -517471 -3021081 -3180174
9591 -3180174 -3199424 -5621710 -7151078 -3969525 1024631 1987629 -1497910 -4897317 -5613152
$$ packed form
9653I74442k642778m750126l804282N86475N712151P424118L778179k415302n592123
9644g29246k971915K280790M430926J679116j927210j782198J394727K944454
9636E319444J000954j228602r20938R547j223337k896852j499595J780959K276932
9627B618512p20368k816423j554966M01443P17704J085487K900958L709493J410563
9618G752403j537394j816583l75602k14039j326475j509853n38697q9699n51898
9609b07837p42288p9088Q99574J296948J75019k167244k939233m1420L129563
9600f76006Q86001n311848o734105J1814O729909N265608o88844k503610j59093
9591c180174j9250k422286j529368L181553M994156R62998l485539l399407p15835
$$ plain form
9582 -5613152 -4671737 -2960317 -359794 1932594 2039608 283505 -1200395 -1170894 349360
9573 349360 2942091 4980602 4083720 884734 -174309 3071261 6343631 4810722 663535
9564 663535 -65887 3331130 5500999 2984102 -1887770 -5127272 -4907345 -1188013 4369207
9555 4369207 7898884 6648756 3104315 2234745 4767490 7156272 7961701 9416082 12018166
9546 12018166 12581346 9393885 5087875 2376955 594036 -1548897 -3088747 -2747536
9538 -2747536 -946753 1697221 5069578 7474542 6092212 1119561 -3619765 -5684294
9530 -5684294 -6374658 -6658220 -4635212 575380 5925488 8147588 7522299 5722090 3180079
9521 3180079 1054817 2126530 6430818 9231445 6886816 1837912 -1638876 -3302613
$$ packed form
9582e613152R41415J711420K600523K292388J07014j756103j483900K9501J520254
9573C49360K592731K038511q96882l198986j059043L245570L272370j532909m147187
9564F63535p29422L397017K169869k516897m871872l239502K19927L719332N557220
9555D369207L529677j250128l544441q69570K532745K388782Q05429J454381K602084
9546A2018166N63180l187461m306010k710920j782919k142933j539850L41211
9538b747536J800783K643974L372357K404964j382330m972651m739326k064529
9530e684294o90364k83562K023008N210592N350108K222100o25289j800209k542011
9521C180079k125262J071713M304288K800627k344629n048904l476788j663737
$$ plain form
9513 -3302613 -4569197 -3907582 23862 3467867 1945284 -2248991 -3357233 -1819674
9505 -1819674 -3422409 -8608361 -10379742 -5150618 1408090 3277221 2772122 5043839
9497 5043839 8645438 8240290 4235339 2647137 5361914 6901717 2934533 -2969895
9489 -2969895 -4434250 -803023 3355677 5358977 6579502 7802491 7022106 3550596
9481 3550596 540799 421885 636567 -2122857 -5343866 -3518567 2586964 5039816 -895138
9472 -895138 -10138261 -14615963 -12936261 -9542063 -7387949 -6138146 -5733580 -6652290 -6964493
9463 -6964493 -3651304 2472390 6579497 5306490 -166086 -6495573 -10696645 -10348050
9455 -10348050 -4924356 2023049 5022089 2514559 -1487291 -2533359 -617704 855173
$$ packed form
9513c302613j266584O61615L931444L444005j522583m194275j108242J537559
9505a819674j602735n185952j771381N229124O558708J869131n05099K271717
9497E043839L601599m05148m004951j588202K714777J539803l967184n904428
9489b969895j464355L631227M158700K003300J220525J222989p80385l471510
9481C550596l009797j18914K14682k759424l221009J825299O105531K452852n934954
9472h95138r243123m477702J679702L394198K154114J249803M04566r18710l12203
9463f964493L313189O123694M107107j273007n472576o329487m201072L48595
9455a0348050N423694O947405K999040k507530m001850j046068J915655J472877
$$ plain form
9447 855173 -738362 -4694855 -7304402 -4921841 1570829 6083068 3601426 -3359651
9439 -3359651 -7432892 -5091741 438507 4398196 4831596 1982512 -2271879 -4071622
9431 -4071622 -1155707 2760667 2097384 -1750317 -1953153 2113635 2581664 -3896267 -8934333
9422 -8934333 -4788907 2820745 3099163 -3105275 -5128489 637500 6082856 4825270
9414 4825270 939834 623857 2575384 1775102 -2109783 -5333729 -6188622 -6036373 -5885160
9405 -5885160 -5545177 -5230224 -5123448 -3939750 -316575 4495944 7152111 5732025 1806015
9396 1806015 -1328878 -2133560 -2152712 -3496677 -5523352 -5612782 -3336514 -1295186 -690729
9387 -690729 740407 4023564 5756461 3577898 1428074 3624870 6192050 1518824
$$ packed form
9447H55173j593535l956493k609547K382561O492670M512239k481642o961077
9439c359651m073241K341151N530248L959689M33400k849084m254391j799743
9431d071622K915915L916374o63283l847701k02836M066788M68029o477931n038066
9422h934333M145426P609652K78418o204438k023214N765989N445356j257586
9414D825270l885436l15977J951527q00282l884885l223946q54893J52249J51213
9405e885160L39983L14953J06776J183698L623175M812519K656167j420086l926010
9396A806015l134893q04682j9152j343965k026675q9430K276268K041328O04457
9387f90729J431136L283157J732897k178563k149824K196796K567180m673226
$$ plain form
9379 1518824 -8968177 -15030667 -12034396 -7044421 -7180611 -9541497 -8009139 -3684323
9371 -3684323 -1750531 -2322229 -1549142 741207 1266453 -97657 58624 2785576 5483656
9362 5483656 6416627 6454634 6609488 7189756 8480373 9231197 6470220 396506 -3370081
9353 -3370081 -1163267 2164020 91330 -5037000 -5845160 -2048784 369044 1140729 6097842
9344 6097842 14082492 14997506 5630849 -3071482 -1497043 4882612 5697627 1853295 1257557
9335 1257557 4031810 3609677 10971 564161 7173762 12761516 12037184 7636501 3778205
9326 3778205 1309283 1015799 4570645 9517834 9953697 5251927 2098103 4745507 9099911
9317 9099911 9902620 7997490 6371138 4422810 1085627 -898893 878526 3482316
$$ packed form
9379A518824j0487001o062490K996271M989975j36190k360886J532358M324816
9371c684323J933792n71698P73087K290349N25246j364110J56281K726952K698080
9362E483656R32971L8007J54854N80268J290617P50824k760977o073714l766587
9353c370081K206814L327287k072690n128330q08160L796376K417828P71685M957113
9344F097842P984650R15014r366657q702331J574439O379655Q15015l844332n95738
9335A257557K774253m22133l598706N53190O609601N587754p24332m400683l858296
9326C778205k468922k93484L554846M947189M35863m701770l153824K647404M354404
9317I099911Q02709j905130j626352j948328l337183j984520J777419K603790
$$ plain form
9309 3482316 2649138 -975922 -3843135 -4738190 -3909727 -380268 5118653 7696607 4027924
9300 4027924 -2007478 -4389403 -2978935 -1337385 268322 3337025 5376125 3092605
9292 3092605 -349484 889453 5134101 5138098 353723 -1724564 1785273 4273691 1088913
9283 1088913 -2547503 -492149 4409749 5808888 3898103 3066551 3363780 1490928 -1774332
9274 -1774332 -1981687 1508661 4017670 2105891 -2441917 -5849865 -6557033 -5647409 -5097021
9265 -5097021 -5737728 -5962315 -3474283 859014 3160465 2018234 857364 2400045 3874091
9256 3874091 1325520 -3815152 -6704388 -5941041 -4116704 -2590495 -229512 2751337
9248 2751337 3880292 2217267 13100 -344180 999412 2195373 1696064 -529290 -2720594
$$ packed form
9309C482316q33178l625060k867213q95055Q28463L529459N498921K577954l668683
9300D027924o035402k381925J410468J641550J605707L068703K039100k283520
9292C092605l442089J238937M244648L997m784375k078287L509837K488418l184778
9283A088913l636416K055354M901898J399139j910785q31552K97229j872852l265260
9274a774332k07355L490348K509009j911779m547808l407948p07168R09624N50388
9265e097021o40707k24587K488032M333297K301451j142231j160870J542681J474046
9256C874091k548571n140672k889236P63347J824337J526209K360983K980849
9248B751337J128955j663025k204167l57280J343592J195961m99309k225354k191304
$$ plain form
9239 -2720594 -2924579 -1476695 -167945 1530951 5955764 11336394 11121176 3132100 -4926013
9230 -4926013 -4747392 1028261 3192009 -324237 -2799095 -309131 3022476 2959936 1315846
9221 1315846 1359223 2720126 3980881 5703634 7839967 8077786 5605835 3118049 2744933
9212 2744933 3386121 3999523 5565258 7522562 6610427 2355743 -414173 1587806 4251513
9203 4251513 1508071 -5809952 -10996205 -9909783 -4460917 1305213 4897286 5535371
9195 5535371 3826625 1598749 132890 -1285654 -3689396 -6093847 -6383856 -3873239
9187 -3873239 165800 3584422 4071533 371464 -5679564 -9517690 -7850556 -1837653
9179 -1837653 4320675 7134955 6106034 3716917 3215252 4884062 5115105 1423943 -2814407
$$ packed form
9239b720594k03985J447884J308750J698896M424813N380630k15218p989076q058113
9230d926013J78621N775653K163748l516246k474858K489964L331607o2540j644090
9221A315846M3377J360903J260755J722753K136333K37819k471951k487786l73116
9212B744933O41188O13402J565735J957304r12135m254684k769916K001979K663707
9203D251513k743442p318023n186253J086422N448866N766130L592073O38085
9195E535371j708746k227876j465859j418544k403742k404451k90009K510617
9187c873239M039039L418622M87111l700069o051028l838126J667134O012903
9179a837653O158328K814280j028921k389117n01665J668810K31043l691162m238350
$$ plain form
9170 -2814407 -2440238 1353276 2014752 -2634327 -7104101 -6415424 -2260911 1431922 3761164
9161 3761164 4539348 2062508 -2776637 -5041195 -2824826 -929364 -2624423 -3109127 2266890
9152 2266890 8092738 5625986 -3378332 -8529127 -5723312 -1618827 -2360216 -5720286
9144 -5720286 -6780876 -4907296 -1990018 1249059 4034146 4242967 1055368 -3469971
9136 -3469971 -6896203 -8283462 -7244264 -4039374 -908281 -264092 -1393571 -1910596 -1969814
9127 -1969814 -3307346 -4713371 -3156934 488578 1805107 -423048 -2786683 -3472765
9119 -3472765 -4471433 -5854562 -3551520 3945502 11329802 12783210 9124793 5114905
9111 5114905 2572017 -120667 -3774329 -7257747 -9589986 -10618489 -10312576 -8919825
$$ packed form
9170b814407L74169L793514O61476m649079m469774O88677M154513L692833K329242
9161C761164P78184k476840m839145k264558K216369J895462j695059m84704N376017
9152B266890N825848k466752r004318n150795K805815M104485p41389l360070
9144e720286j060590J873580K917278L239077K785087K08821l187599m525339
9136c469971l426232j387259J039198L204890L131093O44189j129479n17025n9218
9127a969814j337532j406025J556437L645512J316529k228155k363635o86082
9119c472765r98668j383129K303042P497022P384300J453408l658417m009888
9111E114905k542888k692684l653662l483418k332239j028503L05913J392751
$$ plain form
9103 -8919825 -6949872 -4321705 -932841 1918282 3056886 4249424 8034456 12355499
9095 12355499 11655887 4826533 -2214477 -4219710 -3012913 -3400289 -6191635 -8569609
9087 -8569609 -8664923 -6549309 -2775933 1340473 3812398 4351163 4572693 4567086 2427553
9078 2427553 -1331994 -3002406 -1566436 -797512 -2454161 -2401360 2214763 6924119 6694721
9069 6694721 4304478 5106877 6980868 3662335 -3671617 -6807377 -2753885 2464735
9061 2464735 3864395 3873676 5809305 7629731 6331950 3515311 2053800 915881 -2252393
9052 -2252393 -6058750 -7278629 -6236262 -6159072 -7702214 -7688707 -3792191 2060902 5988422
9043 5988422 6513536 5636268 5925076 7320319 7414637 4811023 1075362 -1434987 -2615816
$$ packed form
9103h919825J969953K628167L388864K851123J138604J192538L785032M321043
9095A2355499o99612o829354p041010k005233J206797l87376k791346k377974
9087h569609r5314K115614L773376M116406K471925N38765K21530n607k139533
9078B427553l759547j670412J435970P68924j656649N2801M616123M709356k29398
9069F694721k390243Q02399J873991l318533p333952l135760M053492N218620
9061B464735J399660R281J935629J820426j297781k816639j461511j137919l168274
9052b252393l806357j219879J042367P7190j543142J3507L896516N853093L927520
9043E988422N25114q77268K88808J395243R4318k603614l735661k510349j180829
$$ plain form
9034 -2615816 -4157598 -6890618 -10176573 -13286015 -15706273 -16658286 -15917933 -14319770 -11835097
9025 -11835097 -6705447 921456 6189341 4393939 -1911290 -5142930 -2568751 500813
9017 500813 -1067868 -5064678 -5711018 -1491191 3818852 5977269 3611713 -1649556 -6170591
9008 -6170591 -6798051 -4150204 -2018407 -2210724 -2238001 47407 2237531 874682 -2847725
8999 -2847725 -4689288 -3800278 -3708427 -6599608 -9964411 -10136189 -6819010 -2671333 89022
8990 89022 1221553 1354733 646131 -1158270 -3602864 -4909793 -3192656 1470645 6769773
8981 6769773 10177815 10588189 8159603 4124074 1105123 1580839 4785715 6873917 5674814
8972 5674814 3601948 3987487 6188893 6716153 3905067 -1148887 -7082609 -12460492 -14259288
$$ packed form
9034b615816j541782k733020l285955l109442k420258r52013P40353J598163K484673
9025a1835097N129650P626903N267885j795402o305229l231640K574179L069564
9017E00813j568681l996810o46340M219827N310043K158417k365556n261269m521035
9008f170591o27460K647847K131797j92317k7277K285408K190124j362849l722407
8999b847725j841563Q89010R1851k891181l364803j71778L317179M147677K760355
8990H9022J132531J33180p08602j804401k444594j306929J717137M663301N299128
8981F769773L408042M10374k428586m035529l018951M75716L204876K088202j199103
8972E674814k072866L85539K201406N27260k811086n053954n933722n377883j798796
$$ plain form
8963 -14259288 -10156288 -2942208 945372 -1276431 -5801901 -8089765 -8589422 -10186033
8955 -10186033 -12513803 -12452192 -9454587 -6862392 -7153776 -8345447 -6746196 -2223765 1054239
8946 1054239 -432730 -4919027 -7094380 -4657961 -1343896 -1821602 -5020051 -5492943 -1282996
8937 -1282996 3069711 2782328 -915918 -3202035 -2171709 -68094 655468 -440793 -2803854
8928 -2803854 -5339554 -6121209 -4234024 -1831289 -1890195 -3931009 -4455184 -1680248 2782903
8919 2782903 6991483 10301996 11604709 9631890 6283351 5883712 9009644 10616448
8911 10616448 7102236 1772689 -434743 -483480 -2583439 -6314259 -7435869 -5830264
8903 -5830264 -6027717 -8593128 -7490134 462725 8601659 7987374 -708200 -7942241 -7119572
$$ packed form
8963a4259288M103000P214080L887580k221803m525470k287864m99657j596611
8955a0186033k327770O1611K997605K592195k91384j191671J599251M522431L278004
8946A054239j486969m486297k175353K436419L314065m77706l198449m72892M209947
8937a282996M352707k87383l698246k286117J030326K103615P23562j096261k363061
8928b803854k535700p81655J887185K402735n8906k040814n24175K774936M463151
8919B782903M208580L310513J302713j972819l348539l99639L125932J606804
8911A0616448l514212n329547k207432m8737k099959l730820j121610J605605
8903e830264j97453k565411J102994P952859Q138934o14285q695574p234041Q22669
$$ plain form
8894 -7119572 -1417391 1521326 -1628995 -7559435 -10742261 -8789479 -4007181 -359914
8886 -359914 547691 -287183 -2244742 -5601242 -8431904 -6585443 450786 6447404 5241002
8877 5241002 -876617 -3996060 -1179217 2633218 2759570 652877 -490994 -1415073 -4398913
8868 -4398913 -8095133 -8808669 -5640493 -1108418 2509703 4677752 5274976 4559487 3951265
8859 3951265 4311985 4050117 1614543 -905574 -135342 2840206 3196152 -229737 -2502649
8850 -2502649 145932 4449360 5202947 3550605 5382267 12105615 17629789 15740402
8842 15740402 7278830 -1570283 -5780607 -4702582 -845137 2505252 3576161 3710944
8834 3710944 5805889 9797645 11111091 5888320 -3094876 -8738571 -8164454 -5893297
$$ packed form
8894g119572N702181K938717l150321n930440l182826J952782M782298L647267
8886c59914R07605q34874j957559l356500k830662J846461P036229N996618j206402
8877E241002o117619l119443K816843L812435J26352k106693j143871r24079k983840
8868d398913l696220p13536L168176M532075L618121K168049N97224p15489o08222
8859C951265L60720k61868k435574k520117P70232K975548L55946l425889k272912
8850b502649K648581M303428P53587j652342J831662O723348N524174j889387
8842A5740402q461572q849113m210324J078025L857445L350389J070909J34783
8834C710944K094945L991756J313446n222771q983196n643695N74117K271157
$$ plain form
8826 -5893297 -6963732 -9729820 -8725465 -3310334 728862 -932414 -5304081 -6561270
8818 -6561270 -3797894 -853534 126824 543950 548321 -2773812 -9920475 -15462108 -13981066
8809 -13981066 -7454561 -2611891 -2146632 -2945284 -2518562 -2047588 -2024204 12247 4729653
8800 4729653 8132572 6866264 3207944 1109317 38127 -3016503 -7546944 -10237389
8792 -10237389 -10358099 -9689179 -7957501 -3553199 1442408 2663212 659753 725889 3738826
8783 3738826 3607154 -2540139 -7871503 -5443657 472794 238827 -6440663 -10055468 -5761510
8774 -5761510 -69181 -72514 -2911530 -1333598 4632886 7977163 5148969 241267 -1876475
8765 -1876475 -1627481 -1714969 -1742442 547327 4232949 5215472 1744755 -2854097 -4461239
$$ packed form
8826e893297j070435k766088J004355N415131M039196j661276m371667j257189
8818f561270K763376K944360R80358M17126M371l322133p146663n541633J481042
8809a3981066O526505M842670M65259p98652M26722M70974K3384K036451M717406
8800D729653L402919j266308l658320k098627j071190l054630m530441k690445
8792a0237389j20710O68920J731678M404302M995607J220804k003459O6136L012937
8783C738826j31672o147293n331364K427846N916451k33967o679490l614805M293958
8774e761510N692329l333k839016J577932N966484L344277k828194m907702k117742
8765a876475K48994q7488k7473K289769L685622R82523l470717m598852j607142
$$ plain form
8756 -4461239 -3369952 -3224178 -5573972 -7674007 -6048524 -756555 4589886 6298864
8748 6298864 3791094 69790 -893098 1867998 4909781 4060621 -440775 -3953997 -2989203
8739 -2989203 817490 3062090 1480788 -2427726 -5346180 -4727004 -831202 2738368
8731 2738368 2052387 -2348396 -5392114 -3778112 -274420 683651 -387555 480557 3631536
8722 3631536 4770012 1809167 -1400161 -386312 3855021 6838558 6760087 5686053 5335813
8713 5335813 4593522 1797669 -2410303 -5640041 -6376474 -5226384 -3845032 -3266616 -3294401
8704 -3294401 -2907565 -901386 3167873 7596927 8552536 3508816 -4628477 -8969770 -6051090
8695 -6051090 -238647 1615310 -1285647 -3467437 -924013 4512164 9008208 11207172
$$ packed form
8756d461239J091287J45774k349794k100035J625483N291969N346441J708978
8748F298864k507770l721304r62888K761096L041783q49160m501396l513222R64794
8739b989203L806693K244600j581302l908514k918454O19176L895802L569570
8731B738368o85981m400783l043718J614002L503692R58071j071206Q68112L150979
8722C631536J138476k960845l209328J013849M241333K983537p8471j074034l50240
8713E335813p42291k795853m207972l229738p36433J150090J381352N78416k7785
8704c294401L86836K006179M069259M429054R55609n043720q137293m341293K918680
8695f051090N812443J853957k900957k181790K543424N436177M496044K198964
$$ plain form
8687 11207172 11157819 8065058 2030847 -3836111 -5920263 -3817648 462385 5594436
8679 5594436 10664343 13155189 10915164 6308316 4895275 8558686 12534154 11181952
8671 11181952 4892525 -899918 -2461640 -1179634 -447564 -1248701 -1604171 640116 5115454
8662 5115454 8565383 7268132 858438 -6123219 -7941802 -3857967 573130 -133771
8654 -133771 -4524144 -5751330 -29071 8686375 13435875 11694946 6298394 593615
8646 593615 -4264587 -7238364 -6038062 -128411 6366567 7458087 1402500 -7424172
8638 -7424172 -13147500 -13644197 -10759738 -7067671 -4134222 -2971045 -3662861 -4238499 -2244078
8629 -2244078 1568099 3311837 1211107 -1586308 -1823908 -1358871 -3707482 -6958246 -5400992
$$ packed form
8687A1207172m9353l092761o034211n866958k084152K102615M280033N132051
8679E594436N069907K490846k240025m606848j413041L663411L975468j352202
8671A1181952o289427n792443j561722J282006P32070q01137l55470K244287M475338
8662E115454L449929j297251o409694o981657j818583M083835M431097p06901
8654a33771m390373j227186N722259Q715446M749500j740929n396552n704779
8646E93615m858202k973777J200302N909651O494978J091520o055587q826672
8638g424172n723328m96697K884459L692067K933449J163177o91816n75638J994421
8629b244078L812177J743738k100730k797415k37600M65037k348611l250764J557254
$$ plain form
8620 -5400992 1444461 6821502 5701152 928965 -2389891 -3974471 -5825865 -6782502
8612 -6782502 -4994239 -2957628 -4112260 -6115315 -3783463 1957657 4745754 3060129
8604 3060129 3057356 8714601 15089021 15247308 9530687 3676849 756622 -832990 -3232508
8595 -3232508 -6762245 -10795641 -14165394 -15309488 -13920983 -11557835 -9251570 -6047713
8587 -6047713 -1456849 2428087 3188643 1094183 -1711987 -3645294 -4105112 -3275707 -2678789
8578 -2678789 -3868149 -5619205 -5177650 -3396996 -4876323 -10848134 -15887610 -14780034
8570 -14780034 -8964742 -2764423 2599690 6741480 6277721 -339028 -7200670 -7265686 -2475806
8561 -2475806 -338330 -1853067 -1182006 2751768 3642890 -916060 -4321660 -1413381 3454996
$$ packed form
8620e400992O845453N377041j120350m772187l318856j584580j851394r56637
8612f782502J788263K036611j154632k003055K331852N741120K788097j685625
8604C060129k773N657245O374420J58287n716621n853838k920227j589612k399518
8595c232508l529737m033396l369753j144094J388505K363148K306265L203857
8587f047713M590864L884936P60556k094460k806170j933307m59818Q29405N96918
8578b678789j189360j751056M41555J780654j479327n971811n039476J107576
8570a4780034N815292O200319N364113M141790m63759o616749o861642o5016M789880
8561b475806K137476j514737O71061L933774Q91122m558950l405600K908279M868377
$$ plain form
8552 3454996 4217744 2657739 3752450 6326858 5503529 1599769 -288296 1667955 4222914
8543 4222914 4732816 3740206 2268856 810771 616179 2211334 3410394 2577135 2547302
8534 2547302 6638330 11764763 11175523 4360319 -1402727 -856922 2933854 4225771 1987667
8525 1987667 -1110315 -3270641 -3962762 -2664227 -228127 818020 -146761 -479080 1035479
8516 1035479 1240977 -2195285 -5591899 -3854741 1630378 4761799 3462070 1358105
8508 1358105 716869 -643819 -3886095 -5872197 -4184516 -1156309 443805 1974265
8500 1974265 5108948 6724013 2793572 -4409450 -8419263 -7223880 -4525584 -2545940
8492 -2545940 391899 3888123 3563068 -1476043 -4881425 -1747100 3303471 2717843 -2440310
$$ packed form
8552C454996P62748j560005J094711K574408q23329l903760j888065J956251K554959
8543D222914N09902r92610j471350j458085j94592J595155J199060q33259k9833
8534B547302M091028N126433n89240o815204n763046N45805L790776J291917k238104
8525A987667l097982k160326o92121J298535K436100J046147r64781l32319J514559
8516A035479K05498l436262l396614J737158N485119L131421j299729k103965
8508A358105o41236j360688l242276j986102J687681L028207J600114J530460
8500A974265L134683J615065l930441p203022m009813J195383K698296J979644
8492b545940K937839L496224l25055n039111l405382L134325N050571n85628n158153
$$ plain form
8483 -2440310 -4636580 -2082394 -869627 -4003327 -6162753 -2863246 1732809 1541394
8475 1541394 -1441993 -230853 6230431 11467283 10674668 6286492 3275802 3030528 3757077
8466 3757077 4052804 3874704 3479660 3119764 3149854 3579465 3986796 4082172 3728853 2614303
8456 2614303 886036 -179205 561768 2304873 3071340 2219126 814452 -405756 -1795281
8447 -1795281 -3232969 -3351216 -1042089 3168208 7592910 10445276 10441088 7448460 2854074
8438 2854074 -1360751 -3940102 -4521424 -3425353 -2094980 -2458115 -4440366 -5441945 -3996403
8429 -3996403 -2192505 -1966461 -1069575 3301564 8270313 7876061 1991039 -2756479 -2259228
8420 -2259228 137781 184067 -1009609 -658904 280233 -392209 -1782724 -2336369 -3353121
$$ packed form
8483b440310k196270K554186J212767l133700k159426L299507M596055j91415
8475A541394k983387J211140O461284N236852p92615m388176l010690k45274P26549
8466C757077K95727j78100l95044l59896L0090M29611M07331R5376l53319j114550
8456B614303j728267j065241P40973J743105P66467q52214j404674j220208j389525
8447a795281j437688j18247K309127M210297M424702K852366m188k992628m594386
8438B854074m214825k579351n81322J096071J330373l63135j982251j001579J445542
8429c996403J803898K26044Q96886M371139M968749l94252n885022m747518M97251
8420b259228K397009M6286j193676L50705R39137o72442j390515n53645j016752
$$ plain form
8411 -3353121 -5554016 -5342873 109887 6529514 7220236 2573241 -1055490 -1000686 -616333
8402 -616333 -2172268 -3742132 -3895494 -3642358 -2769213 -18494 2202635 -155736 -4493172
8393 -4493172 -2719796 6070481 11649098 6607723 -2436045 -4463507 428816 3282258
8385 3282258 581993 -2598700 -2649900 -2029073 -2832438 -3117629 -1784248 -1067642 -1587841
8376 -1587841 -145858 4502612 8126966 6798579 2798767 1198501 3116125 5898686
8368 5898686 8019168 9935624 10868017 8418857 2201453 -4369411 -7099423 -5116324
8360 -5116324 -1447093 241293 -718498 -1731827 -305427 3087623 6174795 7880687
8352 7880687 8606123 8260332 6231607 3336491 1661870 2035195 3390677 4774173 5984714
$$ packed form
8411c353121k200895K11143N452760O419627O90722m646995l628731N4804L84353
8402f16333j555935j569864j53362K53136Q73145K750719K221129k358371m337436
8393d493172J773376Q790277N578617n041375r043768k027462M892323K853442
8385C282258k700265l180693n1200O20827q03365k85191J333381P16606n20199
8376a587841J441983M648470L624354j328387l999812j600266J917624K782561
8368E898686K120482J916456R32393k449160o217404o570864k730012J983099
8360e116324L669231J688386r59791j013329J426400L393050L087172J705892
8352G880687P25436l45791k028725k895116j674621L73325J355482J383496J210541
$$ plain form
8343 5984714 6213956 4623148 2685447 3056286 5221178 5435919 2567082 672389 3143587
8334 3143587 7109404 7176886 2969768 -785354 -917451 921808 1621913 282575 -1896620
8325 -1896620 -3127878 -2126594 426994 1570986 -777930 -4509274 -5475597 -2942533
8317 -2942533 -257897 213207 -238177 -151727 -874110 -3674424 -6231554 -5204314 -1355776
8308 -1355776 1001601 -206547 -2298582 -2086642 -535440 -1341473 -5705753 -10409158 -11495556
8299 -11495556 -8731919 -5461740 -4403142 -4795837 -4249919 -2378370 -1069139 -1317738 -1789101
8290 -1789101 -1589604 -2671513 -7120232 -12748211 -14425655 -10675337 -6260312 -6221472 -9385950
8281 -9385950 -10632125 -8344535 -5973945 -6112885 -6853881 -5554488 -2905362 -730187 1613884
$$ packed form
8343E984714K29242j590808j937701L70839K164892K14741k868837j894693K471198
8334C143587L965817O7482m207118l755122j32097J839259P00105j339338k179195
8325a896620j231258J001284K553588J143992k348916l731344r66323K533064
8317b942533K684636M71104m51384Q6450p22383k800314k557130J027240L848538
8308a355776K357377j208148k092035K11940J551202q06033m364280m703405j086398
8299a1495556K763637L270179J058598l92695N45918J871549J309231k48599m71363
8290a789101J99497j081909m448719n627979j677444L750318M415025L8840l164478
8281i385950j246175K287590K370590j38940p40996J299393K649126K175175K344071
$$ plain form
8272 1613884 5256441 7903685 5864920 -240721 -5348514 -6053833 -3797481 -1172874
8264 -1172874 1718095 5357447 7813040 6443985 1762303 -2577797 -3693827 -2243697
8256 -2243697 -1247652 -2702262 -5398704 -6251519 -4114975 -1483881 -1229273 -2616658 -2796924
8247 -2796924 -1723108 -2419360 -5729428 -8099070 -6433014 -2587433 -730170 -2116811
8239 -2116811 -4824053 -7162512 -8858190 -9734130 -9507091 -8603816 -7709451 -6988922 -6618361
8230 -6618361 -6872974 -6819044 -4866398 -1928482 -1426926 -3819045 -3851582 3003440 13123993
8221 13123993 18091518 14927044 8773314 5180922 4003416 2360321 20932 -717853
8213 -717853 1304271 4613717 6543065 5315045 1514322 -2194570 -3735650 -3853915 -4498455
$$ packed form
8272A613884L642557K647244k038765o105641n107793p05319K256352K624607
8264a172874K890969L639352K455593j369055m681682m340100j116030J450130
8256b243697R96045j454610k696442q52815K136544K631094K54608j387385j80266
8247b796924J073816o96252l310068k369642J666056L845581J857263j386641
8239b116811k707242k338459j695678q75940K27039R03275Q94365P20529L70561
8230f618361k54613N3930J952646K937916N01556k392119l2537O855022J0120553
8221A3123993M967525l164474o153730l592392j177506j643095k339389p38785
8213g17853K022124L309446J929348j228020l800723l708892j541080j18265o44540
$$ plain form
8204 -4498455 -5589525 -5347006 -3529413 -2012319 -1836590 -1734403 -199004 2346751 3640234
8195 3640234 1076039 -5633035 -11764611 -9963661 1091648 12227388 13035197 5018751
8187 5018751 -284602 3107095 8467063 7285901 851724 -3815012 -4547105 -4555241 -5518184
8178 -5518184 -6299926 -6936295 -8150941 -7662175 -2516713 4797391 7786704 4451555 -123654
8169 -123654 -866192 1704456 4327843 5280701 3850247 -496253 -5676161 -7155076 -3902070
8160 -3902070 -1409747 -4859413 -11265202 -12919689 -7857675 -2198206 -1546993 -4535647
8152 -4535647 -6726526 -7007349 -6909896 -6260308 -3600929 -37356 1245393 -284642 -1521697
8143 -1521697 -569189 198233 -2348752 -7550981 -11842646 -12735914 -10253459 -5924512 -2373059
$$ packed form
8204d498455j091070K42519J817593J517094J75729J02187J535399K545755J293483
8195C640234k564195o709074o131576J800950J1055309J1135740Q07809q016446
8187E018751n303353L391697N359968j181162o434177m666736p32093q136r62943
8178e518184p81742o36369j214646M88766N145462P314104K989313l335149m575209
8169a23654p42538K570648K623387R52858j430454m346500n179908j478915L253006
8160c902070K492323l449666o405789j654487N062014N659469O51213k988654
8152d535647k190879k80823R7453O49588K659379L563573J282749j530035j237055
8143a521697R52508P67422k546985n202229m291665q93268K482455M328947L551453
$$ plain form
8134 -2373059 -2480364 -6327712 -9656181 -8009682 -2343472 1757021 505177 -4503821
8126 -4503821 -9143750 -10987954 -10332841 -8953105 -8429006 -8475607 -7082200 -3625954 -882683
8117 -882683 -1684920 -4519327 -5484332 -4066860 -3414240 -4952500 -6647866 -7025542 -6840419
8108 -6840419 -6095280 -3892153 -2249536 -4854053 -10125441 -11220881 -6009803 -1168405
8100 -1168405 -1956462 -3810272 -324635 5443581 5568867 -28075 -3919541 -2733666 -60816
8091 -60816 1644072 3478790 3907174 -779266 -7655157 -7900110 -360538 4201572 -1733701
8082 -1733701 -10707040 -11444206 -5619002 -3839478 -8383707 -10543521 -5149024 2022128
8074 2022128 4005297 1915705 316039 -580543 -2898420 -5277578 -4402836 -430677 3366488
$$ packed form
8134b373059j07305l847348l328469J646499N666210M100493j251844n008998
8126d503821m639929j844204O55113J379736N24099m6601J393407L456246K743271
8117h82683q02237k834407r65005J417472O52620j538260j695366l77676J85123
8108f840419P45139K203127J642617k604517n271388j095440N211078M841398
8100a168405p88057j853810L485637N768216J25286n596942l891466J185875K672850
8091f0816J704888J834718M28384m686440o875891k44953P539572M562110n935273
8082a733701q973339p37166N825204J779524m544229k159814N394497P171152
8074B022128J983169k089592j599666q96582k317877k379158Q74742L972159L797165
$$ plain form
8065 3366488 5086467 4810191 2211632 -2534931 -6432836 -6445281 -4356415 -4635399 -7242856
8056 -7242856 -7293326 -3141514 251054 -1097637 -3768534 -2376110 2076348 4495015 3984936
8047 3984936 3902222 4671633 2956263 -1444832 -4048247 -2851842 -1400513 -2092663 -1884576
8038 -1884576 1593706 4565649 2707032 -1498444 -2573582 -784554 -1236549 -5249162
8030 -5249162 -8194933 -6411777 -1970678 410984 -1705524 -7038177 -11707260 -11991907
8022 -11991907 -8150699 -4785121 -5217554 -6885626 -5089587 219976 4738836 5590815
8014 5590815 3312778 -652654 -4609270 -5791056 -2884110 1253815 2794524 1629282
8006 1629282 -475811 -3947092 -8917209 -11297957 -7549786 -1586125 -123655 -2538259
$$ packed form
8065C366488J719979k76276k598559m746563l897905j2445K088866k78984k607457
8056g242856n0470M151812L392568j348691k670897J392424M452458K418667n10079
8047C984936q2714P69411j715370m401095k603415J196405J451329o92150K08087
8038a884576L478282K971943j858617m205476j075138J789028m51995m012613
8030e249162k945771J783156M441099K381662k116508n332653m669083k84647
8022a1991907L841208L365578m32433j668072J796039N309563M518860Q51979
8014E590815k278037l965432l956616j181786K906946M137925J540709j165242
8006A629282k105093l471281m970117k380748L748171N963661J462470k414604
$$ plain form
7998 -2538259 -2881895 -855287 -1757916 -5314515 -4575683 1777450 5828505 2882854 -1647804
7989 -1647804 -2474453 -2681004 -6035155 -9355654 -9215804 -8820204 -11116557 -11958369 -7578732
7980 -7578732 -2329997 -1203538 -1141986 1849369 3698055 109142 -2994469 1706218 8818124
7971 8818124 7578829 -278623 -3428458 256882 1944834 -1152364 -1572970 3061270
7963 3061270 4446854 -1766775 -8011768 -7611193 -4842665 -5409380 -6435697 -3600329 -195420
7954 -195420 -1063901 -3859256 -3844576 -2008237 -1532689 -1290918 451686 785431 -2532534
7945 -2532534 -5002825 -1615275 4680144 7483314 6345278 5023153 3943507 1514643
7937 1514643 -144571 1752990 4146189 1879690 -3759675 -7086530 -6825157 -5987143 -4863842
$$ packed form
7998b538259l43636K026608r02629l556599P38832O353133M051055k945651m530658
7989a647804q26649k06551l354151l320499J39850L95600k296353q41812M379637
7980g578732N248735J126459O1552K991355J848686l588913l103611M700687P111906
7971H818124j239295p857452l149835L685340J687952l097198m20606M634240
7963C061270J385584o213629o244993M00575K768528n66715j026317K835368L404909
7954a95420q68481k795355J4680J836339M75548K41771J742604L33745l317965
7945b532534k470291L387550O295419K803170j138036j322125j079646k428864
7937A514643j659214J897561K393199k266499n639365l326855K61373Q38014J123301
$$ plain form
7928 -4863842 -1818688 213224 -3600783 -10759164 -13057883 -8551157 -4169368 -4625042
7920 -4625042 -6163986 -4096046 254257 3655310 6289853 9160543 10813194 10218137
7912 10218137 9116777 8642956 7324124 4732729 2904915 1859931 -1350026 -6207056
7904 -6207056 -6860020 -1032067 4349744 2167629 -4213474 -5779065 -736091 4262342
7896 4262342 4471445 1821442 -719363 -3048434 -4786833 -3869526 -615773 1273688 283686
7887 283686 -275241 2047962 4178419 2123415 -2536885 -4958751 -4237246 -3877321 -5401161
$$ packed form
7928d863842L045154K031912l814007p158381k298719M506726M381789m55674
7920d625042j538944K067940M350303L401053K634543K870690J652651n95057
7912A0218137j101360m73821j318832k591395j827814j044984l209957m857030
7904f207056o52964N827953N381811k182115o381103j565591N042974M998433
7896D262342K09103k650003k540805k329071j738399R17307L253753J889461r90002
7887B83686n58927K323203K130457k055004m660300k421866P21505L59925j523840
$$ [...]
##END NTUPLES=NMR SPECTRUM
##END=
