##TITLE=31Pdec_SR59H_ACCl:Ac2O-1:1
 , 124 sc
 3.06.2021
##JCAMPDX= 6.0         $$ Bruker NMR JCAMP-DX V2.0
##DATA TYPE= NMR SPECTRUM
##DATA CLASS= NTUPLES
##ORIGIN= UXNMR, Bruker Analytische Messtechnik GmbH
##OWNER= root
$$ XWIN-NMR		Version 3.5
$$ Thu Jun  3 12:34:58 2021 Russian Standard Time (UT+4h)  she@DPX200
##.OBSERVE FREQUENCY= 81.013821
##.OBSERVE NUCLEUS= ^31P
##.ACQUISITION MODE= SIMULTANEOUS
##.ACQUISITION SCHEME= undefined
##.AVERAGES= 124
##.DIGITISER RES= 16
##SPECTROMETER/DATA SYSTEM= spect
##.PULSE SEQUENCE= zgpg30
##.SOLVENT NAME= CDCl3
##.SHIFT REFERENCE= (INTERNAL, CDCl3, 0, 248.564)
##AUDIT TRAIL= $$ (NUMBER, WHEN, WHO, WHERE, WHAT)
$$ ##TITLE= Audit trail, XWIN-NMR		Version 3.5
$$ ##JCAMPDX= 5.01
$$ ##ORIGIN= Bruker BioSpin GmbH
$$ ##OWNER= she
$$ F:/spectra/data/she/nmr/P31/1/pdata/1/auditp.txt
$$ ##AUDIT TRAIL=  $$ (NUMBER, WHEN, WHO, WHERE, WHAT)
(   1,<2021-06-03 12:31:08.59 +0400>,<she>,<DPX200>,
      <continue with go, POWCHK disabled, PULCHK disabled
       configuration hash MD5:
       00 E9 B6 7A A2 85 ED C7 34 08 36 98 17 FE 4E 26
       data hash MD5: 32K
       FC 98 F8 1B 9D 47 65 7A 19 A1 80 EE B8 B4 9E 9C>)
(   2,<2021-06-03 12:31:11.20 +0400>,<she>,<DPX200>,
      <Start of raw data processing
       efp BC_mod = 2 LB = 1 FT_mod = 6 PKNL = 1 PHC0 = -5872.602 PHC1 = 148.6723 SI = 64K 
       data hash MD5: 64K
       F4 DB 29 A7 A3 42 74 65 B2 C4 BE 0E 3C AD 05 0A>)
(   3,<2021-06-03 12:31:34.96 +0400>,<she>,<DPX200>,
      <pk PHC0 = -25.93518 PHC1 = 178.6001 
       data hash MD5: 64K
       19 98 EA 52 82 AD 7B D9 66 60 74 78 62 78 F9 C0>)
(   4,<2021-06-03 12:32:40.59 +0400>,<she>,<DPX200>,
      <pk PHC0 = 10.19848 PHC1 = -237.9999 
       data hash MD5: 64K
       5E B3 E0 63 68 20 53 11 AE 7A F9 08 3E 55 8E 2D>)
$$ ##END=
$$ 
$$ hash MD5
$$ 2E CF 1E 89 40 66 3D 08 0F AD AC AA A9 73 57 46
##$RELAX= 
##$RELAX= 
##$RELAX= 
##$RELAX= 
##$RELAX= 
##$RELAX= 
##$RELAX= 
##$RELAX= 
$$ Bruker specific parameters
$$ --------------------------
##$DU= <F:/spectra>
##$EXPNO= 1
##$NAME= <P31>
##$PROCNO= 1
##$TYPE= <nmr>
##$USER= <she>
##$AMP= (0..31)
100 100 100 100 100 100 100 100 100 100 100 100 100 100 100 100 100 100 
100 100 100 100 100 100 100 100 100 100 100 100 100 100 
##$AQSEQ= 0
##$AQ_mod= 1
##$AUNM= <au_zg>
##$AUTOPOS= <>
##$BF1= 81.014009
##$BF2= 200.13
##$BF3= 200.13
##$BF4= 200.13
##$BF5= 200.13
##$BF6= 200.13
##$BF7= 200.13
##$BF8= 200.13
##$BYTORDA= 1
##$CFDGTYP= 0
##$CFRGTYP= 5
##$CHEMSTR= <none>
##$CNST= (0..31)
1 1 145 1 1 1 1 1 1 1 1 1 1 1 1 1 1 1 1 1 1 1 1 1 1 1 1 1 1 1 1 1 
##$CPDPRG= <waltz16>
##$CPDPRG1= <>
##$CPDPRG2= <waltz16>
##$CPDPRG3= <>
##$CPDPRG4= <mlev>
##$CPDPRG5= <mlev>
##$CPDPRG6= <mlev>
##$CPDPRG7= <mlev>
##$CPDPRG8= <mlev>
##$CPDPRGB= <>
##$CPDPRGT= <>
##$D= (0..31)
0 1 0 0 0 0 0 0 0 0 0 0.03 2e-05 3e-06 0 0 0 0 0 0 0 0 0 0 0 0 0 0 0 0 
0 0 
##$DATE= 1622708843
##$DBL= (0..7)
120 120 120 11 120 120 24 19 
##$DBP= (0..7)
150 150 150 150 150 150 150 150 
##$DBP07= 0
$$ [...]
##$SUBNAM2= <"">
##$SUBNAM3= <"">
##$SUBNAM4= <"">
##$SUBNAM5= <"">
##$SUBNAM6= <"">
##$SUBNAM7= <"">
##$SUBNAM8= <"">
##$SUBNAM9= <"">
##$SW= 501.771253377433
##$SWIBOX= (0..15)
0 1 3 0 0 0 0 0 0 0 0 0 0 0 0 0 
##$SW_h= 40650.406504065
##$TD= 32768
##$TD0= 1
##$TE= 0
##$TE2= 300
##$TE3= 300
##$TEG= 300
##$TL= (0..7)
0 120 53 12 22 120 120 120 
##$TP= (0..7)
150 150 150 150 150 150 150 150 
##$TP07= 0
##$TPNAME0= <>
##$TPNAME1= <>
##$TPNAME2= <>
##$TPNAME3= <>
##$TPNAME4= <>
##$TPNAME5= <>
##$TPNAME6= <>
##$TPNAME7= <>
##$TPOAL= (0..7)
0.5 0.5 0.5 0.5 0.5 0.5 0.5 0.5 
##$TPOFFS= (0..7)
0 0 0 0 0 0 0 0 
##$TUNHIN= 0
##$TUNHOUT= 0
##$TUNXOUT= 0
##$USERA1= <user>
##$USERA2= <user>
##$USERA3= <user>
##$USERA4= <user>
##$USERA5= <user>
##$V9= 5
##$VALIST= <valist>
##$VCLIST= <CCCCCCCCCCCCCCC>
##$VD= 0
##$VDLIST= <DDDDDDDDDDDDDDD>
##$VPLIST= <PPPPPPPPPPPPPPP>
##$VTLIST= <TTTTTTTTTTTTTTT>
##$WBST= 1024
##$WBSW= 4
##$XGAIN= (0..3)
0 0 0 0 
##$XL= 0
##$YL= 0
##$YMAX_a= 11986
##$YMIN_a= -14343
##$ZGOPTNS= <>
##$ZL1= 120
##$ZL2= 120
##$ZL3= 120
##$ZL4= 120
##$ABSF1= 0
##$ABSF2= 0
##$ABSG= 0
##$ABSL= 0
##$ALPHA= 0
##$AQORDER= 0
##$ASSFAC= 0
##$ASSFACI= 0
##$ASSFACX= 0
##$ASSWID= 0
##$AUNMP= <proc_1d>
##$AZFE= 0.1
##$AZFW= 0.5
##$BCFW= 0
##$BC_mod= 2
##$BYTORDP= 0
##$COROFFS= 0
##$CY= -3
##$DATMOD= 1
##$DC= 0
##$DFILT= <>
##$DTYPP= 0
##$F1P= 0
##$F2P= 0
##$FCOR= 1
##$FTSIZE= 65536
##$FT_mod= 6
##$GAMMA= 0
##$GB= 0
##$INTBC= 1
##$INTSCL= 5.30512e-09
##$ISEN= 30
##$LB= 1
##$LEV0= 0
##$LPBIN= 0
##$MAXI= 10000
##$MC2= 0
##$MEAN= 0
##$ME_mod= 0
##$MI= 50
##$NCOEF= 0
##$NC_proc= -6
##$NLEV= 6
##$NOISF1= 182.463
##$NOISF2= 159.3651
##$NSP= 0
##$NTH_PI= 0
##$NZP= 0
##$OFFSET= 248.5645
##$PC= 4
##$PHC0= -5888.339
##$PHC1= 89.27251
##$PH_mod= 1
##$PKNL= yes
##$PPARMOD= 0
##$PSCAL= 0
##$PSIGN= 0
##$REVERSE= no
##$SF= 81.014009
##$SI= 65536
##$SIGF1= 159.3651
##$SIGF2= -187.1042
##$SINO= 113.3802
##$SIOLD= 16384
##$SREGLST= <1H.CDCl3>
##$SSB= 0
##$STSI= 65536
##$STSR= 0
##$SW_p= 40650.406504065
##$SYMM= 0
##$S_DEV= 0
##$TDeff= 32768
##$TDoff= 0
##$TI= <>
##$TILT= no
##$TM1= 0
##$TM2= 0
##$TOPLEV= 0
##$USERP1= <user>
##$USERP2= <user>
##$USERP3= <user>
##$USERP4= <user>
##$USERP5= <user>
##$WDW= 1
##$XDIM= 65536
##$YMAX_p= 124513689
##$YMIN_p= -364475424
$$ End of Bruker specific parameters
$$ ---------------------------------
##NTUPLES= NMR SPECTRUM
##VAR_NAME=  FREQUENCY,     SPECTRUM/REAL,   SPECTRUM/IMAG
##SYMBOL=    X,             R,               I
##VAR_TYPE=  INDEPENDENT,   DEPENDENT,       DEPENDENT
##VAR_FORM=  AFFN,          ASDF,            ASDF
##VAR_DIM=   65536,         65536,           65536
##UNITS=     HZ,            ARBITRARY UNITS, ARBITRARY UNITS
##FACTOR=    0.620285442955139, 1,           1
##FIRST=     20137.2065510759, 0,            0
##LAST=      -20513.1999529892, 0,           0
##MIN=       -20513.1999529892, -364475424,  0
##MAX=       20137.2065510759, 124513689,    0
$$ Real data points
##PAGE= N=1
##DATA TABLE= (X++(R..R)), XYDATA
$$ [...]
60889d447888l613285m36087L097591M454124K131520k108833l370783L9634K809965
60880a444042n6810m750061l577499L313894P849008N316217n37464m120975m078430
60871b086162k035087j82262o98564l393046m259118n94956L902532M296471K399867
60862b650325K901931L998301P89805l507926p24849P291387Q820078L74863p315729
60853I977536o298541k353660k138457j437996M156192P781423K633168m060371
60845H259294j987401M135576K230208o050132p913116j259725K455215j654772
60837a784853m722643q82690L327277K188650M07383K187323K452322k209901
60829I62868m216026K833342J0768664P389958m800230j1973933q294474j067002
$$ y = [-4447888, -8061173, -8497260, -5399669, -945545, 1185975, -922858, -4293641, -4254007, -1444042, -1500852, -6250913, -9828412, -6514518, 1334490, 6650707, 6113243, 1992268, -2086162, -4121249, -4303511, -5002075, -8395121, -12654239, -13249195, -9346663, -5050192, -2650325, 251606, 4249907, 5039712, 1531786, 806937, 8098324, 16918402, 17293265, 9977536, 3678995, 1325335, -813122, -2251118, 1905074, 9686497, 12319665, 8259294, 6271893, 10407469, 12637677, 6587545, -1325571, -2585296, -130081, -1784853, -6507496, -7390186, -4062909, -1874259, -1466876, 720447, 3172769, 962868, -3253158, -419816, 10348848, 17738806, 12938576, 964643, -7329831, -8396833]
60821h396833K324904K460224K062072J025804l80936j12922J393854Q65155j946102
60812g04780k944778k78721K343359J389493j381445k377860j611331j558816
60804g124879k620565k685338m11387L089071N458403M953056J855033j193085
60796A320309j290100J407268L474043K249268r49467k820637k363886j446448
60788d19650j308577n44676K336237N680734O001322K476661j711329l275806
60780I234916k461245j591217j539536j548185j431568j613869j567236o44076
60772c162016n8378j314879k832463j356942K739561M941032K678148j107732
60764E26331k240570m59992J673196K554741J981833l6108k491498l118958j240143
$$ y = [-8396833, -6071929, -3611705, -1549633, -523829, -904765, -1017687, 376167, 1241322, -704780, -3649558, -3928279, -1584920, -195427, -1576872, -3954732, -5566063, -7124879, -9745444, -12430782, -12842169, -9753098, -4294695, 658361, 2513394, 1320309, 30209, 1437477, 4911520, 7160788, 6211321, 3390684, 1026798, -419650, -1728227, -2272903, 63334, 5744068, 11745390, 14222051, 12510722, 9234916, 6773671, 5182454, 3642918, 2094733, 663165, -950704, -2517940, -3162016, -3220394, -4535273, -7367736, -8724678, -5985117, -1044085, 1634063, 526331, -1714239, -2174231, -501035, 2053706, 4035539, 3999431, 1507933, -1611025, -2851168]
60755b851168O52731L79055m32933J117710M341476N405944K390789k246861m488817
60746D267926k897866J55222J192907j13928l35516K397945M120101J02276o523139
60737B365928p182687l43467N036833K237255l430081l385261J121744K555881
60729a023855J65221K26008M036542M975783m35951o298868n799371k88880L930425
60720e12946L763857P20863k626195m225717k890769Q4496J276956q14405l585183
60711h809043l774459j499557N91540P71240l77069r24960O30219L493667M701790
60702e196632K692986q1213n59781J6417j678684m492225l330885K750889P803308
60693b075820O576054R69836l569579m588641k878236L96861L428584L286995
$$ y = [-2851168, -2198437, -1819382, -2252315, -1134605, 3206871, 8612815, 11003604, 8756743, 4267926, 1370060, 1525282, 2718189, 2604261, 2268745, 4666690, 8786791, 8889067, 2365928, -4816759, -5160226, -123393, 2113862, -1316219, -4701480, -3579736, -1023855, -858634, -632626, 3403916, 8379699, 7943748, 1644880, -4154491, -4443371, -512946, 3250911, 3971774, 1345579, -2880138, -5770907, -5686411, -4409455, -5223860, -8809043, -12583502, -14083059, -13491519, -12720279, -13097348, -14022308, -13392089, -9898422, -5196632, -2503646, -2584859, -3144640, -3128223, -4806907, -9299132, -12630017, -9879128, -2075820, 4500234, 5470070, 1900491, -2688150, -5566386, -5169525, -1740941, 1546054]
60685A546054n60485l910428k470541K144960M194237J186259l174150l650125
60677d694219O25243N295295N245505P4871n044876m952480m82055K972885K399878
60668A440047j28610j650197j586370M2591L655505P292471O453938j18657p078068
60659H322650q076400l066435K572836M543231K747356n74362l145531l754251
60651d30906k842584j574507J026K188196L169234N98305l592950m114216Q0918
60642f517484L376146J476512k383147k914620n97082N70488O5396M60190J958986
60633d504615K192676M71325j665673l051259k868311M5934M530209O236945L276823
60624D664054r2112K15819J358474j404591o057210o874264l787544j357669m1352
$$ y = [1546054, 985569, -2924859, -5395400, -3250440, 943797, 2130056, -1044094, -4694219, -4068976, 1226319, 6471824, 6546695, 1501819, -3450661, -3932716, -959831, 1440047, 1311437, -338760, -1925130, -1882539, 1772966, 9065437, 15519375, 15400718, 8322650, 246250, -2820185, -247349, 4295882, 7043238, 6468876, 3323345, -430906, -3273490, -4847997, -4846971, -2658775, 510459, 1108764, -2484186, -6598402, -6517484, -3141338, -1664826, -4047973, -6962593, -7559675, -6989187, -6923791, -6463601, -4504615, -2311939, -1840614, -3506287, -6557546, -9425857, -9379923, -4849714, 1387231, 4664054, 4571942, 4787761, 6146235, 4741644, -1315566, -8189830, -11977374, -13335043, -13376395]
60615a3376395L380430P283443N932349k79289l906948j932360M3813j833381
60607d688338l134133N06915N429728N787744K069325j362137k802055k582693
60599g75644j82453L310741L772956j98820l722360k387845J106695J848983M71531
60590C243784N74484J716487J015575o86222l86116J006369J33134k320434k383345
60581A913716L75781K142893R38494j413701l273451m423282l483375Q90443N814479
60572e18003O092521J357656l005421l137922q42444O54628R77138J043499Q79584
60563C501236Q05232J763130K871218J537031k419828n524729n185641k982989
60555e635340j802631j982347j959343p67594J554940M197829N091677K366563
$$ y = [-13376395, -9995965, -2712522, 3219827, 2940538, -966410, -2898770, -2854957, -4688338, -7822471, -7315556, -1885828, 3901916, 5971241, 4609104, 1807049, -775644, -958097, 2352644, 6125600, 5926780, 2204420, -183425, 923270, 2772253, 3243784, 3818268, 5534755, 6550330, 5864108, 5477992, 6484361, 6617495, 4297061, 1913716, 2289497, 4432390, 5370884, 3957183, 683732, -3739550, -7222925, -6332482, -518003, 5574518, 6932174, 3926753, 788831, -53613, 601015, 1578153, 2621652, 3501236, 4306468, 6069598, 8940816, 10477847, 8058019, 2533290, -2652351, -5635340, -7437971, -9420318, -11379661, -12147255, -10592315, -6394486, -1302809, 1063754]
60547A063754k350453m367117j513986K557081K793077p78753l149036n01871
60539f247304N345593Q871807O522510L05709m283492l965490o53682J619611
60531G515262J306001m26045k346183l575893k544639J244525M701108L705670
60523I579806j355377n519747n384499k636988o95069m30435l69799Q31447L035172
60514b945489M416104K844939p66884j714019K739151P910763O489110j336821
60506A7636854p579836p135558l387931j251319k22325K055200L972365K471668
60498F559118j399648l796119l284995j393158N03669J897730K119613J060052
60490B266262k15681j041990j601395j056411J714271M488130K895779k849903
$$ y = [1063754, -1286699, -5653816, -7167802, -4610721, -1817644, -2596397, -5745433, -6247304, -901711, 7970096, 14492606, 14798315, 10514823, 6549333, 5895651, 7515262, 8821263, 8395218, 6049035, 2473142, -71497, 1173028, 5874136, 9579806, 8224429, 2704682, -2679817, -5316805, -6011874, -6442309, -6812108, -5980661, -2945489, 1470615, 4315554, 3548670, 1834651, 4573802, 12484565, 18973675, 17636854, 10057018, 2921460, -466471, -1717790, -1940115, 115085, 4087450, 6559118, 5159470, 1363351, -1921644, -3314802, -2811133, -913403, 1206210, 2266262, 2050581, 1008591, -592804, -1649215, 65056, 4553186, 7448965, 4599062]
60482D599062o795486n293876j646557L2535L23440L56614j881864o158193o799349
60473b3263674j098351M552524L958714J166059L015390O896211N853088J623365
60465B703326J117519K780496p20330p185723o118924L115253Q151862K694494
60457F537973m185872l601468L43058P15281j76498K135017M239955J608732j946297
60448E669881j107657J084381l35572k158822N04981L335464k38186n618222l013225
60439a876977N552894P919545L76381p368777p323922k456637J636591M161345
60431F20443M736615Q42739n745841p758828k581335K914242K427636r21140j015955
60422f481424J284067P78394k746135l915567K68575O070743P187850J747649
$$ y = [4599062, -2196424, -7490300, -9136857, -9104322, -8780882, -8424268, -10306132, -16464325, -23263674, -24362025, -19809501, -15850787, -14684728, -11669338, -4773127, 1079961, 2703326, 3820845, 6601341, 5881011, -1304712, -7423636, -4308383, 3843479, 6537973, 2352101, -1249367, -906309, -191028, -367526, 1767491, 6007446, 7616178, 5669881, 4562224, 5646605, 5311033, 3152211, 3657192, 6992656, 6754470, 1136248, -1876977, 3675917, 11595462, 11971843, 4603066, -2720856, -5177493, -3540902, 620443, 5357058, 6199797, 453956, -7304872, -9886207, -6971965, -4544329, -5465469, -6481424, -5197357, -4418963, -7165098, -11080665, -10812090, -4741347, 2446503, 4194152]
60414D194152n082404o126110p95643L650131K200510j96587L199825Q465795
60406I509669N885275l686635q317660l027155K879596J353620k386472r14373
60398A295865K102765k10899m317861k359513L021607K560028l139332l780295
60390d827635L299037Q095016L666928l443084l947942R80349L676738J701376
60382I200783r61467j350489l80765N27776J230833J389031J53064k310733m364789
60373C133244m188149j503605J449536J518098j282866k628059M85053M346974
60365A330226K890056l162008o612944l962818K18653J115132L64931J367902
60357f450870K736323J442353q88469m81757J674979J192350j929530k508893
$$ y = [4194152, -888252, -7014362, -7810005, -4159874, -1959364, -2155951, 1043874, 9509669, 15394944, 11708309, 3390649, 363494, 3243090, 4596710, 2210238, 1295865, 3398630, 3187731, -1130130, -3489643, -468036, 2091992, -1047340, -4827635, -1528598, 6566418, 10233346, 6790262, 2842320, 3822669, 7499407, 9200783, 8239316, 6888827, 6508062, 7035838, 8266671, 9655702, 9808766, 7498033, 3133244, -1054905, -2558510, -1108974, 409124, -873742, -3501801, -3016748, 1330226, 4220282, 1058274, -5554670, -9517488, -9298835, -8183703, -7818772, -6450870, -3714547, -2272194, -3160663, -3642420, -1967441, -775091, -2704621, -5213514]
60349e213514J671797N723682M223242j216200m078659j401912K676347K293114
60341D677897k757785o590305m559085N74039K218249p65546k320078J545886
60333g976728O084300M755311k97796j131348L446743N467842m6778p124555p328635
60324d151644j342886L277170K730875l31263k777165l757324k284757K007266
60316f629728N385976L123276k703271m292175Q12805N528898L599633j379890
60308C445524k416657j5417K7005l057890m257136j624469J161808J783847K272869
60299b680516L331495J967243k301850m579704j909480J404436N69128j757293
60291e956541j56051L899748M022869m22864k848926N7748K939131L06130m609658
$$ y = [-5213514, -3541717, 2181965, 6405207, 5189007, 1110348, -291564, 2384783, 4677897, 1920112, -4670193, -9229278, -8655239, -6436990, -7202536, -9522614, -7976728, -1892428, 2862883, 2565087, 1433739, 4880482, 10348324, 10301546, 3176991, -4151644, -5494530, -2217360, 513515, 182252, -2594913, -6352237, -8636994, -6629728, -1243752, 1879524, -823747, -5115922, -4303117, 1225781, 4825414, 3445524, 1028867, 1013450, 1040455, -2017435, -6274571, -7899040, -6737232, -4953385, -2680516, 650979, 2618222, 316372, -4263332, -6172812, -4768376, -4199248, -5956541, -6112592, -2212844, 1810025, 1387161, -1461765, -1404017, 1535114, 1841244, -2768414]
60282b768414m633616N17041L941748J855864j240574J15073L922730L733029
60274E442881j634631o127403m849695j69893K830611L403838L855751L809320
60266F560779R25798l386469m553726k088864r37968l353839m542328j93953N867634
60257e702936O591791J569106l318017m586099m016197l206874q54530L171815
60249a0351941N557102L713963n50647l438086l195121m93253L108121N686541
60241C6679N686639L471613J011252n55008j660074k463238k283044j286601n00188
60232A458030M23364K800160N324498M091942j622095o548652n760094j819532
60224a652379j349453n071135o127813K9950Q236124R741155L593229k548732
$$ y = [-2768414, -7402030, -6884989, -2943241, -1087377, -2327951, -2212878, 1709852, 5442881, 3808250, -2319153, -7168848, -7338741, -4508130, -1104292, 2751459, 6560779, 7486577, 4100108, -453618, -2542482, -3480450, -6834289, -11376617, -11570570, -5702936, 888855, 2457961, -860056, -5446155, -9462352, -12669226, -13523756, -10351941, -4794839, -1080876, -1631523, -5069609, -8264730, -8757983, -5649862, 36679, 5723318, 9194931, 10206183, 9651175, 7991101, 5527863, 3244819, 1958218, 1458030, 1881394, 4681554, 10006052, 14097994, 12475899, 5927247, 167153, -1652379, -3001832, -8072967, -14200780, -14170830, -5934706, 3806449, 7399678, 4850946]
60216D850946k834755J03985Q15665p07217o10886J207592O31430l154521n112377
60207d810138j992400J801174L38747m360360m270227L207517J0386621Q129272
60199H430206k723692j1346864q509215L049815J1157926P705682k036230o200184
60191d72556j406057L727212J450407m374639m850614Q52309N344230M132377
60183D402669K72699k139375k940687k834562o54718L576419O455098M793220
60175A0930763n60637n838658p437690l732931L316187Q104313O284258L02883
60167A1368488l362727k756107j896693k984729k647305J421223N139049L592331
60159G873530j486481m219313k506172M98196J513081K32488k044103m001912
$$ y = [4850946, 2016191, 2120176, 2935841, 2228624, 1617738, 2825330, 3456760, 302239, -4810138, -6802538, -5001364, -4662617, -9022977, -13293204, -10085687, 300934, 8430206, 5706514, -5640350, -14149565, -11099750, 58176, 7763858, 5727628, -472556, -1878613, 1848599, 3299006, -1075633, -5926247, -5073938, 270292, 4402669, 4675368, 2535993, -404694, -3239256, -3893974, -317555, 6137543, 10930763, 10370126, 4531468, -2906222, -6639153, -3322966, 4781347, 11065605, 11368488, 8005761, 5249654, 3352961, 368232, -2279073, -857850, 4281199, 7873530, 6387049, 2167736, -338436, 159760, 1672841, 1905329, -138774, -4140686]
60151d140686m564746l274746m48310L217245O053756N097700n63167o100732
60143d723686m997235J827555N754582K020965l357785k446571L129954N353625
60135B561404J816179j918832j491666O04727j7740l144569m623940j685458L809348
60126d090547P007542M962629j03125l571459m141175m100280l910451j024752
60118h971618M173188O361403K848066j346599o36356K794248L154858J67961
60110H545151j978226k006266j463919K43822L591972L876547l068192j0997811
60102c256922q807362K703394R489249L446227o211796o814005J83972L679196
60094e588047M6825l536341j507464K938198M739704M346875M565390M230282
$$ y = [-4140686, -8705432, -11980178, -12428488, -9211243, -3157487, 1940213, 1377046, -4723686, -9720921, -7893366, -2138784, -117819, -3475604, -5922175, -2792221, 2561404, 4377583, 2458751, 967085, 1571812, 1554072, -1590497, -6214437, -7899895, -4090547, 2916995, 7879624, 7776499, 4205040, 63865, -4036415, -7946866, -8971618, -4798430, 1562973, 4411039, 3064440, 2428084, 5222332, 8377190, 8545151, 6566925, 4560659, 3096740, 3340562, 6932534, 10809081, 7740889, -3256922, -12064284, -9360890, 128359, 3574586, -2637210, -9451215, -9267243, -5588047, -5541222, -9077563, -10585027, -7646829, -2907125, 1439750, 6005140, 10235422]
60086A0235422l3059o719300q869484k758831N728184P339640J297096l849065
60078B370603k292271J525458R83842k352611k519496L71156J163506m82638L13029
60069i19422L878561M293185l71503l977031j978452J784440K123251J7688j595319
60060C255398l579699o577891o514442o05078O086896O667103K068524j513225
60052g12414k152796k522050k641623M53043N918486Q338654M882672j249238
60044A0314734n129581m283386R23550P028284Q274948K253231n442949o706309
60036G232522j138520L688062K458166k050285m326583l016321p75214m45834
60028A625993k842092o006627o072908j201303N207643P615537M495636p86842
$$ y = [10235422, 10202363, 3483063, -5386421, -8145252, -2417068, 4922572, 6219668, 2370603, 78332, 1603790, 2587632, 235021, -2284475, -1913319, -749813, -1232451, -919422, 2959139, 7252324, 6880821, 2903790, 925338, 2709778, 4833029, 4850717, 3255398, -324301, -6902192, -13416634, -14021712, -7934816, -1267713, 800811, -712414, -2865210, -5387260, -8028883, -7575840, -1657354, 6681300, 11563972, 10314734, 5185153, 901767, 1825317, 8853601, 17128549, 19381780, 13938831, 7232522, 6094002, 9782064, 12240230, 10189945, 5863362, 2847041, 2071827, 1625993, -1216099, -7222726, -13295634, -14496937, -9289294, -1673757, 2821879, 2035037]
60020B035037m232960l833151K30636M593838M109930j499258m992876j089063
60012d677867M340632K122024n318145o604644J001147P366602N353615K88180
60004C871544j081700r69653l203612m443198r88216K848020J836562q18176J4975
59995b933454J468350j085032l467434M14514N579786K585285n472402o300247
59987i210634J561740O175661J762417l109118j386763J557906l36324k784943
59979e770058k63313L516395L246016J860911L408147L665181j806857o784072
59971A072350l043836M893394N755788p71102m622405k285292o29245l056802
59963b687150l963414p9431L261801J600069j623440k100294j223440j158228
$$ y = [2035037, -2197923, -6031074, -5800438, -1206600, 2903330, 1404072, -3588804, -4677867, -337235, 1784789, -3533356, -10138000, -9136853, -1770251, 3583364, 3871544, 2789844, 1820191, -1383421, -5826619, -6814835, -3966815, -2130253, -2948429, -2933454, -1465104, -2550136, -6017570, -5603056, -23270, 2562015, -2910387, -9210634, -7648894, -1473233, 289184, -2819934, -4206697, -2648791, -2985115, -5770058, -6033371, -2516976, 729040, 2589951, 5998098, 9663279, 7856422, 1072350, -1971486, 2921908, 8677696, 7906594, 3284189, 998897, 369652, -2687150, -6650564, -6729995, -3468194, -1868125, -3491565, -5591859, -6815299, -7973527]
59955g973527k13138K323307L063631Q23912N624K943393M815438J477804l194515
59946D071929l650510j345663p87088j328878J96183K139194N80424l032500l755424
59937f912333j291880K52328q1031Q86447L976600N920324M688644J872061o21158
59928H690002k163757j908551J54794J061823j796476n542462m644012J154661
59920d993978O365645P381403N834613L857795R40671l011356n687527n441190
59912E246076l560459k242267k398656l542525l684213m08282N086257O994854
59904A490785K124965m074155m206171L45588K300840N80671P74171L423215K041942
59895D801851m344786o940042j011493N069616K238341n071792o081679J56973
$$ y = [-7973527, -8186665, -5863358, -2799727, -1975815, -1970191, 973202, 5788640, 7266444, 4071929, 421419, -924244, -1711332, -3040210, -2844027, -704833, -124409, -3156909, -6912333, -8204213, -7951885, -8032916, -7146469, -3169869, 2750455, 7439099, 9311160, 8690002, 6526245, 4617694, 4772488, 5834311, 4037835, -1504627, -6148639, -4993978, 1371667, 8753070, 14587683, 18445478, 19386149, 16374793, 10687266, 5246076, 1685617, -556650, -2955306, -6497831, -10182044, -10590326, -5504069, 1490785, 3615750, -458405, -4664576, -4318988, -2018148, -1437477, -663306, 2759909, 4801851, 457065, -6482977, -7494470, -2424854, -186513, -5258305, -11339984, -11183011]
59887a1183011N260258N069966L135174J803015r14921m645382m847772j74335
59879f497008M395444M408165J270128j506668l145393m169857l699578j140175
59871a0084942J648295K379830J243470J44365J84379J068032J928336J784818
59863B96583J45583k025689k715918r44976J973162L598904K555844l88935l082878
59854e88320l898275l008718j584643j26931J509748K856289L125153K685993
59846I70296K531505K332891J075756m63699n20568K50956n99693k718033k723510
59837A35901J46012K190981J039158p94473p13042k03816q93118p19741J651827
59828A839689K675443m00423l221505l43740M795104L649935m051149q649159
$$ y = [-11183011, -5922753, -852787, 2282387, 4085402, 3170481, -1474901, -6322673, -6497008, -2101564, 2306601, 3576729, 2070061, -1075332, -5245189, -8944767, -10084942, -8436647, -6056817, -4813347, -4668982, -4484603, -3416571, -1488235, 296583, 442166, -1583523, -4299441, -5244417, -3271255, 327649, 2883493, 2494558, -588320, -4486595, -7495313, -9079956, -9206887, -7697139, -4840850, -1715697, 970296, 3501801, 5834692, 6910448, 6446749, 5926181, 6177137, 5577444, 2859411, 135901, 281913, 2472894, 3512052, 2717579, 2004537, 1800721, 907603, 187862, 1839689, 4515132, 4114709, 893204, 549464, 5344568, 8994503, 4943354, -3705805]
59820c705805m216457L175945M699731P96423j407562M55468J432525j694169
59812d63901m298098m05336P279043R097953J424845o927691n749598K239282
59804B196499M923925j835308q361878n359600L520464Q434699O687500K794091
59796A3000392m72945l819585o494177o307517l683345o77110K495920N422618
59788e35749M691928j297223p269821o933966j706398K511863M476573O337768
59780B74975O126322M93196o427168o531004l26551L350604J137223q78317J087716
59771a693004K514364r7237k833624k034815o75921j926904k906930k15148L647226
59762f221993M317162J702709j712930m354670m400506j13729N809281P457947
$$ y = [-3705805, -7922262, -4746317, -46586, 749837, -657725, -202257, 1230268, -463901, -4761999, -5167335, 2111708, 11209661, 12634506, 5706815, -42783, 2196499, 7120424, 5285116, -3076762, -8436362, -4915898, 3518801, 10206301, 13000392, 12527447, 8707862, 2213685, -4093832, -7777177, -8454287, -5958367, -535749, 4156179, 2858956, -4410865, -11344831, -13051229, -10539366, -6062793, 274975, 6401297, 6894493, 467325, -6063679, -6390230, -3039626, -1902403, -2780720, -1693004, 821360, 724123, -2109501, -4144316, -4820237, -6747141, -9654071, -9869219, -6221993, -1904831, -202122, -1915052, -6269722, -10670228, -10783957, -4974676, 2483271]
59754B483271L925762O93585N64203O3581k325619k346279J331324K743152j346734
59745E786246m791393k148281J853141P55122k235183l24974M392917M214354
59737G501949j388121n404744m365211j774577q75437p01880L54032J998684L246153
59728a409152L146638J326472m90943k75157L2307k928476o083451k462114N785714
59719c358162O957395k200021r019588l895175M164567K536094m215977l054731
59711a2085598N213113Q507863M163065P61999J279464L05836k328605p76904
59703E040233L133284P40146o997053q967946k702582J420979j263336k290114
59695a1886389L099373O830442L445652N44303M243062O885687M44088q270070
$$ y = [2483271, 6409033, 7102618, 7666821, 7730402, 5404783, 3058504, 4389828, 7132980, 5786246, 994853, -1153428, 699713, 1454835, -780348, -1105322, 3287595, 7501949, 6113828, 709084, -3656127, -5430704, -6306141, -7008021, -6653989, -4655305, -1409152, 1737486, 3063958, 2573015, 2297858, 2330165, -598311, -6681762, -9143876, -3358162, 3599233, 1399212, -7620376, -11515551, -7350984, -4814890, -9030867, -12085598, -6872485, 1635378, 5798443, 6560442, 7839906, 8145742, 5817137, 5040233, 8173517, 8913663, 1916610, -7051336, -9753918, -8332939, -9596275, -11886389, -8787016, -1956574, 1489078, 2033381, 6276443, 13162130, 13606218, 5336148]
59687E336148p810090K72588N493817M337789J647819N60066K21742J41266l53449
59678I847696l194676o638715m871638K016394M984374m22949n714084k848012
59670f841610K538989J565295k201785O8286N735225N012133j527367l761139
59662E88027P95754L773546N89211l495361l712806j931261m21631J508536K819461
59653E13476Q41621k572407k715490m16447o72051k836967j447878K596263K090338
59644d619542l268828m635236J224511N599074J990921l116817j210812M442657
59636c594072M753810p75934m476500k529014J206415K353729R72427m98510j63390
59627b751039K118425L955843K292567k072572m450148k821151r04446j803974
$$ y = [5336148, -2473942, -2201354, 3292463, 7630252, 9278071, 9838137, 10059879, 10201145, 9847696, 6653020, 14305, -4857333, -2840939, 2143435, 1720486, -3993598, -6841610, -4302621, -2737326, -4939111, -4870825, 864400, 5876533, 4349166, 588027, 1383781, 5157327, 5746538, 2251177, -1461629, -3392890, -3814521, -2305985, 513476, 1355097, -1217310, -3932800, -4349247, -5021298, -7858265, -9306143, -6709880, -4619542, -7888370, -12523606, -11299095, -5700021, -3709100, -6825917, -8036729, -3594072, 1159738, 383804, -4092696, -6621710, -5415295, -3061566, -2089139, -2587649, -2751039, -632614, 3323229, 5615796, 3543224, -906924, -3728075, -4632521, -6436495]
59619f436495k539287R64947O732272R318380P190181K996798j366053n196844
59611A1663899o391707l721302o62909j619538m773251m227647N59138L507819
59603e665498J522040q49906M12884J748649j469969n594095l160224M775639
59595h280480Q615344L947970k005008j515561K411833K142863j820786k426109
59587A070066J411086K940969p50177l992495k717690j179360l196552m073232
59579a0487385J269875P777159O878432K02397k808122N18237L431570J839973
59571H622136m58717m88542r74333l018338k183998L085553O181931J677702n416033
59562G027361o480669j605329J831420O33286j098421N3906J918383J220295j432478
$$ y = [-6436495, -8975782, -8010835, -1278563, 8039817, 15229998, 18226796, 16860743, 11663899, 5272192, 1550890, 887981, -731557, -5504808, -9732455, -9173317, -5665498, -4143458, -4993364, -4580480, -2831831, -4301800, -9895895, -13056119, -8280480, 334864, 4282834, 2277826, 762265, 3174098, 5316961, 3496175, 1070066, 2481152, 5422121, 4671944, 679449, -2038241, -3217601, -6414153, -10487385, -9217510, -1440351, 5438081, 5640478, 2832356, 3350593, 6782163, 8622136, 8163419, 7674877, 6700544, 3682206, 1498208, 4583761, 10765692, 12443394, 7027361, 546692, -1058637, 772783, 1406069, 307648, 361554, 2279937, 3500232, 2067754]
59553B067754l135540k632963p59479J624956M311269O411793N758722J259585
59545A4906097l962581m241225J575086O836400M715531k148106m816911q96552
59537A1967739K146781j163109n516791k976576M468234P149221J168018o532295
59529A0711222p640278k598790J374011L43126j563733J339648P023849P119738
59521A6108793r78978q171875m952960M627134P882423J351478n201036m103159
59513F561820L59253J434917J84148o4685j476309n747203o993169j50804Q311879
59504B419847Q200988P77580m192330m005285m281991n828264k913577L681355
59496f141677M579466k639745p155808r08426Q676741J0092433M101044m70783
$$ y = [2067754, -1067786, -3700749, -4460228, -2835272, 1475997, 7887790, 13646512, 14906097, 10943516, 6702291, 8277377, 15113777, 19829308, 17681202, 12864291, 11967739, 14114520, 12951411, 7434620, 4458044, 8926278, 16075499, 17243517, 10711222, 3070944, 472154, 1846165, 2189291, 625558, 1965206, 8989055, 16108793, 15129815, 6957940, 2004980, 6632114, 14514537, 15866015, 10664979, 6561820, 6921073, 8355990, 8540138, 8475453, 6999144, 1251941, -5741228, -5892032, 2419847, 10620835, 11398415, 7206085, 3200800, -1081191, -6909455, -9823032, -6141677, -1562211, -4201956, -11357764, -12266190, -3589449, 6502984, 10604028, 10133245]
59488A0133245j218419k211901l393922p94423L683700L054604k813677n296226
59480A142981k53579M827525J933648n439393p735719l006737J750861J560542
59472e219871p34774m76736K238489M175199L570965Q63229k536126m204231k042132
59463d365988K263030L895384J481605k88586J963142M142712J271157l241654
59455G120802k553521J409766L31763n636151o468491Q21778N323056o49822p993954
59446h294774m746171M570680O254962j051788n990149l463598Q2869Q42751L194795
59437h600423P872025P492414m65748p049519m806803J589485M251927L397132
59429C680490K902551K221855J58956j74378K203203J381841n512532j0089999
$$ y = [10133245, 8914826, 6702925, 3309003, 2514580, 6198280, 9252884, 6439207, 1142981, 889402, 5716927, 7650575, 2211182, -5524537, -8531274, -6780413, -5219871, -5954645, -6431381, -4192892, -17693, 3553272, 4416501, 1880375, -2323856, -4365988, -2102958, 1792426, 3274031, 2985445, 4948587, 9091299, 10362456, 7120802, 4567281, 5977047, 6308810, 672659, -5795832, -4974054, 349002, -300820, -8294774, -13040945, -8470265, -2215303, -3267091, -9257240, -12720838, -12637969, -11795218, -8600423, -728398, 6764016, 6298268, -751251, -5558054, -3968569, 283358, 3680490, 6583041, 8804896, 8963852, 8789474, 10992677, 12374518, 6861986, -3228013]
59421c228013m092527O187137P646567p08570p406880n522868L65232M075988
59413b683934M903691L644222J42405l286299l028014k60035L44123j423966j246157
59404b893964J379147J937420q37996k611929r82962J304643K248358L024833
59396B567550L066411k22330m974840n400504j099358J581021k1771j139802N98583
59387e045040M49238l643770n416515q04517M195653L757099K450936O022577
59379A965661Q979830K874744p636312r733265j929409L880582J032964l045231
59371c610436m57978M884511M981650M32856k086945q97996m59887k734148l902963
59362c851336j033974K615379K113926j505829k176677K195170N753352K806398
$$ y = [-3228013, -7320540, -1133403, 6513164, 5804594, -1602286, -7125154, -6759922, -2683934, 2219757, 5863979, 6006384, 2720085, -307929, -567964, -223841, -1647807, -2893964, -1514817, 422603, -415393, -3027322, -4010284, -2705641, -457283, 2567550, 5633961, 5411631, 436791, -4963713, -6063071, -4482050, -4503821, -5643623, -5045040, -4595802, -8239572, -13656087, -14460604, -10264951, -6507852, -4056916, 1965661, 10945491, 13820235, 6183923, -3549342, -5478751, -1598169, -565205, -3610436, -4068414, 816097, 5797747, 6230603, 4143658, 3245662, 2785775, 51627, -3851336, -4885310, -2269931, -156005, -1661834, -3838511, -1643341, 4110011, 6916409]
59354F916409l306849m823542j380275r6012l315895m556904P114M239553K102224
59345d214177k131585j428061K039538J514765j957868j661323K695807M945427
59337a97477L432317K307311K190454n36786m449443l213808K938826N555394
59329H026788R22538m296938m189070j865011k028820k953885j117557K417846
59321e084109M949417N922508M290353j585528q061168p561628N8447N126489
59313a945219J927291l084757k542607O60784P22852k83038K330252O065206N676847
59304I527611K361589O7697k357772o728214q351175k789013M572424N424480
59296A727627J161065j081524r12780k522786l720206Q57831P722680P949050
$$ y = [6916409, 3609560, -1213982, -2594257, -2690269, -6006164, -10563068, -10555954, -6316401, -4214177, -6345762, -7773823, -5734285, -4219520, -6177388, -7838711, -5142904, -197477, 3234840, 5542151, 7732605, 7195819, 2746376, -467432, 2471394, 8026788, 8949326, 4652388, 463318, -1401693, -3430513, -6384398, -7501955, -5084109, -134692, 5787816, 10078169, 8492641, 431473, -7130155, -7071708, -1945219, -17928, -3102685, -5645292, -4984508, -4261656, -4544694, -2214442, 3850764, 9527611, 11889200, 11956897, 9599125, 2870911, -5480264, -8269277, -3696853, 1727627, 2888692, 1807168, 894388, -1628398, -5348604, -4490773, 3231907, 11180957]
59288A1180957J749929k216277j621944k311757n146388l944209J536601L180075
59280B406987j652455n495494l641611m91644P14234L098520O529360M381831
59272E849728m132389r216791m885345J765087K715960Q83685K016008L673896
59264a330161J116902l004516l302234k00549L054240N863579O943333K869589
59256A2010183m147569n562132m3522K093438m216527q653323k683906M583945
59248f619413J470945n412508k123984Q009690R358900K5514n906471k052722
59240c250049K163539k70228l721745k500878J14448P63246K133264N053363M991808
59231E476768J261328j61987K427868K412772l465254q638579p059514j574052
$$ y = [11180957, 12930886, 10714609, 9092665, 6780908, 1634520, -2309689, -773088, 2406987, 754532, -4740962, -8382573, -8874217, -8159983, -5061463, 1467897, 5849728, 1717339, -7499452, -12384797, -10619710, -7903750, -7020065, -5004057, -1330161, -213259, -3217775, -6520009, -6720558, -3666318, 2197261, 9140594, 12010183, 7862614, 2300482, 2256960, 4350398, 133871, -8519452, -11203358, -6619413, -5148468, -10560976, -12684960, -4675270, 4683630, 4709144, -1197327, -3250049, -1086510, -1356738, -5078483, -7579361, -7464913, -6701667, -4568403, 484960, 5476768, 6738096, 6576109, 9003977, 11416749, 7951495, -687084, -7746598, -9320650]
59223i320650K752669N385815O038167K446179k763034k007897M980795P926897
59215A5438941J321730o147911n010699Q02768K133854n83012r57821N29872j577950
59206E949772n970072n312711J568744O916722M679486k180568o380149m363660
59198e092436J149074M436261K663143r62771j640625R6585J03493j379776j05691
59189g32743L319166L361861K80034R96634N475281L616662p347270j3961176
59181d991551n539594P815717R217636l37700n777174j783660K389721N14336
59173A507731k622777k121509K11345J967781L100126J691608l756136p663492
59165g685323l202321N192173O344727j79671l548647j01723J578540k192275
$$ y = [-9320650, -6567981, -1182166, 4856001, 7302180, 4539146, 2531249, 7512044, 15438941, 16760671, 10612760, 5602061, 6404829, 8538683, 7955671, 6997850, 7527722, 5949772, -20300, -5333011, -3764267, 3152455, 7831941, 5651373, -728776, -5092436, -3943362, 492899, 3156042, 2193271, 552646, 649231, 752724, -627052, -732743, 2586423, 5948284, 6228318, 7224952, 12700233, 16316895, 8969625, -4991551, -10531145, -2715428, 6502208, 6164508, 387334, -1396326, 993395, 1507731, -1115046, -3236555, -3025210, -1057429, 2042697, 3734305, -21831, -7685323, -10887644, -5695471, 649256, 469585, -3079062, -3180785, -1602245, -3794520]
59157c794520k663450M604721R178075K237232p554753o847071J901531N570511
59149B632276P71146l636598k015317J658303K723887J516125p77546m091606
59141a219330o163651l794340J361443L738012J593992r92741o84045J009852
59133e150808J245615k39022j892106k386120j248706O82759J637459J183679
59125f167250Q90166J267584M55945j846599k280234J032782M391469L770686
59117A514549J220283J027611K164611N41291k991404l440254J07812L348011
59109C492510L874052L393066K570996r1486l404471l742048j442933p97766k238082
59100A613838j339768K224005K325672l117308o717225k466238M340098N091118
$$ y = [-3794520, -6457970, -1853249, 7324826, 9562058, 2007305, -4839766, -2938235, 2632276, 3403422, -233176, -2248493, -590190, 2133697, 3649822, 2872276, -1219330, -7382981, -11177321, -9815878, -6077866, -4483874, -5476615, -6160660, -5150808, -3905193, -4144215, -6036321, -8422441, -9671147, -8988388, -7350929, -6167250, -5277084, -4009500, -3553555, -5400154, -7680388, -6647606, -2256137, 1514549, 2734832, 3762443, 5927054, 6468345, 3476941, 36687, 144499, 3492510, 7366562, 10759628, 13330624, 13239138, 9834667, 6092619, 4649686, 3851920, 1613838, 274070, 2498075, 4823747, 1706439, -5010786, -7477024, -3136926, 1954192]
59092A954192P20773j427107M5262K04866j984905k086209Q82284K307579M73075
59083A089810l70417J860797K743071j022484n358710m755818k31946K990461
59075c055236K433661p40952m469597n889343k375691L700886N355254O57043
59067d383975k628641J850990Q012367N903183k066339m104301K410644O950940
59059A1944868K852460l017041k888693j91525j319542l725851j766551J750271
59051C638396L85818l569247k560347K393121K622711l206982o166799j654177
59043h117506L325837K063283j483371n36010L027247K460123k637176o049800
59035g947373m220656k9968K290937J804641K85021l04852M27396J028662M52684
$$ y = [1954192, 2674965, 1247858, 1293120, 1497986, -486919, -2573128, -1690844, 616735, 1089810, 719393, 2580190, 5323261, 4300777, -1057933, -5813751, -6045697, -3055236, -621575, -1362527, -5832124, -11721467, -14097158, -10396272, -5041018, -4383975, -7012616, -5161626, 2850741, 8753924, 6687585, 2583284, 4993928, 11944868, 14797328, 11780287, 8891594, 8700069, 7380527, 3654676, 1888125, 3638396, 4024214, 454967, -2105380, 287741, 2910452, -296530, -6463329, -8117506, -4791669, -2728386, -4211757, -4747767, -1720520, 739603, -1897573, -7947373, -12168029, -12197997, -9907060, -8102419, -7817398, -8122250, -7694854, -6666192, -6213508]
59026f213508M57850L174957O302546N020765r8645k264519J615045N353061K277476
59017A5625028m759293p796996n090068j722001n17424J089305M658759O806105
59009H293415L874219k493567o461044l907175K929272O616252K092292o438385
59001D505279r394550l975704K087771J923889o64880J688864P443106Q409617
58993A2023392K358728m418272o636434m912663j184367L371937N101565K52512
58985E956398p344653q352389p92084O134047N146317R95992J646308N113984
58977H503920L095915n002077j0051982o007040J863740M513825Q23828k199187
58969d459058M35748N320482N801736Q91028m226604n779937n223995m398685
$$ y = [-6213508, -5755658, -2580701, 3721845, 8742610, 8643965, 6379446, 7994491, 13347552, 15625028, 10865735, 3068739, -2021329, -3743330, -4260754, -3171449, 1487310, 8293415, 12167634, 9674067, 3213023, -694152, 2235120, 8851372, 10943664, 4505279, -4889271, -8864975, -6777204, -4853315, -5518195, -3829331, 3613775, 12023392, 14382120, 9963848, 3327414, -1585249, -2769616, 602321, 5703886, 5956398, -1388255, -9740644, -10532728, -4398681, 747636, 1743628, 3389936, 8503920, 11599835, 6597758, -3454224, -9461264, -7597524, -3083699, -2259871, -4459058, -4023310, 1297172, 7098908, 7989936, 3763332, -2016605, -7240600, -11639285]
58961a1639285j714028L559283P469304O564175L452619K003564O78634k894730
58953G479536m681230l93991M135002j24728r121806r223305J311566Q161899
58945b457057K987206m365390l666493p11102m120695p445262J5214J2188704
58937g574875J3246231K360880n415321k972877M95350k018134m026552M76024
58929e429274M624102k6214q470786q923796m0684P678206O264761r79938n599500
58920a0903123m194755p90085m92141k397468p98239N740723J0329429O972071
58912C466412L70174m39039L692114L049248n175258j1632293q461637L21292
58904a4808987O449761P685877N421391l20745o898798o952348J627952Q948193
$$ y = [-11639285, -13353313, -9794030, -2324726, 4239449, 7692068, 9695632, 10374266, 7479536, 2798306, 2404315, 6539317, 6414589, -2707217, -11930522, -10618956, -2457057, 530149, -3835241, -7501734, -8212836, -12333531, -19778793, -19763579, -7574875, 5671356, 8032236, 2616915, -355962, 139388, -1878746, -5905298, -5429274, -805172, -831386, -9302172, -18225968, -18266652, -10588446, -4323685, -5303623, -10903123, -15097878, -15887963, -16380104, -18777572, -19575811, -13835088, -3505659, 3466412, 3836586, 3397547, 7089661, 10138909, 4963651, -6668642, -15130279, -14808987, -8359226, -673349, 4748042, 4427297, -2471501, -9423849, -7795897, 1152296]
58896A152296N117803m912667p917675j372817M259515K106461k335961j749981
58888e653026K140410L165659M95914j629860r69433O54903J201144Q01812M11085
58879F18608L09555L20896L82092M97448M54275j25417j191755j854500j247095
58870a835893J55866J028299J055488J032671J043832K64061j164630k018962
58862d39268k018556j726537m93816K290945L900056R26997l685788k332705N337642
58853A758970Q694972L69309j1160522j1763298j466239N983680L465132l54690
58845d472686L551622R421301N619701o311322j2020423m296595O490856O775566
58837D758020j523600m619526K724451R652388N398325m851558p835704j510704
$$ y = [1152296, 6270099, 1357432, -6560243, -7933060, -3673545, -1567084, -3903045, -5653026, -3512616, -346957, 148957, -1480903, -2450336, -1795433, -594289, 207523, 618608, 928163, 1249059, 1631151, 2128599, 2582874, 2457457, 1265702, -588798, -1835893, -1680027, -651728, 403760, 1436431, 2480263, 2744324, 1579694, -439268, -2457824, -4184361, -4678177, -2387232, 1512824, 2439821, -1245967, -3578672, 1758970, 10453942, 10823251, -337271, -12100569, -13566808, -7583128, -4117996, -4472686, -921064, 8500237, 14119938, 7808616, -4211807, -8508402, -2017546, 4758020, 3234420, -1385106, 1339345, 10991733, 16390058, 11538500, 3702796, 2192092]
58829B192092L266748j19226n169279l709098K186112N128516L194778j44193
58821F826450k454926l123937j308884J797879K103579j266781k925863P42202
58813C89719N052074M307721P13105r01312k071078n789801p459126j538883O041527
58804a256054M503466l837332n524100K700868Q076743J855485p358763p561974
58796h401661n22666L674795J815925j581797l466632m033785k589002J306186
58788a3798637M684678M587591K549870J566589J429054Q46455P33404J520546
58780D119550J010770j171201j378132J486993K242870k238979o081447k805277
58772d814853L559143M066713j132041l463503j5950K216136j743255o430047
$$ y = [2192092, 5458840, 5339614, 170335, -3538763, -1352651, 3775865, 6970643, 6826450, 4371524, 1247587, -61297, 1736582, 3840161, 2573380, -352483, 389719, 5441793, 9749514, 10462619, 9561307, 7490229, 1700428, -5758698, -7297581, -1256054, 3247412, -589920, -6114020, -3413152, 4663591, 6519076, -839687, -8401661, -8924327, -5249532, -3433607, -5015404, -8482036, -12515821, -15104823, -13798637, -9113959, -4526368, -1976498, -409909, 1019145, 1865600, 2599004, 4119550, 5130320, 3959119, 2580987, 4067980, 6310850, 4071871, -2009576, -4814853, -1255710, 2811003, 1678962, -1784541, -1800491, 415645, -1327610, -7757657]
58764g757657l859250M744859R938107N475859m403158r697617n690943K022963
58756i226837M717216J352556j307681P91455L683875K694944l86683j504526
58748H14319j119076j736212k278194m48051K001655J857657J20810j96775K00916
58739g82951j093301k402464j84544M183371N702338L098897n36074l477879o045455
58730a538062o468618k388929L565018N838281M001282K841393L873793L064053
58722A2788211j450569n431971n029968k338842j385669k146263j598434J363682
58714e229823M332803M021854J56053k904251l78049N676319O977676K83049o414404
58705F521227m729764J229512J062241n395366p689088j019447P004195Q208569
$$ y = [-7757657, -11616907, -6872048, 3066059, 8541918, 4138760, -5558857, -11249800, -9226837, -4509621, -3157065, -4464746, -3673291, 10584, 2705528, 2318845, 814319, -304757, -2040969, -4319163, -4767214, -2765559, -907902, -787092, -983867, -782951, -1876252, -4278716, -4463260, -279889, 5422449, 8521346, 7985272, 4507393, -1538062, -8006680, -10395609, -6830591, -992310, 3008972, 5850365, 9724158, 12788211, 11337642, 5905671, 875703, -1463139, -2848808, -4995071, -6593505, -5229823, -897020, 3124834, 3280887, 376636, -1413, 5674906, 12652582, 12935631, 6521227, 1791463, 3020975, 4083216, -1312150, -9001238, -10020685, -3016490, 5192079]
58697E192079L788051p99005l221330l135046o09757J052595k264247p349374
58689g346034n587934L469975Q980304M328118k785085k636372K068068K731227
58681C222267n35663r34098K333754L507754P34293j899096k309293k586137l233415
58672a699634k201323R5674R77709P53549J901884L285239J453892k233636k429551
58663i6197J445612L851529K108993K66775J437261K299434r70114n981398p593185
58654c231290m935441j191594J332915K575102K769000J992317P79414n16750
58646d26327j925663k635471j518674L69776N17353p15058J57822L741857N255035
58637B820650J271116m367832n732985l307738j995674k281170J00114N304086
$$ y = [5192079, 8980130, 8181125, 4959795, 1824749, 1214992, 2267587, 3340, -7346034, -12933968, -9463993, -483689, 3844429, 1059344, -1577028, 491040, 3222267, 2686604, 1752506, 4086260, 7594014, 8328307, 6429211, 4119918, 1533781, -1699634, -3900957, -3805283, -2827574, -2074025, -172141, 3113098, 4566990, 2333354, -96197, 1349415, 5200944, 7309937, 7576712, 9013973, 11313407, 10343293, 4361895, -3231290, -8166731, -9358325, -8025410, -5450308, -2681308, -688991, 90423, -426327, -2351990, -4987461, -6506135, -6136359, -5619006, -6334064, -6176242, -2434385, 2820650, 4091766, -276066, -6009051, -9316789, -11312463, -13593633, -13493519, -8189433]
58629h189433P075005K196188l455618k796847K640382N930144M796947K554744
58621A0751512P93994k160645n385255m723835j00462K427709p47311n036337
58613d180630m541343n63961J626653J365062K318209N291427O873748N028609
58605A3217774J335038k470592n839753o928477l289914L400867O938679L234901
58597I598523m500946q846636n540068K636403Q423004O826925K59419l997236
58589D859388k330987J345700J906888n9449r79731p95679j791006l022584j590892
58580b458352J474491K235931M70728j94078J232940K003729J270986J108511
58572G144886J173150j729669p107356r188760m209149M583939J0628448R603592
$$ y = [-8189433, -1114428, 1081760, -2373858, -5170705, -2530323, 3399821, 8196768, 10751512, 11545506, 9384861, 3999606, -724229, -824691, 1603018, 855707, -4180630, -8721973, -9285934, -7659281, -6294219, -3976010, 1315417, 8189165, 13217774, 14552812, 12082220, 6242467, -686010, -3975924, -575057, 6363622, 9598523, 5097577, -3749059, -9289127, -6652724, 1770280, 8597205, 8856624, 4859388, 2528401, 3874101, 5780989, 5721540, 4741809, 3946130, 2155124, -867460, -2458352, -983861, 1252070, 1722798, 1528720, 2761660, 4765389, 6036375, 7144886, 8318036, 6588367, -518989, -9707749, -13916898, -9332959, 1295489, 10899081]
58564A0899081J682809p625758j0121028l676972L356003K887907o18247K256871
58556i59334Q668636O851566l051946o755979J151887P493150K215099m807108
58548A0805971j059025O779372M127500o446750q955132L08451P486291K814629
58540A5861307o488724q944936l812502J629704K705862P18579l81498J743315
58532C031107M799087L680800k272046o601654m184348J173639K683466M02062
58524B712113r07043j07745P86748J962128L692612K525820l013380o955389m264446
58515c568582q2005j191836l408929P97580O785495M281643l295361k552197O664858
58506D430666R341226J54943p246520k865198M071966K245564l311067k469541
$$ y = [10899081, 12581890, 4956132, -5164896, -8841868, -5485865, -2597958, -3216205, -959334, 7709302, 14560868, 11508922, 4752943, 5904830, 13397980, 15613079, 10805971, 9746946, 16526318, 20653818, 14207068, 5251936, 5560387, 13046678, 15861307, 9372583, 427647, -3384855, -1755151, 950711, 1669290, 1287792, 3031107, 7830194, 11510994, 9238948, 2637294, -1547054, -373415, 2310051, 2712113, 1805070, 1697325, 2484073, 4446201, 8138813, 10664633, 7651253, 695864, -3568582, -3650587, -4842423, -8251352, -7453772, -668277, 3613366, 318005, -2234192, 4430666, 13771892, 13926835, 6680315, 3815117, 7887083, 10132647, 6821580, 4352039]
58498D352039J730600K38430m742684m217124R66257K079417j448715j412916
58490b454696L922023O301238J362646m378757m145966k72024J535666J004348
58482B874478J254997K122693Q64092k195596l375648j266958P88766m58851k988476
58473b380503k097487K313385M767010J983631k155366k648647r82219j828957
58465c029153m590466m322498j49713L483032L971172L021304J886816L36931
58457F07425M13185M146129P113725K481139p052619j0401281m126424K197408
58449d621313J243120j361334J365173M800683J348245m898575l872584L625864
58441b370721O641869J230093l888870j188160M875915N311245q28772o216407
$$ y = [4352039, 6082639, 6321069, 1578385, -2638739, -1672482, 406935, -1041780, -2454696, 1467327, 7768565, 9131211, 4752454, 606488, 334464, 1870130, 2874478, 4129475, 6252168, 7116260, 4920664, 1545016, 278058, 1066824, 607973, -2380503, -4477990, -2164605, 2602405, 4586036, 2430670, -217977, -1200196, -3029153, -7619619, -11942117, -12091830, -8608798, -4637626, -1616322, 270494, 607425, 1020610, 5166739, 12280464, 14761603, 7708984, -2692297, -6818721, -4621313, -3378193, -4739527, -3374354, 1426329, 2774574, -2124001, -5996585, -2370721, 4271148, 5501241, 1612371, 424211, 5300126, 10611371, 9782599, 3566192]
58433C566192n098555N52346M498677L520383K5541k116084k318896k346499k592679
58424b309574k369238k364110k767615n65987N747873J0164236N466135m420412
58416F581308p385688l96822N809751L087804l000398m330390k844197l862018
58408f340650m999758j455752L814773N004258L659327M540692N751330K696315
58400A2670535j984040k350304K67166N37187k82558K388710N435938J938937
58392A8621571n450360p064215j986482P18875k504330m894863k212382J172464
58384c599722K296620M673640R040606R368385L412470j879843j022476K241567
58376B4531247L199940L946183O877169Q222956M912290J278415K191705N516297
$$ y = [3566192, -1532363, -980017, 3518660, 7039043, 7064584, 4948500, 2629604, 283105, -2309574, -4678812, -7042922, -9810537, -10376524, -4628651, 5535585, 11001720, 6581308, -804380, -1201202, 4608549, 7696353, 4695955, 365565, -2478632, -6340650, -11340408, -12796160, -8981387, -3977129, -317802, 4222890, 9974220, 12670535, 10686495, 8336191, 8603357, 9140544, 8857986, 11246696, 16682634, 18621571, 13171211, 6106996, 4120514, 4839389, 2335059, -2559804, -4772186, -3599722, -1303102, 3370538, 12411144, 21779529, 25191999, 23312156, 22289680, 24531247, 27731187, 31677370, 38554539, 46777495, 51689785, 52968200, 55159905, 60676202]
58368F0676202P802635J1093892J6725925J8368875R846160m402795j4812184
58361A05298710j8787334j9345628j6104350p640795r6454k082208j0713133j3286079
58353A7242729n128931L752490L522970k614476n644526l550304k25068K899104
58345A0253988O280766O552153k08988r948349j3040676o763419J060918L299306
58337b514301K192328K846072L896530J171600l137788l037531P02841R76569
58329C096320l530186n082805O54325O650725M855509j630928m101312j641086
58321g29438o44282l167107m383345j660198J619357K666665L008809L634931
58313C45392K432814r07080k533003J4197L819412M755919K289873j802851n916280
$$ y = [60676202, 68478837, 79572729, 96298654, 114667529, 124513689, 120110894, 105298710, 86511376, 67165748, 51061398, 43420603, 43324149, 41241941, 30528808, 17242729, 12113798, 15866288, 19389258, 16774782, 11130256, 7579952, 7354884, 10253988, 16534754, 23086907, 22877919, 12929570, -111106, -6874525, -5813607, -2514301, -321973, 2524099, 6420629, 7592229, 4454441, 1416910, 2119751, 3096320, -433866, -5516671, -4862346, 1788379, 6643888, 5012960, 911648, -729438, -1373720, -4540827, -8924172, -10584370, -8965013, -6298348, -3289539, 345392, 2778206, 1871126, -661877, -647680, 3171732, 7927651, 10217524, 8414673, 2498393]
58304B498393p776634m813551J986535P381943P323632K949770k077226n399099
58296B073763n985289l685140m69404P96591K43779P57914K902815L679295J591330
58287A905654r44595j820633j893810j758277j74128K267018K478127L27879j1166
58278C76069K926128M610579J905970j493446j643689j123596l289250m597421
58270b328656k85777N644658M851127k188422o196849k909639J450829P93188
58262a169541k298844k527748k56069J009265J098342J931532K690674J260132
58254A737743j288159k251829k039845k705302k650794J690556Q286623R506230
58246A0285223K570271m916430m510632J428071L563744n93830l759775q81560
$$ y = [2498393, -5278241, -10091792, -8105257, -723314, 6600318, 9550088, 7472862, 2073763, -3911526, -7596666, -8066070, -7269479, -7025700, -6267786, -3364971, 314324, 1905654, 961059, -859574, -2753384, -4511661, -4685789, -2418771, 59356, 387235, 376069, 3302197, 7912776, 9818746, 8325300, 6681611, 5558015, 2268765, -2328656, -2614433, 3030225, 7881352, 5692930, -503919, -3413558, -1962729, -1169541, -3468385, -5996133, -6252202, -5242937, -4144595, -2213063, 477611, 1737743, 449584, -1802245, -3842090, -6547392, -9198186, -7507630, 778993, 10285223, 12855494, 7939064, 3428432, 4856503, 8420247, 7826417, 4066642, 3185082]
58238C185082K945331Q39567m657834n033659J500991P093675M886935k138879
58230H621209n318694q56729O109641P525762J339554o186277p558343k690073
58222I86050J726314J390719q15825q60188n0934j655713m380719m323428j560263
58213i543987L86584O67613J655660L802773M803210L948972K906329K097583
58205A0724737N05405j097082j062547p31121k787888n983437o232213k808036
58197i472182J228955M108185N688448M019742j858159o577570l694679L624181
58189b933079N560553J93202l948821j745460J825279K112437J860195K991193
58181E915499J227060m581292o948542j337592M988444M123319j90185o53658
$$ y = [3185082, 6130413, 6969980, 2312146, -2721513, -1220522, 5873153, 10760088, 8621209, 3302515, 2445786, 8555427, 16081189, 17420743, 11234466, 3676123, 986050, 2712364, 4103083, 3287258, 2427070, 2376136, 720423, -3660296, -7983724, -9543987, -9157403, -8489790, -6834130, -3031357, 1771853, 5720825, 8627154, 10724737, 11230142, 10133060, 9070513, 8339392, 5551504, -431933, -6664146, -9472182, -8243227, -4135042, 1553406, 5573148, 3714989, -2862581, -6557260, -2933079, 2627474, 2820676, -1128145, -2873605, -1048326, 1064111, 2924306, 5915499, 7142559, 2561267, -4387275, -5724867, -736423, 3386896, 3196711, 2543053]
58173B543053O85307j605468m033009k70343N154374K758920m815518n614344
58165e197028J881150N796197J82428n812185l238219L325520M723513R77788
58157B639164j689078j725219k378874m095898l453793J101286O661917Q848207
58149E907712N638986n97564m201628j694140L277005L625589j710037n828482
58141D417441l097774L448363O588122L835170j145216m095957m051509k320398
58133C578242j37341J898490K924406J605721k001119m808370l391092R13857
58125E82794K669786j57887k984670j797127M88618o19128l259695k745881j66974
58116g990164k45149k227171q61037L748954N410164K071042j096861q31681k71003
$$ y = [2543053, 3228360, 1622892, -2410117, -2680460, 2473914, 5232834, 417316, -5197028, -3315878, 2480319, 2662747, -3149438, -6387657, -3062137, 1661376, 2639164, 950086, -775133, -3154007, -7249905, -10703698, -9602412, -2940495, 5907712, 11546698, 10949134, 6747506, 5053366, 8330371, 11955960, 10245923, 4417441, 1319667, 4768030, 11356152, 15191322, 14046106, 9950149, 5898640, 3578242, 3440901, 5339391, 8263797, 9869518, 7868399, 3060029, -331063, 582794, 3252580, 3094693, 110023, -1687104, -1198486, -1817614, -5077309, -7823190, -7990164, -8235313, -10462484, -11323521, -7574567, -2164403, -93361, -1190222, -2021903, -2292906]
58107b292906j532883j545414Q71324J316002j805344k448916L080149P806736
58099C448748L803465m637364o674223r51795L560638K078411j75327J574098
58091B026651L956736K286037j427218k493044j217651j117340k128202j123254
58083a237285J770164K589180j23647k767518k102769K84936J233103Q51180J082934
58074A580278J467467M5131k384899k754999o23696R67913K32545j093726j202052
58065c766038o00164K14068J949878L669346K446050j697826m118087j851020
58057c753793J723582J928380o23987k229814j913657r80176M64354K266061K252855
58048h66195m9424p76264K267858M429778J031949m144106m523675j709504j910091
$$ y = [-2292906, -3825789, -5371203, -4499879, -3183877, -4989221, -7438137, -4357988, 3448748, 7252213, 2614849, -4059374, -5011169, -1450531, 627880, 452553, 2026651, 5983387, 8269424, 6842206, 4349162, 3131511, 2014171, -114031, -1237285, 532879, 3122059, 2998412, 230894, -1871875, -1586939, -353836, 497344, 1580278, 3047745, 3092876, 707977, -2047022, -2670718, -1702805, -1470260, -2563986, -3766038, -4366202, -4152134, -2202256, 1467090, 3913140, 2215314, -1902773, -3753793, -2030211, -101831, -725818, -2955632, -4869289, -5849465, -5385111, -3119050, -866195, -915619, -1691883, 575975, 5005753, 6037702, 1893596, -2630079, -4339583, -6249674]
58039f249674l700197m4655P638272R129784J742124m271265j581678L169805
58031E832516J116612m696525n465332o39792L199164L436288K848406K362369
58023G993706K74009k400274k661649j227655j583451l554637l392922n53990
58015g106863Q95475j140562l198141j256036L595155O616640N187318J536087
58007E129073j65497J201415K473201P02812k402803k907749o24378R26479M04488
57998D737041M6745M17228j079478m409442m983839r16671K690318J163010k174070
57989d509158j062927M013254O611055L145121l573120q312964p392463o50814
57981a1732016O910672P786218L01153p863107q414766k271872L401997M781513
$$ y = [-6249674, -9949871, -9994526, -2356254, 6773530, 8515654, 4244389, 2662711, 5832516, 6949128, 2252603, -3212729, -3852521, -653357, 2782931, 5631337, 7993706, 8267715, 5867441, 3205792, 1978137, 394686, -3159951, -6552873, -7106863, -6211388, -7351950, -10550091, -11806127, -8210972, -1594332, 3592986, 5129073, 4963576, 6164991, 8638192, 9341004, 6938201, 4030452, 3406074, 4332553, 4737041, 4783786, 5201014, 4121536, -287906, -5271745, -6188416, -3498098, -2335088, -4509158, -5572085, -1558831, 5052224, 8197345, 4624225, -3688739, -11081202, -11732016, -4821344, 2964874, 3266027, -4597080, -13011846, -15283718, -11881721, -7100208]
57973g100208K869984j275669o101996o575139P14230J0029997J1536102M373740
57965H471041k398653l023913j828158m197509p649627o408414l33953N250438
57957a2118748O225300L129264k76868l41057K587419L371518j610223p744093
57949f777488o868794Q18005O028780L723372j2519J251744L787491J051971m019457
57940a016895l361419K189204L213380l355959q854995n621383K354899O161638
57932h291530L793919K4249j556812r04619J443880M388628M990687K118798j02179
57923E905021K271945N475769K391824n782917r742131n637566m95151k31141
57915e844347l83528M385870Q643718M067002n184054o762580Q01769N444301
$$ y = [-7100208, -4230224, -5505893, -11607889, -18183028, -17468798, -7438801, 4097301, 8471041, 6072388, 3048475, 1220317, -2977192, -10626819, -17035233, -17369186, -12118748, -5893448, -2764184, -3041052, -3382109, -794690, 2576828, 966605, -6777488, -13646282, -12828277, -6799497, -3076125, -3088644, -1836900, 1950591, 3002562, -1016895, -4378314, -2189110, 1024270, -2331689, -11186684, -16808067, -14453168, -8291530, -4497611, -4473362, -6030174, -6934793, -5490913, -1102285, 3888402, 6007200, 5905021, 8176966, 13652735, 16044559, 10261642, 519511, -5118055, -5613206, -5844347, -6227875, -1842005, 6801713, 10868715, 5684661, -1077919, -276150, 5168151]
57907E168151O51172m557906r52245N731284M408532l420479o540961j772403
57899a284855K332955p2966l933837k601679K381620N290025M543621K252679
57891H907563p12495m186387n565046k287598L088116M715078J068871k881596
57883B146506k683999m94475j257041m673540n160091k62219M954020M514267
57875b916572l16923l289444k015851k9641j16621m96006P01529J506142l15473
57866g288860k848118k641555K14481K821292L764173L490077J617693k459204
57858c330021o406960n915550o8356O456935Q089300M290748l23888j335271J035095
57849B492032L050134K113425r27936l858059n394771m684745j103052L428275
$$ y = [5168151, 5819323, 1261417, 309172, 6040456, 10448988, 7028509, 487548, -1284855, 1048100, 975134, -2958703, -5560382, -3178762, 2111263, 6654884, 8907563, 8195068, 4008681, -1556365, -3843963, -755847, 3959231, 5028102, 2146506, -537493, -1031968, -2289009, -6962549, -12122640, -12384859, -7430839, -2916572, -3233495, -6522939, -8538790, -8568431, -8685052, -9181058, -8479529, -6973387, -7288860, -10136978, -12778533, -12564052, -9742760, -5978587, -2488510, -870817, -3330021, -9736981, -15652531, -15720887, -9263952, -1174652, 3116096, 2792208, 1456937, 2492032, 5542166, 7655591, 6727655, 2869596, -2525175, -7209920, -8312972, -4884697]
57841d884697M514115Q07519k816694j480436K492492L338517O42537j661118
57833I52235l179599o233895p979723k737304O544360R158479K371115l533342
57825d637674r22360M160820L396474n68250q61187J487218J707186R28868J805590
57816F496685P80391m705445p500086j311581N733741K155250o737723n989343
57808a1078111L952732P520299N43388k811242M699788R890585J353380j0657859
57800C412960j0448589j230633K310539j885076k820701L114747O655774J769930
57792H78951n079486n427962j4221M446478M089156L26731k968037k785078J89238
57783f344230J802618k95073k832996j589924J763532K100366o79461j064196
$$ y = [-4884697, -370582, 436937, -2379757, -3860193, -1367701, 1970816, 2613353, 952235, -2227364, -8461259, -16440982, -19178286, -12633926, -3475447, -1104332, -4637674, -5560034, -1399214, 1997260, 1429010, 567823, 2055041, 3762227, 4691095, 6496685, 7277076, 2571631, -4928455, -6240036, -506295, 1648955, -5088768, -11078111, -7125379, 394920, 938308, -1872934, 2826854, 12717439, 14070819, 3412960, -7035629, -8266262, -5955723, -7840799, -10661500, -7546753, -890979, 878951, -4200535, -9628497, -9642718, -5196240, -1107084, -780353, -3748390, -6533468, -6344230, -4541612, -4836685, -7669681, -9259605, -7496073, -5395707, -6075168, -7139364]
57775g139364L192086O721939L900242k912012o188204k915394K107766L024324
57767b08617l0566k630664k759837k228256j826768J84648L034820K111079l245972
57758g600133n613721L18604P481415N332490l132975m413736M557223J0715414
57750G644581M872831m127214l699156L279421M593647j821876o563963m673711
57742d95440j432895j579011k525046r78159J317089J888162J933311K951304
57734A079315L104969K43214m069547o094984m028965O06359M310281M126606
57726g22752N35050k344991j290981J934033L285794K207544J535633K213733
57718G353063J904042n25515k555854j579447J383167L077894J832856j065039
$$ y = [-7139364, -3947278, 2774661, 6674903, 3762891, -2425313, -5340707, -3232941, -208617, -239183, -2869847, -5629684, -7857940, -9684708, -9500060, -6465240, -4354161, -7600133, -13213854, -12895250, -5413835, -81345, -3214320, -7628056, -3070833, 7644581, 12517412, 8390198, 4691042, 7970463, 12564110, 10742234, 4178271, -495440, -1928335, -3507346, -6032392, -7010551, -5693462, -3805300, -1871989, 1079315, 4184284, 4427498, 357951, -5737033, -9765998, -9159639, -4849358, -722752, -187702, -2532693, -3823674, -1889641, 1396153, 3603697, 5139330, 7353063, 9257105, 8731590, 6175736, 4596289, 5979456, 9057350, 10890206, 9825167]
57710I825167l078535k994026k031807k084922k767531j562743K362570O168622
57702C836795O500605L238758j075724l946386m023946j700878Q2733j787592
57694A124365n839982o710727k645021J353794Q35721j537331q70894K148509
57686a2141566L529536L159471L707241M267609J575194l107673m598980j608767
57678e217935J617189J980169O55247r41871k985830m210161k321992J362296
57670a0062888K707524J303519R89419K647009K393380r55296k815907n02547
57662d295787J948708R17488l50725J998172M348646Q06626o154153p751282j439088
57653i971395N219305M803822r48662m810730l081771J827165N454628N159120
$$ y = [9825167, 6746632, 3752606, 1720799, -364123, -3131654, -4694397, -2331827, 3836795, 10337400, 13576158, 12500434, 8554048, 4530102, 2829224, 2911957, 1124365, -4715617, -11426344, -14071365, -12717571, -11881850, -13419181, -14290075, -12141566, -8612030, -5452559, -1745318, 2522291, 4097485, 989812, -3609168, -5217935, -3600746, -1620577, -965330, -1907201, -4893031, -9103192, -11425184, -10062888, -7355364, -6051845, -5062426, -2415417, -22037, -977333, -3793240, -4295787, -2347079, -1429591, -1780316, 217856, 4566502, 5373128, -781025, -8532307, -9971395, -4752090, 51732, -896930, -5707660, -8789431, -6962266, -1507638, 3651482]
57645C651482J193135l493811m820053j213045L773656M352871o94127n550403
57637b800295l873350K927899O952535L871590j738760l156459k68818K003320
57629C917662J525904M60798J24197n44606j334391n54804Q05729l23482l116310
57620I60697k740825J705017M686072K887425P77158K744896M891479J382152
57612A7294071m725986n205670J73477K792087j498526o335497n204314p00057
57604c410415J365550J293319K648663M160771J906266k187640j839046K939027
57596F876495M115337k414886r376487p621625J026285O393678L534890k246304
57588B87383l926163r61999K479168L266463J134035k209213l816833j803874
$$ y = [3651482, 4844617, 1350806, -3469247, -4682292, -908636, 3444235, 2750108, -2800295, -6673645, -3745746, 3206789, 7078379, 5339619, 2183160, 1914342, 3917662, 5443566, 5904364, 6028561, 5483955, 4149564, 3594760, 4400489, 4077007, 960697, -1780128, -75111, 4610961, 7498386, 8275544, 11020440, 15911919, 17294071, 12568085, 7362415, 7535892, 10327979, 8829453, 2493956, -2710358, -3410415, -2044865, -751546, 1897117, 6057888, 7964154, 5776514, 3937468, 6876495, 10991832, 8576946, -799541, -8421166, -7394881, -1001203, 2533687, 287383, -3638780, -4600779, -2121611, 1144852, 2278887, 69674, -3747159, -5551033]
57580e551033J582310J918640r14692j784789J715492M388974R15881m932237
57572b661454m632917K490083P433883L706006m048633o672241k124510L154873
57564c354910K807749k635503p195948n867484M46155N849002N701184J637561
57556b612194j065739n50118R7884j238036k084236N9123K836476K371400o04666
57547b790106k160122j606410j816433l006641j416101L790326P038088L601041
57539A633642k921941n052226j423502K701644L863841L528826K441291j535436
57531C236139p305777q518154k417367M264853M272928O79129J394869N619030
57523A225650M948930k122773o632756l013686K346068J730223k032791j496368
$$ y = [-5551033, -3968723, -2050083, -2964775, -4749564, -3034072, 1354902, 2270783, -2661454, -7294371, -4804288, 2629595, 6335601, 2286968, -4385273, -6509783, -3354910, -547161, -3182664, -10378612, -16246096, -15799941, -9950939, -4249755, -2612194, -3677933, -4228051, -4130167, -5368203, -7452439, -7393316, -4556840, -2185440, -2790106, -4950228, -6556638, -8373071, -11379712, -12795813, -9005487, -1967399, 1633642, -1288299, -6340525, -7764027, -5062383, -1198542, 2330284, 4771575, 3236139, -4069638, -12587792, -15005159, -10740306, -6467378, -5788249, -4393380, 1225650, 6174580, 4051807, -2580949, -5594635, -3248567, -1518344, -3551135, -5047503]
57515e047503K684639L210067j854408o242745m911426l27787K058347O87047
57507i743769j204377M68895O047226J0494050P933857o94775p208978n869479
57499B22650m49503J682183o98829l165772k955185p29183K656008N854466N538153
57490G954988O54889l880326l532900j679808l813373o816920l187992N069556
57482i231886P455107J325710l695185j419012J568635j441635n164495j864145
57474a2466906M573584M890203L6885j020633K787830K690569m427016r302415
57466a2237899l942998O005498R261138M354196l32863R0099J318033j130175
57458C385029l765583p58577N770939P361714J165478n502346n140085K9549K332870
$$ y = [-5047503, -2362864, 847203, -1007205, -7249950, -12161376, -12489163, -10430816, -9743769, -10948146, -10479251, -4432025, 6062025, 13995882, 13301107, 6092129, 222650, -226853, 1455330, 756501, -2409271, -5364456, -6093639, -3437631, 2416835, 7954988, 8609877, 4729551, 1196651, -483157, -4296530, -11113450, -14301442, -9231886, -1776779, -451069, -4146254, -5565266, -3996631, -5438266, -10602761, -12466906, -7893322, -3003119, -2966234, -3986867, -1199037, 1491532, -2935484, -12237899, -16180897, -10175399, -914261, 3439935, 3107072, 3197171, 4515204, 3385029, -380554, -1139131, 4631808, 11993522, 13159000, 7656654, 2516569, 2546118, 4878988]
57449D878988m56978l816376m296971k841924o30310K548746M932630L365321
57441C683126j023895k788895Q4222L305849L492310K859506L331452J544949
57433A4488624n025676j1328234j0467329l657611J682359K238018J243154J565035
57425i261660K571618L970231O481831P530566K635132o215934r637038k907865
57417d833119N809610N520661k253124n647531L58166O972885M819174k873866
57409G872856o228638l181647k92354j014018j516822Q68515K842744J738697
57401A089333K72752P72526O37060j831971k866448o5251J878478r44831l578172
57392d636524m25495L475325Q4348o213191l680345O783893J0603953J583410
$$ y = [4878988, 4422010, 605634, -3691337, -6533261, -7163571, -4614825, 317805, 3683126, 2659231, -129664, -45442, 3260407, 6752717, 9612223, 12943675, 14488624, 9462948, -1865286, -12332615, -15990226, -14307867, -12069849, -10826695, -9261660, -6690042, -2719811, 3762020, 11292586, 13927718, 7711784, -1925254, -4833119, 976491, 6497152, 4244028, -1403503, -1045337, 5927548, 10746722, 7872856, 1644218, -1537429, -1829783, -2843801, -4360623, -3492108, -649364, 1089333, 1362085, 2134611, 2771671, 939700, -1926748, -1991999, -113521, -1058352, -4636524, -5062019, -1586694, -1502346, -7715537, -11395882, -4611989, 5991964, 7575374]
57384G575374q220164o932437L57007K001732k067122l109008J164267M639889
57376d590462L698825J067839o81210k332967m270486m759834k782442N69690
57368a4081047L442020M078363J815946j042995p03238K939480N433772L902662
57360E784963O29936j326400k017548j962590l15241J684701N13175l240768l739781
57351c989553J088208N195533L628645J37592L9153J315532m62165l399505k922352
57342F31088k25133L09003j079369j364568j371978l486156n381079l028995K205328
57333a2791859N705460O228097M702337M22374m996147m825197L249296R578755
57325G273116M523398n980064q199602j177705L247558J87506k232972J260621
$$ y = [7575374, -644790, -7577227, -7220220, -5218488, -7285610, -10394618, -9230351, -4590462, -891637, 176202, -505008, -2837975, -7108461, -11868295, -14650737, -14081047, -10639027, -6560664, -4744718, -5787713, -6490951, -3551471, 1882301, 5784963, 6414899, 5088499, 3070951, 1108361, 793120, 2477821, 2990996, -249772, -3989553, -2901345, 2294188, 5922833, 6060425, 6099578, 7415110, 6952945, 3553440, 631088, 405955, 714958, -364411, -1728979, -3100957, -6587113, -11968192, -14997187, -12791859, -7086399, -858302, 3844035, 4266409, -729738, -5554935, -2305639, 7273116, 11796514, 5816450, -2383152, -3560857, -313299, -125793, -2358765, -1098144]
57317a098144M231996O67482m601173m050085J489183N742382N495253J849990
57309I726884k506143m472146l178906k522195o053036r631545o129736K582901
57301b2183922O852424L527259j12820J099168L285093K665924K218347M237384
57293A588857M759011J152655k119819j153505O63920p72296l291938l581276
57285b754391l066916l049638l30393O062768R795629N699934j793049n254190
57277E309754m395657l153580j756530J120364K839831R23897j225199K3343J282470
57268I68693j618125m395061o70680N548993M447163l449001o697601k36199O925325
57259H23507N394206j569483m533919j591682J116044k48973k652513k047220
$$ y = [-1098144, 3133852, 3801334, -799839, -4849924, -3360741, 2381641, 7876894, 9726884, 7220741, 2748595, -430311, -2952506, -9005542, -18637087, -24766823, -22183922, -15331498, -11804239, -11917059, -10817891, -7532798, -4866874, -2648527, 1588857, 6347868, 7500523, 5380704, 4227199, 4891119, 4118823, 826885, -2754391, -5821307, -8870945, -9201338, -3138570, 6657059, 12356993, 10563944, 5309754, 914097, -2239483, -3996013, -2875649, -35818, 888079, -337120, -313777, 968693, -649432, -5044493, -5715173, -166180, 4280983, 831982, -5865619, -6101818, 823507, 6217713, 4648230, 114311, -1477371, -361327, -610300, -3262813, -5310033]
57251e310033P30135J857482K48086j083364L73036K554280J410518k908159n196628
57242g324647j725576M471551O864444L065199k586017m098358n37229L018688
57234A148055J717350k581466l527292N04810L456822O13809l852543l498600
57226f019055R7817P77866j200338l34642L088901K941517j048058j752549K751985
57217f96556N267307K062512p92065R54969J901309k021148m317642R42725O752815
57208A0054226K952184p052535j0743638m675825K529203M148603K465162J498589
57200A175969J058468j43784j416008j860531j592343q27446j54917m93857r54872
57191e209321M19284K170484M60263l238986k192542M169486O892028J286324
$$ y = [-5310033, -4579898, -2722416, -2474330, -3557694, -3184658, -630378, 780140, -2128019, -7324647, -9050223, -4578672, 2285772, 5350971, 2764954, -1333404, -1870633, 1148055, 2865405, 283939, -3243353, -2738543, 718279, 1332088, -2520455, -6019055, -5921238, -5143372, -6343710, -6678352, -3589451, -647934, -1695992, -3448541, -696556, 4570751, 6633263, 5841198, 6796167, 8697476, 6676328, 2358686, 3301411, 10054226, 13006410, 5953875, -4789763, -9465588, -6936385, -2787782, -322620, 1175969, 2234437, 2090653, 674645, -1185886, -2778229, -3605675, -3760592, -4254449, -5209321, -4790037, -2619553, -2159290, -5398276, -7590818, -3421332, 3470696, 4757020]
57183D757020m482277k431841K217645J118262k265332k92402L096549q99056
57175H18568p828048m960570O695970J1689713L399883p025157q840667n002120
57167a1052428j960390J136895N824509P338096K407527l564930m439117k379143
57159f688981k486187l660922j252822M641525Q829222P153159K49229o803036
57151a8813p889990k087913L910232L804342O29992J642109O008514N913739m61019
57142A1451193o311127p404962o387031m364681J486004Q908635R612524K024083
57134I014638m447701l122714Q71355Q11804j165918m33123J372476J232967J400770
57125E534554L772710L878939j876528q197335p593781j064828M318527M727454
$$ y = [4757020, 274743, -2157098, 60547, 1178809, -1086523, -1378925, 1717624, 818568, -7009480, -11970050, -5274080, 6415633, 9815516, 2790359, -6050308, -11052428, -13012818, -11875923, -6051414, 1286682, 3694209, 129279, -4309838, -6688981, -9175168, -12836090, -14088912, -9447387, -618165, 6534994, 6784223, -18813, -7908803, -9996716, -6086484, -2282142, -1652150, -10041, 5998473, 11912212, 11451193, 5140066, -2264896, -8651927, -13016608, -11530604, -2621969, 6990555, 9014638, 4566937, 1444223, 2315578, 3127382, 1961464, 1528341, 2900817, 4133784, 5534554, 9307264, 13186203, 11309675, 3112340, -4481441, -5546269, -1227742, 3499712]
57117C499712J085443m415496q118624n798091J153755N054004K056500k286179
57109g768976k007599J006642K736707L951916N382132L347049k575766m817406
57101g45301Q67370O285512K553256n313080o322865r38207J249606j948515l284641
57092g596865L70738L743050L232677J652456J397804R40201k76929j71803J354965
57083D646294J546978o83568l495430m843117l109859K476962Q332226P625682
57075A2496168j63263n997168l737236L20505j631247n205248j884729M822715
57067i79503M480963k173165m224351R94653M184223J91816m705054m275125k09272
57058f714815L979949O994765N949935j358456q935581p857365l80600K403499
$$ y = [3499712, 4585155, 169659, -7948965, -13747056, -12593301, -7539297, -5482797, -7768976, -9776575, -8769933, -6033226, -2081310, 3300822, 6647871, 4072105, -745301, 122069, 6407581, 8960837, 3647757, -2675108, -3613315, -2363709, -4312224, -7596865, -7226127, -3483077, -250400, 1402056, 2799860, 3740061, 3463132, 3291329, 4646294, 6193272, 5509704, 2014274, -2828843, -5938702, -3461740, 4870486, 12496168, 12332905, 6335737, 2598501, 2919006, 1287759, -3917489, -5802218, -979503, 3501460, 1328295, -2896056, -1901403, 2282820, 2474636, -2230418, -6505543, -6714815, -2734866, 4259899, 10209834, 8851378, -84203, -7941568, -8322168, -5918669]
57050e918669j708250l244154J759722N558448L746735K465192M759381L672543
57042A1090948l482694p372691k333502K708414n28163n124962j478731N851968
57034f69413O654676J911024q77975j800190m699742n833901k69290N760257L137483
57025C312929l788947l712172K192225K811219k777153m077790J317951L369131
57017a352607j964747n285213m45134M969754L247383r39421r3493L423465L171446
57008D731433j54029j938044k477142m442235n874397l374145R51559K576114
57000a0000886J847215J930968K167131l4537k816940k185244N20444L24368k436244
56991a0683725j926059L119226O062427K473709k290741r77288M036740M092158
$$ y = [-5918669, -7626919, -10871073, -9111351, -3552903, 193832, 2659024, 7418405, 11090948, 7608254, 235563, -2097939, 610475, 82312, -5042650, -6521381, -669413, 5985263, 7896287, 7018312, 5218122, 518380, -5315521, -5584811, 175446, 3312929, -476018, -4188190, -1995965, 815254, -1961899, -6039689, -4721738, -1352607, -3317354, -8602567, -9047701, -4077947, -830564, -1769985, -1863478, 1559987, 4731433, 4577404, 2639360, 162218, -4280017, -10154414, -13528559, -12577000, -10000886, -8153671, -6222703, -4055572, -4090109, -6907049, -9092293, -8571849, -8247481, -10683725, -12609784, -9490558, -3428131, -954422, -3245163, -4222451, -185711, 3906447]
56983C906447j949282m966600Q09766Q212152P003417r95217m628141j10330L815760
56974A1097972k32555p283009q116223k424740K647046L268190J566135j03461
56966D19355j167433n50125J891232K938748L83537k011669J11356L490920J751425
56957G257346l308635l579762K024978N224701J420695l558450l278530L44837
56949B547180K141128J168750j172141m503568o802268m304114J768460M572199
56941d584374K092553J241647O009129R124335L397684n278755o127524p7324
56933E797371K605371j193792m372904k764113o30690j162530j093793J718797
56925a096283L424918J247922j151098j04629J653493P7373k904280k600461O23792
$$ y = [3906447, 1957165, -3009435, -2199669, 6012483, 13015900, 12020683, 7392542, 7282212, 11097972, 10865417, 3582408, -4533815, -6958555, -4311509, -1043319, 522816, 419355, -748078, -1298203, 593029, 3531777, 3915314, 1903645, 2015001, 5505921, 7257346, 3948711, 368949, 2393927, 7618628, 9039323, 5480873, 2202343, 2547180, 4688308, 5857058, 4684917, 181349, -6620919, -10925033, -9156573, -4584374, -2491821, -1250174, 4758955, 13883290, 17280974, 12002219, 5874695, 5797371, 8402742, 7208950, 2836046, 71933, -558757, -1721287, -2815080, -1096283, 2328635, 3576557, 2425459, 2320830, 3974323, 4051696, 1147416, -1453045, -829253]
56916h29253K001245k72402k815184k292759M86628K516469K499278J722152J913071
56907D929245L086693L609844K124720j040044m312371n897912m409157j29009
56899b037991L853525L977946Q71499q44662Q29462J927690j270623n795488o109141
56890d597783k404445L57179L85136M65202J731867J745530l34443j793341j058159
56881e503257N9985K68808P51524J708512J064446j528191l081491j510172J699117
56872f070719M314459N544620M618114J106723k447610k486111J00933J055565
56864E735974j28903J67153K145411J704236j093293q59354K500885J266498o351451
56855E087156r651805j501162P738940M340212o968408r579358n38749N974709
$$ y = [-829253, 1171992, 899590, -1915594, -4208353, -3721725, -1205256, 1294022, 3016174, 4929245, 8015938, 11625782, 13750502, 12710458, 8398087, 2500175, -1908982, -2037991, 1815534, 5793480, 6664979, 5820317, 6649779, 8577469, 7306846, 1511358, -4597783, -7002228, -6645049, -6259913, -5794711, -4062844, -2317314, -2651757, -4445098, -5503257, -5443272, -5174464, -4422940, -2714428, -1649982, -3178173, -6259664, -7769836, -6070719, -1756260, 3788360, 8406474, 9513197, 7065587, 4579476, 4680409, 5735974, 5607071, 5774224, 7919635, 9623871, 8530578, 7671224, 10172109, 11438607, 5087156, -4564649, -6065811, 1673129, 6013341, -955067, -10534425, -11073174, -5098465]
56847e098465J792816l880978j341066M830759N973563L569729L281485K885356
56839A2013199k505996q311388n559576L733818P640434J594947n597468n708083
56831b700113j719546K06160J169665M668147P061857K050680p453357j0995563
56823g712070n048301K074015K613592k48922P50923N110340O145991J680028
56815E365596l492372n098863l619718r85910J713287K746509Q94446j250685
56807c727710M1372L178241K904756q75322k417837Q6391J431098p89229j251896
56798a420136L008348N407797K44807o284940m885534J808647L554655r14119
56790E19525k936978Q20289L491193N82239k778688j291139K169377K596531O19634
$$ y = [-5098465, -3305649, -7186627, -8527693, -3696934, 2276629, 5846358, 9127843, 12013199, 9507203, 1195815, -4363761, -629943, 7010491, 8605438, 3007970, -2700113, -4419659, -4213499, -3043834, 1624313, 8686170, 10736850, 3283493, -7712070, -12760371, -10686356, -8072764, -8321686, -7570763, -2460423, 3685568, 5365596, 1873224, -3225639, -6845357, -7831267, -6117980, -3371471, -2477025, -3727710, -3686338, -508097, 2396659, 1521337, -896500, -810109, 620989, -168240, -1420136, 1588212, 6996009, 7240816, 955876, -3929658, -2121011, 1433644, 519525, -2417453, -1597164, 1894029, 2476268, -302420, -1593559, 575818, 3172349, 3791983]
56781C791983p70913j811043l388402l470821q44818J474330J021741M08025K481687
56772a108231M415799J991097k541006k731742K315279N688790J717032o077131
56764C669887q636835k144462P093851R812035M650455j156629k305267j927807
56756I055228m386908o605236l213238K785501L086658k690941n718301j336549
56748i023786M823697O793804N912777M601748R16050m941411o245277O21424
56740C459026P788650N218779n139838j1942969q928797m48407N659078N299387
56732I64909L8665l785285m36311O934372P722824j610488j0198471p136102K421921
56723e083966N298323K89383j898403K525561M779798n80120o014456l343509
$$ y = [3791983, 3021070, 1210027, -2178375, -5649196, -6494014, -5019684, -3997943, -3589918, -1108231, 3307568, 5298665, 2757659, 25917, 2341196, 8029986, 9747018, 3669887, -4966948, -7111410, -17559, 9794476, 14444931, 13288302, 10983035, 9055228, 4668320, -1936916, -5150154, -2364653, 722005, -1968936, -7687237, -9023786, -4200089, 2593715, 8506492, 13108240, 14024290, 9082879, 2837602, 3459026, 11247676, 16466455, 11326617, -616352, -9545149, -9993556, -4334478, 964909, 1003574, -2781711, -3218022, 3716350, 11439174, 9828686, -369785, -7505887, -5083966, 214357, 503740, -1394663, 1130898, 5910696, 5330576, -683880, -4027389]
56715d027389L213736L967738j893360o416277m604405K85151K532647P37127
56707f205032j603349l83464M260057P337039M660368j412983m708534l425730
56699a481628j721711k546543l413958j363333J864597K798789J723470J744742
56691b395575L551382M100115Q23601m424197o680417l546444J123032J371118
56683f077385k561226l657898J774608P644479O572631J282936L53466M361693
56675I693304M938999j439743p485723o389509j511017L35840q05514o10213J051504
56666b222072R22002q45062j009757O89233J304559K54469K68014K315901L688735
56657E366022K132287j132631l447846l526100j756383K56898L22616j981644
$$ y = [-4027389, -813653, 3154085, 1260725, -5155552, -9759957, -9474806, -6942159, -6205032, -7808381, -8191845, -3931788, 3405251, 8065619, 6652636, 1944102, -1481628, -3203339, -5749882, -9163840, -10527173, -8662576, -5863787, -4140317, -2395575, 1155807, 5255922, 6079523, 1655326, -5025091, -8571535, -7448503, -6077385, -8638611, -12296509, -10521901, -2877422, 3695209, 4978145, 5331611, 9693304, 14632303, 13192560, 5706837, -682672, -2193689, -1857849, -2663363, -3273576, -2222072, -1300070, -2145132, -3154889, -2465656, -1161097, -906628, -638614, 1677287, 5366022, 7498309, 6365678, 2917832, -608268, -2364651, -2107753, -1785137, -3766781]
56649c766781l513037p30584M804745P052076L222526j831241j858514J965310
56641E344500K667417j995027n519724j984911M637078N699139M07734l453621
56633E802585j682202O82045j143049l431419q70489L640706L555930l04397j490611
56624D759099R32858J567638r58710j608374J226654K002268k170668n557276
56616A93489k753871K567693L747619J065533p42703j082244k710057m630272
56608d344813k872538J992361M430172K087805p82022k4637K197962Q10932m420874
56599i25652p485696l094388O070164J0830921N521931m611961q708806k917808
56591e321295N578544Q020314L759779j568587l814757k805027J61249L199392
$$ y = [-3766781, -7279818, -8010402, -3205657, 3846419, 7068945, 5237704, 3379190, 5344500, 8011917, 6016890, 497166, -1487745, 3149333, 8848472, 9256206, 5802585, 4120383, 4802428, 3659379, 227960, -642529, 2998177, 6554107, 6249710, 4759099, 5691957, 7259595, 6300885, 4692511, 5919165, 7921433, 5750765, 193489, -2560382, 7311, 3754930, 4820463, 4077760, 2995516, 285459, -4344813, -7217351, -5224990, -794818, 1292987, 510965, 486328, 2684290, 3495222, -925652, -8411348, -11505736, -5435572, 5395349, 10917280, 6305319, -2403487, -5321295, 257249, 8277563, 12037342, 10468755, 6653998, 3848971, 4010220, 7209612]
56583G209612L646859O56209k828522l659182k851820l133326l486102m63579
56575d909851N200585P878061M492095q22380j925396J613503M633627L261762
56567A9422006r48759m127367n084188n291086m887369j801465L932939P763824
56559H978535N526381o34812m594042l768776q01833J557082K721043J518663
56551A0502241l123185p378325m675575M152903R025398L874754l841549l701433
56543D835229K144992K922650l394080o921784j616318N395841M985314q49972
56535G501872l671054j594438N6149r94718r33077K129993M040850J665137j194336
56526G006378L49974L931909L206311j953794m809649j996826J730589J504522
$$ y = [7209612, 10856471, 11512680, 8684158, 5024976, 2173156, -960170, -4446272, -4909851, 290734, 8168795, 12660890, 11838510, 9913114, 11526617, 16160244, 19422006, 18473247, 14345880, 9261692, 3970606, -916763, -2718228, 1214711, 8978535, 14504916, 13870104, 9276062, 5507286, 4705453, 6262535, 8983578, 10502241, 7379056, 731, -4674844, -521941, 8503457, 12378211, 8536662, 4835229, 6980221, 9902871, 6508791, -412993, -2029311, 3366530, 8351844, 7501872, 3830818, 2236380, 2292529, 1297811, 364734, 2494727, 6535577, 8200714, 7006378, 7356352, 11288261, 14494572, 12540778, 7731129, 5734303, 7464892, 8969414]
56518H969414o59432j040814j129461l292454l759661J970985Q864988O868919
56510A6792484l635537j0160864m993061M533413P343649K955857j567901l002467
56502H265573k990232j816920J174609L115318N10753m444156o343851m305483
56494f834389j672820O16655M082980O878894M797553j199007m790151l109390
56486a229675q5327O57560N33975J327505J423120P2306L54670L551428M813977
56477A1419539k04464p278790q197343k360814K228465L85764l369510k161375
56469i538528L122698N524075K154469k133464j992326J362886K797729O19511
56461A917050j898760j646103O16884K063989J230480q85186j733040O16618M552695
$$ y = [8969414, 8309982, 7269168, 6139707, 2847253, -912408, 1058577, 9923565, 16792484, 13156947, 2996083, -1996978, 2536435, 9880084, 12835941, 11268040, 8265573, 5275341, 3458421, 4633030, 7748348, 8259101, 3814945, -2528906, -6834389, -8507209, -7890554, -3807574, 3071320, 7868873, 6669866, 1879715, -1229675, -1315002, -657442, -123467, 1204038, 2627158, 2699464, 3054134, 6605562, 11419539, 11215075, 3936285, -4261058, -6621872, -4393407, -4007643, -7377153, -9538528, -6415830, -891755, 1262714, -870750, -2863076, -1500190, 1297539, 1917050, 18290, -1627813, -1010929, 1053060, 2283540, 1398354, -334686, 281932, 4834627]
56452D834627M977545q24856p729621p225239J496673Q934830O388955l379863
56444G473051r829367o928381J554453P801002P612583K518673k886291m776420
56436B539303k677405P92470K675275K080527K53780r16691o50285j94834j216551
56427B685589k610433j047603L455199N488087J431328m131986m352806j23292
56419G94083K281035J636173J772838K094019k037518q307802p642958J044945
56411h365185O911126L355732k189541j710779L53729k962213p033894l139717
56403a4780742N927126R626622N390239j77141k877930l636012k360130J096033
56395a791935K420449j229553l914714N40713O466505M257065l122137m664161
$$ y = [4834627, 9812172, 8987316, 1257695, -5967544, -4470871, 4463959, 10852914, 7473051, -2356316, -9284697, -7730244, 70758, 7683341, 10202014, 7315723, 2539303, -138102, 654368, 3329643, 5410170, 5663950, 4747259, 4096974, 3902140, 2685589, 75156, -972447, 2482752, 7970839, 9402167, 5270181, 917375, 794083, 3075118, 4711291, 6484129, 8578148, 6540630, -1767172, -9410130, -8365185, -1454059, 1901673, -287868, -1998647, -1644918, -4607131, -11641025, -14780742, -8853616, 773006, 6163245, 5986104, 3108174, -527838, -2887968, -1791935, 628514, -601039, -4515753, -3975040, 2491465, 6748530, 3626393, -1037768]
56387a037768L01R54189l651696n016913q26709P67364k307248j226323O484150
56378e860653J0102327L788504k569589J1207M871260K516409l011843k929419
56370F918203J84453j615721o057124m568227K046091M577068M95131l216369
56362a236495k303036n89802j748230l382763j602783L208490O722175M693460
56354C761016k463962p989692n081697L462102P161884K073686l628091k482099
56346e186853J610958J993172O69957K308271L599697o29168n626768k910223
56338d170957M579787N711524j261701o332479l935473m8425l20052j562359M36666
56329f903469L263443L273977J878934J399249K88858k556224l524011M77842
$$ y = [-1037768, -1037467, -83278, -3734974, -8751887, -9578596, -8811232, -11118480, -12344803, -5860653, 4241674, 8030178, 5460589, 5471796, 10343056, 12859465, 9847622, 6918203, 7102656, 5486935, -570189, -5138416, -3092325, 1484743, 1979874, -1236495, -3539531, -4129333, -5877563, -9260326, -10863109, -7654619, -932444, 3761016, 1297054, -6692638, -11774335, -8312233, -1150349, 923337, -2704754, -5186853, -3575895, -1582723, -912766, 1395505, 4995202, 4366034, -1260734, -4170957, 408830, 6120354, 4858653, -1473826, -5409299, -5457724, -5777776, -7340135, -6903469, -3640026, -366049, 1512885, 2912134, 3200992, 644768, -2879243, -2401401]
56321b401401N969726O997941L106970r01322j724497n93899k61587j582741l054975
56312E554215k545609J86712K486246J541681j697482l096341m33843L644896
56304E640475M622894J091004l810421n447286k253900K507248M289583K631361
56296I270958J122764J503660Q76722l070122p088066o264856j162952K844530
56288a967362K757904R75636J019118L000883L984444J479907l443144o187611
56280A619775l234980K775270N136516J374851l723104n076347l464861k054974
56272f647854q75003J316125L070711K533456R83581J93615p31687k069494r76048
56263c202598L044025M614548L98406l939997k021223K223881Q79953l870846
$$ y = [-2401401, 3568325, 10566266, 13673236, 12771914, 11047417, 10453518, 10191931, 8609190, 5554215, 3008606, 3195318, 5681564, 7223245, 5525763, 2429422, 1995579, 5640475, 10263369, 11354373, 7543952, 2096666, -157234, 2350014, 6639597, 9270958, 10393722, 11897382, 12774104, 9703982, 2615916, -3648940, -4811892, -1967362, 790542, 1766178, 2785296, 5786179, 9770623, 11250530, 7807386, 1619775, -1615205, 1160065, 6296581, 7671432, 3948328, -1128019, -4592880, -6647854, -7522857, -6206732, -3136021, -602565, 381016, 574631, -157056, -2226550, -3202598, -158573, 4455975, 4854381, 914384, -1106839, 1117042, 1996995, -1873851]
56255a873851k892604L818117O036466j52392o221993n363240k119476k263979
56247a1032952k642478J302070N526597L844178p70364o02860L881161M668260
56239D173612o73383m882131k073560L646046M522590J14667k824170l64826L128580
56230D767425J434702m281866o531220j864528M006850L955795j005777l921916
56222c440535j602471K514869M327700L167611L8783l595807m818590j566439
56214d974879L215225M080460P26194j444566J94558J411657j818445o518941
56206e128737o739637j677708L779975N285986L247319J471701K856094N838383
56198H933376N496382q2296n730480n052898M10920K866792m62561l618900j614581
$$ y = [-1873851, -4766455, -948338, 5088128, 4935736, -1286257, -6649497, -8768973, -11032952, -13675430, -12373360, -6846763, -3002585, -3772949, -4375809, -494648, 4173612, 3500229, -1381902, -3455462, 190584, 4713174, 4827841, 2003671, 1638845, 4767425, 6202127, 1920261, -4610959, -6475487, -2468637, 1487158, 481381, -3440535, -5043006, -2528137, 1799563, 4967174, 5005957, 1410150, -3408440, -4974879, -1759654, 2320806, 3047000, 1602434, 1796992, 3208649, 1390204, -5128737, -11868374, -13546082, -9766107, -4480121, -1232802, 238899, 3094993, 8933376, 14429758, 14347462, 8616982, 3564084, 3975004, 6841796, 6379235, 2760335, 1145754]
56189A145754K077128J845284j128479j817035j40464o45025m312360o397657
56181i372854l459422J739697M376094L817872L177538L827234L199866r50061
56173F355964n852865n869515K63638O720959O918242J064339m690021n563759
56165f53018k371591P99913R12915j614166l137146k18890N773068R097577O349208
56156A4937870N18149l668410n292455n114590j883217M181671P533627L434305
56148A4646950l888101n877113j428785K647871K328054M50820n6441O9890L35485
56139I228630J433558J308652k975759q336106p712541o71762N006228M279723
56131A560623N06888j777542k523531k265520J03589K911280K189923q97673o97641
$$ y = [1145754, 3222882, 5068166, 3939687, 2122652, 1982188, 1337163, -2975197, -9372854, -12832276, -11092579, -6716485, -2898613, 278925, 4106159, 7306025, 6355964, 503099, -5366416, -5102778, 1618181, 8536423, 9600762, 4910741, -653018, -3024609, -2224696, -1311781, -2925947, -6063093, -6281983, -508915, 8588662, 14937870, 15456019, 11787609, 6495154, 1380564, -502653, 3679018, 11212645, 14646950, 10758849, 4881736, 3452951, 6100822, 8428876, 8879696, 8823255, 8893145, 9228630, 10662188, 11970840, 8995081, 658975, -7053566, -7725328, -2719100, 1560623, 2067511, 289969, -2233562, -4499082, -4395493, -1484213, 705710, -191963, -889604]
56122h89604K500847J489453n077010q533786l682256L057822M796650M102868
56114b235016N081658M960467J530662n9452L118177M121513k014431p300729
56106G202849l077865M463398L892197k806923n116937k403748k460884m993935
56098e301848k314430M554564O104915J471740J76477M528640N274040j166719
56090A3327379n601556k178537J751168n02892l200872N16744N506882L220015
56082A2838331l802747o364932k767326Q43489J169403N86232J054311J789269
56074E346030J815071K07216m067417q621813p395147J271239R682928R425585
56066G663692K329004k728047j821880R56954J164705r66097l147343m054927
$$ y = [-889604, 1611243, 3100696, -1976314, -10510100, -14192356, -11134534, -6337884, -2235016, 2846642, 7807109, 9337771, 9278319, 12396496, 16518009, 14503578, 7202849, 4124984, 8588382, 12480579, 9673656, 4556719, 2152971, -307913, -5301848, -7616278, -3061714, 3043201, 4514941, 4691418, 9220058, 14494098, 13327379, 7725823, 5547286, 7298454, 6795562, 3594690, 4111434, 9618316, 12838331, 9035584, 2670652, -96674, 746815, 1916218, 2502450, 3556761, 5346030, 7161101, 7368317, 3300900, -5320913, -12716060, -11444821, -1761893, 7663692, 9992696, 7264649, 5442769, 6399723, 7564428, 6598331, 3450988, -603939]
56058f03939l183246r82326O51158M74056m6703Q90951K076252J029662j861467
56049a555602l759003l260936j336618R18428K930962L570281J864630j242311
56041a870169l520738l605296j558536J604437L847498L220891N91017m72601
56033a763497J675494M105452L380143L41624j695391j751408j273080q97872
56025B121465l13734k63082j372515j731162Q97323M757423N516017K188429j671714
56016A0128450l095715k618443j425402O31322K622838J873188j729595l892485
56008B494158j648373J647459J042552k158525k164102K188081N377413L363035
56000A0141698j135623l712564l996548l117027P81N047370O796596J425168n845906
$$ y = [-603939, -3787185, -4769511, -4118353, -3644297, -3691000, -2800049, -723797, 305865, -1555602, -5314605, -8575541, -9912159, -8993731, -6062769, -2492488, -627858, -1870169, -5390907, -8996203, -10554739, -8950302, -5102804, -1881913, -1290896, -1763497, -88003, 4017449, 7397592, 7739216, 6043825, 4292417, 3019337, 2121465, 1807731, 1544649, 172134, -1559028, -661705, 4095718, 9611735, 11800164, 10128450, 7032735, 4414292, 2988890, 3620212, 6243050, 8116238, 6386643, 2494158, 845785, 2493244, 3535796, 1377271, -786831, 1401250, 6778663, 10141698, 9006075, 5293511, 1296963, -1820064, -1819283, 3228087, 10024683, 11449851, 5603945]
55991E603945o341600k36002M113400L145303J881464K865080Q85792o059497
55983E857885r362246j838018Q933757R375814r62846r119831o950633J0526L442124
55974f13468L067505K688570K255302o19551m817957o172617k641183L492593
55966c360806P801247P182528K436064k328637m132583m173620m616826m367175
55958e559808j609787J340016Q01164j598351p97298L151714M668637J828295
55950B224582n20004R04731K587487P99137k086861k160436l89600J55083o5014
55941A449105J059054K398586J192124k106151m385438l965555j262097K669937
55933b950435N413581L611695k225476n786993k314496L910167M556295j047958
$$ y = [5603945, -737655, -973657, 3139743, 6285046, 8166510, 11031590, 11917382, 5857885, -3504361, -5342379, 3591378, 12967192, 12004346, 2884515, -4066118, -4055592, -613468, 2454037, 5142607, 7397909, 6778358, 1960401, -4212216, -6853399, -3360806, 4440441, 11622969, 14059033, 11730396, 7597813, 3424193, -1192633, -5559808, -7169595, -5829579, -5028415, -6626766, -7424064, -4272350, 396287, 2224582, 1704578, 2609309, 5196796, 5995933, 3909072, 1748636, 1359036, 1514119, 1449105, 2508159, 4906745, 6098869, 3992718, -392720, -4358275, -5620372, -2950435, 2463146, 6074841, 3849365, -1937628, -4252124, -341957, 4214338, 3166380]
55925C166380m824786j470994M286731M804786m4630l697307k328329R44258J565467
55916B401576m84865k060076j605129R517J720947K449589M42766l880891n488506
55907f495072p6076Q166129J0041364L835340k324266k994105k442097m628954
55899C082263m875283P15033N407757J849783m342515l272115J782747q2697p132981
55890f868008o568199L117483Q356340K987760k058510J651708O434932L841266
55882A0894772n60322O78253K287823k837988q229950l861987N726386P893726
55874A1990713J513503l599597l264169j939267j766097p80789j56874k218051
55866b20628l525188l86311K261528j200582m661015P22598R059992P104457l009710
$$ y = [3166380, -1658406, -3129400, 1157331, 5962117, 5917487, 2220180, -108149, 836109, 2401576, 1916711, -143365, -1748494, -1738977, -18030, 2431559, 2874325, -1006566, -6495072, -6571148, 1594981, 11636345, 15471685, 13147419, 10153314, 7711217, 3082263, -1793020, -1077987, 4329770, 6179553, 1837038, -1435077, 347670, 264973, -6868008, -13436207, -10318724, -1962384, 1025376, -1033134, 618574, 7053506, 10894772, 10334450, 11012703, 13300526, 10462538, 2232588, -1629399, 4096987, 11990713, 13504216, 9904619, 6640450, 4701183, 2935086, 2154297, 1997423, -220628, -3745816, -4132127, -1870599, -3071181, -7732196, -7009598, 2050394, 9154851, 6145141]
55857F145141n977100J252208M909536j041780m725816J649098P175380J002766
55849A0389433q643778p811647J189767N213571J029078k628041l74623L729352
55841B093112M423107J442592k145301k856932L85681L534003J270281m358978
$$ y = [6145141, 168041, 1420249, 6329785, 5288005, 562189, 2211287, 9386667, 10389433, 1745655, -6065992, -4876225, 337346, 1366424, -1261617, -1636240, 2093112, 6516219, 7958811, 5813510, 2956578, 3342259, 6876262, 8146543, 3787565]
$$ [...]
##END NTUPLES=NMR SPECTRUM
##END=
