##TITLE=31Pdec_SR58(52)
 CDCl3, 24 sc
 30.04.2021
##JCAMPDX= 6.0         $$ Bruker NMR JCAMP-DX V2.0
##DATA TYPE= NMR SPECTRUM
##DATA CLASS= NTUPLES
##ORIGIN= UXNMR, Bruker Analytische Messtechnik GmbH
##OWNER= root
$$ XWIN-NMR		Version 3.5
$$ Fri Apr 30 14:41:19 2021 Russian Standard Time (UT+4h)  she@DPX200
##.OBSERVE FREQUENCY= 81.013821
##.OBSERVE NUCLEUS= ^31P
##.ACQUISITION MODE= SIMULTANEOUS
##.ACQUISITION SCHEME= undefined
##.AVERAGES= 24
##.DIGITISER RES= 16
##SPECTROMETER/DATA SYSTEM= spect
##.PULSE SEQUENCE= zgpg30
##.SOLVENT NAME= CDCl3
##.SHIFT REFERENCE= (INTERNAL, CDCl3, 0, 248.564)
##AUDIT TRAIL= $$ (NUMBER, WHEN, WHO, WHERE, WHAT)
$$ ##TITLE= Audit trail, XWIN-NMR		Version 3.5
$$ ##JCAMPDX= 5.01
$$ ##ORIGIN= Bruker BioSpin GmbH
$$ ##OWNER= she
$$ F:/spectra/data/she/nmr/P31/1/pdata/1/auditp.txt
$$ ##AUDIT TRAIL=  $$ (NUMBER, WHEN, WHO, WHERE, WHAT)
(   1,<2021-04-30 14:40:50.50 +0400>,<she>,<DPX200>,
      <created by zg, POWCHK disabled, PULCHK disabled
       configuration hash MD5:
       00 E9 B6 7A A2 85 ED C7 34 08 36 98 17 FE 4E 26
       data hash MD5: 32K
       3B 9A D4 17 EF AA 59 B8 CA 29 ED B0 1D 45 53 EA>)
(   2,<2021-04-30 14:40:52.96 +0400>,<she>,<DPX200>,
      <Start of raw data processing
       efp BC_mod = 2 LB = 1 FT_mod = 6 PKNL = 1 PHC0 = -6397.871 PHC1 = 433.4009 SI = 64K 
       data hash MD5: 64K
       8A 16 26 85 AE 9C 5A 13 D7 88 E1 6D FD C7 AA CF>)
$$ ##END=
$$ 
$$ hash MD5
$$ C7 33 93 F0 4A 96 C7 6D 4C C9 99 BE 71 78 CA 3A
##$RELAX= 
##$RELAX= 
##$RELAX= 
##$RELAX= 
##$RELAX= 
##$RELAX= 
##$RELAX= 
##$RELAX= 
$$ Bruker specific parameters
$$ --------------------------
##$DU= <F:/spectra>
##$EXPNO= 1
##$NAME= <P31>
##$PROCNO= 1
##$TYPE= <nmr>
##$USER= <she>
##$AMP= (0..31)
100 100 100 100 100 100 100 100 100 100 100 100 100 100 100 100 100 100 
100 100 100 100 100 100 100 100 100 100 100 100 100 100 
##$AQSEQ= 0
##$AQ_mod= 1
##$AUNM= <au_zg>
##$AUTOPOS= <>
##$BF1= 81.014009
##$BF2= 200.13
##$BF3= 200.13
##$BF4= 200.13
##$BF5= 200.13
##$BF6= 200.13
##$BF7= 200.13
##$BF8= 200.13
##$BYTORDA= 1
##$CFDGTYP= 0
##$CFRGTYP= 5
##$CHEMSTR= <none>
##$CNST= (0..31)
1 1 145 1 1 1 1 1 1 1 1 1 1 1 1 1 1 1 1 1 1 1 1 1 1 1 1 1 1 1 1 1 
##$CPDPRG= <waltz16>
##$CPDPRG1= <>
##$CPDPRG2= <waltz16>
##$CPDPRG3= <>
##$CPDPRG4= <mlev>
##$CPDPRG5= <mlev>
##$CPDPRG6= <mlev>
##$CPDPRG7= <mlev>
##$CPDPRG8= <mlev>
##$CPDPRGB= <>
##$CPDPRGT= <>
##$D= (0..31)
0 1 0 0 0 0 0 0 0 0 0 0.03 2e-05 3e-06 0 0 0 0 0 0 0 0 0 0 0 0 0 0 0 0 
0 0 
##$DATE= 1619779249
##$DBL= (0..7)
120 120 120 11 120 120 24 19 
##$DBP= (0..7)
150 150 150 150 150 150 150 150 
##$DBP07= 0
##$DBPNAM0= <>
##$DBPNAM1= <>
##$DBPNAM2= <>
##$DBPNAM3= <>
##$DBPNAM4= <>
##$DBPNAM5= <>
##$DBPNAM6= <>
##$DBPNAM7= <>
##$DBPOAL= (0..7)
0.5 0.5 0.5 0.5 0.5 0.5 0.5 0.5 
##$DBPOFFS= (0..7)
0 0 0 0 0 0 0 0 
##$DE= 6
##$DECBNUC= <off>
##$DECIM= 3
##$DECNUC= <off>
##$DECSTAT= 4
##$DIGMOD= 1
##$DIGTYP= 9
##$DL= (0..7)
0 0 52 120 120 21 21 25 
##$DP= (0..7)
$$ [...]
##$SUBNAM2= <"">
##$SUBNAM3= <"">
##$SUBNAM4= <"">
##$SUBNAM5= <"">
##$SUBNAM6= <"">
##$SUBNAM7= <"">
##$SUBNAM8= <"">
##$SUBNAM9= <"">
##$SW= 501.771253377433
##$SWIBOX= (0..15)
0 1 3 0 0 0 0 0 0 0 0 0 0 0 0 0 
##$SW_h= 40650.406504065
##$TD= 32768
##$TD0= 1
##$TE= 0
##$TE2= 300
##$TE3= 300
##$TEG= 300
##$TL= (0..7)
0 120 53 12 22 120 120 120 
##$TP= (0..7)
150 150 150 150 150 150 150 150 
##$TP07= 0
##$TPNAME0= <>
##$TPNAME1= <>
##$TPNAME2= <>
##$TPNAME3= <>
##$TPNAME4= <>
##$TPNAME5= <>
##$TPNAME6= <>
##$TPNAME7= <>
##$TPOAL= (0..7)
0.5 0.5 0.5 0.5 0.5 0.5 0.5 0.5 
##$TPOFFS= (0..7)
0 0 0 0 0 0 0 0 
##$TUNHIN= 0
##$TUNHOUT= 0
##$TUNXOUT= 0
##$USERA1= <user>
##$USERA2= <user>
##$USERA3= <user>
##$USERA4= <user>
##$USERA5= <user>
##$V9= 5
##$VALIST= <valist>
##$VCLIST= <CCCCCCCCCCCCCCC>
##$VD= 0
##$VDLIST= <DDDDDDDDDDDDDDD>
##$VPLIST= <PPPPPPPPPPPPPPP>
##$VTLIST= <TTTTTTTTTTTTTTT>
##$WBST= 1024
##$WBSW= 4
##$XGAIN= (0..3)
0 0 0 0 
##$XL= 0
##$YL= 0
##$YMAX_a= 3920
##$YMIN_a= -7068
##$ZGOPTNS= <>
##$ZL1= 120
##$ZL2= 120
##$ZL3= 120
##$ZL4= 120
##$ABSF1= 0
##$ABSF2= 0
##$ABSG= 0
##$ABSL= 0
##$ALPHA= 0
##$AQORDER= 0
##$ASSFAC= 0
##$ASSFACI= 0
##$ASSFACX= 0
##$ASSWID= 0
##$AUNMP= <proc_1d>
##$AZFE= 0.1
##$AZFW= 0.5
##$BCFW= 0
##$BC_mod= 2
##$BYTORDP= 0
##$COROFFS= 0
##$CY= -3
##$DATMOD= 1
##$DC= 0
##$DFILT= <>
##$DTYPP= 0
##$F1P= 0
##$F2P= 0
##$FCOR= 1
##$FTSIZE= 65536
##$FT_mod= 6
##$GAMMA= 0
##$GB= 0
##$INTBC= 1
##$INTSCL= 5.30512e-09
##$ISEN= 30
##$LB= 1
##$LEV0= 0
##$LPBIN= 0
##$MAXI= 10000
##$MC2= 0
##$MEAN= 0
##$ME_mod= 0
##$MI= 50
##$NCOEF= 0
##$NC_proc= -6
##$NLEV= 6
##$NOISF1= 182.463
##$NOISF2= 159.3651
##$NSP= 0
##$NTH_PI= 0
##$NZP= 0
##$OFFSET= 248.5645
##$PC= 4
##$PHC0= -6397.871
##$PHC1= 433.4009
##$PH_mod= 1
##$PKNL= yes
##$PPARMOD= 0
##$PSCAL= 0
##$PSIGN= 0
##$REVERSE= no
##$SF= 81.014009
##$SI= 65536
##$SIGF1= 159.3651
##$SIGF2= -187.1042
##$SINO= 113.3802
##$SIOLD= 16384
##$SREGLST= <1H.CDCl3>
##$SSB= 0
##$STSI= 65536
##$STSR= 0
##$SW_p= 40650.406504065
##$SYMM= 0
##$S_DEV= 0
##$TDeff= 32768
##$TDoff= 0
##$TI= <>
##$TILT= no
##$TM1= 0
##$TM2= 0
##$TOPLEV= 0
##$USERP1= <user>
##$USERP2= <user>
##$USERP3= <user>
##$USERP4= <user>
##$USERP5= <user>
##$WDW= 1
##$XDIM= 65536
##$YMAX_p= 179297354
##$YMIN_p= -207596342
$$ End of Bruker specific parameters
$$ ---------------------------------
##NTUPLES= NMR SPECTRUM
##VAR_NAME=  FREQUENCY,     SPECTRUM/REAL,   SPECTRUM/IMAG
##SYMBOL=    X,             R,               I
##VAR_TYPE=  INDEPENDENT,   DEPENDENT,       DEPENDENT
##VAR_FORM=  AFFN,          ASDF,            ASDF
##VAR_DIM=   65536,         65536,           65536
##UNITS=     HZ,            ARBITRARY UNITS, ARBITRARY UNITS
##FACTOR=    0.620285442955139, 1,           1
##FIRST=     20137.2065510759, 0,            0
##LAST=      -20513.1999529892, 0,           0
##MIN=       -20513.1999529892, -207596342,  0
##MAX=       20137.2065510759, 179297354,    0
$$ Real data points
##PAGE= N=1
##DATA TABLE= (X++(R..R)), XYDATA
$$ [...]
15219 3385850 2522456 1765614 369866 -800475 -1057912 -1388065 -2135096 -1695706 317129
15210 317129 1131551 -1337781 -4776766 -5396563 -3007833 -526392 237996 -343238 -1724146
15201 -1724146 -3553656 -4694561 -4235968 -2974662 -2004346 -833018 1009838 1855442 168088
15192 168088 -2173491 -2139234 -400924 -271063 -2022732 -2429489 -603893 155380 -1858233
15183 -1858233 -3425015 -1842409 3939 -1832647 -5369925 -5193134 -826840 2485294
15175 2485294 1629520 -599212 -1006769 -840156 -2409992 -4364568 -3956801 -1897205 -1134511
15166 -1134511 -1802934 -1119265 1665927 3594615 2208002 -1127741 -3348197 -3307961 -2076450
15157 -2076450 -1021608 -717097 -784282 -90031 1965025 4040490 4127145 2576009 1932327
15148 1932327 2886091 2652647 -802427 -4889413 -5397237 -2281478 449967 360265 -797403
15139 -797403 -564080 831871 1875816 2457432 3284422 3801673 2634925 -197094 -2958251
15130 -2958251 -4099430 -3509366 -1961198 -341609 488554 170090 -300379 903095 4127196
15121 4127196 6952212 6437930 2780474 -476386 -544306 1343360 1926092 366345 -1085096
15112 -1085096 -749178 281958 465764 475427 1875036 4217540 5369723 4400032 2497977
15103 2497977 1027219 96362 -763930 -1759607 -2941013 -4079719 -4238959 -2581798 123961
15094 123961 1943572 2087741 1690172 1930544 2665168 3427372 4240318 4471216 2521022
15085 2521022 -1670532 -5090882 -4833866 -2146869 -859180 -1923978 -2337881 -233661
15077 -233661 1875109 934136 -1779996 -2479746 -468958 1160320 406473 -979437 -601840
15068 -601840 1157303 2229396 1691403 44614 -2022864 -3651750 -3658128 -1950381 -341723
15059 -341723 -455660 -1487421 -1556306 -624505 -310850 -1176284 -2060681 -2137138 -1926506 -2037222
15049 -2037222 -2341920 -2617071 -2705476 -2015048 -263986 1334347 1279064 172076 -15260
15040 -15260 780515 471253 -1498191 -2713326 -1447714 442135 275881 -1422936 -1949352
15031 -1949352 -522346 886250 492451 -1452326 -3724025 -5406894 -5922003 -5095285 -3561532
15022 -3561532 -2234639 -1155187 473857 2990234 5540215 6727726 5737410 3016485
15014 3016485 142629 -1268983 -858201 448057 1668584 2487996 2761625 2208793 969806
15005 969806 -265702 -1063919 -1582701 -1966460 -2161625 -2358788 -2646439 -2250789 -387438
14996 -387438 2044342 3101223 2398800 1526810 1542202 1758599 1456863 905300 94987
14987 94987 -1496835 -3170125 -3291663 -2240854 -2551927 -4816307 -6087227 -4113806 -578546
14978 -578546 1892548 3244963 4084051 3073475 -493417 -3817707 -3931923 -2201022 -1878928
14969 -1878928 -2721726 -1910776 840046 3106096 3879158 3980906 3120209 629412 -1491578
14960 -1491578 -685054 1317691 441793 -2866928 -3732648 -515907 2715550 2753123 1246807
14951 1246807 186042 -1590121 -4546778 -5701363 -3243887 -138972 489250 132101
14943 132101 1239127 2110344 46970 -2912096 -2507696 801806 2360045 412876 -1840715
14934 -1840715 -1688130 -367609 -5407 -338883 -61967 742491 1010824 337869 -686990
14925 -686990 -1100000 -365259 831079 1066922 270991 301838 2103381 3545338 2203829
14916 2203829 -664704 -1594958 -40452 848877 -953297 -3455221 -3815274 -2324320 -1508561
14907 -1508561 -2419057 -3482909 -2765865 -283525 2077514 2536791 1205228 -176871 -312156
14898 -312156 338797 701392 821166 1482309 2501844 2617819 1189955 -880933 -2108419
14889 -2108419 -1659270 353787 3070510 5193275 5653385 4264961 1665150 -1186232
14881 -1186232 -3309821 -4020682 -3433932 -2419584 -1787924 -1806744 -2459802 -3403983 -3640249
14872 -3640249 -2385440 -542417 100446 -417079 -153335 1168751 815662 -2728326 -6247526
14863 -6247526 -5599947 -1918940 -404727 -2917341 -5448934 -4179504 -829936 267184
14855 267184 -1794017 -4149481 -4799783 -4808070 -5719538 -6942326 -6693367 -4543223 -2088882
14846 -2088882 -1282701 -2464342 -4031288 -4087549 -2546843 -1374160 -2362739 -4856507 -6319299
14837 -6319299 -5282942 -3004199 -1665851 -1591752 -1355485 -469475 -387605 -2047758 -3785997
14828 -3785997 -3293420 -957104 631573 360456 -261842 -39808 49337 -896777 -1652042
14819 -1652042 -1057164 -783692 -3224961 -7109264 -8114465 -4591978 -270036 348768 -2321594
14810 -2321594 -3955054 -2322265 56999 -219541 -2907705 -4970472 -4797751 -3502880
14802 -3502880 -2228551 -494213 1848673 3018879 1518462 -1187197 -2234585 -1073259
14794 -1073259 340861 742784 792293 962122 358007 -1605670 -3986344 -5521528 -5820553
14785 -5820553 -5006611 -3545167 -2565036 -2697011 -2565262 -504378 2191675 2445716 238473
14776 238473 -1007898 -13054 98143 -2647898 -4872270 -2692699 1970103 4088103 2807130
14767 2807130 1699723 2552502 3210557 1809609 -582402 -2309697 -3158348 -3294206 -2613187
14758 -2613187 -1696111 -1295742 -761287 807251 2093295 1029015 -1361732 -1787010 292746
14749 292746 1843478 1253826 653527 1853599 3385044 3584669 3533525 4444790 4844485
14740 4844485 3280915 1660422 2624830 5091983 5723642 3967056 2398869 2421626 2825636
14731 2825636 2848021 3541071 5090800 5416203 3102456 -68990 -1318240 -434004 652023
14722 652023 1104112 1913000 3313928 3533410 1241450 -2067500 -3734833 -3372446 -2898365
14713 -2898365 -3238767 -3007783 -1206411 633440 497433 -1182269 -2328513 -2071400 -1084557
14704 -1084557 160442 1472856 1725476 -199413 -3123879 -4295258 -2861223 -892133
14696 -892133 -440382 -1183253 -1555441 -802072 626364 1524208 596019 -1980542 -3783910
14687 -3783910 -2787195 -703879 -1315351 -5091046 -8174429 -7708878 -5442122 -4418007 -4591541
14678 -4591541 -3946610 -2060832 -147016 1168110 1930411 1766255 661904 -147938 121300
14669 121300 320774 -533416 -916840 1156818 4668346 6611251 5944032 4234004 2815842
14660 2815842 1708813 1169193 1854278 3134173 3292583 1829219 -27869 -1193554 -1561526
14651 -1561526 -1186751 -408043 -454949 -1844884 -2524321 -199534 3490242 4130779 525662
14642 525662 -3434592 -4044789 -2023710 119142 1995509 4116207 5141865 3529627
14634 3529627 630375 -850177 -757656 -1122484 -2435097 -3144962 -2769132 -2591394 -2802726
14625 -2802726 -1726691 1056135 3238490 2930153 1327968 541743 345389 -880091 -2994071
14616 -2994071 -4071251 -3247430 -1748804 -1001244 -1208950 -1983506 -2986322 -3554723 -2910484
14607 -2910484 -1328184 -158764 -99376 -249785 440067 1439531 1161285 -1025387 -3848248
14598 -3848248 -5130550 -3639568 -341706 2102657 1749094 -491064 -1876382 -1301871
14590 -1301871 -654816 -1914053 -4018241 -4146161 -1617703 1222888 2183048 1659858 1186332
14581 1186332 905154 -133396 -1704711 -1967367 268209 3706170 5759594 5277027 3350605
14572 3350605 1496288 55349 -1076353 -1203278 308317 2368154 3063526 2400589 2384679
14563 2384679 3692143 4096444 1611278 -2246577 -4191914 -3325652 -1708611 -1287164 -2058803
14554 -2058803 -3071794 -3533482 -2940711 -1581580 -800704 -1383661 -2081715 -1429144 -473472
14545 -473472 -1364979 -3398570 -3289995 -58517 3077157 2971878 435287 -1683150 -2254405
14536 -2254405 -1922326 -1092629 122730 1089018 1525564 2242301 3550113 4113622 2952415
14527 2952415 1296567 603789 -20316 -2191728 -4987749 -5831687 -4239445 -2282603 -1408421
14518 -1408421 -1113603 -926093 -1366669 -2326269 -2519854 -1464901 -458490 -753283 -2005754
14509 -2005754 -3108617 -3274991 -1870015 1203663 4191462 4289398 1076764 -2215323 -2426937
14500 -2426937 -447165 258205 -1599997 -3863914 -4313840 -3216048 -1798191 -66323
14492 -66323 2274784 3817177 2482671 -1320890 -4375717 -4383226 -2799498 -2731723 -4810098
14483 -4810098 -6684248 -6392776 -4625731 -3254011 -2931704 -2912246 -2390926 -1278528 -114750
14474 -114750 349590 -90254 -649918 -550725 -409340 -1528323 -3672268 -4954719 -4399114
14465 -4399114 -3122831 -2279604 -1467513 -274805 251053 -706428 -1859571 -1433420 246129
14456 246129 1457755 1525445 874058 -438398 -2327630 -3605041 -3359716 -2764786 -3311669
14447 -3311669 -3878329 -2161614 1246153 3113588 2208086 799690 738075 842077 -394912
14438 -394912 -1951538 -2028953 -875536 53115 449293 878134 1204893 1051288 1023441 1789265
14428 1789265 2525817 1985206 761002 721207 2052345 2524280 464647 -2634394 -3627539
14419 -3627539 -1534092 1244702 1853569 169540 -1895832 -3472133 -5149248 -6273255
14411 -6273255 -4532005 119531 3451007 1668181 -3262889 -6108396 -5233500 -3399961
14403 -3399961 -2206165 -153506 2943138 4117063 1948435 -669560 -1111229 -1012816 -2542736
14394 -2542736 -3732622 -1523137 2627115 4452011 3071327 1420311 1076174 620362
14386 620362 -820012 -2090592 -2572682 -3021862 -3260312 -2024007 185574 940433 -548190
14377 -548190 -2244338 -2449353 -1714665 -1002398 -564582 -1201920 -3594647 -5573854 -3567516
14368 -3567516 1763627 5006933 3344753 777834 1871258 4670821 4205306 708762
14360 708762 -822517 1405436 3454851 1804617 -2121929 -5025450 -6014660 -5959967 -5048767
14351 -5048767 -3069110 -673976 1278501 2711644 3621875 3388568 1731308 -444454
14343 -444454 -1834067 -1740464 -198441 1888001 2830572 1857008 692829 1584375 3665906
14334 3665906 3719349 1141601 -666476 707676 3066913 3156444 1417972 424522 549017
14325 549017 464955 513649 1853402 3011753 1289056 -2361144 -3896034 -2357872 -1403223
14316 -1403223 -3129713 -4460456 -2381920 736790 765984 -1744138 -2986549 -2308999 -2607446
14307 -2607446 -4516485 -4817003 -1928309 804544 -445218 -4824146 -8404398 -9125066
14299 -9125066 -7815944 -5632672 -3028270 -859064 -287711 -1267071 -2466190 -2873077 -2508558
14290 -2508558 -1690183 -641358 268655 893729 1781073 3304580 4632870 4764162 4275748
14281 4275748 4490948 5040576 4235818 2244989 1644899 3618072 5660386 4946797 2335322
14272 2335322 640798 129657 -1285864 -3780823 -4907439 -3813629 -2937474 -3868024 -4385619
14263 -4385619 -2157950 817105 738585 -2205887 -4115473 -3239296 -2000413 -2431101 -3034802
14254 -3034802 -2022442 -815350 -1567924 -3001569 -1887771 1882618 4658906 3810077
14246 3810077 773794 -1462089 -1956633 -1667986 -1193807 -360581 470498 254022 -1303725
14237 -1303725 -3059220 -3641776 -2908426 -1733363 -575542 1032345 3205472 4564558
14229 4564558 3475477 500096 -1656599 -1411045 -446978 -1346195 -3853847 -5248494 -4237537
14220 -4237537 -2516442 -1946547 -2070955 -1633311 -1062264 -1674895 -3161574 -3726820 -2681311
14211 -2681311 -1322731 -934264 -1198198 -1119487 -508902 77010 121771 -661605 -2178582
14202 -2178582 -3382712 -2635784 450732 4003877 5648275 5038588 3846203 3524571 4032079
14193 4032079 4577927 4525419 3487389 1601218 -87601 -563287 -391129 -1153354 -2971402
14184 -2971402 -3949177 -2743746 -275487 2009607 3959314 5425598 4914896 1793426
14176 1793426 -1372149 -1459312 714237 1412096 -534126 -2344020 -1955335 -811214 -573535
14167 -573535 -168837 1532647 2568562 432645 -3675513 -6116406 -5570084 -3842630 -2445112
14158 -2445112 -1179591 -156607 -429368 -1798381 -2159698 -215339 2611397 4017541
14150 4017541 3509752 2254455 971681 -903503 -3860959 -6716605 -7154625 -4484979
14142 -4484979 -1341108 -1106889 -3476787 -4534530 -2103940 1231967 2100022 984671
14134 984671 338308 134889 -1166776 -2565559 -1517505 1407240 2952589 2375095 2002844
14125 2002844 2046553 -455062 -5812328 -9296252 -7332720 -2464030 844097 2063002
14117 2063002 2972257 3283683 1950441 551040 1044148 1701617 -337360 -3444020 -3010885
14108 -3010885 1524184 5536319 5759371 4067068 3538765 4208928 4436422 3752248 2413078
14099 2413078 109067 -3049928 -5588634 -6159311 -5067366 -3436465 -1872898 -650103
14091 -650103 -129740 -268455 -554244 -890457 -1718665 -3017669 -4015377 -3972813 -2546084
14082 -2546084 167580 2883862 3243720 371307 -3318486 -4813467 -4333374 -4169445 -4506932
14073 -4506932 -3557717 -1576293 -986709 -1895679 -1313532 1787929 4348401 4126519 3228095
14064 3228095 4163684 5593968 5187916 4033324 4540697 5902115 5419025 3085872 1258376
14055 1258376 692900 431047 882283 3275192 6191215 6308751 3083901 -443338 -2066075
14046 -2066075 -2693425 -3566095 -4113672 -3687844 -2973724 -2481011 -1624303 -270320 638731
14037 638731 770962 898363 1130021 605800 -523844 -946948 -586239 -844144 -1833104
14028 -1833104 -1967392 -1199596 -1760775 -4272652 -6075251 -5366494 -4161455 -4677992 -5435766
14019 -5435766 -3996216 -1360728 -113156 193893 1928266 4534178 4806274 2052962
14011 2052962 -673648 -1147335 -513867 -261611 327761 2060887 3552298 3111850 1462807
14002 1462807 686730 1250068 1665959 784115 -859456 -2100251 -2740954 -3564201 -4807519
13993 -4807519 -5252316 -3712930 -1260330 -416131 -1547708 -1896259 395463 3076986 2823963
13984 2823963 110076 -1689676 -1237087 -276724 -94026 -91458 -65329 -745054 -1479524 -457594
13974 -457594 1884541 2673119 919112 -906820 -858743 -24160 415344 1345837 2970602
13965 2970602 3233148 1538707 835377 2890410 4538456 2339202 -1731805 -3459960
13957 -3459960 -2899345 -2918819 -3170276 -1088643 2076229 2329869 239141 919070 5231723
13948 5231723 7108808 2654063 -3316821 -3919115 536573 4378012 4846596 3881288 3302052
13939 3302052 2781087 2215923 2341564 2688049 1704379 -785534 -3285750 -4672033 -4781084
13930 -4781084 -3607576 -1956300 -2050940 -4910852 -7678449 -6509164 -2066459 975633
13922 975633 394985 -852040 341162 2511524 2215014 -792828 -3660420 -4588942 -4232044
13913 -4232044 -3329127 -1512259 975329 2408689 1692089 252042 500018 2786052 5006616
13904 5006616 5258224 3875317 2447365 1698065 1194295 671645 533036 967218 1505892
13895 1505892 1721759 1621289 1166235 258775 -625799 -894178 -1217741 -2981819 -5603472
13886 -5603472 -6131300 -3082725 755297 1515256 -677572 -2331929 -1911919 -1638147 -3402566
13877 -3402566 -5638490 -5770120 -3779710 -1556891 -127274 629606 567844 -416234 -1209198
13868 -1209198 -552118 817648 853810 -774527 -1983534 -1177199 518407 845252 -661210
13859 -661210 -2361531 -2680184 -1603352 -38747 1474734 2929606 4041512 4009625 2587015
13850 2587015 1074652 1251897 2905194 3460045 1249512 -1519733 -912947 3407007 6970592
13841 6970592 5789381 1297737 -1793867 -1567966 -492185 -1163614 -3070616 -4458425
13833 -4458425 -5138185 -5723463 -5634667 -3970433 -1565000 -126242 300587 1032937 2112012
13824 2112012 2149688 1047952 571503 1421803 1971643 1204259 773094 2200690 3810276
13815 3810276 2983441 350533 -1088143 -517539 29140 -276322 463721 3150973 5260814
13806 5260814 4177269 983597 -1348541 -2122325 -2777078 -3515319 -2885537 -712271 1144511
13797 1144511 1556188 1454974 1530514 712238 -1595647 -3476667 -2676392 105840 2027093
13788 2027093 1776002 641729 51642 -128627 -493525 -906945 -1141561 -1557084 -2412224
13779 -2412224 -3352798 -4090358 -4655096 -4523309 -2722094 381127 2617450 2538437 1404965
13770 1404965 1282247 2050284 2080238 1348291 1728199 3899206 5833858 5222051 2194360
13761 2194360 -1181378 -3279787 -4127593 -4826227 -6205553 -7666960 -7468947 -4900577 -1823170
13752 -1823170 -733088 -1450516 -1492015 48703 1112600 32779 -1854020 -2513084 -2335832
13743 -2335832 -2925446 -4091729 -4393832 -3875321 -3792380 -3926948 -2719621 -373933 609723
13734 609723 -1045267 -3289053 -3464430 -1698622 -143646 147977 -45694 -95442 -585228
13725 -585228 -1982121 -3319135 -3088046 -1217224 569643 651509 -662480 -1698414 -1520054
13716 -1520054 -690745 -37103 213790 -278411 -2224797 -5280915 -7414729 -6999628 -4828725
13707 -4828725 -2741744 -994299 1349831 3953696 5191717 4644137 3658613 3090713 2392069
13698 2392069 1516909 1729151 3401445 4731233 4115730 2515627 1879767 2170200 1625238
13689 1625238 -519319 -3080148 -4501384 -4207305 -2594886 -719443 245122 185770 368765
13680 368765 1652597 2958071 2800670 1757529 1574057 1990511 757261 -2497858 -4701001
13671 -4701001 -3302828 -176972 694231 -1412790 -3392152 -3008963 -1521774 -760301 -115339
13662 -115339 1592160 3064404 2153419 -132893 -286384 2546145 4833027 3486740 173041
13653 173041 -1262791 -67441 1212962 888201 -273632 -1484346 -3148754 -4836079
13645 -4836079 -4534487 -1557428 1524862 1803790 -83645 -927587 612024 2484708 2442412
13636 2442412 1039599 434258 1210686 1812948 1100507 199192 936490 2972320 3767679
13627 3767679 1818766 -1090393 -1860766 168757 2565433 2827690 947785 -1314539
13619 -1314539 -2676000 -3145994 -3172788 -2785262 -1694096 -6657 1408182 1675482 1154666
13610 1154666 1238776 2407352 3325481 2841626 1979496 2392591 3515807 3353236 1920338
13601 1920338 1466842 2819032 3993048 3459710 2348248 1904285 1188331 -519391 -1221537
13592 -1221537 937040 3820975 3712079 880170 -778646 283950 1279971 35132
13584 35132 -1496192 -675013 1476834 1983278 401756 -1008403 -827530 242935 1435278
13575 1435278 2963120 4518390 4577773 2360270 -475487 -1306759 404506 2388148 2234086
13566 2234086 299276 -819268 225029 1659734 1165866 -614858 -1025749 350696
13558 350696 866847 -809204 -1970804 266487 4103665 4999344 1801197 -2115082 -3932118
13549 -3932118 -4477108 -5242179 -5311865 -3316262 -345943 1503503 2222843 3207976 4362733
13540 4362733 4238062 2665085 1044860 104235 -659867 -1374434 -1631506 -1892736 -2876569
13531 -2876569 -3465184 -1735308 1450122 2652053 734027 -1268699 -849719 164614
13523 164614 -972840 -3087479 -3003012 -847469 262781 -605376 -977372 618933 2220994
13514 2220994 1550887 -893359 -3132773 -4160266 -3929296 -2595834 -981494 -421156 -1104434
13505 -1104434 -1751960 -1631273 -1407006 -1258118 -43331 2320488 3391889 1046274 -3228168
13496 -3228168 -5735224 -4801934 -2164522 -517430 -918682 -2350108 -2882205 -1534396 477833
13487 477833 1007814 -126715 -827266 -79634 132390 -2078184 -5064394 -5648077 -3598893
13478 -3598893 -1507221 -621476 362288 2104872 3049561 2142865 845885 889645 1682284
13469 1682284 1593689 600727 -70977 -150367 -408514 -843774 -412309 1228083 2937381
13460 2937381 3448535 2631945 1054429 -902907 -2906667 -4229088 -4217854 -3105212 -1781430
13451 -1781430 -703285 526513 2311197 4130153 4803470 3689165 1497190 -156789
13443 -156789 -190982 730515 606649 -1819664 -5431758 -7746473 -7541292 -5720036 -3536838
13434 -3536838 -1213994 1076977 2234938 1540421 40565 -790685 -1027511 -1423515 -1421452
13425 -1421452 -57473 1667818 1687483 96466 -932117 -702506 -907706 -2359465 -3448322
13416 -3448322 -2968339 -1980050 -1487630 -713071 653205 928655 -755057 -2371794 -2086377
13407 -2086377 -1318909 -2077088 -3228850 -2540607 -727950 35690 311765 2140055 4362486
13398 4362486 3598302 122489 -1552195 824531 3949112 3998405 1744449 285522 123837
13389 123837 -687849 -2679905 -3755365 -1886775 2216076 5389222 4948517 1665996 -769121
13380 -769121 -190768 1187882 166419 -2363391 -2713328 -299679 1437342 567125 -682641
13371 -682641 -292324 142668 -1283435 -3085016 -2834164 -1040673 300386 1187530 2658695
13362 2658695 3812272 2922838 735272 -278117 364725 698585 -537142 -2460042 -3786038
13353 -3786038 -4243444 -4218700 -4253572 -4583555 -4296129 -2030060 1398613 2855344 1170629
13344 1170629 -536740 483065 1773417 -561342 -4672082 -4583977 850882 5738841
13336 5738841 5463628 2606070 1907841 3270488 3444361 1929598 1015828 1310869 1171269
13327 1171269 200199 -146418 388066 291621 -643756 -516506 1297066 2401097 668191
13318 668191 -2548349 -4337019 -4069912 -3366611 -3113582 -2736774 -2207556 -2511453 -3630227
13309 -3630227 -4039606 -3181829 -2712224 -3873524 -5076259 -4040387 -1479099 -403904 -1904082
13300 -1904082 -3756736 -3591115 -1565950 617148 1588382 617318 -2040240 -4293224 -3759251
13291 -3759251 -1254882 -487512 -2711628 -4256613 -1903537 1682538 1577675 -1869770
13283 -1869770 -3591270 -1651154 119333 -1466451 -4116252 -4000868 -1314724 1007871
13275 1007871 1911476 2513138 3122953 2894523 1938488 1411180 1623009 1802601 1514162
13266 1514162 873975 -187575 -1462085 -1856608 -783111 435492 163360 -1126898 -1739416
13257 -1739416 -1419100 -1137465 -775938 572382 2132069 1880964 -166961 -1648404 -1554176
13248 -1554176 -1729730 -3486355 -5096350 -4405918 -2053375 -149339 778796 1550645 2215476
13239 2215476 2185592 1686860 1290781 753753 -23106 153042 2015768 3873835 3638690
13230 3638690 2037021 1265962 1099319 -542886 -3209491 -3665418 -987559 1428321 728831
13221 728831 -1353722 -1568714 56305 1092123 656623 -264960 -1273643 -2588146 -3340403
13212 -3340403 -2481934 -1045570 -1053762 -2352888 -2907775 -2156079 -1544480 -1501650 -546415 1720888
13202 1720888 3110373 1737629 -1201384 -2911933 -2185910 -114239 1491940 1701184
13194 1701184 1277218 2139431 4989133 7635532 7388560 5066186 4233843 5941636 7022420
13185 7022420 4993039 1853211 770795 1385188 1328498 620934 1082531 2289473 1787654
13176 1787654 -594394 -2035745 -1085776 255951 93599 -356411 820865 2757720 2971428
13167 2971428 998664 -1198249 -2066327 -1915658 -1501883 -761831 388748 1071148 338357
13158 338357 -1192420 -1626183 -154440 1565315 1302076 -787587 -2363609 -2246576 -1999167
13149 -1999167 -3262157 -5014102 -5130743 -3608228 -2126113 -965388 1139383 3892472
13141 3892472 4781607 2639082 -217896 -973091 72970 581997 -257334 -1146820 -1037511
13132 -1037511 -156270 1168359 2867878 4019719 3050708 -89349 -3096478 -3688842 -2165983
13123 -2165983 -615615 -6988 704605 2436061 4151927 4132096 2544193 1510286 2317818
13114 2317818 3581509 3028013 538586 -1706456 -2039247 -1077935 -293862 58133 567206
13105 567206 935431 125493 -1592354 -2142519 -163884 2767790 3723545 1999775 -259357
13096 -259357 -1190263 -1355752 -1913005 -2285917 -1460339 -474854 -1146361 -2649305 -2177361
13087 -2177361 499992 2092245 753026 -882739 88205 2098688 1783194 -381355
13079 -381355 -957387 741426 1997750 1943028 3146311 6541763 8719677 6843242 3298180
13070 3298180 2381975 4389374 6157734 6169009 5829393 6142443 6144761 4960218 3101054
13061 3101054 1293209 -195330 -855360 -367456 57276 -1319021 -3925996 -4923119 -2929657
13052 -2929657 -127529 448152 -1492620 -3700371 -4233066 -3009603 -1241992 -362284 -1024628
13043 -1024628 -2285619 -2176574 164184 3357593 5422913 5883898 5332444 3684875 522066
13034 522066 -2885591 -3730359 -859673 3189340 4553713 2143490 -1504458 -3271500
13026 -3271500 -2437430 -568232 611947 679203 321880 278342 456002 61970 -1144921
13017 -1144921 -1952493 -917679 1324171 2139042 107040 -2843531 -3753315 -2339181 -866788
13008 -866788 -842364 -1680165 -2489612 -3041246 -2634488 -318035 2841568 3957326 2225634
12999 2225634 578936 1608244 3771734 3999192 2335972 1022705 211105 -1813170
12991 -1813170 -4522772 -5080770 -2968822 -1130627 -1279459 -1404150 219675 1634036 425710
12982 425710 -2032000 -2580860 -986148 314718 174236 -445307 -1081701 -2392579 -4139109
12973 -4139109 -4958977 -4477400 -3791350 -3704390 -4087595 -4804136 -5515951 -4929788 -2304623
12964 -2304623 556231 1077705 -515615 -1825805 -2160620 -2722041 -2961854 -657385 3349820
12955 3349820 4592547 1344299 -2118603 -1533114 1325314 2191576 1041831 887986 1837975
12946 1837975 1356007 -329719 -133878 2209109 3032242 527145 -2336610 -2323494 2278
12937 2278 2404470 4044741 4594750 3247884 726796 -381157 561300 747862 -1395108
12928 -1395108 -2897546 -784090 2561856 2570697 -496510 -2010736 -1337 2455261 2389592
12919 2389592 793414 59281 503055 1102026 1621983 2341584 2956923 3046067 2786338
12910 2786338 2489832 2237634 2276395 2749706 2914029 1919062 491929 293967 1330220
12901 1330220 1761786 861618 268868 1251261 2452616 1924837 193487 -494978 528211
12892 528211 1468583 666660 -1012125 -986616 2041884 6278160 8441554 7304143 4921619
12883 4921619 3763297 3573078 2401616 10797 -1692262 -1495251 -174529 1246913
12875 1246913 2504741 2902240 1298210 -1723596 -3575924 -2768679 -718062 582272
12867 582272 991526 1186173 1088576 845228 1563448 3261256 3742347 1553198 -1453085
12858 -1453085 -2738276 -2803505 -3675912 -4908465 -4229544 -1647625 303509 524890 567703
12849 567703 1404578 1808582 840962 -549701 -1492776 -2486116 -3530112 -3193254 -1100979
12840 -1100979 552230 -216989 -2368343 -3569912 -3406592 -2944304 -2269775 -776962 695711
12831 695711 472819 -1068598 -1424976 467153 2353190 1573716 -1255037 -2914914 -1594767
12822 -1594767 1050371 2104307 744834 -1253449 -1886906 -864402 867562 2471847
12814 2471847 3318485 2540549 -56004 -2646586 -2488999 850160 4443453 5218566 3479021
12805 3479021 2000797 2143181 2461124 1314259 -768607 -2185738 -2537458 -2568526 -2532557
12796 -2532557 -2033604 -1275984 -1017223 -1115876 -580183 476786 530277 -714851 -992114
12787 -992114 1448730 4601668 4881816 2082389 -375334 -301743 755569 618648 -492645
12778 -492645 -1456961 -2473698 -3871366 -4601192 -4118333 -4139246 -6014739 -7690852 -6202282
12769 -6202282 -2393673 -61036 -646749 -1912925 -2081697 -2056079 -2639802 -2585688 -983888
12760 -983888 793480 1256035 998312 1086610 948833 -384957 -2338963 -3755463 -4568009
12751 -4568009 -4977972 -4285578 -2247985 -349059 161681 335515 1541868 2513885 995312
12742 995312 -2152768 -3340287 -1100149 1963960 2941752 2152678 1598067 1616715 926924
12733 926924 -828840 -2400287 -2790741 -2460425 -2273078 -2193779 -1764816 -1373086 -2033850
12724 -2033850 -3740068 -4925040 -4276808 -2543921 -1611701 -2065149 -2719291 -2478477 -1492664
12715 -1492664 -380838 400874 129598 -1815853 -4523503 -5797230 -4652796 -2466496
12707 -2466496 -992693 -540620 -770804 -1576526 -2084981 -686393 2263018 3528064 944199
12698 944199 -3139893 -4757352 -3434482 -1719065 -652896 1001121 3326732 4506584
12690 4506584 4058765 3773040 4462376 4465490 2575497 118570 -1154031 -1190119 -511355
12681 -511355 933656 2535670 2736822 1401759 466732 746599 306068 -2050899 -3852154
12672 -3852154 -2161055 1794581 4000784 2791823 -2727 -2397210 -4013676 -4644768
12664 -4644768 -3703713 -1692307 -307508 -454274 -1435050 -2283453 -2608377 -2128380 -793644
12655 -793644 569648 1058848 1049238 1369048 1433187 40762 -2036524 -2451122 -761428
12646 -761428 604615 -166280 -1710250 -1745513 -344406 709600 787334 816454 1221700
12637 1221700 1155566 49546 -1212162 -1243613 165725 1719134 1916410 611466 -802474
12628 -802474 -891728 227491 1061648 450505 -1189678 -2318740 -1759269 182924 1979305
12619 1979305 2486606 2198178 2237124 2308619 1196777 -294479 843988 5335828 8982748
12610 8982748 7399551 2168324 -1164835 -730093 -5344 -1407152 -2582193 -1041789
12602 -1041789 1358479 1633073 518989 647684 1872308 2039845 1101626 784887 922420
12593 922420 -183419 -1936461 -1729559 450481 1224101 -1223897 -4411448 -5244171 -3815755
12584 -3815755 -1893864 -19401 1851862 2742617 1967845 794586 724831 1099878 366669
12575 366669 -1099581 -1488530 -415615 661127 765742 424012 298401 315864 325326 331899
12565 331899 -38261 -1064054 -1883066 -1347014 -144160 -485103 -3020612 -5516136 -5591657
12556 -5591657 -3615030 -1713673 -940841 -895940 -1365244 -2370695 -2675403 -385129 4080665
12547 4080665 7276825 6437260 2930773 505221 682102 1577962 1116058 -468563 -1805916
12538 -1805916 -2407334 -2552601 -2406531 -2327432 -3063766 -4501717 -5068594 -3605136 -1085756
12529 -1085756 794818 1926458 3085104 3682415 2354126 -315100 -1831140 -1012432
12521 -1012432 647923 1353112 943827 -125939 -1767728 -3186396 -2752963 -418931 1380350
12512 1380350 928189 -143459 564056 2287393 2302921 394542 -762278 54635 663061
12503 663061 -901599 -2998280 -2591614 302283 2537564 2064360 289962 -518247 -673307
12494 -673307 -2232875 -5177059 -6534354 -4318002 -765280 251914 -1659238 -3143569
12486 -3143569 -1985163 171216 846721 155097 -423891 -783540 -1493207 -1648602 70874
12477 70874 2726874 3865373 2883264 1578586 1241111 1245891 955243 1029108 1907501 2481798
12467 2481798 1446333 -820361 -2615283 -2758475 -1600618 -440391 -110608 -77522 714912
12458 714912 2033020 2401686 1489879 986229 1886608 2506580 1110931 -978501 -1463989
12449 -1463989 -969690 -1616731 -2603886 -1242656 1627824 1779083 -1705017 -4280135 -2653910
12440 -2653910 382818 813704 -445708 -51963 1737053 1839305 -262199 -1969198 -1833109
12431 -1833109 -884414 5778 963037 1445557 607710 -686926 -737405 306170 1055629
12422 1055629 1666338 3189047 4605669 3788233 1419036 558837 1876088 2686883 1511897
12413 1511897 177683 181232 292127 -566585 -1134323 -495860 -130615 -1062161 -1613560 -581697
12403 -581697 -212168 -2876295 -6581249 -7214548 -4316944 -1416929 -1035095 -2307778 -3535469
12394 -3535469 -4282144 -4422985 -3456960 -1695603 -543017 -784535 -1674261 -2171391 -2086615
12385 -2086615 -1652882 -876881 248651 1430518 2204981 2153589 1205194 -3500 -506804
12376 -506804 -25260 973415 2239774 3600337 3782380 1368787 -2270211 -3308058 -365820
12367 -365820 3108980 3576185 2329777 2675834 4097960 3282152 97815 -1877763 -1098581
12358 -1098581 -106093 -772571 -1366788 -108645 1710424 2296954 2233008 2556021 2464848
12349 2464848 1301792 564590 1392893 2016938 406393 -2219916 -3321206 -2987712 -2974673
12340 -2974673 -3007714 -1389530 1315563 2568716 1807319 983820 906357 207843 -1265477
12331 -1265477 -1203674 1352182 3462594 1907665 -2008819 -3614776 -603151 4068671
12323 4068671 5428358 1841378 -3405096 -5750873 -4081228 -1204621 71559 -126603
12315 -126603 -288691 -206980 -455677 -497038 504312 1702051 1634259 766041 643185 956052
12305 956052 140589 -1272117 -1006934 877390 1496390 -325954 -2200520 -2215092 -1669903
12296 -1669903 -1932545 -1720509 -56990 913109 -776236 -3080940 -2956567 -1494910 -2196327
12287 -2196327 -5066345 -6373629 -4192760 -637528 1772635 2777927 2826240 1840830 488665
12278 488665 151364 618760 978 -2153051 -3770601 -3245283 -1495921 -47231 933710
12269 933710 1509242 844838 -1205634 -2840799 -2266307 -55019 1629968 1473028 -107728
12260 -107728 -1696695 -1897742 -461164 1216083 1617728 1144434 1304205 2003359 1569405
12251 1569405 -334001 -2014060 -2482844 -2604289 -2874560 -2623441 -2351989 -3958220 -7100431
12242 -7100431 -8251249 -5469467 -1428975 642323 1281837 2235359 2443615 408829 -1600174
12233 -1600174 -148216 3676480 5457713 3785508 1307866 -206967 -1569443 -2742202
12225 -2742202 -2090179 -12404 657264 -743621 -1263484 934034 3685961 4422531 3619314
12216 3619314 2779471 1787387 348103 -433610 -39178 78699 -952586 -1646223 -831783
12207 -831783 153693 27117 41 1222648 1898425 -260827 -4242765 -7000916 -7246054
12198 -7246054 -5782246 -3642945 -2171827 -3087600 -5747186 -6219176 -2293361 2280042
12190 2280042 2283844 -1514334 -3598490 -1789424 390724 -216552 -2290500 -3241307 -2924870
12181 -2924870 -2490608 -2368027 -2944714 -4754485 -6580689 -5800459 -2152269 1066241 1174693
12172 1174693 -506566 -1043900 209672 1795268 2585321 2311313 1005669 -513351 -824214
12163 -824214 54149 134495 -1615533 -3259404 -2479868 53557 1700078 1262376 -338158
12154 -338158 -1918100 -2774749 -2272751 -531632 842010 333264 -1430803 -2607279 -2698889
12145 -2698889 -2641419 -2644685 -1723113 386554 2290792 2440171 702608 -1775435 -3510432
12136 -3510432 -3466840 -1825306 -168359 -104375 -1391827 -1994604 -302508 3039770 5687698
12127 5687698 5747290 3289242 -75500 -2848880 -4562115 -5091087 -3993312 -1496431 466985
12118 466985 -138726 -2619300 -3868199 -2133006 856651 2270275 1446335 -115154 -912936
12109 -912936 -556986 458420 1225196 1336552 1736760 3538890 5654734 5342756 1978556
12100 1978556 -1594721 -2748904 -2199857 -1864161 -1664563 -770241 -205183 -1267628 -2482951
12091 -2482951 -1274624 1817372 3582146 2645705 675961 -882474 -2241046 -3062503
12083 -3062503 -1953522 774119 2515138 1873073 491418 92934 -54640 -1080717 -1958816
12074 -1958816 -1121927 676450 1170666 -425646 -2850067 -4677601 -5347176 -4665748 -2633093
12065 -2633093 122108 2458910 3424565 2803449 1384147 659724 1516661 3135099 3955050
12056 3955050 3603008 2799109 1659255 -190849 -1747069 -1037949 1774307 3671532 2408194
12047 2408194 -748794 -3182571 -4184502 -4459084 -3948784 -2341348 -855511 -1241355 -3152575
12038 -3152575 -4328615 -3447611 -1344336 596143 1801628 2124561 1530962 717990 982752
12029 982752 2752611 4800811 5506616 4638588 3477078 3265647 3904631 4355945 4092187
12020 4092187 3585082 3232391 2592368 1339108 248215 157334 491234 197312 -191029
12011 -191029 901048 3435928 5358775 5211624 3642482 1969558 774923 231011 165226
12002 165226 -500934 -2551544 -4485223 -3923800 -1307621 529444 1019716 2651564 5751807
11993 5751807 6421567 2398361 -2561717 -3807843 -2365261 -2123104 -2918314 -1574166 1576432
11984 1576432 2841655 1700362 1618274 3391796 2986821 -1864496 -7412856 -9040636 -7137792
11975 -7137792 -4909673 -3282780 -1238946 918169 1891676 1746104 1330333 479861 -900195
11966 -900195 -1234446 668225 2886919 2364323 -802399 -3401163 -3221023 -991644 1613550
11957 1613550 3692547 4640337 4037501 2662371 2134931 3009934 4358127 5410668 6262062
11948 6262062 6719259 6021889 4293816 2829737 2159126 1222880 -471712 -1279590 319922
11939 319922 2798875 3055100 711818 -1266858 -945967 -260428 -1822521 -4518292 -4880647
11930 -4880647 -2332840 -127964 -390900 -1041680 505729 2816396 2454033 -504340 -2107416
11921 -2107416 58834 3716794 5114385 3461448 973510 -117648 602852 1960214
11913 1960214 2281961 934838 -681385 -554910 1147782 2051497 1026469 51495 1247708
11904 1247708 3434543 3611651 1155824 -1558605 -2619795 -2648688 -2965705 -3439437 -3151297
11895 -3151297 -2070432 -981259 -365191 -255125 -728946 -1620953 -2008617 -975740 1030439
11886 1030439 2419349 2244978 1061109 -207520 -1312499 -2087952 -1888728 -702285 47306
11877 47306 -700104 -1658259 -900012 821886 918195 -682720 -1040296 789231 1540883
11868 1540883 -1016990 -3631546 -2148920 1448924 1282748 -3694218 -8028312 -7590848
11860 -7590848 -4621456 -3250991 -3948202 -4911349 -5691224 -6362393 -5554508 -2614009 -72818
11851 -72818 -719164 -3206322 -3593033 -730171 2611542 3773286 2926558 1705819 1159439
11842 1159439 1242502 893350 -1154733 -4353187 -5950213 -4323525 -1668628 -1109362 -2103434
11833 -2103434 -1636010 554221 1458601 -96015 -1378499 -155759 1913364 2260573 1291378
11824 1291378 930769 1164048 638553 -420728 -481683 534724 1001415 121042 -1078286
11815 -1078286 -1506546 -1343232 -1292781 -1609571 -2170923 -2703366 -2755261 -2125777 -1384665 -1323156
11805 -1323156 -1876697 -2213888 -1905286 -1427291 -1440845 -1945205 -2121015 -931359 1624871
11796 1624871 3745662 3401214 1264798 555639 2544954 3859562 887152 -4138485
11788 -4138485 -5125637 -564573 3980751 3645500 808527 591312 2771309 2880643 54161
11779 54161 -1551884 158426 1663181 -366833 -3610449 -3786645 -1221892 31356 -1634701
11770 -1634701 -3783587 -4350582 -4363427 -5427023 -6966437 -7338401 -6211898 -4517824 -2806222
11761 -2806222 -868485 1049129 1534621 -681007 -4521629 -6623076 -4884159 -1514352
11753 -1514352 -590430 -2499604 -3426189 -1308193 768629 -640618 -3959314 -5303640
11745 -5303640 -4437009 -3960890 -3944440 -2089039 992068 1583537 -1057518 -2934200 -1406864
11736 -1406864 893414 566144 -1524906 -2368350 -1170036 1091121 4024573 6931758
11728 6931758 7654013 5268528 2338389 1758061 2854019 3260662 3016866 3660213 4500803
11719 4500803 3301301 279669 -1730513 -1250383 253573 870074 186897 -1164666 -1874599
11710 -1874599 -250467 3543888 5926104 3310613 -2747464 -6509877 -4796195 -412671
11702 -412671 1953435 1019740 -1119070 -2456773 -2866236 -3243045 -4057071 -4619293 -3610888
11693 -3610888 -780274 2183431 3393831 3082293 3007459 3839875 4542206 4210297 2964749
11684 2964749 953889 -1848744 -4458925 -5110177 -3495402 -1666219 -1851627 -4047508
11676 -4047508 -6362412 -7232750 -6762620 -6056940 -5564467 -4426429 -1934404 690259 1291484
11667 1291484 -157588 -1135569 -68991 1560726 1967371 1917283 2666728 2842279 418252
11658 418252 -3168140 -4184927 -1757515 1171698 2252868 2191235 2238372 2039416 1108790
11649 1108790 217148 74857 278163 434930 812389 1261861 1116536 693083 1209114
11640 1209114 2663743 3490182 2847114 1594687 603492 -78356 -35066 1376878 3065645
11631 3065645 2628073 -248014 -2792303 -2629588 -434829 1826129 3336433 3964152 3293338
11622 3293338 1555652 70011 -352508 -48975 1021698 3353492 5639549 5094006 1583846
11613 1583846 -1159450 -570417 978141 157148 -1761055 -922112 2710434 4890600 3149342
11604 3149342 -117899 -1613268 -1436983 -1814304 -3370948 -4596592 -4270074 -2806451 -1227077
11595 -1227077 54664 1052164 1574191 1447256 1030094 737362 214860 -955189 -1673142
11586 -1673142 -16096 3745012 6502511 6052965 3879741 2435654 1483445 -196281
11578 -196281 -1150714 870427 4108034 4176516 617155 -2164820 -1583040 -306555 -1224922
11569 -1224922 -2994883 -3221968 -2634910 -2959858 -3369797 -2347082 -1012600 -1437744 -3242432
11560 -3242432 -4683201 -5565251 -6383762 -6203120 -4238189 -2078947 -1479808 -1318016 340208
11551 340208 2515291 2800839 1460686 807682 1301844 1441411 920175 752184 679656
11542 679656 -481654 -2153242 -2483639 -1250499 352565 2167196 4363045 5121814 2671543
11533 2671543 -727132 -822683 2307613 3981164 1793016 -1173000 -1473247 90698 1150765
11524 1150765 1847193 3419477 4921270 4298222 1745715 -347516 -499445 291222 -82342
11515 -82342 -2595231 -5908867 -7300519 -5454334 -2148130 -177028 -105436 -569182 -1138742
11506 -1138742 -2662570 -4982027 -6692953 -7246505 -7007417 -5454514 -2152795 662851
11498 662851 86517 -2418325 -2006533 2325846 5812594 5287739 4005468 5742456 8168958
11489 8168958 6796253 2635733 536481 1455591 1932190 834530 984590 3111473 3489268
11480 3489268 6446 -3628922 -3029672 418362 1800136 -361688 -2957601 -3449566
11472 -3449566 -2719619 -2197180 -1020031 2152715 5955157 7063474 4235192 196195
11464 196195 -1373744 -127433 899648 -310475 -1738436 -44619 4444269 7502064
11456 7502064 6185606 2425947 226622 650992 1407058 736372 -428704 -454543 684617
11447 684617 1941568 2728136 2908556 2263815 1054205 329507 515949 359834 -1378212
11438 -1378212 -3639573 -4029738 -2003467 415133 1313744 868941 198058 -404111 -1268691
11429 -1268691 -2328426 -3096943 -3152201 -2277089 -764329 278981 -102776 -1190835 -1107555
11420 -1107555 817177 3295013 4896921 5198113 3864324 585274 -3207918 -4640002
11412 -4640002 -2922399 -828758 -907195 -1931405 -1304520 550337 1044968 -146445 -575008
11403 -575008 1019743 2992595 3620079 3283794 2919175 2273331 948552 -207394 -18200
11394 -18200 1469852 3181903 4149906 3956904 2819147 1811132 2281897 4244633 5725033
11385 5725033 4586994 1187599 -1395223 -473581 2949265 4920157 3163784 -57799
11377 -57799 -989299 691232 2089369 1631475 489359 -664932 -2886529 -5805118 -6767692
11368 -6767692 -5134722 -4052177 -5303174 -5811604 -2818650 685623 324756 -2399940
11360 -2399940 -2630794 -315332 181285 -1888031 -2381482 118652 1584187 -525880 -3151167
11351 -3151167 -3261769 -2640698 -3548369 -3988846 -1611620 988228 -368643 -4778421 -7463064
11342 -7463064 -6602969 -4812978 -4069026 -3012055 -164793 2940735 3371551 417825 -3364453
11333 -3364453 -4608846 -2497943 585506 2161233 2555185 3274683 3562480 1512238 -1569717
11324 -1569717 -1719191 1638779 3960298 1985483 -1611746 -2796428 -2250482 -3238200 -5715248
11315 -5715248 -6617839 -4789091 -1941430 498525 2152807 2001065 -660316 -3836055
11307 -3836055 -4564961 -2987667 -1851709 -2156997 -2303490 -1585131 -1387477 -2408704 -3535382
11298 -3535382 -4141029 -4881261 -5545440 -4780587 -2849529 -2070793 -3319423 -4457817 -3618336
11289 -3618336 -1858684 -986150 -757066 -118915 403113 -323857 -1730888 -2190657 -1362324
11280 -1362324 -232371 653537 1394043 1582975 642487 -765052 -1225503 -668261 -561179
11271 -561179 -1637321 -2801460 -3014540 -3026695 -4073145 -5674634 -6173598 -5144227 -3779508
11262 -3779508 -2804048 -1591738 61368 895267 160751 -641169 261647 1974334 2018630
11253 2018630 117571 -1303972 -778939 199666 -164780 -1198471 -1209437 -395698 -410082
11244 -410082 -1588827 -2444992 -2036887 -1336700 -1563650 -2105686 -1213300 1293969 3102547
11235 3102547 2057950 -804251 -2305653 -1257263 273759 518833 567670 1616341 1913193
11226 1913193 -561178 -3922120 -4602371 -2971455 -2593789 -3959466 -3600334 -389832 2097313
11217 2097313 1546841 605204 1650683 2187033 -505508 -3710622 -3179714 -262589 67074
11208 67074 -3046013 -5718480 -5920763 -5599320 -5804839 -4503680 -716570 3000577 4073668
11199 4073668 3071884 1764714 501683 -873927 -1589847 -1089527 -199078 59916 -297417
11190 -297417 -846480 -1382663 -1506927 -901145 -201190 -130796 115126 1683396 3415017
11181 3415017 2982528 979007 787827 3202820 4337213 1172085 -3348407 -3859240 201921
11172 201921 4160514 4497219 2543472 1196809 750209 -218040 -1517239 -1371760 433574
11163 433574 1653193 750437 -600302 233315 2969057 4746058 4079289 2325275 931710
11154 931710 -371648 -1658034 -1507998 614824 2722177 3150820 3254123 4793349 6335868
11145 6335868 5367166 2879417 2365353 4568908 6599509 6389029 4824496 3112641 1282095
11136 1282095 -20769 464624 1736000 872106 -2298363 -4038263 -2110873 739930
11128 739930 1223681 560814 1772981 4039382 3792425 675517 -1541847 -484833 1632928
11119 1632928 1588833 -452720 -1802619 -1079698 543975 1381657 1068297 262979 -422600
11110 -422600 -555184 593069 3648426 7812563 10582941 9788217 5999647 2225551 995581
11101 995581 2213048 3890446 4291005 3112100 1238148 -144873 -394893 308345 1374973
11092 1374973 2170547 1925199 100810 -2500848 -3797323 -2681334 -655794 37281 -530957
11083 -530957 -273183 1794274 4336118 5643914 5231114 3340288 497390 -2090398 -3283127
11074 -3283127 -3603131 -4496113 -5552135 -4378897 -212667 4174170 5648904 4431979
11066 4431979 3051388 2696401 2450964 1566194 601761 206568 195295 196745 205726 71251
11056 71251 -794782 -2613920 -4528697 -5323100 -4900431 -4498378 -4989396 -5392408 -4061245
11047 -4061245 -1376718 143662 -794523 -2165856 -1369361 996025 2170636 1555368 1528183
11038 1528183 3523786 5560779 4887065 1626408 -1470618 -2071266 -173652 2310473
11030 2310473 3190849 1798744 -374534 -1278792 -526498 711398 1683621 2585880 3232732
11021 3232732 2887557 1675069 500536 -745727 -3000037 -5514242 -5740451 -2882043
11013 -2882043 409588 1330224 183047 -1136056 -2035370 -2647260 -2074053 240719 2467457
11004 2467457 2346201 587987 -224562 265621 -54454 -1864228 -3137725 -2482165 -1087256
10995 -1087256 -190300 880614 2437840 2533965 -194940 -3393401 -3617628 -1348917 -315392
10986 -315392 -1784225 -2704336 -595312 2545102 3187880 1075694 -1279371 -2496580 -3098617
10977 -3098617 -3147582 -1911058 74369 1102530 857125 644208 656949 -538758 -2962394
10968 -2962394 -4214618 -2958592 -1125756 -810342 -997947 331422 2439520 2806733 1016123
10959 1016123 -809446 -1093535 -227709 884134 1799751 2038568 1134543 -689298 -2757311
10950 -2757311 -4414627 -4641020 -2482916 950861 2506097 777145 -1599155 -1544891 74968
10941 74968 261253 -1285320 -2309339 -2174309 -2448390 -3424183 -3374632 -1787396 -530879
10932 -530879 -1106082 -2967703 -4913705 -5990229 -4982894 -1423977 2726969 4704720
10924 4704720 4264298 3188952 2018524 141478 -1367512 -624534 1220332 805048 -2080903
10915 -2080903 -3634822 -1626315 1628223 3174653 3050125 2661005 2670810 3808523 6608660
10906 6608660 9069659 7941851 3730384 811807 1030640 1234489 -717627 -1944082
10898 -1944082 179795 2678495 1119804 -3673880 -7241889 -7799254 -6982948 -5855985
10890 -5855985 -4061001 -2125299 -1287558 -1446039 -1661297 -1854044 -1982315 -931843 1569317
10881 1569317 3462121 3053077 1610877 1093445 1200249 1058008 1636734 3641976 5124020
10872 5124020 4322861 2892767 3007372 3345349 1677168 -550152 -494866 756007 -236579
10863 -236579 -3277886 -4754311 -3417213 -1492159 -205568 1278142 2309678 771167
10855 771167 -2589355 -4120420 -2653996 -1019926 -1071324 -1125327 182279 1286547 848609
10846 848609 222900 749215 1444332 1307757 1239231 1790036 1644497 290391 -416333 479089
10836 479089 733859 -1565569 -4348745 -4276416 -1530105 898460 1503684 1081526 97414
10827 97414 -1866705 -4134200 -4914070 -3713093 -1987499 -974818 -310745 774160 2055648
10818 2055648 2645854 2052087 664827 -348555 235971 2434393 4626737 5101273 3981706
10809 3981706 2937873 3030846 3656140 3826980 3748543 4549268 6698991 9099286 9782881
10800 9782881 7564293 3299951 -428526 -1349635 387343 2347735 2357864 621821 -1066148
10791 -1066148 -1683154 -1679227 -1647017 -1526966 -1212454 -637408 967278 4273251 7694232
10782 7694232 7963980 4228778 -162909 -1681162 -783129 -17144 254752 1381428 3037154
10773 3037154 3712846 3800595 4581071 4654338 1532021 -3083929 -4161411 -555178 3047131
10764 3047131 3110785 1843136 2372567 3548674 2977893 1815369 2537933 4351427 4748688
10755 4748688 3896665 3699919 3785678 2147750 -847736 -2427248 -1225327 1454656 3916845
10746 3916845 5343311 5172125 3384892 1324302 685227 1949676 4644633 8017620
10738 8017620 10564698 10658653 8931689 8065042 8800866 8547364 5734306 2826413 2552635
10729 2552635 3780278 4064628 3818374 4568771 5216250 3739290 1063476 -278715 19206
10720 19206 779469 2265445 4843284 6310806 4429147 995007 -272620 1147777 3012232
10711 3012232 4434894 5763917 5744586 3058025 -285456 -1306961 -976295 -2564118 -5929485
10702 -5929485 -7877968 -7536891 -6784596 -5837952 -3239100 -75022 696807 -633071 -779639
10693 -779639 913395 1857563 1500371 2104478 3520003 2457837 -1577352 -4537776 -3798608
10684 -3798608 -1455928 -16533 783213 1112217 -463844 -3441368 -4521944 -2558014
10676 -2558014 -411243 174230 1251944 3848474 5042175 3052340 985548 1760932
10668 1760932 3167198 2192392 744489 2074071 4221723 2671919 -1866151 -4047232
10660 -4047232 -2153260 -328926 -1411181 -2489431 -218960 3277400 3594000 1003440
10652 1003440 -12756 2120744 3577008 1205225 -2334364 -2414496 858808 3522772
10644 3522772 4126429 4823749 6100786 5231451 1489486 -1557579 -1394528 -262195 -710301
10635 -710301 -1320676 -281544 522667 -860981 -2082811 -394283 2005164 1560430 -234594
10626 -234594 588479 3577983 5135228 4941125 5278065 5341415 2457454 -1720696 -2451881
10617 -2451881 709563 3519508 3995578 4080112 4388947 3204957 1061648 539136 991526
10608 991526 -772174 -4019083 -4289304 -963586 1315500 30405 -2165624 -3161762 -4368950
10599 -4368950 -6196371 -6013181 -2780570 929426 3213459 4765501 5533377 4212452
10591 4212452 2000628 1941218 3675754 3832399 2164190 1838337 3066650 2417169 -555063
10582 -555063 -2021066 -483732 1151648 1306008 1748783 2874343 2829887 2179790 3378681
10573 3378681 5073714 3485674 -118857 -469605 2738296 4623561 4407292 6378037
10565 6378037 10451232 10930869 6800400 4185695 5940355 7684795 6953870 7109352 9012038
10556 9012038 8188277 4021346 2545524 6027972 8722492 6995409 4686271 4529172
10548 4529172 3622170 1423200 2501336 7128571 9153100 7375811 8271553 13015277
10540 13015277 13681703 7804371 4299349 8208146 11911724 9103449 5255834 5920621
10532 5920621 6817700 4494788 4677032 10360456 13569694 9139311 4896394 7657137
10524 7657137 11084482 8509087 5627912 8579981 11439110 8063887 4607626 7494265
10516 7494265 10750543 8176727 5937588 9931886 13451167 10868758 9855164 15923787
10508 15923787 19787450 15063944 12191400 18544869 22853981 17343169 15095045 24828045
10500 24828045 30923141 22636048 18331561 31939664 42709867 33471616 28984237 51798164
10492 51798164 71966648 59461888 56184137 114714602 179297354 127693787 -48522854
10485 -48522854 -200926304 -207596342 -119504349 -63756115 -70665865 -76901828 -52889377
10478 -52889377 -34433634 -41429972 -47021861 -35148881 -25896688 -30551913 -31394787 -20086281
10470 -20086281 -14385194 -22699811 -27808687 -19497441 -12029288 -15854680 -19855565 -14854599
10462 -14854599 -9903695 -12273554 -13384327 -7208337 -3004001 -7683545 -12875849 -10720519
10454 -10720519 -7011302 -8460494 -11068608 -10404985 -10349765 -13270463 -13785232 -9701036 -7356395
10445 -7356395 -9605190 -10357705 -7083244 -6482123 -11345320 -13910994 -9285983 -4120418
10437 -4120418 -4769315 -7392194 -6927794 -5964855 -7539360 -8276774 -5753516 -4401630 -7413380
10428 -7413380 -10264812 -8413474 -4639052 -3407366 -4273011 -5197184 -6153189 -6182463 -3528097
10419 -3528097 -994173 -3579089 -8967873 -9217589 -3889753 -1473000 -4974813 -7043873
10411 -7043873 -3502585 -477408 -2493647 -4364942 -1814991 -140111 -4414162 -9787491
10403 -9787491 -9738329 -6541898 -5639676 -6305398 -5507161 -4849589 -6367807 -7228577 -5445057
10394 -5445057 -4875175 -7741308 -8578533 -3208899 2423337 867245 -4653701 -5703791
10386 -5703791 -2186894 -1139417 -4563961 -7476165 -7107188 -6112404 -6492514 -6799290 -5986242
10377 -5986242 -5106416 -4729287 -4239148 -3505534 -2666958 -1426257 -651956 -2372871 -5914781
10368 -5914781 -7174990 -4564248 -2208099 -3870887 -7209505 -7944269 -6443439 -5900918
10360 -5900918 -6786871 -7394277 -7529920 -7654504 -6561686 -3662224 -1396431 -1830267 -3076140
10351 -3076140 -2475172 -951560 -800800 -1605594 -1852809 -2231182 -3796708 -5108400 -4616988
10342 -4616988 -3733628 -4290127 -5210189 -4824558 -4051552 -4146142 -3917497 -2423358 -1617852
10333 -1617852 -2851786 -3706869 -2194221 -1127308 -3785151 -7707503 -7777365 -3876198 -673708
10324 -673708 -752418 -2335313 -3313941 -3585192 -3549295 -3490385 -4195314 -5652116 -5954718 -3937097
10314 -3937097 -1632174 -1469678 -2478690 -2231752 -1172255 -1660020 -3567506 -4146697 -2104098
10305 -2104098 847560 2471766 2077342 384421 -1157328 -1451430 -1164413 -1922439 -3367738
10296 -3367738 -3064472 -496899 1399568 504893 -1284419 -1377959 -479909 -544693 -1040210
10287 -1040210 -398299 526781 -303370 -2470816 -3632073 -3122843 -2665787 -3816151 -6350809
10278 -6350809 -8721881 -9102470 -6907940 -3919097 -2516832 -2529494 -1909749 -648176 -954523
10269 -954523 -2969765 -3967980 -3077804 -2930979 -4845464 -6363306 -5839672 -5405687 -6565873
10260 -6565873 -6913071 -4675858 -2758668 -4215151 -6841338 -6485552 -3200031 -82688
10252 -82688 1660534 2502313 1667774 -1336781 -3888003 -3000244 98320 1531337 -15262
10243 -15262 -2433046 -3434383 -2359375 -142214 766071 -1477954 -4572367 -3733931 1275357
10234 1275357 4677091 2780798 -778328 -1283674 105874 -29750 -1089987 -902234 -740073
10225 -740073 -2460236 -3908643 -2717949 -1481572 -3260454 -5098125 -2582835 1859725
10217 1859725 2419262 -357603 -823935 1902401 2973712 508451 -2114440 -3129870
10209 -3129870 -4547181 -6444854 -5767710 -2392234 -391096 -1483117 -2624467 -1769971
10201 -1769971 -865033 -1406297 -1925996 -1652253 -2143541 -3653350 -4098538 -2966148 -2126094
10192 -2126094 -1890750 -698982 684793 -241154 -2115559 -445602 4497583 6484739
10184 6484739 2535472 -2347262 -2858607 -632629 -60177 -1413313 -2277522 -2174292 -1733986
10175 -1733986 -319968 1831654 1986887 -956424 -3450183 -2119061 865786 1077146
10167 1077146 -1609057 -3748683 -4064441 -4342440 -5330206 -5588394 -4611977 -4037513 -5002949
10158 -5002949 -6249030 -5545487 -2105842 2467111 5181059 4197211 850506 -1713345
10150 -1713345 -2194724 -2134259 -2969704 -3982488 -4064594 -3731885 -4073250 -4992190 -5615319 -5383249
10140 -5383249 -3988398 -1459631 1052974 1958858 1362196 1151354 2355302 3790015 3855318
10131 3855318 2291047 -203277 -2588793 -3543208 -2661227 -1773090 -3086260 -5815393 -6887825
10122 -6887825 -5302618 -3296299 -2640661 -2511367 -2021409 -2155946 -3661268 -5227101 -5357462
10113 -5357462 -4304441 -2936223 -1494745 -559714 -1270925 -3346015 -4711573 -4286356 -3347511
10104 -3347511 -3114034 -2975707 -2261888 -1661964 -1528214 -827669 658518 1016603 -1152241
10095 -1152241 -4295112 -5754613 -4811746 -2636117 -590088 240399 -698667 -2421111 -3003454
10086 -3003454 -2175800 -1792210 -2869642 -4038802 -4010990 -3521699 -3397241 -2719401 -716997
10077 -716997 1229505 1423399 374231 -314919 -417522 -699007 -1075495 -910193 -495742
10068 -495742 -763598 -1928232 -3415478 -4613945 -5021905 -4421255 -3502425 -3435870 -4321653
10059 -4321653 -5003778 -4745242 -4006284 -3403874 -3167752 -3618551 -4642610 -4814160 -2911367
10050 -2911367 -138623 1352626 1849205 3173686 4623878 3517505 342866 -804561
10042 -804561 1492386 3352404 1693132 -896183 -683845 1033486 314071 -3042953 -5608739
10033 -5608739 -5581036 -4126805 -2208788 240970 2051888 1128134 -2218211 -4756292 -4163718
10024 -4163718 -1767768 -658782 -2084602 -4358009 -4945704 -3339467 -1621185 -1776218
10016 -1776218 -2998196 -2943385 -1246019 213591 510777 648739 881658 -64843 -1952489
10007 -1952489 -2100492 655352 3523126 3380345 858763 -1132858 -1073235 793167 3685644
9998 3685644 5922140 5353363 2246766 -166110 53808 902023 11989 -1689226 -2421812
9989 -2421812 -3018183 -4806813 -6291548 -5392682 -3197956 -2093112 -1857591 -1062645 -599063
9980 -599063 -1994659 -3720516 -3219520 -1400208 -969919 -1431506 -262865 1787068 1602439
9971 1602439 -347607 -272195 2193465 2918199 373674 -1526046 -149956 1177763 -1177066
9962 -1177066 -4705272 -4337300 -162531 2799329 1603483 -1633318 -3712891 -4130904 -4061603
9953 -4061603 -3864769 -3077709 -1993568 -1959773 -3857441 -6744034 -8577222 -8380071 -7038251
9944 -7038251 -5633698 -4001649 -1813774 19204 514126 316452 445944 124101 -1853554
9935 -1853554 -4035100 -3474895 -391441 1227325 -1029686 -4480943 -5084767 -2911351 -1578771
9926 -1578771 -3076802 -5438241 -5703965 -3525732 -1129028 -600302 -2020158 -4024325 -5463498
9917 -5463498 -6166183 -6461345 -6594399 -6617009 -6276878 -5009939 -2757165 -800430 -794780 -2736533
9907 -2736533 -4904504 -6006531 -6149006 -5553463 -4103938 -2707939 -3044832 -4922973 -5909334
9898 -5909334 -4840796 -3566731 -3708749 -4065965 -3203036 -2173594 -2247391 -2357566 -1618168
9889 -1618168 -1854146 -4251251 -6031188 -4516768 -2070214 -2246041 -3532828 -2932929 -3583441
9880 -3583441 -10772004 -20572144 -21602532 -10834362 739598 2851961 -994323 -1376842
9872 -1376842 2519553 4382382 2772358 2501557 4975092 5568214 1966352 -1695180 -1470876
9863 -1470876 884519 1861218 1492590 1632859 2075058 1589213 773316 932807 1386522
9854 1386522 422072 -1782816 -3265764 -2903371 -1307636 553465 2177369 3121702 3012069
9845 3012069 2041139 734367 -579550 -1408392 -748466 1725915 4266659 4210075 1098189
9836 1098189 -2263723 -2736335 -473358 1253095 -28991 -2991714 -4064684 -1724659
9828 -1724659 1684940 2840356 1343602 -356140 -632829 -574238 -1461627 -2057160 -428070
9819 -428070 2273121 2533999 -448610 -2950433 -1545660 2276380 4546391 4311979 3823090
9810 3823090 4096103 3754942 2531189 2412117 3962452 4505336 2002888 -1553890 -2882271
9801 -2882271 -1758530 -411476 -135926 -828402 -2452960 -4363174 -4315837 -1030310 2939689
9792 2939689 3753833 1391647 -546906 10255 1521030 2043833 1595479 671118 -784902
9783 -784902 -1880010 -795838 2246217 4129044 2584658 -748294 -2558258 -1976939 -973268
9774 -973268 -1329063 -2490986 -2410839 -145294 2454859 2397645 -411149 -2133816 148357
9765 148357 3815395 3843226 -95271 -3290908 -2998633 -1802680 -2721204 -4848541 -6107468
9756 -6107468 -6890987 -8022148 -7923526 -5234666 -2147518 -1583149 -2579287 -2094571 -279979
9747 -279979 -75998 -1943893 -2908304 -1387231 482189 540892 -182169 385826 1957764
9738 1957764 2386750 595124 -2249349 -4058012 -3800761 -2562535 -2568939 -4508390 -6273447
9729 -6273447 -5504382 -2873608 -1169937 -1333850 -1460003 -131370 1319677 974757 -727543
9720 -727543 -1536125 -128831 2608047 4512048 3865809 911579 -1931498 -2212060 -251648
9711 -251648 1125810 132303 -1847613 -2378747 -1036017 768313 1980075 2419082 1727440
9702 1727440 -420806 -2993833 -4066302 -3186559 -2136660 -2577852 -3796202 -3765598 -1999108
9693 -1999108 -237933 -191971 -1505388 -2526111 -2578535 -2639744 -3706451 -5239709 -5757710
9684 -5757710 -4581686 -2340294 25753 1831363 2158309 139690 -3308145 -5132135
9676 -5132135 -3307915 -78038 64647 -3802354 -7313034 -6311850 -2237144 190049
9668 190049 -662974 -2217973 -2468719 -2425944 -2966800 -2547996 -80415 2376058 2271505
9659 2271505 207988 -1546912 -2675105 -4109497 -4910547 -3247202 -205426 812321
9651 812321 -1008597 -2713575 -2243332 -1315460 -2132373 -3824742 -4242482 -3345694 -2574342
9642 -2574342 -2172426 -1325373 -123276 615890 993170 1738322 2566499 2418144 1253523
9633 1253523 206577 -159828 -579408 -1735272 -2959691 -2737588 -421369 2593247 3711344
9624 3711344 1830250 -974063 -1595379 135108 1133942 -659628 -3344510 -3691550 -1430424
9615 -1430424 759240 819362 -727163 -2065010 -1970582 -490326 1260321 2003743 1533150
9606 1533150 691606 -71011 -1053770 -1796230 -927220 1252608 1773733 -1421549 -6132533
9597 -6132533 -8346655 -7105230 -4602878 -2356484 -221447 1139381 220598 -2197190
9589 -2197190 -2955450 -866628 1437877 1535538 624499 901582 1708877 927602 -1225422
9580 -1225422 -2657974 -2940666 -3499221 -4319701 -3336145 40207 3134930 3198913 794163
9571 794163 -1510767 -2620176 -3380079 -4336117 -4970152 -5140345 -5518668 -6101246 -5713701
9562 -5713701 -3766868 -1350957 299794 1326648 2084373 1589409 -1037087 -4123310 -4641522
9553 -4641522 -2127013 604946 1378679 1347694 2473872 4034130 3659343 1001955 -1709449
9544 -1709449 -2641336 -2122724 -1232697 -160613 1361481 2928934 3480452 2209929 -612982
9535 -612982 -3470475 -4571157 -3557102 -1898285 -1029017 -769713 -520019 -1061241 -3337124
9526 -3337124 -5829790 -5524617 -2134368 783329 313678 -1841953 -1764775 1267733 3960235
9517 3960235 3548036 1113022 -481835 -470388 -481256 -1493042 -2184590 -938752 1598019
9508 1598019 3175106 2862887 2021551 2048956 2428153 1932743 805054 315194 528084
9499 528084 59413 -1690691 -3332240 -3112988 -936693 1777867 3657505 4379563 4589738
9490 4589738 5046038 5428324 4213043 709520 -2903559 -3172596 386359 4171927 4753161
9481 4753161 2901323 1801723 2324192 2270629 120190 -2696630 -3909340 -3123681 -1472915
9472 -1472915 200820 1606717 2135411 994027 -1708148 -4608084 -5994309 -5108278 -2902342
9463 -2902342 -1505754 -2328090 -4525952 -5961118 -5722759 -4733467 -3678015 -1849847 938464
9454 938464 2704206 1406554 -1850328 -3656576 -2430540 -21628 1204248 1229652 1447537
9445 1447537 2207761 2705211 2740482 3177479 4389703 5088539 3426725 -588614 -4200623
9436 -4200623 -4223377 -576381 3327209 4451030 3469537 2977751 3335427 2494290 -203170
9427 -203170 -2587397 -2786501 -1610853 -696789 -254100 -79299 -937555 -3041578 -4548528
9418 -4548528 -3601223 -989056 954937 1290052 758949 137569 -61513 736876 2063868
9409 2063868 2039484 -98070 -2305177 -2496609 -1507415 -1013817 -360487 1352615 1794842
9400 1794842 -1636614 -6233815 -6300465 -1384949 2724217 2414524 764930 1477440 2944773
9391 2944773 1805974 -1105164 -2360178 -1331937 -340331 -716492 -1785493 -2833435 -3550845
9382 -3550845 -3348390 -2304210 -1827811 -2613490 -3191531 -2212322 -600641 393639 1465008
9373 1465008 3413973 4885787 4414954 3050868 2388610 1659151 -475404 -2877203 -3636683
9364 -3636683 -3237395 -2942594 -1786811 1190083 3337240 1342580 -3156987 -5369632 -4280779
9355 -4280779 -3287474 -4086778 -4704556 -3989208 -3224648 -2418296 92192 3028410 2358374
9346 2358374 -1768338 -3456592 399790 4792172 3904576 -342969 -1985324 -119805
9338 -119805 1271706 823509 1279157 3638673 5026067 3491040 942687 -102584 409757
9329 409757 1550814 3192591 4840634 5031660 3580014 2643409 3871631 5794705 5635724
9320 5635724 2856612 -460041 -2167211 -1875367 -685152 -42024 -525623 -1134667 -301244
9311 -301244 1758602 2546518 267706 -3318378 -4626138 -2789429 -798186 -1519761 -4158842
9302 -4158842 -5870225 -5623218 -4645399 -3657240 -1901543 715147 2501897 2064885 164003
9293 164003 -1598030 -2794984 -3689401 -3795052 -2500786 -599910 262726 -486098 -1972627
9284 -1972627 -3029202 -2792384 -834341 2072256 3925516 3540068 2017045 870520 -337112
9275 -337112 -2592903 -4574687 -3839373 -755606 1414604 818581 -1016981 -2134461 -2571883
9266 -2571883 -2782261 -2010750 121602 2198702 2828507 2508567 2252909 1778922 636122
9257 636122 -188718 349304 1299115 914628 -649803 -1622236 -1338384 -1025917 -1745045 -2897845
9247 -2897845 -3214207 -2382032 -1241012 -698484 -737682 -580902 116911 632481 278094 -343740
9237 -343740 -297772 -189863 -1397008 -3263804 -3132908 -189181 2573114 1930234 -1221248
9228 -1221248 -3048597 -1824669 114503 -292378 -2966417 -4977826 -4137116 -1426598 464420
9219 464420 493270 56030 244365 -18021 -1725433 -3248943 -2546482 -1002839 -1813724
9210 -1813724 -4589857 -5322191 -2763342 -949224 -3039041 -6071666 -5282649 -1214611 1453326
9201 1453326 826198 -569803 -766249 -981880 -2420965 -3691384 -3074223 -1341573 -693765
9192 -693765 -1959162 -3937762 -4871620 -3985943 -2101074 -899028 -1081316 -1517814 -971491
9183 -971491 -88622 -387913 -1704121 -2325728 -1666559 -995084 -1066557 -835611 411403 1096748
9173 1096748 -762601 -4203215 -5637477 -3141679 736575 1763428 -664928 -2622254
9165 -2622254 -815017 2936941 4255521 2297820 572561 1488005 3041574 2357733 62802
9156 62802 -1063199 -176579 1197627 1781069 1405259 11971 -2068322 -3299199 -2413797
9147 -2413797 -473147 331998 -292900 -631533 302149 1547658 1681344 199224 -2288268
9138 -2288268 -4030305 -3053784 295426 2598250 1189946 -2016989 -2967837 -1153382 90705
9129 90705 -1023725 -2350360 -1787247 -584862 -831499 -1932836 -1861251 -498733 526686
9120 526686 715317 1417350 3581603 6122543 7018247 5546624 3120245 1853342 2297109
9111 2297109 2946686 2281293 657714 -558557 -1031733 -1384803 -1598464 -1110963 -473963
9102 -473963 -1200733 -3479546 -5407192 -5202941 -3303882 -1754604 -2132903 -4222481 -6097091
9093 -6097091 -5668990 -2995611 -760822 -1389969 -3988403 -5411240 -4103937 -1447236 486276
9084 486276 850401 -269610 -2290419 -3958593 -4252251 -3695231 -3422102 -3117621 -1748663
9075 -1748663 -247156 -1008566 -4101154 -6376732 -5544822 -3094159 -1708615 -1516343 -680130
9066 -680130 1422270 3376970 3669987 2286644 602574 199078 1332808 2422525 1821311
9057 1821311 34831 -995273 -692598 -275449 -312804 63491 917865 679449 -1251517
9048 -1251517 -2913597 -2282672 0 1752328 1961982 1158888 88445 -896349 -1882239
9039 -1882239 -3409101 -5455707 -6336282 -4398044 -1128695 -206006 -2572473 -5002485 -4929882
9030 -4929882 -3985963 -4675294 -6102308 -5822239 -4021127 -2728909 -2118642 -721936 1298997
9021 1298997 1966602 417648 -2226184 -4593243 -5684210 -4454469 -1039995 2189302
9013 2189302 3094213 2654748 3016624 3543784 1908257 -1348768 -2944883 -1912149 -939377
9004 -939377 -1575310 -1542940 1178258 4405089 4530602 1558371 -1181104 -1467877 -194704
8995 -194704 664962 301260 -755157 -1510772 -1430373 -1056550 -1507162 -2978011 -4259168
8986 -4259168 -4172491 -2849759 -1119726 545772 1778087 1880098 737469 -366091 -67298
8977 -67298 1041738 819459 -1696601 -4771100 -5636543 -3237721 987310 4542648 5567194
8968 5567194 3626625 -17311 -2671528 -1928973 1771007 4823902 3983982 140258 -2701253
8959 -2701253 -2351621 -866061 -1377759 -3946197 -5853072 -5172869 -2634378 -250933 692903
8950 692903 271255 -608474 -1154822 -1359004 -1579716 -1601125 -945340 -204478 -743612 -2494516
8940 -2494516 -3466618 -2483717 -1083768 -1334172 -2880048 -3727261 -3061024 -1638301 -109885
8931 -109885 1310542 1992820 1371265 -12234 -1295447 -2584812 -4075256 -4682623 -3314262
8922 -3314262 -874967 828936 1591834 2301011 2633507 1583530 -104117 -473966 734091
8913 734091 1969523 2467989 2541896 1533997 -1610484 -5539046 -7273998 -6365403 -5321137
8904 -5321137 -5233793 -4226567 -1413900 941427 1066833 463883 867800 1173836 -56062
8895 -56062 -1459115 -1193243 -494928 -1737127 -4109021 -4304888 -1072012 3379626 6216103
8886 6216103 6312006 4243954 1724427 575833 908625 1106728 623261 1083300 3073930
8877 3073930 4083157 2157838 -426823 -363743 1464399 1671344 69295 -558641 124149
8868 124149 -532728 -2778001 -3115806 102619 3707404 4366082 2800780 1127836 -770955
8859 -770955 -3400767 -4877645 -3321330 -309226 1163374 944659 1018738 1537548 710347
8850 710347 -1590662 -3003438 -1884772 767365 2973389 3606450 2361125 -321938 -2820127
8841 -2820127 -3294989 -1685594 249228 1088352 951214 546528 221310 85068 -40030
8832 -40030 -827399 -2403144 -3184118 -1372723 2114605 3980342 2599254 163110 -392996
8823 -392996 694628 744088 -1446845 -4093233 -4904918 -3802036 -2596446 -2543734 -2862601
8814 -2862601 -1924156 240650 1333903 -552438 -4072942 -5713310 -3933849 -899255
8806 -899255 496036 -40433 -844434 -991951 -808448 -462034 236005 865219 724284 39222
8796 39222 -507845 -1281928 -3106788 -5100961 -4972765 -2173842 846441 1581757 416692
8787 416692 -520278 -388588 -69046 -140506 35668 1045278 2224073 2195464 428100 -1816733
8777 -1816733 -2342526 -405481 1941210 2000766 1327 -1098356 12764 798817 -1355145
8768 -1355145 -4919065 -6227018 -4724249 -3334722 -3749389 -4334264 -3450703 -2108659 -1824366
8759 -1824366 -1993472 -1273987 -40283 515033 627036 1280043 1987244 1321646 -556069
8750 -556069 -1833190 -1663466 -1140851 -1245760 -1347397 -499500 877365 1427579 327224
8741 327224 -2159194 -4896980 -6275952 -5249836 -2588221 -366057 399502 813469 2067635
8732 2067635 3299891 2821859 928295 -223894 339564 1150917 759837 -52115 207378
8723 207378 1060431 654841 -1211662 -2387041 -1150724 1532503 3223640 2651717 581886
8714 581886 -1185877 -1096215 1101955 3815183 4744453 3311936 1357296 707809 903099
8705 903099 431769 -609712 -742366 346041 1263855 1091275 432051 -164587 -1259480
8696 -1259480 -3207196 -5079757 -5845820 -5633272 -4993233 -3916578 -2489587 -1518602 -1394019
8687 -1394019 -1167823 67060 1587831 2026903 1297279 295177 -635495 -1462449 -1301418
8678 -1301418 609111 2885396 2939968 376931 -2302165 -3059743 -2724535 -3005936 -3628667
8669 -3628667 -3041560 -1117573 583656 1090889 1120310 1641422 2406765 2429354 1357594
8660 1357594 -87865 -833733 -367194 965191 2411836 3442661 3783816 3060129 1101240
8651 1101240 -1134263 -1735031 219116 3238941 4865716 4460785 3662916 3960312 4791863
8642 4791863 4581196 2932633 1063903 357781 1030728 2054228 2029605 393155 -1926538
8633 -1926538 -3369905 -3526528 -3515920 -4198698 -4802068 -4163491 -2620586 -1440821 -848551
8624 -848551 -93732 738668 713833 -5293 -40227 823730 1008255 -195404 -1213076 -759433
8614 -759433 -9516 -455865 -1276724 -1005559 -293941 -325309 253311 3425547 7370892 7722171
8604 7722171 3691761 -693349 -2467260 -3133465 -4471084 -4692093 -1798105 2079583 3355890
8595 3355890 2267239 1879374 2979951 3649271 3395148 3912892 5359982 5341495 2702798
8586 2702798 -422914 -1613460 -963537 223829 1323162 1631790 -78336 -3390376 -5318964
8577 -5318964 -3696997 -442376 614231 -1434301 -3830559 -3973087 -2093707 72817
8569 72817 1552763 2232270 1844518 127469 -2132938 -3165753 -1911863 536514 1831390
8560 1831390 963763 -614015 -982991 -189188 372952 457907 1110117 2149286 1532512
8551 1532512 -1612112 -4880918 -5279545 -3150071 -1514785 -1804165 -2238077 -876276 1482120
8542 1482120 2513000 1345528 -936455 -3120003 -4762688 -5352820 -4082519 -1236589
8534 -1236589 1159866 1323739 123258 272931 2770199 5191534 4396567 323735 -3925006
8525 -3925006 -5548294 -4536645 -2641192 -1032739 278514 1380818 1882431 1510270 646956
8516 646956 -80740 -445116 -492477 -53427 908947 1395019 -123817 -3439707 -5740430
8507 -5740430 -4571254 -1331325 121932 -1432015 -3143330 -2677077 -1734015 -2947576 -5335623
8498 -5335623 -5821415 -4155219 -3002361 -3380397 -3381733 -2016899 -1129636 -2100529 -3311431
8489 -3311431 -2804254 -1513685 -1763244 -3746675 -5381184 -5004318 -2838779 -315505 1035646
8480 1035646 541152 -1058886 -2493638 -3487013 -4390107 -4574081 -3158132 -1389912 -1605254
8471 -1605254 -3104572 -2242817 1755374 4419313 2182201 -2060414 -3139270 -1056029
8463 -1056029 -2382 -1398393 -2566920 -1984991 -1312990 -1659089 -1902568 -1733586 -2639515
8454 -2639515 -4513910 -4681428 -1975548 1154061 2288847 2059114 1827663 1110920 -675497
8445 -675497 -2357671 -2969655 -3323696 -3694401 -2510400 352384 1771483 -80786 -2002192
8436 -2002192 -399502 2459258 1515872 -2867657 -5009107 -2553556 123899 -1004533
8428 -1004533 -3521546 -2617189 1706036 4994197 4495075 1816454 -179702 -607277 -342832
8419 -342832 -297242 -594150 -774925 -484899 -84696 -257935 -802156 -511001 1166526 2994711
8409 2994711 3276552 1927028 471925 218994 1110904 2253237 2927641 3002310 2740700
8400 2740700 2348793 1669471 463919 -985309 -1886373 -1725524 -800436 133947 526059
8391 526059 370132 191689 515124 905174 -48482 -2859373 -5548591 -5358101 -2307870
8382 -2307870 468056 580102 -969623 -2011718 -2366259 -2914471 -2830584 -439933 3325631
8373 3325631 5033748 3201599 578452 632380 3192220 5096236 4272029 1681327 -299963
8364 -299963 -88949 2220778 4837107 5141018 1896448 -2974281 -5735736 -4481899 -868023
8355 -868023 2093345 3207594 3444026 3741961 3648390 2451169 856173 562120 2020404
8346 2020404 3403067 2588460 -92219 -2122136 -2036958 -1267040 -1938636 -3810750 -4782869
8337 -4782869 -3966248 -2575046 -1676094 -800301 506670 1308007 695021 -464646 -610881
8328 -610881 277453 897550 732739 649181 1526895 3459311 6125815 8656663 9278230
8319 9278230 6769527 2620031 84205 361673 1274268 732895 -183799 617420 2313460
8310 2313460 1932758 -1136558 -3963059 -4209702 -3335537 -4091679 -6239752 -6883338 -4731110
8301 -4731110 -2034986 -1698044 -3801377 -5931731 -6200074 -4980673 -3969207 -4287901 -5416851
8292 -5416851 -5514269 -3127116 798169 3113845 1758862 -1445833 -2744400 -1238407 108652
8283 108652 -1083925 -3282904 -3789362 -2922674 -2846460 -3417004 -2564262 -674591 -889846
8274 -889846 -3922870 -6076812 -4631316 -2187184 -2490072 -4239692 -3201063 515193 1898508
8265 1898508 -1525639 -5807090 -6120259 -3114908 -1045390 -1622734 -2814050 -2906493 -2748976
8256 -2748976 -3551127 -4643023 -4454704 -2601903 -131527 1747798 2542408 2320986 1211722
8247 1211722 -668280 -2744810 -3833214 -3117320 -1313099 -77121 12197 32722 830788
8238 830788 1564296 1025498 -410088 -1360861 -1472519 -1578129 -2030924 -2232135 -1999727 -2177224
8228 -2177224 -3306837 -4482287 -4154127 -1772944 1639096 4292536 4951349 3798026 2060632
8219 2060632 675946 -343882 -1017086 -715013 738084 2003195 1623669 150589 -631780
8210 -631780 -479139 -910954 -2373997 -3105257 -1717125 739316 2439724 2992660 2598039
8201 2598039 564638 -3242146 -6436700 -6055191 -2428307 918081 1461290 -9713 -1527102
8192 -1527102 -2355952 -2462309 -1467359 377529 1373551 170193 -2162450 -3260784 -2462304
8183 -2462304 -1481116 -2059515 -3943155 -5485763 -5628998 -4904524 -4665212 -5485034 -6418959
8174 -6418959 -6090997 -4403142 -2535417 -1199264 86859 1475800 1762992 104757 -2109453
8165 -2109453 -2774928 -2073684 -2048925 -3075967 -2925598 -305342 2605772 2890927 876386
8156 876386 -692540 -747201 -789733 -1646989 -1842305 -285540 1451764 1347798 114803
8147 114803 63594 1439516 2215522 1568786 1078977 1546299 1003928 -2090310 -5358951
8138 -5358951 -5000987 -1235016 1738239 1657680 1068962 2703112 4709188 3416045 -642634
8129 -642634 -2955036 -1191987 2098373 3689781 3491941 2615546 532875 -3099942 -5732283
8120 -5732283 -4389109 -162826 2854346 2942301 1994698 1276843 -466745 -3452582 -4932019
8111 -4932019 -3257666 -1149526 -1878875 -4219128 -4631488 -3037987 -2431202 -3276092 -2670794
8102 -2670794 209006 2020346 460957 -1949487 -1870170 -140974 246771 -889039 -1385362
8093 -1385362 -957278 -1502117 -3494375 -5162552 -5488634 -5427220 -5764022 -6064296 -6097009 -6040514
8083 -6040514 -4963463 -1666664 2300008 3264016 453255 -2181918 -1146144 1740865
8075 1740865 2091816 -1006992 -4435234 -5651905 -5054274 -3854894 -2301882 -739415 -352002
8066 -352002 -1605068 -3117370 -3180074 -1755253 -185183 545086 446240 -263237 -1598968
8057 -1598968 -3097229 -3370044 -1436753 1378703 2112148 -271796 -2895522 -2159114 1572226
8048 1572226 4464916 4283638 2501789 924968 -787495 -2716220 -2803872 -106864 2316569
8039 2316569 1065034 -2536882 -4479694 -4077249 -4059009 -5196628 -5224866 -3636354 -3168605
8030 -3168605 -4977694 -6283415 -5009980 -3201166 -3014763 -2496544 1055746 5809705 7497790
8021 7497790 5590886 3499020 3068860 2624349 830769 -877920 -878945 127856 507921
8012 507921 -107358 -1054927 -1757315 -1830421 -1207719 -681236 -1218294 -2414416 -2835459 -2154346
8002 -2154346 -1585643 -1895442 -2500582 -3005436 -3968591 -5333835 -5682925 -4205281 -2183174
7993 -2183174 -1342597 -1732981 -2322501 -2675642 -2865828 -2698594 -2315837 -2650124 -3813925
7984 -3813925 -3907561 -1261256 2623935 4354395 2811070 133748 -1606758 -2598803 -3456911
7975 -3456911 -3386622 -1794929 -207989 -527430 -2114485 -2694033 -1982148 -2241020 -4603862
7966 -4603862 -6741682 -5618636 -1565324 1918394 2119131 -386765 -3147678 -4539204
7958 -4539204 -4625854 -4217656 -3856488 -3553945 -3099982 -2611087 -2753832 -4071415 -5938027
7949 -5938027 -6618742 -4852664 -1349908 1579433 2025688 166945 -1940751 -2303004 -893765
7940 -893765 406769 -41315 -1728738 -2699960 -2144621 -1580939 -2962319 -6031388 -8347097
7931 -8347097 -8088848 -6205253 -5168827 -5792986 -6204731 -4529564 -1800872 -827868 -2241339
7922 -2241339 -3427862 -2299075 -507467 -1100250 -3923466 -5685246 -4557649 -2442786
7914 -2442786 -1954764 -3026559 -3648166 -2628563 -442394 1723332 2755328 2226396 1032747
7905 1032747 664968 1271780 1453756 534330 -320420 -102933 397500 170517 -221619 72324
7895 72324 405180 -129189 -767040 -298903 652085 573107 -382617 -781854 -342758 -71378
7885 -71378 -506200 -1700605 -4143483 -7419824 -8795758 -6024854 -1188359 1371868 928081
7876 928081 835462 2778000 4267474 3107995 820054 -283066 -373013 -365010 195391 1103111
7866 1103111 167672 -3166586 -5383759 -3481800 56262 661407 -1517410 -2442440 -985488
7857 -985488 -286601 -1995646 -3560976 -2694246 -921576 -691965 -1723468 -2366533 -2472637
7848 -2472637 -2741723 -2772979 -1830541 -530855 -52296 -413492 -833096 -979521 -774954 21864
7838 21864 929506 647798 -858666 -1510395 9434 1831566 1455487 -339244 -712627
7829 -712627 682918 1332792 242837 -345335 1270125 3385042 3534050 1999504 702544
7820 702544 124406 -516248 -1117469 -1011559 -816508 -1740887 -3259829 -3539725 -2155527
7811 -2155527 -484359 553956 1137626 985443 -447931 -1946836 -1398133 544267 547713
7802 547713 -2238629 -4111575 -2203182 782429 424663 -2822520 -4674243 -3531268 -1886604
7793 -1886604 -1379078 -540086 1584265 3134888 2471074 814035 42676 -36959 -417678
7784 -417678 -632780 345009 2119154 3363621 3448056 2489537 828796 -569189 -401192
7775 -401192 1207235 2357139 1791551 442633 -369305 -793617 -1272897 -1024171 670328
7766 670328 2763212 3595738 2882863 1332275 -548711 -1979072 -1691867 139921 1209908
7757 1209908 264509 -495604 1359285 4205249 4462954 2314340 1692820 4118254 6067980
7748 6067980 4131958 76274 -1608568 321825 2818051 3031228 1696022 1424323 2968171
7739 2968171 4459544 4275805 3466466 4250554 6444865 6958766 3589427 -1840471 -5322018
7730 -5322018 -4972367 -2355901 -33458 871372 807895 768973 1434437 2647972 3543921
7721 3543921 3477118 2643960 1578322 578939 -414 373009 1600210 2571203 2208152
7712 2208152 547355 -1400327 -2323766 -1356202 781044 1711083 109122 -1908214 -1480472
7703 -1480472 180158 -848500 -4471536 -5597577 -1932666 1735531 602629 -2743855
7695 -2743855 -2719575 498872 2200791 1219625 749318 1737201 1463268 -787164 -2148682
7686 -2148682 -1473030 -1233506 -2553631 -2924133 -878061 1134575 751391 -943610 -2129103
7677 -2129103 -2990744 -3715231 -2958317 -514191 1338612 1188316 519186 725061 1031616
7668 1031616 1018491 1916310 3506969 3242444 699430 -702040 918694 2447953 834383
7659 834383 -1970587 -2802691 -2648059 -3902840 -5143422 -3529582 -443906 279716 -1391323
7650 -1391323 -2005475 -638348 -16839 -1556471 -3345433 -3602855 -2801672 -1839921 -928870
7641 -928870 -638351 -1571720 -2879614 -3233426 -2917841 -2852190 -2472102 -1164807 -670905 -2842527
7631 -2842527 -5867391 -6286366 -4264418 -3074829 -3494487 -2801359 64640 2331216 1783871
7622 1783871 57783 -169517 1174477 2270177 1977938 653962 -165475 1381432 5222886
7613 5222886 8111653 6912675 3012115 822076 1876453 3356928 2752127 708615
7605 708615 -1547125 -4270660 -7159861 -8131328 -6118555 -3107445 -1697769 -2140190 -2987672
7596 -2987672 -3247767 -2950990 -2815559 -3719805 -5198228 -4885184 -1609662 1557410 505746
7587 505746 -3748882 -5847787 -3661213 -1013412 -1341291 -2686659 -1588697 1324977 2749210
7578 2749210 1490617 -949708 -2980815 -3881251 -3610480 -3343994 -4528503 -6162859 -5378622
7569 -5378622 -2125087 -272539 -1980765 -4192893 -3591909 -1902668 -2499937 -4345396 -3860395
7560 -3860395 -1316388 -593756 -2901297 -5053058 -4473080 -2285625 -566471 441921 1217077
7551 1217077 1390274 544587 -842280 -2006749 -2537917 -2368807 -2036674 -2463999 -3398876
7542 -3398876 -3013601 -577912 1598936 984529 -1354598 -2211030 -896383 310726 240180
7533 240180 446222 2107888 3793422 3486376 1205659 -1389733 -2863198 -2800637 -1706878
7524 -1706878 -618368 -215548 -240155 -251435 -442352 -939884 -1078157 -467083 27767 -381602
7514 -381602 -1001908 -984944 -987600 -1797263 -2378554 -1321843 673747 1886776 2200174 2331841
7504 2331841 1503681 -1265831 -4275034 -4718357 -2887468 -1638153 -1737280 -1075139 1194501
7495 1194501 3132469 3369026 2835954 2324040 1382188 469907 956854 2018977 1082356
7486 1082356 -1333309 -1126915 2956342 6299225 4737073 450568 -1947504 -2113927 -2541719
7477 -2541719 -2869295 -682100 2987411 3995738 1348442 -1101391 -366336 1673804 1546381
7468 1546381 -1130493 -3960659 -5006789 -4192362 -2624139 -1674649 -1970296 -2627605 -2247306
7459 -2247306 -968286 -496722 -1714494 -3400487 -3954899 -3396410 -2811770 -2520882 -1787551
7450 -1787551 -218903 1344936 1707922 824558 -74677 -51126 396700 360694 88508 279019
7440 279019 171331 -1765477 -4900456 -6348558 -4920942 -3180165 -3889667 -6127846 -7007903
7431 -7007903 -5871831 -4395860 -3551263 -3027027 -3008919 -3874426 -4460594 -3281945 -1279019
7422 -1279019 -617872 -919503 109377 2072184 1686677 -1603153 -3622676 -1384032 2216344
7413 2216344 2621254 -32590 -2271176 -3042756 -4032265 -5156662 -4178410 -1298273 -136492
7404 -136492 -2516851 -5334489 -4754600 -1349984 1229370 1178593 -245730 -1470589 -2089709
7395 -2089709 -1888844 -808021 -258185 -2258184 -6220194 -8408048 -6181849 -1586952 1045986
7386 1045986 258217 -1764788 -2983923 -3386924 -2763752 298931 5383399 8672491 7209515
7377 7209515 3253890 1289367 1551718 157651 -4229831 -7829110 -7318041 -4541135 -3164363
7368 -3164363 -3240466 -2191333 423268 2397279 2530237 1911380 1631072 1642316 1988279
7359 1988279 2896413 3309438 1398361 -2746756 -6411165 -6840623 -3640999 1241930 4755309
7350 4755309 4492371 1010259 -1896768 -1170484 1565935 2223425 -21829 -2178428 -2685390
7341 -2685390 -3548526 -6013013 -7694327 -6364712 -3759414 -2812152 -3265408 -2994697 -2015059
7332 -2015059 -1998760 -2859839 -2922633 -1971906 -1322975 -1149266 -381446 868343 1331295 1064827
7322 1064827 1471719 2660451 3131506 2407631 1730000 1740018 1673119 1334010 1608745 2297687
7312 2297687 1682990 -672498 -2658504 -2431905 -960524 -535164 -1953806 -4179339 -5714068
7303 -5714068 -5558005 -3905678 -2442574 -2693071 -3668701 -2774961 355220 2799366 2121934
7294 2121934 -528065 -2327008 -2180077 -821870 965630 2512390 2754222 1390105 -48691
7285 -48691 153611 1478226 1626275 -717477 -4349063 -6644775 -5890807 -2884564 -184934
7276 -184934 811394 1417961 2954214 3520374 284888 -5197610 -7614128 -4946354 -1269840
7267 -1269840 -514542 -1036172 478904 2823312 2258670 -1056007 -3094353 -2008620 -301109
7258 -301109 -696124 -2954300 -5269276 -6358759 -5760419 -3975970 -2376616 -1444756 164872
7249 164872 3058162 4997949 3933984 1704438 1447597 2561080 2172991 746140 1478261
7240 1478261 4093269 4359812 981599 -1958113 -1494418 -139313 -878310 -1925763 -316310
7231 -316310 2258723 1525846 -2897759 -6832499 -6854841 -3575811 37119 1527518 468561
7222 468561 -1368117 -1738383 -538796 363133 231534 266561 595381 -602304 -3321518
7213 -3321518 -4213670 -1425932 1843290 1794540 -420643 -1237629 -647698 -1369788 -3451148
7204 -3451148 -4288742 -3546697 -3567140 -4698616 -4493465 -2313269 -766250 -1343193 -2191160
7195 -2191160 -1728847 -1234133 -2046721 -3020416 -2704301 -1690528 -937351 62113 1573045
7186 1573045 2147258 874505 -675705 -787091 -282551 -843801 -2123774 -2698635 -2604388
7177 -2604388 -2599733 -1967034 345708 2904943 2753597 -599863 -4275825 -5544706 -4567416
7168 -4567416 -3211929 -2706942 -3089728 -3708089 -3530591 -1850670 670290 2285339 1953883
7159 1953883 363425 -1094196 -1776652 -1898500 -1761378 -1438475 -1082108 -1141971 -2031897
7150 -2031897 -3445534 -4197005 -3338554 -1590185 -878542 -1972145 -3458366 -3898213 -3954301
7141 -3954301 -4841892 -5462430 -3472731 544687 2523008 -57527 -4462892 -5981767 -3632169
7132 -3632169 -341290 1722407 3119422 4246861 3540467 267598 -2966227 -2887051 110607
7123 110607 2444109 1935187 -15761 -1076999 -1033639 -1348273 -2802938 -4567420 -5217320
7114 -5217320 -4154903 -2232665 -1022923 -1071447 -1087919 375973 2688213 3740818 2822999
7105 2822999 1511145 1283284 1643070 1401538 606962 164337 422127 1110347 1940169
7096 1940169 2435321 1994041 944971 601715 1378518 1956401 1388358 728686 1094619
7087 1094619 1436844 250389 -1535883 -1785807 -669093 -332537 -1208497 -1410780 -225008
7078 -225008 516332 -473912 -1910216 -2385046 -2745835 -4291060 -6210753 -6722552 -5702992
7069 -5702992 -4449604 -3574936 -2754722 -2092794 -2241250 -3237241 -4196168 -4084753 -2366782
7060 -2366782 512161 2814002 2686837 493362 -1041470 -80683 1869677 2048307 173149
7051 173149 -1486363 -1393558 -510412 -595206 -1863973 -2803908 -1926951 464085 2429536
7042 2429536 2752520 2664030 3861241 5177779 3723953 -73914 -1699506 1226361 4879050
7033 4879050 4480927 1218451 -103439 1324391 1898944 350204 -358527 1115210 1704634
7024 1704634 -773499 -3719059 -4027586 -2854302 -2882345 -3637982 -3028121 -1400515 -538971
7015 -538971 -276594 431372 535028 -1363043 -3475991 -2955373 -816856 -676527 -2824002
7006 -2824002 -3803010 -2259952 -885949 -1412067 -1795674 -232404 1663736 1948126 1489819
6997 1489819 1605701 1368541 -64720 -942668 347328 2124611 2004766 875864 1183664
6988 1183664 2715561 3285067 2460156 1449494 343909 -1220189 -1686181 355203 2416440
6979 2416440 709563 -3506062 -4747941 -1384950 1698068 408517 -2818431 -3415844
6971 -3415844 -1277190 537053 1038061 1394021 1430242 -63292 -2186173 -2596218 -1349943
6962 -1349943 -1106392 -3071049 -5181610 -5016680 -2681912 -201079 583543 -800398 -3098177
6953 -3098177 -4043047 -2650492 -727766 -778535 -2609901 -3648607 -2610206 -1030997 -784033
6944 -784033 -1824183 -3133922 -4418711 -5830972 -6974477 -7170066 -6285156 -4793087 -3346168
6935 -3346168 -2406363 -1866867 -1187856 -439377 -697549 -2481542 -4435996 -4921852 -4322678
6926 -4322678 -4031011 -3690781 -1806492 973512 1962205 520637 -663951 373057 2103569
6917 2103569 2461474 2113400 2527390 2894410 1750509 148212 234402 1639051 2224937
6908 2224937 1722951 1531579 1355309 -473277 -3130812 -3424135 -815353 1092278 -203247
6899 -203247 -2454154 -2541876 -1324900 -1668353 -3534501 -4302047 -2976127 -981636 750838
6890 750838 2516525 3757936 3193794 1408146 571997 903834 118930 -2488207 -4108938
6881 -4108938 -2385643 894675 2315833 1396532 194991 -427893 -1359177 -2517091 -2401352
6872 -2401352 -744115 691113 687383 83220 -116275 -446669 -1721322 -3399490 -4388920
6863 -4388920 -4476861 -3891902 -2413247 -179340 1375643 883248 -911904 -1804428 -904334
6854 -904334 358043 283156 -982011 -1918677 -1633018 -718305 -290004 -728869 -1559345 -2205990
6844 -2205990 -2442106 -2193722 -1469295 -646370 -220189 25950 788557 1641139 832331 -2034924
6834 -2034924 -4224139 -2890278 606661 2020168 101224 -1678904 -377972 2265086
6826 2265086 2920570 1497124 153537 -753997 -2464220 -4392417 -4335320 -2275079 -1023291
6817 -1023291 -2301813 -4504239 -5215822 -4014375 -1968489 -195702 208723 -1402128 -3755678
6808 -3755678 -4116390 -1406926 2280776 4263529 4162757 3232422 2078444 473693 -1288521
6799 -1288521 -2225783 -1744924 -269123 972471 701987 -1046789 -2218651 -606996 3188882
6790 3188882 6005235 5846004 3957151 2575585 2340597 2944102 4467237 6416565 6965385
6781 6965385 5148850 2776180 2228780 3199866 3521884 2426665 922452 -397021 -1637183
6772 -1637183 -2076966 -747637 1449774 2430340 1828256 1003405 145448 -1860508 -4123104
6763 -4123104 -3474478 768576 4451713 3527674 -412503 -2326955 -448220 2037822 1878263
6754 1878263 -353015 -1952600 -1708837 -714457 -662745 -2244427 -4646593 -6128942 -5566766
6745 -5566766 -3636502 -1977267 -1279757 -1042062 -1058251 -1765857 -2772195 -2591641 -885797
6736 -885797 253582 -1278396 -4554036 -6454117 -5290434 -2288159 360139 1571316
6728 1571316 1568755 1451945 2680079 5446121 7325714 5400257 431586 -3091530 -2419050
6719 -2419050 -129569 -242058 -2420329 -2985771 -931232 560960 -765757 -2749378 -2225669
6710 -2225669 190412 1042615 -1155798 -4090121 -4612163 -2244777 565788 1141359 -672705
6701 -672705 -2511289 -2474482 -1573085 -2144116 -4263021 -5576972 -4893911 -3693960 -3124264
6692 -3124264 -1890639 894268 2749576 625892 -4136764 -6608637 -4257710 243122
6684 243122 2791311 2407292 1065906 614005 1227637 2157900 2781807 2897175 2486158
6675 2486158 1453469 -57755 -983928 162465 3279260 5893514 5655563 3196393 1176573
6666 1176573 869732 1270778 1377032 1431143 1630574 1538860 1483937 2770390 5461222 7428650
6656 7428650 6803570 4181052 1294789 -1193853 -3171169 -3590763 -1554848 1564714 3006786
6647 3006786 1766737 -581551 -2329411 -3398036 -4208405 -4251815 -2893537 -852572 281932
6638 281932 -103030 -1088922 -1564917 -1432529 -1216497 -1088286 -894946 -871471 -1490413 -2452331
6628 -2452331 -2662873 -1766937 -999699 -1601424 -2830380 -2753043 -1005113 501464 102178
6619 102178 -1438141 -2060230 -1034431 456821 1031925 537411 -271663 -839272 -1273177
6610 -1273177 -1850626 -2295562 -1821644 -88296 2133566 3643228 3963102 3383768 2268143
6601 2268143 1111740 860460 1812620 2274954 87793 -3908813 -5779726 -3234420 1004390
6592 1004390 2438054 424955 -1631530 -1339389 -84688 -213465 -1658616 -2724697 -2815265
6583 -2815265 -2781531 -3166179 -3449405 -2924526 -1446807 594573 2405720 3052670 2210877
6574 2210877 585624 -808274 -1583609 -1906884 -1978310 -2092052 -2656203 -3450195 -3461451 -2391820
6564 -2391820 -1644433 -2408662 -3294211 -1873151 1372954 3011108 1426703 -732474 -564582
6555 -564582 786457 396251 -1460544 -1948401 -721503 -614831 -2635043 -3795377 -1691349
6546 -1691349 1646439 2850435 1971306 1362199 1337612 83495 -2639045 -4657484 -4538549
6537 -4538549 -3297758 -2537349 -2750317 -3817298 -5340435 -5996754 -4354058 -1074814 1228139
6528 1228139 1135403 42273 -210182 16496 -940583 -3381202 -5702038 -6228617 -4809605
6519 -4809605 -2673206 -1048016 53751 1431979 2885830 2718675 108307 -2899320
6511 -2899320 -3519837 -1906355 -657890 -841324 -920737 76384 1005389 1095375 1346597 2082589
6501 2082589 1699879 -264033 -1255702 628152 3059695 2375808 -1324520 -4749075 -5934438
6492 -5934438 -5354465 -3562976 -1020738 237544 -1726980 -5218355 -6330105 -4465203
6484 -4465203 -3175297 -4514200 -5903109 -4456668 -1533215 -415418 -1441870 -2173124
6476 -2173124 -1277680 251962 1218469 1416408 927107 2763 -411661 423186 1586195
6467 1586195 1269195 -904365 -3499609 -5273890 -6342140 -7049387 -6859774 -5142025 -2468826
6458 -2468826 -349520 320434 169679 558644 1930816 3167069 2841489 964962 -1059156
6449 -1059156 -2227003 -2899216 -3629936 -3910779 -2954940 -1217209 -50301 72471 -44816
6440 -44816 77601 -364231 -2029977 -3671374 -3027194 247688 3523068 3962042 1936847
6431 1936847 529309 1499474 3031824 2309876 -681576 -3264290 -3519461 -2173569 -975307
6422 -975307 -518400 -161288 778116 2246340 3404761 3310102 2182556 1632399 2622592
6413 2622592 3645683 2497504 -296931 -1830356 -906759 432372 341841 -181682 380009
6404 380009 1234960 919181 78821 105107 247049 -1098873 -2973952 -2784157 -556207
6395 -556207 703691 -634152 -2843554 -4004281 -4518867 -5235356 -5391626 -4077615 -1996655
6386 -1996655 -226962 1234663 2276569 1725269 -606026 -2406066 -1519013 894616 1891418
6377 1891418 640505 -1218875 -2366640 -2752355 -2283870 -942474 -41979 -983780 -2660880
6368 -2660880 -2543081 -671477 107056 -1264711 -2023876 185400 3491874 4534243 3233138
6359 3233138 2138316 2102874 1497879 -512264 -2572782 -3349393 -2915927 -1469616 1172963
6350 1172963 4000974 4814401 3080135 1067100 649091 548359 -1306770 -3931168 -4319641
6341 -4319641 -1943983 427096 876911 843965 2179688 3750214 3147849 768702 -307652
6332 -307652 1311819 3172078 2190000 -1290537 -3992820 -3677160 -1371424 282102 -154080
6323 -154080 -2015612 -3626855 -3726584 -2242295 -239088 975505 1038751 769004 1014723
6314 1014723 1500370 1208314 -248978 -2144998 -3493562 -3830435 -3116670 -1639254 -371038
6305 -371038 -625008 -2557415 -4526420 -4859108 -3886377 -3133125 -2795231 -1599567 594446
6296 594446 1868390 933206 -800266 -1356371 -1149006 -1803661 -2893556 -2429376 -585075
6287 -585075 -212414 -2725906 -5801611 -6587075 -5258446 -3713188 -2525796 -1338223 -776363
6278 -776363 -1342562 -1352248 1096303 4453441 5092259 2570046 374042 615338 1216601
6269 1216601 -24594 -1699616 -1640511 -937220 -1847819 -3439317 -2997232 -933423 -403029
6260 -403029 -1929063 -2252706 371894 3200065 3234810 1634734 1375569 2514240 2630333
6251 2630333 907638 -990776 -1788551 -1910848 -1825037 -1183292 -99712 429422 28272
6242 28272 -461822 -476099 -616599 -1385838 -2085048 -1775025 -595640 570394 1183844 1274937
6232 1274937 1151326 1310126 2016753 2607306 2034307 620371 280878 2086332 4406109
6223 4406109 4659083 2474650 -26538 -845035 78191 1444839 1863394 606546 -1713611
6214 -1713611 -3135312 -2172553 150659 1266840 329134 -866369 -815700 -656856 -2286790
6205 -2286790 -5127001 -6433214 -4683703 -1354533 917840 1049415 -23423 -1085152
6197 -1085152 -2201605 -4098843 -6044724 -5511681 -1345402 3343929 3812890 -274347 -3942214
6188 -3942214 -3431887 -1048530 -1014534 -2795246 -2357989 999748 3430726 2484763 247269
6179 247269 -660448 -582924 -584085 -57193 1094967 859745 -1511063 -3064101 -1247412 1670115
6169 1670115 1802619 -410886 -1377805 -353423 13164 -1158595 -1687958 -843067 -935618
6160 -935618 -2916037 -4111947 -2534824 -371815 -581411 -2336276 -2637845 -869411 1002803
6151 1002803 1811936 2209866 2651371 2519458 1418285 -109990 -1341191 -1995280 -2216632
6142 -2216632 -2456653 -2934812 -2879826 -1218090 1510551 3156226 2639973 1319803 741356
6133 741356 485268 -486995 -1827064 -2777768 -3864354 -5716241 -7195153 -6663114 -4410495
6124 -4410495 -2051010 -312808 749894 388599 -1697119 -3675966 -3624468 -2684446 -3398058
6115 -3398058 -5281534 -5309120 -3001007 -1513415 -2620664 -3934626 -2875781 -574016 352775
6106 352775 -423096 -1719099 -3402590 -5574787 -6735731 -5528621 -3344119 -2565908 -2943752
6097 -2943752 -2347031 -614834 220753 -424428 -726635 212534 761882 -270475 -1346944
6088 -1346944 -620349 1004398 1204050 -315279 -1596786 -1244981 221899 1756647 2973689
6079 2973689 3639914 3295228 2119768 1366768 2086324 3752384 4821917 4469606 3135846
6070 3135846 1464914 -434724 -2299028 -3051454 -1781145 739082 2378781 1784875 -317819
6061 -317819 -2138003 -2560310 -1645274 -85317 1302113 2006652 2267151 2712658 3227820
6052 3227820 2829181 1186828 -555909 -1283788 -1298463 -1038609 474125 3836936 6517437
6043 6517437 4798186 -811685 -4828056 -3243099 1277191 2950085 275251 -2864617
6035 -2864617 -3004327 -1043094 291545 472484 1029549 2632183 3974766 3412541 884028
6026 884028 -1793899 -2398824 -471807 1937572 2332799 595114 -1151025 -1561053 -1614904
6017 -1614904 -2536484 -3592259 -3302656 -1950725 -1199319 -1401389 -939549 1235678 3612195
6008 3612195 3659292 948427 -2167112 -3102916 -1624064 545093 2149795 3418050 4574684
5999 4574684 4691966 3061362 800314 -384412 -559559 -1039250 -1742463 -1091146 1159336
5990 1159336 3064881 3244129 2560095 2058369 1202606 -435221 -1584414 -1146769 -115898
5981 -115898 182266 258808 928828 1209760 88184 -1098571 -745326 -122260 -1330750
5972 -1330750 -3150215 -2465335 627517 2779373 2407334 1135121 130057 -1021957 -1273732
5963 -1273732 1637782 6474847 8307939 5230641 1410895 890162 2057729 1424492 -567654
5954 -567654 -1359674 -1128754 -1619273 -2132525 -943835 691626 167514 -1782182 -2155472
5945 -2155472 -863462 -695831 -2254803 -3026491 -1860977 -483966 172297 1427998 3566970
5936 3566970 4552728 3443778 2008309 1446884 483573 -1551749 -2652377 -1404069 95073
5927 95073 -846382 -3431943 -4740456 -3880944 -2351815 -1185477 -174108 487180 78179
5918 78179 -993650 -1235703 -170333 915140 725082 -517734 -1648162 -1822269 -787887
5909 -787887 1382010 4110978 6131049 6235272 4508606 2366369 932114 -229773 -2040912
5900 -2040912 -3903441 -4008094 -1844308 877227 2300430 2163621 964414 -967597 -2666196
5891 -2666196 -2676315 -1415257 -1439665 -3481539 -4321142 -1264820 3197186 4680923 3409506
5882 3409506 3252581 4995865 5393161 3392291 2305644 3923600 4936250 2164184 -2121206
5873 -2121206 -3570589 -2013157 -790823 -1400957 -2276175 -2203404 -1830256 -1729563 -1440920
5864 -1440920 -853933 -747691 -1439193 -2124103 -2064786 -1707265 -2154072 -3669899 -4963278
5855 -4963278 -4438149 -2431184 -1291306 -2277570 -3496999 -2646121 -675199 -148842 -799175
5846 -799175 -141629 1658880 1609214 -684391 -1787176 -400771 -166862 -3627740 -7361226
5837 -7361226 -7015982 -4054155 -3028475 -4405691 -4887747 -3582023 -2991655 -4079896 -4765522
5828 -4765522 -3900498 -3070214 -3550032 -4453052 -4767667 -4720727 -4392228 -3238411 -1633648
5819 -1633648 -859035 -1070136 -1167196 -961127 -1471278 -2756277 -3458778 -2944835 -2062789 -1412269
5809 -1412269 -647453 182113 391882 104721 231881 771685 847256 559602 868092 1432089
5799 1432089 750201 -1036305 -1719279 -348212 1041151 312669 -1774520 -2917602 -2457767
5790 -2457767 -1687541 -1540849 -1351691 -65853 2021933 3261675 2588436 1125019 901142
5781 901142 1896241 1903379 86658 -1269371 -274911 1144801 13800 -2701715 -3082771
5772 -3082771 50273 3612897 4759960 3941369 2715820 1367040 16451 -280739 737417
5763 737417 1337050 -138294 -3039636 -5289840 -5509139 -3599008 -390690 2568705 3943734
5754 3943734 3922673 3697599 3498954 2463503 604456 -762056 -1055658 -1274409 -2118162
5745 -2118162 -2789470 -2495566 -1791489 -1466764 -1133936 131609 2345699 4390029 4928396
5736 4928396 3634993 1957044 1971022 3566353 3845743 943547 -2699002 -3258596 -952594
5727 -952594 396635 -955203 -2607267 -2155784 -371067 822255 915743 139761 -1483753
5718 -1483753 -3128526 -3175709 -1412291 421102 977544 460505 -792922 -2572750 -3417211
5709 -3417211 -1849865 453806 -32661 -3250257 -4876397 -2552793 718513 1333873 -259425
5700 -259425 -2031072 -3930596 -5907657 -5637397 -2020574 1529725 1242817 -1482091 -2603612
5691 -2603612 -1812173 -2123505 -4133547 -5108587 -3789897 -2224252 -2271609 -3428293 -4664940
5682 -4664940 -5696719 -5926052 -4614033 -2637922 -1875107 -2386855 -2255846 -617155 1129494
5673 1129494 1621056 1267841 1123669 1440030 1798940 1618254 435039 -1330908 -2162314
5664 -2162314 -1125668 612512 1130297 108674 -1356371 -2570867 -3447512 -3667482 -3245918
5655 -3245918 -3193897 -3909846 -3706603 -918275 3133139 5354947 4683454 2698554 872547
$$ [...]
##END NTUPLES=NMR SPECTRUM
##END=
