##TITLE=31Pdec_SR57r+TFA
 CDCl3, 124 sc
 26.10.2020
##JCAMPDX= 6.0         $$ Bruker NMR JCAMP-DX V2.0
##DATA TYPE= NMR SPECTRUM
##DATA CLASS= NTUPLES
##ORIGIN= UXNMR, Bruker Analytische Messtechnik GmbH
##OWNER= root
$$ XWIN-NMR		Version 3.5
$$ Mon Oct 26 13:33:50 2020 Russian Standard Time (UT+4h)  she@DPX200
##.OBSERVE FREQUENCY= 81.013821
##.OBSERVE NUCLEUS= ^31P
##.ACQUISITION MODE= SIMULTANEOUS
##.ACQUISITION SCHEME= undefined
##.AVERAGES= 124
##.DIGITISER RES= 17
##SPECTROMETER/DATA SYSTEM= spect
##.PULSE SEQUENCE= zgpg30
##.SOLVENT NAME= D2O
##.SHIFT REFERENCE= (INTERNAL, D2O, 0, 182.463)
##AUDIT TRAIL= $$ (NUMBER, WHEN, WHO, WHERE, WHAT)
$$ ##TITLE= Audit trail, XWIN-NMR		Version 3.5
$$ ##JCAMPDX= 5.01
$$ ##ORIGIN= Bruker BioSpin GmbH
$$ ##OWNER= she
$$ F:/spectra/data/she/nmr/P31/1/pdata/1/auditp.txt
$$ ##AUDIT TRAIL=  $$ (NUMBER, WHEN, WHO, WHERE, WHAT)
(   1,<2020-10-26 13:29:46.90 +0400>,<she>,<DPX200>,
      <continue with go, POWCHK disabled, PULCHK disabled
       configuration hash MD5:
       00 E9 B6 7A A2 85 ED C7 34 08 36 98 17 FE 4E 26
       data hash MD5: 32K
       DC 0A 88 52 DA 28 C9 32 B9 AD F5 E0 FE B4 29 60>)
(   2,<2020-10-26 13:33:06.48 +0400>,<she>,<DPX200>,
      <Start of raw data processing
       efp BC_mod = 2 LB = 1 FT_mod = 6 PKNL = 1 PHC0 = -2382.604 PHC1 = 28.80069 SI = 64K 
       data hash MD5: 64K
       EB BA 91 38 48 4D BD 95 FA B8 56 E4 77 A0 B0 18>)
(   3,<2020-10-26 13:33:19.62 +0400>,<she>,<DPX200>,
      <pk PHC0 = 19.81747 PHC1 = 0 
       data hash MD5: 64K
       A8 43 90 3B 93 7C E9 59 6A 9D 83 6D C0 1C 52 0F>)
$$ ##END=
$$ 
$$ hash MD5
$$ CD 65 31 9C 78 30 8F AE 1C EF F9 4F FE 1F 5B 4B
##$RELAX= 
##$RELAX= 
##$RELAX= 
##$RELAX= 
##$RELAX= 
##$RELAX= 
##$RELAX= 
##$RELAX= 
$$ Bruker specific parameters
$$ --------------------------
##$DU= <F:/spectra>
##$EXPNO= 1
##$NAME= <P31>
##$PROCNO= 1
##$TYPE= <nmr>
##$USER= <she>
##$AMP= (0..31)
100 100 100 100 100 100 100 100 100 100 100 100 100 100 100 100 100 100 
100 100 100 100 100 100 100 100 100 100 100 100 100 100 
##$AQSEQ= 0
##$AQ_mod= 1
##$AUNM= <au_zg>
##$AUTOPOS= <>
##$BF1= 81.014009
##$BF2= 200.13
##$BF3= 200.13
##$BF4= 200.13
##$BF5= 200.13
##$BF6= 200.13
##$BF7= 200.13
##$BF8= 200.13
##$BYTORDA= 1
##$CFDGTYP= 0
##$CFRGTYP= 5
##$CHEMSTR= <none>
##$CNST= (0..31)
1 1 145 1 1 1 1 1 1 1 1 1 1 1 1 1 1 1 1 1 1 1 1 1 1 1 1 1 1 1 1 1 
##$CPDPRG= <waltz16>
##$CPDPRG1= <>
##$CPDPRG2= <waltz16>
##$CPDPRG3= <>
##$CPDPRG4= <mlev>
##$CPDPRG5= <mlev>
##$CPDPRG6= <mlev>
##$CPDPRG7= <mlev>
##$CPDPRG8= <mlev>
##$CPDPRGB= <>
##$CPDPRGT= <>
##$D= (0..31)
0 1 0 0 0 0 0 0 0 0 0 0.03 2e-05 3e-06 0 0 0 0 0 0 0 0 0 0 0 0 0 0 0 0 
0 0 
##$DATE= 1603704408
##$DBL= (0..7)
120 120 120 11 120 120 24 19 
##$DBP= (0..7)
150 150 150 150 150 150 150 150 
##$DBP07= 0
##$DBPNAM0= <>
##$DBPNAM1= <>
##$DBPNAM2= <>
##$DBPNAM3= <>
##$DBPNAM4= <>
##$DBPNAM5= <>
##$DBPNAM6= <>
##$DBPNAM7= <>
##$DBPOAL= (0..7)
0.5 0.5 0.5 0.5 0.5 0.5 0.5 0.5 
##$DBPOFFS= (0..7)
0 0 0 0 0 0 0 0 
$$ [...]
##$SUBNAM2= <"">
##$SUBNAM3= <"">
##$SUBNAM4= <"">
##$SUBNAM5= <"">
##$SUBNAM6= <"">
##$SUBNAM7= <"">
##$SUBNAM8= <"">
##$SUBNAM9= <"">
##$SW= 369.568048894756
##$SWIBOX= (0..15)
0 1 3 0 0 0 0 0 0 0 0 0 0 0 0 0 
##$SW_h= 29940.119760479
##$TD= 32768
##$TD0= 1
##$TE= 0
##$TE2= 300
##$TE3= 300
##$TEG= 300
##$TL= (0..7)
0 120 53 12 22 120 120 120 
##$TP= (0..7)
150 150 150 150 150 150 150 150 
##$TP07= 0
##$TPNAME0= <>
##$TPNAME1= <>
##$TPNAME2= <>
##$TPNAME3= <>
##$TPNAME4= <>
##$TPNAME5= <>
##$TPNAME6= <>
##$TPNAME7= <>
##$TPOAL= (0..7)
0.5 0.5 0.5 0.5 0.5 0.5 0.5 0.5 
##$TPOFFS= (0..7)
0 0 0 0 0 0 0 0 
##$TUNHIN= 0
##$TUNHOUT= 0
##$TUNXOUT= 0
##$USERA1= <user>
##$USERA2= <user>
##$USERA3= <user>
##$USERA4= <user>
##$USERA5= <user>
##$V9= 5
##$VALIST= <valist>
##$VCLIST= <CCCCCCCCCCCCCCC>
##$VD= 0
##$VDLIST= <DDDDDDDDDDDDDDD>
##$VPLIST= <PPPPPPPPPPPPPPP>
##$VTLIST= <TTTTTTTTTTTTTTT>
##$WBST= 1024
##$WBSW= 4
##$XGAIN= (0..3)
0 0 0 0 
##$XL= 0
##$YL= 0
##$YMAX_a= 32965
##$YMIN_a= -13943
##$ZGOPTNS= <>
##$ZL1= 120
##$ZL2= 120
##$ZL3= 120
##$ZL4= 120
##$ABSF1= 0
##$ABSF2= 0
##$ABSG= 0
##$ABSL= 0
##$ALPHA= 0
##$AQORDER= 0
##$ASSFAC= 0
##$ASSFACI= 0
##$ASSFACX= 0
##$ASSWID= 0
##$AUNMP= <proc_1d>
##$AZFE= 0.1
##$AZFW= 0.5
##$BCFW= 0
##$BC_mod= 2
##$BYTORDP= 0
##$COROFFS= 0
##$CY= -3
##$DATMOD= 1
##$DC= 0
##$DFILT= <>
##$DTYPP= 0
##$F1P= 0
##$F2P= 0
##$FCOR= 1
##$FTSIZE= 65536
##$FT_mod= 6
##$GAMMA= 0
##$GB= 0
##$INTBC= 1
##$INTSCL= 5.30512e-09
##$ISEN= 30
##$LB= 1
##$LEV0= 0
##$LPBIN= 0
##$MAXI= 10000
##$MC2= 0
##$MEAN= 0
##$ME_mod= 0
##$MI= 50
##$NCOEF= 0
##$NC_proc= -9
##$NLEV= 6
##$NOISF1= 182.463
##$NOISF2= 159.3651
##$NSP= 0
##$NTH_PI= 0
##$NZP= 0
##$OFFSET= 182.463
##$PC= 4
##$PHC0= -2362.787
##$PHC1= 28.80069
##$PH_mod= 1
##$PKNL= yes
##$PPARMOD= 0
##$PSCAL= 0
##$PSIGN= 0
##$REVERSE= no
##$SF= 81.014009
##$SI= 65536
##$SIGF1= 159.3651
##$SIGF2= -187.1042
##$SINO= 113.3802
##$SIOLD= 16384
##$SREGLST= <1H.CDCl3>
##$SSB= 0
##$STSI= 65536
##$STSR= 0
##$SW_p= 29940.119760479
##$SYMM= 0
##$S_DEV= 0
##$TDeff= 32768
##$TDoff= 0
##$TI= <>
##$TILT= no
##$TM1= 0
##$TM2= 0
##$TOPLEV= 0
##$USERP1= <user>
##$USERP2= <user>
##$USERP3= <user>
##$USERP4= <user>
##$USERP5= <user>
##$WDW= 1
##$XDIM= 65536
##$YMAX_p= 457675955
##$YMIN_p= -215055420
$$ End of Bruker specific parameters
$$ ---------------------------------
##NTUPLES= NMR SPECTRUM
##VAR_NAME=  FREQUENCY,     SPECTRUM/REAL,   SPECTRUM/IMAG
##SYMBOL=    X,             R,               I
##VAR_TYPE=  INDEPENDENT,   DEPENDENT,       DEPENDENT
##VAR_FORM=  AFFN,          ASDF,            ASDF
##VAR_DIM=   65536,         65536,           65536
##UNITS=     HZ,            ARBITRARY UNITS, ARBITRARY UNITS
##FACTOR=    0.456856943014862, 1,           1
##FIRST=     14782.0589164895, 0,            0
##LAST=      -15158.0608439895, 0,           0
##MIN=       -15158.0608439895, -215055420,  0
##MAX=       14782.0589164895, 457675955,    0
$$ Real data points
##PAGE= N=1
##DATA TABLE= (X++(R..R)), XYDATA
$$ [...]
46259A3593381J0091256M951833m516861p462550n393620j3478357k7926924k0167403
46251e0309245J7048333M5527443L0890431p370615k5843563j6483375j845075
46244h385666R393593K1675107K2439145j011904k2532358m652568L5367072L8992228
46236I1284649n710251m2257547l0265447j385693j573611k1435684k2736595
46229c4080179j835562J4998315J8343166J8645446J6769091O785316k266822
46222C7358771R36549N279763m630348j6145585p152421J1930038J1102961q530804
46214C0148924j5857491l177735K130164j0866099j4209804R172694K8859189
46207B6199842J1116639k5017047l2216646l603574J9471074Q774326j4249472
$$ plain form
46259 13593381 23684637 28636470 24119609 16657059 11263439 -2214918 -30141842 -50309245
46251 -50309245 -33260912 12266531 43156962 35786347 9942784 -6540591 -8385666
46244 -8385666 1007927 22683034 45122179 44110275 21577917 16925349 52292421 91284649
46236 91284649 85574398 43316851 13051404 11665711 10092100 -11343584 -34080179
46229 -34080179 -35915741 -20917426 -2574260 16071186 32840277 39625593 37358771
46222 37358771 38295320 43575083 38944735 22799150 15646729 27576767 38679728 30148924
46214 30148924 14291433 11113698 13243862 2377763 -11832041 -2659347 26199842
46207 26199842 37316481 12299434 -19917212 -23520786 -4049712 4724614 -9524858
46200i524858j4744195O900441K1599720J4041698k214114j0266274j2048762
46193f256344j7680910k5103784k3232696j0743538J803041Q953875J6090524
46186e6169832K4217319K3152743R023583m019269k694097N016972M107511j824766
46178H10164P91077P363680N96786j5810123j6475824M545933J8628394M331872
46170D781959j8283670j6575423Q006104K6414058K4646042J4722417P668785
46163E1380272p5627j1629334k0725719k2078407j7370216r830556l929931o758141
46155d1017659j6405212j5890827L519657K1473370J5505586J348880J2863429
46148a8602776M2698198M4061807L045179l3268930k5087346K281621L733981
$$ plain form
46200 -9524858 -24269053 -17368612 4231108 18272806 16058692 5792418 -6256344
46193 -6256344 -23937254 -49041038 -72273734 -83017272 -81214231 -72260356 -56169832
46186 -56169832 -31952513 -8799770 223813 -3795456 -6489553 -1472581 2634930 810164
46178 810164 1601241 8964921 9561707 -6248416 -22724240 -18178307 450087 4781959
46170 4781959 -13501711 -30077134 -22071030 4343028 28989070 43711487 51380272
46163 51380272 51304645 39675311 18949592 -3128815 -20499031 -30329587 -34259518 -41017659
46155 -41017659 -57422871 -73313698 -69794041 -48320671 -32815085 -31466205 -18602776
46148 -18602776 24095422 68157229 71202408 37933478 12846132 15127753 18861734
46141A8861734j4658007j4857017M289254Q799534p049798j0761985Q794953J8948919
46133A2367587k330420k7849192k1345435J0398359L0309280J9502146o870032
46126A4182293k1821264j1829128J1155824J8169665l511759k6967346j7762247
46119c8383962J2140575J6600598j2323246k6795246J536253L2624692K0776767
46112F176431j1239692j0895960J6495886J8320710j5061146l2052622l081117
46105c1337510L1923081K5206802r966778k4913903m385632K2998251L0261971
46098C9786282J9718124Q145536M122717K510557o669185k3381055l1512141j6593949
46090c873114J0371327K2018506J1306604O98147O074012J1511907l614917k8405123
$$ plain form
46141 18861734 4203727 -10653290 -6364036 2435498 -4614300 -15376285 -6581332 12367587
46133 12367587 10037167 -17812025 -39157460 -28759101 1550179 21052325 14182293
46126 14182293 -7638971 -19468099 -8312275 9857390 6345631 -20621715 -38383962
46119 -38383962 -26243387 -9642789 -21966035 -48761281 -47225028 -14600336 6176431
46112 6176431 -5063261 -15959221 536665 18857375 3796229 -28256393 -31337510
46105 -31337510 585571 25792373 15825595 -9088308 -13473940 9524311 39786282
46098 39786282 59504406 67649942 71772659 74283216 67614031 44232976 12720835 -3873114
46090 -3873114 6498213 28516719 39823323 40521470 46595482 58107389 54492472 26087349
46082B6087349l3272983j1510736J3148859J9332975J0568551K535236K220020
46075B9109271N459677N998888Q50699r035984j9392280k5273836k4142388j5896840
46067e2322793j922101J3571954K3507768K3004851J4324521M548954j599357
46060B3113797n251759r668712j4237175j4420886r537824p470364j4739596k2478149
46052g4690668j3391903J2483129L1135043K4121215M408946j698474R336236
46045h296476J7855772J2701338L881810K121395L297326j291909j1413564j9143277
46037b87585j6036423n05806J4039194O685210k1302107l5712134j1055585K6874118
46029c7301118L1026686Q31067j7560932j489043J9573438J7987900P702657P242726
$$ plain form
46082 26087349 -7185634 -18696370 -5547511 13785464 24354015 26889251 29109271
46075 29109271 34568948 40567836 41418535 32382551 12990271 -12283565 -36425953 -52322793
46067 -52322793 -54244894 -40672940 -17165172 5839679 20164200 24713154 23113797
46060 23113797 17862038 8193326 -6043849 -20464735 -30002559 -37472923 -52212519 -74690668
46052 -74690668 -88082571 -75599442 -44464399 -20343184 -15934238 -17632712 -8296476
46045 -8296476 9559296 22260634 26142444 28263839 31561165 30269256 18855692 -287585
46037 -287585 -16324008 -16829814 -2790620 3894590 -17407517 -53119651 -64175236 -37301118
46029 -37301118 -6274432 -5443365 -23004297 -24493340 -4919902 13067998 20770655 28013381
46021B8013381L163214j7031797k9167373q504713K3865598L1278748J7841911
46014D9458969J2178458J1735366q851870m1859867m8533113j9651026J0567704
46007c4955379J8339880J6514298J6589812O478881j5471407k1981248J733546
46000a2751617K6940076K0566588m814564r433547J6547841M1556397L6404015
45993A15015189R008683r902843n798938K737060j0807590m1911257n5711291
45986B629013l4850714o901117k312967n026570J7496634M7626022L3515952k2771480
45978B9404773n0391339r464376M4893951M0647097p518579k6163629O808614
45971B8216512L7869948K2201317j8813398l8065322k3706569o17284O217433
$$ plain form
46021 28013381 31176595 14144798 -15022575 -23527288 338310 31617058 49458969
46014 49458969 61637427 73372793 64520923 22661056 -25872057 -45523083 -34955379
46007 -34955379 -16615499 -101201 16488611 22967492 7496085 -14485163 -12751617
46000 -12751617 14188459 34755047 29940483 20506936 37054777 78611174 115015189
45993 115015189 124023872 114121029 108322091 111059151 100251561 58340304 2629013
45986 2629013 -32221701 -39122818 -41435785 -46462355 -28965721 18660301 52176253 29404773
45978 29404773 -20986566 -30450942 14443009 55090106 47571527 21407898 28216512
45971 28216512 66086460 88287777 69474379 31409057 7702488 7085204 13302637
45964A3302637o907677k4754345k6829277p550881J4148532J5276491j673290
45957b4987810j2381810l575940J1912685J4808017J932820j3263529j4233176
45950c9788743L680653K4792652K5538845M211813j2108260l738023J1706267
45943A4295204O502742j1818674j1047236J4398624L4208261K7343590O871333
45936H0753844p948033j6707704k3595623k2932396j3219121n454798m604776
45929a3708607j626149N355002L801447o590863m400575J8309875L4664832J9914761
45921E5719723j0122765k3194535j6230900q857746n744586K813087J1800874
45914F183152O396285o971472o526556O899692Q654333q769486k3277682j8889071
$$ plain form
45964 13302637 6394960 -18359385 -45188662 -52739543 -38591011 -23314520 -24987810
45957 -24987810 -37369620 -40945560 -29032875 -14224858 -12292038 -25555567 -39788743
45950 -39788743 -36108090 -11315438 14223407 18435220 6326960 2588937 14295204
45943 14295204 20797946 8979272 -2067964 12330660 46538921 73882511 80753844
45936 80753844 72805811 56098107 32502484 9570088 -3649033 -9103831 -13708607
45929 -13708607 -15334756 -9979754 -6178307 -12769170 -17169745 1140130 35804962 55719723
45921 55719723 45596958 22402423 6171523 -2686223 -8430809 -5617722 6183152
45914 6183152 12579437 5607965 -918591 5981101 14635434 5865948 -17411734 -36300805
45906c6300805n602252N263927J6650615K4707835J2429326j7413368l1449716
45899c1714438j1841432J2028147O936136j1597561o535181J6709799J7535144
45892h479386j1506959k8809019p246729K5601126L1224131J2960329r41002l555599
45884I246892q622444j7878883j9185901j1417413m967076n6594J1301221K2981900
45876a8598298J9317908L743594k574603M220301L789227j0379574j4476956N600452
45868i357949K3510797R101954k2564398l1232397j0504324P883935O928368N234223
45860b0999791J6896942K4678390J1784941o215220n560266P466704Q089006p890512
45852B8250194k1444156k1262497j3691119l184418J4073074L2948314L5611423
$$ plain form
45906 -36300805 -41903057 -36639130 -19988515 4719320 17148646 -264722 -31714438
45899 -31714438 -43555870 -31527723 -24591587 -36189148 -42724329 -26014530 -8479386
45892 -8479386 -19986345 -48795364 -56042093 -30440967 783164 13743493 12802491 9246892
45884 9246892 624448 -17254435 -36440336 -47857749 -52824825 -52881419 -41580198 -18598298
45876 -18598298 719610 4463204 1888601 6108902 9898129 -481445 -14958401 -9357949
45868 -9357949 14152848 23254802 690404 -30541993 -41046317 -33162382 -26234014 -20999791
45860 -20999791 -4102849 20575541 32360482 26145262 20584996 28051700 36140706 28250194
45852 28250194 6806038 -14456459 -28147578 -31331996 -17258922 15689392 51300815
45845E1300815J3734262j8069028l7269378l2387416n585799K9607806M9607638
45838E0938900L6416654J029768k2650279j7807663n299660j1120310k6908195
45831D599215k3259339M747041K9159295K7941588J0236617m870220j5074741
45824C3479456k5966837l0469763j7677103L820677J2619286N921670M678058
45817a3594556K0167172L3547406K2886997k941470j6922522j3379119j1853912
45810A7909996k0872701k2354401l012776J9208434J8791210K11668r381513L80102
45802H80019J2135654R742677j467202q845121j0372466r572618m818803N801598
45794f516262J6527034J9905758J6047128R674393K944801l239810n844412l531267
$$ plain form
45845 51300815 65035077 46966049 9696671 -22690745 -28276544 1331262 50938900
45838 50938900 87355554 88385322 65735043 47927380 42627720 31507410 4599215
45831 4599215 -18660124 -13913083 15246212 43187800 53424417 48554197 33479456
45824 33479456 7512619 -22957144 -40634247 -36813570 -24194284 -18272614 -13594556
45817 -13594556 6572616 40120022 63007019 60065549 43143027 29763908 17909996
45810 17909996 -2962705 -25317106 -28329882 -9121448 9669762 9881430 499917 880019
45802 880019 13015673 22758350 21291148 12446027 2073561 -7499057 -12317860 -6516262
45794 -6516262 10010772 29916530 45963658 55638051 58582852 55343042 49498630 45967363
45786D5967363n47269k767963j2496430k7509638l9574505l5369707r990379J9291373
45778f2997155K7103674J2864688L762394J6053898L1014431K4577513M075376
45771E6454819p053689q819283k0058141l8391018l6895546p906804J8625652
45764d4044010J6047453k098584o042353N887186J1045773K077474l090225P658443
45756a2558843K1469695K0798483P066418p089121j7795331k7908018l0950015
45749d6966732j4219412J8747696M2546331L6335534Q946516j2127053j2596806
45742B0666074j717517O830291J1046206J4352630J5122883J0208460K153404
45735G8662431l827843n790433m260129j064068j493947r805881j9510527j7785663
$$ plain form
45786 45967363 45420094 42652131 30155701 2646063 -36928442 -72298149 -82288528 -62997155
45778 -62997155 -35893481 -23028793 -19266399 -3212501 27801930 52379443 56454819
45771 56454819 49401130 40581847 20523706 -17867312 -54762858 -62669662 -44044010
45764 -44044010 -27996557 -30095141 -36137494 -30250308 -19204535 -17127061 -20217286 -12558843
45756 -12558843 8910852 29709335 36775753 29686632 11891301 -16016717 -46966732
45749 -46966732 -61186144 -42438448 107883 36443417 45389933 33262880 20666074
45742 20666074 18948557 25778848 36825054 51177684 66300567 76509027 78662431
45735 78662431 74834588 69044155 64784026 63719958 62226011 52420130 32909603 15123940
45727A5123940l744005Q424570Q983644K425770o892823k1225076l3336013k5944594
45719e6184587k211824O895449j1744803k4163196K266718M1208635M0097255
45712c836353j01586k5026423p518376J9451729K1575784J0329670J0584243J7929493
45704D3388181J4018847j845603j8546797k9174516k6022011l661403K0888575
45697i54727K0201861L22842l206307J3152825R326700k4982978l8519273l43264
45689b5002321L8193653J9998076k2806245k0447440J9344144K8100969o180105
45682C1200731k3452459K814013K6028122J1904297r690595p680625m37262q359833
45674B2326389j1983367M001789J4518389K136266m336349J7720699L6274289
$$ plain form
45727 15123940 11379935 19804505 28788149 31213919 24321096 3096020 -30239993 -56184587
45719 -56184587 -58396411 -51500962 -63245765 -87408961 -85142243 -43933608 -3836353
45712 -3836353 -3937939 -28964362 -36482738 -17031009 4544775 14874445 25458688 43388181
45704 43388181 57407028 55561425 37014628 7840112 -18181899 -21843302 -954727
45697 -954727 19247134 19569976 16363669 29516494 38843194 13860216 -24659057 -25002321
45689 -25002321 13191332 33189408 10383163 -10064277 9279867 37380836 31200731
45682 31200731 7748272 10562285 36590407 48494704 38804109 31123484 30686222 22326389
45674 22326389 10343022 14344811 28863200 30999466 26663117 44383816 80658105
45667H0658105J6379846j6978893j9819942j903108l205516k1859520k4019540
45660I251432j0067401j1042582k4838332j5073855K1272827L9038124J2085081
45653B0625294k8575751m1295241k3285060K675026K0518622K3467027R966351
45646a5903732p113426p282774R740122K0869821J1888179n903718j6438310j5641600
45638b5785438l365093J7884666L1006050J7024652j2734920k4364528j0488513
45631a0823124j386998j3408322k0264658L80211K3634093J5658776p962461m587057
45623a8759540K5501834L6580346Q123103k4514400k6057647j1851502j4600549
45616b5578355k6141716j0819525L0514963N0004153J8407738k9396214l8633270
$$ plain form
45667 80658105 97037951 80059058 60239116 58336008 55130492 33270972 9251432
45660 9251432 -815969 -11858551 -36696883 -51770738 -30497911 8540213 20625294
45653 20625294 -7950457 -49245698 -72530758 -69855732 -49337110 -25870083 -15903732
45646 -15903732 -23017158 -30299932 -20559810 310011 12198190 6294472 -10143838 -25785438
45638 -25785438 -29150531 -11265865 19740185 36764837 24029917 -334611 -10823124
45631 -10823124 -12210122 -25618444 -45883102 -45502891 -21868798 -6210022 -14172483 -18759540
45623 -18759540 6742294 43322640 51445743 26931343 873696 -10977806 -25578355
45616 -25578355 -51720071 -62539596 -32024633 17979520 36387258 6991044 -31642226
45609c1642226o337395K0411571J1509106j2133008j7336283l421114P848775
45602c1100574P532603M404769M562900M063217j599302j1291544j7444021p906540
45594d8778492J9484826M1412948K9518586n288014j7400207P104951K2289552
45587D8344150p813721m4344513k7708888K5680369M2351249K590244l3104322
45580E994568k0944593N965941L486655j2415479l231504K3377028L0832414J5168874
45572D8233904L265756L265077j761180j6447458k4566129j6842733p34005J5162677
45564I575909K4589647J7794334n381187k3486407j7223587J756851Q387360J917815
45556A7930735L53240M577169j895091j8385758k1819703j674848K3138766K9222424
$$ plain form
45609 -31642226 -37979621 -17568050 -6058944 -18191952 -35528235 -38949349 -31100574
45602 -31100574 -23567971 -19163202 -14600302 -10537085 -12136387 -23427931 -40871952 -48778492
45594 -48778492 -29293666 12119282 41637868 36349854 18949647 26054598 48344150
45587 48344150 40530429 -3814084 -31522972 -5842603 36508646 39098890 5994568
45580 5994568 -14950025 -8984084 -5497429 -17912908 -21144412 2232616 33065030 48233904
45572 48233904 51499660 54764737 53003557 36556099 11989970 -4852763 -5586768 9575909
45564 9575909 34165556 51959890 46578703 23092296 5868709 7625560 16012920 17930735
45556 17930735 18283975 22861144 20966053 2580295 -19239408 -20914256 2224510 31446934
45548C1446934J3366835j0880946k5641121j7591671R018301K9247355K4014855
45541E2980542O466742K948064J2830600J1761654o943540k1938246j8812713
45534C9293103q986121n964589o534673m995413m684312n579813k14837R113408
45526A1446753R225729Q73364K180677J5790694J6907963p983440l2154223k2229613
45518e942096J3494914L5149078K2664751m985478j9336049j2312709M360989
45511C3093400J4704361R845323o605125k0561361j8940879j579493J7330477
45504B7286703J8802919m277780l3098790l3802357K315316L6617229K5012133
45497C8855373k0115753m1364912j6311087J1189521J41899k3909914j1199383
$$ plain form
45548 31446934 44813769 33932823 8291702 -9299969 -281668 28965687 52980542
45541 52980542 59447284 62395348 75225948 86987602 80044062 58105816 39293103
45534 39293103 30306982 24342393 17807720 12812307 8127995 2548182 2333345 11446753
45526 11446753 20672482 21545846 23726523 39517217 56425180 48441740 16287517 -5942096
45518 -5942096 7552818 42701896 65366647 60381169 41045120 28732411 33093400
45511 33093400 47797761 57643084 51037959 30476598 11535719 9956226 27286703
45504 27286703 46089622 41811842 8713052 -25089305 -22773989 13843240 38855373
45497 38855373 18739620 -22625292 -38936379 -27746858 -27604959 -51514873 -62714256
45490f2714256L2181776N3596138L3402707P261376N160950J2422501O404472
45483H7715664n366477o596581l397685p996703j1889153k424719Q695894K402799
45475F1143039j1049710l338238K4019710L3348629K670691m0377296n3616541
45468A2800284l3204477j1205375q841585j4380101q678101O801671J6671313
45461d0036371J4137610N761253j00509o7236N339392J1354713J0447413J428795
45453H265060o473805o435429n788946j3792363k2414648j5389429M392079J5821589
45445d1815892J2522744J3671004K9800089L8447906J5856476k0616750k9894404
45438A7971173l863824K1783005J9114934L422332K279554J1623053O941887j3618968
$$ plain form
45490 -62714256 -30532480 23063658 56466365 63727741 68888691 81311192 87715664
45483 87715664 82349187 75752606 72354921 64358218 52469065 50044346 58740240 61143039
45475 61143039 50093329 46755091 70774801 104123430 106794121 66416825 12800284
45468 12800284 -20404193 -31609568 -40451153 -54831254 -63509355 -56707684 -40036371
45461 -40036371 -25898761 -20137508 -20238017 -20305253 -14965861 -3611148 6836265 8265060
45453 8265060 1791255 -4644174 -10433120 -24225483 -46640131 -62029560 -57637481 -41815892
45445 -41815892 -29293148 -15622144 14177945 52625851 68482327 47865577 17971173
45438 17971173 14107349 35890354 55005288 58427620 60707174 72330227 79272114 65653146
45430F5653146k5256098j5649163k983272o192358j7151361j6714953m238847
45423b2532906O271081J0734405J6702093K3915114K2226292J0126769k108537
45416F5334311j0742007k2200363l3351447k7805776j848119K4351784L4077537
45409B7815920L4401926L4189538K2579207p703572l3893555l0178930r251098
45402C7959436l819560j3867432r396727J4441489K4537872J983823k8188584
45395B3650317l4654172j7586940O261700K7151892L4127578J3060190k5082231
45388B6928334m0792067j5424271J9587723K7354136J4618466Q176050P550137
45381D7998508l111755j5867737j1971178j144646o630301j8678202o102450K6291286
$$ plain form
45430 65653146 40397048 24747885 21764613 15572255 -1579106 -18294059 -22532906
45423 -22532906 -16261825 -5527420 11174673 35089787 57316079 67442848 65334311
45416 65334311 54592304 32391941 -959506 -28765282 -30613401 -6261617 27815920
45409 27815920 62217846 96407384 118986591 111283019 77389464 47210534 37959436
45402 37959436 34139876 20272444 10875717 25317206 49855078 51838901 23650317
45395 23650317 -11003855 -28590795 -22329095 4822797 38950375 52010565 26928334
45388 26928334 -13863733 -29288004 -9700281 17653855 32272321 40448371 47998508
45381 47998508 44886753 29019016 17047838 15903192 9272891 -9405311 -15507761 10783525
45373A0783525L5458501M295606l0629223l1645923r398757K00086j3292911k7598646
45365f1827742k0365294N305308K4726135J7482139p815387k0862559q258614
45358g1616014R338906J1737380J0270370K0272979K4632418J571403k8089883
45351b1882441k7079003n130013m114924k2431722j4124458K6721218M4577464
45344b3463879J1589172k1757996n484380L0789455K8281766q794040k7006775
45337a5846677o818124K1046502L0053284K1723951K340024k1824585l0256589
45330D17786q056394K2110593K3437416j695782j6580030p008613L120334l648639
45322A2096671j3504277j0245722R76569R937737J6225897J6855211J994450k3458274
$$ plain form
45373 10783525 46242026 50537632 19908409 -11737514 -21136271 -20936185 -34229096 -61827742
45365 -61827742 -82193036 -76887728 -52161593 -34679454 -42494841 -63357400 -71616014
45358 -71616014 -62277108 -50539728 -40269358 -19996379 4636039 6207442 -21882441
45351 -21882441 -48961444 -54091457 -58206381 -80638103 -94762561 -68041343 -23463879
45344 -23463879 -11874707 -33632703 -39117083 -8327628 19954138 11160098 -15846677
45337 -15846677 -22664801 -1618299 28434985 50158936 52498960 30674375 417786
45330 417786 -7638608 14471985 37909401 36213619 19633589 12624976 15745310 12096671
45322 12096671 -1407606 -11653328 -10676759 -739022 15486875 32342086 34336536 10878262
45314A0878262l2813256q700508K8547889L8297806N149255l9713554m7864235
45307d6218341p634981L7686836L9230421M712735j4488967Q02617J3017756n165121
45299B1942955k3162457o456543K0572886J4929645j0518286j0848633J0537640
45292A6997207R741459j4981109j6212252J7992999L7980584J3206017j8986431
45285D5738474j6161176O604865J2328790K87878p911903p956168m077000J0405757
45277C9259517L0716168K6814516j2900343m9326724m1543299o833420P249753
45270f563832n912743j0625644R549080K9793826K5933010N940585p684305n406393
45262C5023584N132713R009481k291113j8288148j7049190N791297K6700826K3623029
$$ plain form
45314 10878262 -21934994 -30635502 -2087613 36210193 41359448 1645894 -46218341
45307 -46218341 -53853322 -16166486 23063935 27776670 13287703 14090320 27108076 21942955
45299 21942955 -1219502 -7676045 12896841 27826486 17308200 6459567 16997207
45292 16997207 26738666 11757557 -4454695 13538304 51518888 64724905 45738474
45285 45738474 29577298 36182163 48510953 48798831 40886928 32930760 28853760 39259517
45277 39259517 69975685 96790201 83889858 34563134 -6980165 -13813585 -6563832
45270 -6563832 -12476575 -23102219 -13553139 16240687 42173697 48114282 40429977 35023584
45262 35023584 40156297 49165778 46874665 28586517 11537327 17328624 44029450 67652479
45254F7652479K291754j8166732k9361380k9645838j4642528J0826791K8280297
45247A7234843K9597965K7216819K5695667Q921036k3564385l7327510j0985535
45240C6788900K2980398K1905892m917095j7904628j1102663q609765j1400166
45233B7740873J464413K3178278K1116674p595045k7685536k0462340n836090
45226A1921227j198174J708643P679940L951480j0526785j5777127n324404J054077
45218f511123p342157j4111956o230694O549777J4636659K0974506J9857620k560167
45210B5262465l2824162l2322900M958134L2779047J6372623j7359399k3670557
45203b6804749m201106Q520065P685227J2841915K5567877K3301473k058704k8039988
$$ plain form
45254 67652479 69944233 51777501 22416121 -7229717 -21872245 -11045454 17234843
45247 17234843 46832808 74049627 99745294 108666330 85101945 47774435 36788900
45240 36788900 59769298 81675190 76758095 58853467 47750804 39141039 27740873
45233 27740873 29205286 52383564 73500238 65905193 38219657 17757317 11921227
45226 11921227 10723053 12431696 20111636 24063116 13536331 -2240796 -7565200 -6511123
45218 -6511123 -13853280 -27965236 -34195930 -27646153 -13009494 7965012 27822632 25262465
45210 25262465 -7561697 -39884597 -34926463 -2147416 14225207 -3134192 -26804749
45203 -26804749 -31005855 -22485790 -14800563 -1958648 23609229 46910702 44851998 16812010
45195A6812010k9497254o381352J8374763K0257480l304141k5778557j8377485
45188b7894536J1766841K7045257R189809j8077099k6358870j7627405o496059
45181d8452062O703465K3454122L0238440J8653754L786071l83154m352655j7927223
45173A1720758k3537688m463281J9310001J6951790n725132j8322935j3443333
45166a7509820p289555k211060J3952605L4834375L7808034K0057333R14146j1667751
45158F8888307k5604070l5797216k4557498M533305K4707507K4491747J8965897
45151E5627979J6712023O499488j3512490k3836689j5377421o805441j3841617
45144E465832k3434035j6010715M337062J8969606K0601102J5197641Q084833
$$ plain form
45195 16812010 -12685244 -19066596 -691833 19565647 16261506 -9517051 -27894536
45188 -27894536 -16127695 10917562 20107371 2030272 -24328598 -41956003 -48452062
45181 -48452062 -41748597 -18294475 11943965 30597719 34383790 34000636 29647981 11720758
45173 11720758 -11816930 -16280211 3029790 19981580 14256448 -4066487 -17509820
45166 -17509820 -24799375 -27010435 -13057830 21776545 59584579 79641912 80556058 68888307
45158 68888307 43284237 7487021 -17070477 -12537172 12170335 36662082 55627979
45151 55627979 72340002 78839490 65327000 41490311 26112890 19307449 5465832
45144 5465832 -17968203 -33978918 -29641856 -10672250 9928852 25126493 33211326
45137C3211326M72633o736901j2878709j5882791j0356284L571858J2851227P113857
45129A1366216k626293M21627Q908917J481784j8539129k3795357o650170Q444736
45121b0987669O618978N804783K1102827L3577236J8650608j3348839k9704534
45114B1713390j7859577M203451J3483506M029385j0885699j1380336O111615
45107I415735J7887763J607963k4615860j9392273J9113047M1983871J9470898
45100F5471144j2653237p114847K3296863K8219869m172973l7468973m6880499
45093H697347m4978256m2773832k5479067J5506226N4762075N9166828K8154684
45086E3056005q477274k4429407j7028240m46410J0208319R680248L892235J645516
$$ plain form
45137 33211326 33683959 26947058 14068349 -1814442 -12170726 -8598868 4252359 11366216
45129 11366216 8739923 9161550 18070467 19552251 1013122 -22782235 -29432405 -20987669
45121 -20987669 -14368691 -8563908 12538919 46116155 64766763 51417924 21713390
45114 21713390 3853813 8057264 21540770 25570155 14684456 3304120 9415735
45107 9415735 27303498 28911461 4295601 -15096672 4016375 46000246 65471144
45100 65471144 52817907 45703060 68999923 97219792 93046819 55577846 8697347
45093 8697347 -36280909 -79054741 -104533808 -89027582 -34265507 24901321 53056005
45086 53056005 44578731 20149324 3121084 2674674 12882993 22563241 26455476 28100992
45078B8100992M833068Q047541O111211p73204p843147r813221o005648j320728
45070B1336864J282758N753177J2366043P983385j6685868m2668469l9084500
45063d9716610q546108J0504363r78544j3223975N169710L6487893M1057363J6817858
45055C7571950l880850p145121r641028j8788150j7562942J684801J7686831R301252
45047I226743j4870126k8514487j7148716J1330023L5089375L4622559J1408038
45040D1143409r937447r367602L236050N019061n047243r381213l968765j453814
45032A0242436l989422q70044N614700J360612r077924n019342J0682752R322500
45024A8266268j4522153k8516039j5416905j883807p991108p161966K4316320
$$ plain form
45078 28100992 32934060 40981601 47092812 46319608 38476461 28663240 22657592 21336864
45070 21336864 22619622 28372799 40738842 48722227 32036359 -10632110 -49716610
45063 -49716610 -58262718 -47758355 -48736899 -61960874 -56791164 -20303271 20754092 37571950
45055 37571950 33691100 26545979 16904951 -1883199 -19446141 -17761340 -74509 9226743
45047 9226743 -5643383 -34157870 -51306586 -39976563 -4887188 29735371 41143409
45040 41143409 31205962 21838360 25074410 30093471 25046228 15665015 11696250 10242436
45032 10242436 6253014 5382970 10997670 12358282 3280358 -1738984 8943768 18266268
45024 18266268 3744115 -24771924 -40188829 -42072636 -50063744 -57225710 -32909390
45017c2909390N1402139K5991833l1200746n1826741j8217262J5939974J0400233
45010c0419960j0459541j0479849L245892Q435217J0931386K2802949K7341075
45003B1397169P042448j5073845o061052J8867654J5923650j4458800k4480547
44996C156677M279139L0513725J9392109n606608p614489M461000J098453j2071545
44988C7608461r444691K157600m293637k0517020j1572878J9550568K9488822
44981D2977225O997415o148435J1977919K3005077m742824l6733318k7111671
44974A0221388M201143N503225j9821237k1263129J3442637M0272348K9727510
44967F2283885L469046r890348j0494187o877452l82475r55204j9141250l3319331
$$ plain form
45017 -32909390 18492749 44484582 13283836 -38542905 -56760167 -40820193 -30419960
45010 -30419960 -40879501 -51359350 -48113458 -39678241 -28746855 -5943906 21397169
45003 21397169 28439617 13365772 7304720 26172374 42096024 27637224 3156677
44996 3156677 7435816 37949541 57341650 51735042 44120553 48581553 49680006 37608461
44988 37608461 28163770 30321370 26027733 5510713 -6062165 13488403 42977225
44981 42977225 49974640 43826205 55804124 78809201 74066377 37333059 10221388
44974 10221388 14422531 19925756 104519 -21158610 -7715973 32556375 62283885
44967 62283885 65752931 55862583 45368396 38490944 38108469 37153265 18012015 -15307316
44959a5307316r149838L6689454M3388298k572901l7612251j6209589J8371575
44952A7597432P726285k4662331j5816805K7395962L6190931r745854n0757978
44945a2072358l7753210N306670L0974624L1651374K5415728J6228371J92612
44938E9943811j2705217j1562463l938904j033804K205407J3010156K0237433
44931F6156419Q302010j6492062l1607639k6481656j1811592l308745n887907
44924b1131172j2208035j1285338p51233Q708012O983955N05820L026666J1727036
44916a4424289R228790p642279j9900156j4534558k099626M046425P281766J2557948
44908b5485979J0424036m223288j2893202K625354K6644676K6211864j540560
$$ plain form
44959 -15307316 -24457154 12232300 55620598 53047697 15435446 -774143 17597432
44952 17597432 25323717 661386 -15155419 12240543 48431474 38685620 -12072358
44945 -12072358 -49825568 -44518898 -13544274 18107100 43522828 59751199 59943811
44938 59943811 47238594 35676131 31737227 30703423 32908830 45918986 66156419
44931 66156419 74458429 57966367 26358728 -122928 -11934520 -15243265 -21131172
44924 -21131172 -33339207 -44624545 -45375778 -36667766 -29683811 -29177991 -26151325 -14424289
44916 -14424289 -5195499 -12837778 -32737934 -47272492 -49372118 -45325693 -38043927 -25485979
44908 -25485979 -15061943 -19285231 -32178433 -29553079 -2908403 23303461 21762901
44901B1762901k4280015j9213407P13064J2122431J0894085M810904n013812j8295720
44893a6499569k2799470o720588J9566658L1193568K0343108O289017P980453
44886C9353177J7777248J3821934o143948j7712976j933271K5669951L0594543
44879A01426658K249915l1864366m0545726k6387928j6794611k3488631k8271462
44872f3676151j2943270J2721161K5606125K1771325J6300010J3457857o60802
44865A2576255k7158534l7592565r954528L0954420L8452765Q518181j2909028
44858B886966J995320K1132589M813863k8055498k6898489J1481939L8759228
44851B6115918L0849098J7323039J9455768R752424l2345996o6797027m5218012
$$ plain form
44901 21762901 -2517114 -21730521 -21017457 -8895026 1999059 6809963 1796151 -16499569
44893 -16499569 -39299039 -46019627 -26452969 4740599 25083707 31372724 39353177
44886 39353177 57130425 70952359 64808411 47095435 45162164 70832115 101426658
44879 101426658 103676573 71812207 31266481 4878553 -11916058 -35404689 -63676151
44872 -63676151 -76619421 -63898260 -38292135 -16520810 -220800 13237057 12576255
44865 12576255 -14582279 -52174844 -62129372 -31174952 7277813 15795994 2886966
44858 2886966 4882286 26014875 30828738 2773240 -24125249 -12643310 26115918
44851 26115918 56965016 74288055 93743823 103496247 71150251 4353224 -40864788
44844d0864788R100650K9694508M220142j5148521k38737J4485430m48905j9130677
44836a8330898r655080J1836399J6241454J3136546K1737629K1329130j5069257
44829D1225923n7618216n0512368l7254K8656162Q997723j1904267O069974L5598563
44821D76240L3219405N743554j2692442j5661111j7517098j8381909j3911745
44814c8725106j6317866k8055987j9177045K5851694O1983216L7161257k2621450
44807I8713m1015744p08553L6443157K6486171k035177j1547528j3338097k6207820
44799c1824878k8151968L415506L9022031L4495555j864530k5458238k1553211
44792c1919733j0439242L00063K1072343M2303134L7605165R689301p036998J637775
$$ plain form
44844 -40864788 -31764138 -2069630 2150512 -12998009 -13236746 1248684 799779 -18330898
44836 -18330898 -27985978 -16149579 91875 13228421 34966050 56295180 41225923
44829 41225923 -16392293 -66904661 -66941915 -38285753 -29288030 -41192297 -35122323 476240
44821 476240 33695645 39439199 26746757 11085646 -6431452 -24813361 -38725106
44814 -38725106 -55042972 -83098959 -102276004 -76424310 -14441094 22720163 98713
44807 98713 -40917031 -41625584 -5182427 21303744 19268567 7721039 -5617058 -31824878
44799 -31824878 -59976846 -56561340 -17539309 16956246 15091716 -10366522 -31919733
44792 -31919733 -42358975 -42058912 -20986569 21316565 58921730 68611031 61574033 63211808
44784F3211808J0660042q02609j9480973k5605613k1861407j8557379j3627322
44777b6063453l932712L153939M420565Q977304J8047770J5653411m612108k1965188
44769f320472j6884177j366392J555139l867614N113117K7513495L3871284J0426078
44761E0040458j5558343j0804350J7199260K9265406Q438831j6847183j4825827
44754D6908252J698219n620767l8405704n1006972j5650801L1408381L6930366
44747F260974L960190j8112730p193262Q920088O004317k157255K170680Q047549
44739G900551N64612r127790m452224O156756M838056n637680j1325642j1958862
44731b3042223j2423172m319146J6810604K9076187J0722255j9294961k1664383
$$ plain form
44784 63211808 73871850 73069241 53588268 27982655 6121248 -12436131 -26063453
44777 -26063453 -29996165 -26842226 -22421661 -13444357 4603413 20256824 15644716 -6320472
44769 -6320472 -23204649 -24571041 -23015902 -26883516 -21770399 5743096 39614380 50040458
44761 50040458 34482115 23677765 40877025 70142431 78581262 61734079 46908252
44754 46908252 48606471 42985704 4580000 -46426972 -62077773 -30669392 6260974
44747 6260974 10221164 -7891566 -15084828 -6164740 -160423 -2317678 -146998 7900551
44739 7900551 8465163 -662627 -5114851 1041905 5879961 242281 -11083361 -23042223
44731 -23042223 -35465395 -39784541 -22973937 6102250 16824505 -2470456 -24134839
44724b4134839M601036K0034466O561017n115845J3889372M3285548M1843917
44717A00964672M438124l4600323m6058623l1583650q552145J0541047K0350035
44710A5499137J8863381R073578q78234m180336j314178J005297l510708j3615975
44702B0941962j9732909j3580369J25678O349252k081183j3269589j0121302N881645
44694b5486815J3796239M14845j9721278k2025469n876665M819267j146058l403728
44686e8629662J6749400M0620065L5646384O942263p379875M426328Q764142j7177733
44678B9961312m4143039l3888499K262652K3421954K0420516J7233882K0487543
44671C5756321J1989076o407812n680087J8589380K8403773J240093k9015717
$$ plain form
44724 -24134839 -19533803 500663 7061680 1945835 15835207 59120755 100964672
44717 100964672 105402796 70802473 24743850 -6839800 -15391945 -4850898 15499137
44710 15499137 34362518 43436096 42557862 38377526 37063348 38068645 34557937 20941962
44702 20941962 1209053 -12371316 -12245638 -5896386 -7977569 -21247158 -31368460 -25486815
44694 -25486815 -11690576 -11275731 -30997009 -53022478 -58899143 -54079876 -55225934 -58629662
44686 -58629662 -41880262 -1260197 34386187 41328450 33948575 38374903 47139045 29961312
44678 29961312 -14181727 -48070226 -45807574 -22385620 -1965104 15268778 35756321
44671 35756321 47745397 41337585 35657498 54246878 82650651 83890744 54875027
44664E4875027k1208795R390226J5445478r701602k6410603j3923216J125202
44657I591717n919855j5576347K614217L6777321M4766794J3851822k1345711
44650F4759958k6977506j1921067o369373j5869104j9977353j0098424k105894
44643b8558763n966978o844137Q836391K6491653K2661344L91119j5726283j3978217
44635a2693871m290846L978924J1095784J3726418M951344q551987j0053633R55378
44627h82489O318584n08887l971631L630349N117095j1909332k8719579k0842314
44619e1768204M253501J8357889J3079746O155957J0262253J6620662J2119175
44612B9080979k735645j7042227k1110188j2575579L284374J8965743L1519992
$$ plain form
44664 54875027 33666232 43056458 58501936 48800334 22389731 8466515 9591717
44657 9591717 3671862 -11904485 -9290268 27487053 72253847 86105669 64759958
44650 64759958 37782452 25861385 19492012 3622908 -16354445 -26452869 -28558763
44643 -28558763 -34525741 -41369878 -32533487 -6041834 16619510 17010629 1284346 -12693871
44635 -12693871 -16984717 -13005793 -1910009 11816409 16767753 8215766 -1837867 -882489
44627 -882489 5436095 4927208 955577 4585926 9703021 -2206311 -30925890 -51768204
44619 -51768204 -47514703 -29156814 -16077068 -9921111 341142 16961804 29080979
44612 29080979 26345334 9303107 -11807081 -24382660 -21098286 -2132543 29387449
44605B9387449L9000195L2300407N336622k4505040k7805397n154047O045200
44598E4605389j5781116m1638270l5600091r567473J149165j580475J2110755
44591c6302116L8266647L7620618K620957k2790352q397357J9841950K6825502
44584E7685849J9548211K0072341J9606149j778867l1057776l8130901k4380224
44577B1564782j7704697k4087430k0115117L946781K5597146K3548920N919055
44570A8669440n474562k484283O282961Q152759l268644k1755736l0747073j9606422
44562e0231560L819057K3677389L3087137L2270537K0495603L336547l891716
44555F2562994K664265L732735j2089311k1652327k644748J8868769K89715m2288893
$$ plain form
44605 29387449 68387644 100688051 106024673 81519633 53714236 48560189 54605389
44598 54605389 38824273 -2813997 -38414088 -47981561 -46832396 -48412871 -36302116
44591 -36302116 1964531 39585149 42206106 19415754 11018397 30860347 57685849
44584 57685849 77234060 97306401 116912550 115133683 84075907 45945006 21564782
44577 21564782 3860085 -20227345 -40342462 -36395681 -10798535 12750385 18669440
44570 18669440 13194878 10710595 16993556 25146315 21877671 121935 -30625138 -50231560
44562 -50231560 -46412503 -22735114 10352023 42622560 63118163 66454710 62562994
44555 62562994 65227259 68959994 56870683 35218356 32573608 51442377 51732092 9443199
44547I443199m3744705J2126869N7269871L2596146k7302806m5394034p626310
44540a2631770L1390872L1757639Q338796r862376j6426567j5512868p154726
44533I899000L153737L897686l838502n885704J281829M799639k103934j0412991
44525G90760j2817450j3017028j2975082q326448p44443K349673L499145J1955710
44517b9285163K2360385J8708856L771504n03717J0536534J5023137M078092N13575
44509D5203203J7593861K8090911M839794k9819866l2066592k019481J7745384
44502D9567214O662594r285224m944486P079014M213244p892548q350015L172219
44494D0222012P307504l659639j4953324j1638775J189103N426218q530870l0321923
$$ plain form
44547 9443199 -34301506 -22174637 35095234 67691380 40388574 -5005460 -12631770
44540 -12631770 18759102 50516741 58855537 48993161 32566594 17053726 9899000
44533 9899000 13052737 16950423 13111921 7226217 8508046 13307685 11203751 790760
44525 790760 -12026690 -25043718 -38018800 -46345248 -47089691 -44740018 -41240873 -29285163
44517 -29285163 -6924778 11784078 15555582 15051865 25588399 40611536 44689628 45203203
44509 45203203 62797064 90887975 95727769 65907903 33841311 31821830 49567214
44502 49567214 56229808 46944584 42000098 49079112 53292356 45399808 37049793 40222012
44494 40222012 47529516 43869877 28916553 17277778 18466881 23893099 15362229 -14959694
44486a4959694l8067436j9395051J3183048L0164792J4055901j8637654l0681360
44479f4337454m933759L2077945L7729261N810208k2552214j0961599K2923133
44472d244479L1938147O789262j2047845L092592K5510480J7754706r700915j7984699
44464D1107249l674024k482459k8449414m8310220l0686643Q886731L1855790
44457c1752990K4693487K956584j6363629k4548824j4110553J4409112M1294876
44450c421937M2921341K0156444k127864n165422N764992J4201589J1404997j55380
44442H3578760j1749018j3177993j637180J0276591M399111j9143386l5719171
44435A6827714k2739178J1262655L2787634J8482663k1545967n4523024n3528404
$$ plain form
44486 -14959694 -53027130 -72422181 -59239133 -29074341 -15018440 -33656094 -64337454
44479 -64337454 -69271213 -37193268 535993 6346201 -16206013 -27167612 -4244479
44472 -4244479 27693668 34482930 22435085 25527677 51038157 68792863 59091948 41107249
44464 41107249 37433225 34950766 6501352 -41808868 -72495511 -63608780 -31752990
44457 -31752990 -7059503 -4102919 -20466548 -45015372 -59125925 -44716813 -3421937
44450 -3421937 39499404 59655848 57527984 52362562 58127554 72329143 83734140 83578760
44442 83578760 71829742 58651749 57014569 67291160 71690271 52546885 16827714
44435 16827714 -5911464 5351191 38138825 56621488 35075521 -19447503 -72975907
44428g2975907j7620131K7364168M7551831L1004971K493791k221834J8572268
44421C4169157K7920075J522514l3153441l1293375O403179L4821165K6916988
44414F7306262K681288j1498992j8240828k6199234k3625206k870978J3717291
44407A269603O270444k969995J8504697N3555289N1577161M507102l7287025l5597342
44399E9829934j1089379j331406p485829r513677q015241j8406787l6306930l8517956
44391g0837271j6601272J1373669K4240925J9833186J1827426J1474952J4024364
44384E335979M416261j9345184l4390104j8024584J8710337M0962610L3683797
44377C1349112J4592450J684526p522835j7614263k1759973j7839185j4986623
$$ plain form
44428 -72975907 -90596038 -63231870 -15680039 15324932 17818723 15596889 34169157
44421 34169157 62089232 63611746 30458305 -835070 5568109 40389274 67306262
44414 67306262 69987550 58488558 40247730 14048496 -9576710 -12447688 1269603
44407 1269603 7540047 4570052 23074749 76630038 128207199 132714301 95427276 59829934
44399 59829934 48740555 47409149 39923320 30409643 22394402 3987615 -32319315 -70837271
44391 -70837271 -87438543 -76064874 -51823949 -31990763 -20163337 -8688385 5335979
44384 5335979 9752240 -9592944 -43983048 -62007632 -43297295 -2334685 31349112
44377 31349112 45941562 47626088 40103253 22488990 729017 -17110168 -32096791
44370c2096791j3320302j703321J3719058Q610688j6325215k3936480M778612
44363f0273751L6615644L5077663J2639512O52915k859302j4359820k0481593
44356a2988732j384397K0863717J0532904j6858282j4190829J6599115K2783120
44349B5356616j3075105m3086409k8359170P694167K5201438K3218468K0683493
44342A7633498J8609886J1765675R200467J4735318J1367040r557066k6928929
44335D6825889k1756868p502194m342514n883043K437093J2565553Q808952l901040
44327B7251828j2271645j7722647k1999701r516221K5431473N0796593L1864891
44320G3834571j4331336l4371238p137294L2186574L9250402Q182298l1332059
$$ plain form
44370 -32096791 -45417093 -47120414 -33401356 -24790668 -41115883 -65052363 -60273751
44363 -60273751 -23658107 11419556 24059068 24711983 21852681 7492861 -12988732
44356 -12988732 -14373129 6490588 17023492 165210 -14025619 2573496 25356616
44349 25356616 12281511 -30804898 -59164068 -51469901 -26268463 -3049995 17633498
44342 17633498 36243384 48009059 57209526 71944844 83311884 73754818 46825889
44335 46825889 25069021 17566827 13224313 7341270 9778363 22343916 31152868 27251828
44327 27251828 14980183 -2742464 -24742165 -34258386 -8826913 41969680 73834571
44320 73834571 59503235 25131997 17994703 50181277 89431679 97613977 66281918
44313F6281918m6816589l0141857l224541N169603n615704p738586J2861982L4028882
44305B4805108L2783564J9726240J3980909O585005j8599655m5177708m3070699
44298h967236j6598955L353339P703579J2336852J9253342J5004763N481129J0164547
44290D7731360K0519287Q127655k0397853k3503015P753960K8984787J0018596
44283G9234777j9725676k0117688K696732J7957645J7072664Q242468p505817
44276G7855105k4332062k1642513K990597J5954516n438814l2927674k8719130
44269a6259975k469311J1556907J0830949J4066548J4915093l276858k0680907
44262H682446m392039K7984154K6864003n906453j4622287J7124957L5252642
$$ plain form
44313 66281918 19465329 -10676528 -13901069 -8731466 -14347170 -22085756 -9223774 24805108
44305 24805108 57588672 77314912 91295821 97880826 79281171 34103463 -8967236
44298 -8967236 -25566191 -22212852 -14509273 -2172421 17080921 32085684 37566813 47731360
44290 47731360 68250647 76378302 55980449 32477434 40231394 69216181 79234777
44283 79234777 59509101 39391413 42088145 60045790 77118454 85360922 77855105
44276 77855105 53523043 31880530 34871127 50825643 45386829 12459155 -16259975
44269 -16259975 -18729286 -7172379 3658570 17725118 32640211 29363353 8682446
44262 8682446 4290407 32274561 59138564 53232111 38609824 55734781 90987423
44255I0987423L897617l5062573l1667626n456010k330113j4500334l451333K2927814
44247B5344865K0147536j4851904l5649356j9854619L017597Q310572J1482408
44240b052901K6738302L3193718J0746961k1210668l0681167j7501859m232649
44233e000263P93998N696747J2115370J3679643J0358762O090653n91723q900435
44225C4242752r554180j390583m87446j4365836k2393324n373752J9638576K2679362
44217B2995569P430261J243634O707838J777725j3655568j4222088J772027M669186
44209A8718584j0734750q954679K1407089L4451604j220058l9350421j9824090
44202e506721L3105925M1932595n959955m0923400j9684063J6048246J5991131
$$ plain form
44255 90987423 94885040 59822467 28154841 22698831 20368718 5868384 2417051 25344865
44247 25344865 45492401 30640497 -5008859 -24863478 -21845881 -13535309 -2052901
44240 -2052901 24685401 57879119 68626080 47415412 16734245 -767614 -5000263
44233 -5000263 -4206265 1490482 13605852 27285495 37644257 43734910 43143187 34242752
44225 34242752 24688572 23297989 22810543 8444707 -13948617 -19322369 316207 22995569
44217 22995569 30425830 31669464 38377302 40155027 26499459 12277371 14049398 18718584
44209 18718584 7983834 -970845 20436244 54887848 53667790 14317369 -5506721
44202 -5506721 27599204 69531799 63571844 22648444 2964381 19012627 35003758
44195C5003758k694271J443513J8856619J0205882k0888206l0140911k474478
44188I311906K5776465K0410495r095827l0925921k8284870o381738J7865819
44181a323671K5231096R534395j0982437j2442573K375995Q381853k748542j0316647
44173G709469R9764J2236091O363380p715202o779876Q140921J4290728L499871
44165C7845146p489431n861937n45937k175811l170319O860302J7393310Q453190
44157E1308513j6499497k8378246r142359K3903094L9949095K9525068O199032
44150I6864700j5456592k6742546j7920510J1779897L7196636K6449396j4036335
44143I8134646l8566468k1551703O223573L890021j8881817k1444261J102835
$$ plain form
44195 35003758 32309487 33753000 52609619 62815501 41927295 11786384 9311906
44188 9311906 35088371 55498866 46403039 15477118 -12807752 -19189490 -1323671
44181 -1323671 23907425 33441820 22459383 10016810 12392805 20774658 18026116 7709469
44173 7709469 7809233 20045324 26408704 18693502 11913626 20054547 34345275 37845146
44165 37845146 30355715 24493778 23947841 21772030 18601711 25462013 42855323 51308513
44157 51308513 34809016 6430770 -2711589 21191505 61140600 90665668 96864700
44150 96864700 81408108 54665562 36745052 48524949 85721585 112170981 98134646
44143 98134646 59568178 38016475 44240048 48130069 29248252 7803991 8906826
44136H906826J2893471n52546q694778J0476713L1258852K0889475q389077j9416766
44128D7372170m971877R403864Q425934K533454K320250L876424K160454j620269
44120F9500404q068375j7349773j9192592m025917J6420056K0847944J1661397
44113F9793144J2349896K6711588K7292963k573910l8420601m4898395k0118353
44106C0136332Q656105K1015532J7188683O329877p06850N615076K1159894K5689192
44098A35083841Q147123j4246004j9408015j2972641j5152369k2806650j2897082
44091D5748203J6295157L6505299K9410057R486066l728325j1832517k1223623
44084A00660317k3325304j1488982K00960j982209n183600R893776L2093314L1147000
$$ plain form
44136 8906826 21800297 21247751 12552973 23029686 54288538 75178013 66788936 47372170
44128 47372170 42400293 51804157 60230091 62763545 65083795 68960219 71120673 69500404
44120 69500404 61432029 44082256 24889664 20863747 37283803 58131747 69793144
44113 69793144 82143040 108854628 136147591 133573681 95153080 50254685 30136332
44106 30136332 38792437 59807969 76996652 83326529 82619679 88234755 109394649 135083841
44098 135083841 143230964 128984960 109576945 96604304 81451935 58645285 45748203
44091 45748203 62043360 98548659 127958716 137444782 133716457 121883940 100660317
44084 100660317 77335013 65846031 66046991 64064782 58881182 68774958 100868272 132015272
44076A32015272L249586k2246650k4471168j3461119m370726N025335J8176488
44069I3917018K3384691J1607831n124132j0724857p128067k096463R832693L1132948
44061A44801662L9407592J3046365k6164478l1489301K140539K5408743M554081
44054A71705203k8691587k4563114J1733745L0559234J0564958j6144414j3837664
44047A41326361J2625655L3094850K9602364P799833j3865557j8458758n306839
44040A86817909P304283O248396N759539K4573838M5716046L1904552j3672522
44033B94652041l9483452j5915640K2041497K8506274J0394757K430953O419552
44026C09045982j8184j1903622l561510J9146584K1548380k224413j9201573j2202343
$$ plain form
44076 132015272 135264858 113018208 88547040 75085921 70715195 75740530 93917018
44069 93917018 117301709 128909540 123785408 113060551 105932484 103836021 113668714 144801662
44061 144801662 184209254 197255619 171091141 139601840 141742379 167151122 171705203
44054 171705203 143013616 118450502 130184247 160743481 171308439 155164025 141326361
44047 141326361 153952016 187046866 216649230 224449063 210583506 192124748 186817909
44040 186817909 194122192 200370588 206130127 230703965 276420011 308324563 294652041
44033 294652041 255168589 239252949 261294446 289800720 300195477 302626430 309045982
44026 309045982 309027798 297124176 293562666 312709250 334257630 332033217 312831644 300629301
44018C00629301j048939J611559J1518862L2576626L8002802J5250922q744719
44011C89796414j3141404j5655602k9031903k5071159J6189161N5577257M3952198
44004D22614962j341764k3003000j0733332l975419j4947043j1333670J6848253
43997C74128987L3170383J7908883K411449J1614102J8442151p142966m0750260
43990D09782729l9403948j0025480L944699q816659j7332713m202068J0304951
43983C44251511P700047n09253Q79588L425709o258512j8681149j4100165N506388
43975C22214164J6613455N239198j6796769k9060117k4990724j2754523j869980
43968B58594704M034405N113199L124825J073393L09653j701842o635453r875065
$$ plain form
44018 300629301 299580362 301191921 312710783 345287409 383290211 398541133 389796414
44011 389796414 376655010 360999408 331967505 306896346 323085507 378662764 422614962
44004 422614962 421273198 398270198 387536866 383561447 368614404 357280734 374128987
43997 374128987 407299370 425208253 427619702 439233804 457675955 450532989 409782729
43990 409782729 370378781 360353301 364298000 355481341 338148628 333946560 344251511
43983 344251511 351951558 351442305 352321893 355747602 349489090 330807941 316707776 322214164
43975 322214164 338827619 344066817 327270048 298209931 273219207 260464684 258594704
43968 258594704 262629109 267742308 270867133 271940526 272250179 270548337 263912884 254037819
43960B54037819o128226J23322j758913j2256705j7533054o362326J5385582L1615736
43952B57123235L1177848J3256428j3506960l2733118l1152120j4104544p87933
43945B09272836R97689K519902J0524127J3994771O515462K554813J3121667K2920489
43937B82421756J4550860o24779k460477K091657n201814j4893177m748372J3967130
43929B85102784Q601081j6271517j9083271J0081242K7835146M609797k8795675
43922B72079587k9800453m332145J3293694J3064460Q745998N773855J451810
43915B80276806J165080O457901K457864j6974934k9230581j5797036L448062
43908B31803162O60281j2428008m837424J7449334J7312935j3007248l6790732
$$ plain form
43960 254037819 247909593 248032915 246274002 234017297 216484243 210121917 225507499 257123235
43952 257123235 288301083 301557511 288050551 255317433 224165313 210060769 209272836
43945 209272836 210270525 212790427 223314554 237309325 243824787 246379600 259501267 282421756
43937 282421756 296972616 296347837 293887360 295979017 290777203 275884026 271135654 285102784
43929 285102784 293703865 277432348 258349077 268430319 296265465 300875262 272079587
43922 272079587 242279134 237946989 251240683 264305143 273051141 278824996 280276806
43915 280276806 281441886 287899787 290357651 273382717 244152136 228355100 231803162
43908 231803162 232463443 220035435 215198011 232647345 249960280 236953032 200162300
43901B00162300k5740079M102267K0939515J7495416R757427J0771605J6299408
43894B53787859J1089982j1331694l3074130k7803462O36335J5612460p34575
43887B08182775j7950162n303747J6042980P504393j9695636k0636009P392781
43880A75537375J7644789j1469888m3406749m0628830j3138012R770968K0661322
43873A14970975K4451178J7039520k725208k0061528k1621592r972847Q186584
43866A10267082K7327097L1097230L647187l7456947n0529703k5080318L469616
43859F2741244Q720899P880732K1290137L3595546K3862531L550638p109689j3920136
43851A40611902k7396666l1763910j0884138J6127649K1852165J4058351J4325935
$$ plain form
43901 200162300 174422221 178524488 199464003 216959419 226716846 237488451 253787859
43894 253787859 264877841 253546147 220472017 192668555 193304890 208917350 208182775
43887 208182775 190232613 184928866 200971846 208476239 188780603 168144594 175537375
43880 175537375 193182164 181712276 138305527 97676697 84538685 94309653 114970975
43873 114970975 139422153 156461673 153736465 133674937 112053345 102080498 110267082
43866 110267082 137594179 168691409 172338596 134881649 84351946 59271628 62741244
43859 62741244 71462143 79342875 100633012 134228558 158091089 161641727 154532038 140611902
43851 140611902 113215236 81451326 70567188 86694837 108547002 122605353 136931288
43844A36931288J2241268j4459177m7110635m3270452m201980K3120003J6694741
43837G9945056N666081J3054949J7158070n275784l2729022k8613491K987433
43830E2193292K3314239J2846898p669861j1187620J217001Q750485K711215l550641
43822G8625008K429457J1461414O655892q216501j3144423n504145o055679k2120582
43814D4130441k9520340r656218J7352295K1640283Q321980M036852J1377379
43807F7682672R156494p914677k1767578k1901775j4530308j260421K1714090
43800C1178497M1247821L4251678L380875k0955502k1063217r763651k182344
43793E6094157L754382J0240522Q888362j050368n419001K386965R859936M963765
$$ plain form
43844 136931288 149172556 134713379 87602744 44332292 40130312 63250315 79945056
43837 79945056 85611137 98666086 115824156 110548372 77819350 49205859 52193292
43830 52193292 75507531 88354429 80684568 69496948 70713949 79464434 82175649 78625008
43822 78625008 81054465 92515879 99171771 90955270 77810847 72306702 66251023 44130441
43814 44130441 14610101 4953883 22306178 43946461 52268441 56305293 67682672
43807 67682672 76839166 68924489 47156911 25255136 10724828 9464407 31178497
43800 31178497 72426318 106677996 110058871 89103369 68040152 58276501 56094157
43793 56094157 59848539 70089061 78977423 77927055 72508054 74895019 84754955 89718720
43785H9718720r341067k4445043l1826734j9819067J1311465L2598707J6315401
43778F4512382j5892501j3376687K7130698M9210446J8532725k7470676l9309354
43771F3337033k3060532j1892242p034588P617205J9873003Q035886j2002791
43764D4872974p153461J5956008K1365948M385406n406216P11203J241815o034776
43756F9938901M588530L2749025L7371294k37611l8692034l2255177N678256K7028654
43748A06169838J5570778l891820j0689794j1102476j7004884k4513583j9395234
43741C5142825N141054L6616461M8226666K4738742j4381612l2178585j9135671
43734H4169880k614604l912149r456448p55191J0970378O070329n687574q60469
$$ plain form
43785 89718720 80377653 55932610 24105876 4286809 15598274 48196981 64512382
43778 64512382 48619881 35243194 62373892 111584338 130117063 102646387 63337033
43771 63337033 40276501 28384259 21349671 28966876 48839879 56875765 44872974
43764 44872974 37719513 53675521 75041469 79426875 74020659 74731862 75973677 69938901
43756 69938901 74527431 107276456 144647750 144410139 105718105 73462928 79141184 106169838
43748 106169838 121740616 117848796 107159002 96056526 79051642 54538059 35142825
43741 35142825 40283879 76900340 125127006 149865748 135484136 103305551 84169880
43734 84169880 81555276 77643127 68186679 67431488 78401866 84472195 78784621 77924152
43726G7924152J4089205J0661827j1248799j7711439M842561K3622305P924072
43719A10103884k2673503k5527484N135303L3675506L2285628Q963167j3634954
43712A28327547k3744575j9578701k967347J6332027K4176944J8894573J2839501
43705A54279969J0783069K501495j3294390j6639366L896015K5671053K1588380
43698A88786225L380613L663103K0487059J8712044p749654j7970434J0646729
43691B19955685L8548142K1573061j7001502j8760325K0389246M5013004K5758785
43684C35476096j107049K428149J6816682J904248l5703104n0943538k5331411
43677B43540073J0104146J8592611M26596j4931176o024418J7769341K6220716
$$ plain form
43726 77924152 92013357 102675184 91426385 73714946 78557507 102179812 110103884
43719 110103884 87430381 61902897 67038200 100713706 132999334 141962501 128327547
43712 128327547 104582972 85004271 82036924 98368951 122545895 141440468 154279969
43705 154279969 165063038 167564533 154270143 137630777 141526792 167197845 188786225
43698 188786225 192166838 195829941 216317000 235029044 227279390 209308956 219955685
43691 219955685 258503827 280076888 263075386 244315061 264704307 309717311 335476096
43684 335476096 334369047 336797196 353613878 355518126 319815022 268871484 243540073
43677 243540073 253644219 272236830 272663426 257732250 251707832 269477173 295697889
43670B95697889J334782l7790320n0762154k1920238J9559615L4881936K0457857
43663B61459367M006947M476341J3744921J6141347R228760J383750n62036K572771
43655C12452168L504822l342972j1581704q107375M827666M957032j8436656m0231738
43647B44041243k8913158O245826K4227667Q943486j1508536r782803M524624
43640B37778349Q712525K546136j010851j944394o318915o726341N510802J7739205
43632B56286516J0867705q890444j8721878j6038027j8836440k9359933k8363086
43625A46944413j2344867m647763j4945671j8388472J867634J8647071j84721
43618A16947624l5556800l9450324o218029J9527122J0677352o869713k354533
$$ plain form
43670 295697889 297032671 259242351 208480197 186559959 206119574 241001510 261459367
43663 261459367 265466314 269942655 283687576 299828923 309057683 310441433 309879397 312452168
43655 312452168 315956990 312614018 301032314 292924939 297752605 302709637 284272981 244041243
43647 244041243 215128085 221373911 245601578 254545064 243036528 233253725 237778349
43640 237778349 246490874 249037010 248026159 246081765 239762850 233036509 238547311 256286516
43632 256286516 267154221 258263777 239541899 223503872 204667432 175307499 146944413
43625 146944413 134599546 129951783 115006112 96617640 98485274 117132345 116947624
43618 116947624 81390824 41940500 35722471 55249593 65926945 59057232 56702699
43611E6702699J2099921R218467m611424l553312R013261M434109k0096049l1295524
43603C1912148j1095518J3355214J0871803o357809m075602J8272001K5058773
43596G7941010p98028k9812215k6898858l70717J1705365m454028k1983740j4525350
43588i196561P067467J2998569k685944j6142182q438620J0840884J9461984R247793
43580B3153390j0157120k4128309k1599778r1175K7468572L8491084K4920533
43573E8057197N356096Q41549O580918M678684l138554j174195M118254j2612216
43565F2707733m5748209m8121886K977009N8451175N5529198O133074j9715033
43558G2213061M791729K9876110J0510727k8180347l7890706k0849907j3494400
$$ plain form
43611 56702699 68802620 78021087 73409663 69856351 78869612 83303721 63207672 31912148
43603 31912148 20816630 34171844 45043647 38685838 34610236 52882237 77941010
43596 77941010 77142982 47330767 20431909 20061192 31766557 27312529 5328789 -9196561
43588 -9196561 -2129094 10869475 8183531 -7958651 -16397271 -5556387 13905597 23153390
43580 23153390 12996270 -11132039 -32731817 -32822992 -5354420 33136664 58057197
43573 58057197 63413293 64254842 70835760 75514444 72375890 71201695 75319949 62707733
43565 62707733 16959524 -31162362 -28185353 30265822 85795020 91928094 72213061
43558 72213061 77004790 106880900 117391627 89211280 51320574 30470667 16976267
43551A6976267k0264476j2284525J5304523L0766235J5725838r968378k2408281
43544A3847203k0156370p455544J5846738L4775830K3518151j2469874l1373171
43537A6532963j4433901L447115q022668k1078985K375647L8747685L4092243
43530E1660099p840334k9936931j2445852L343097o819529j1709275R713344K3305942
43522A9270561P57222k3992644r581949K0331635J6366537j2772537j7586369
43515g207544P152129J8631086L285095n554754N730093P802945j1236816j9393621
43507g91387q11416J0086538j0623402k7519042j790304L9519879M0061261k051533
43499D6080594l5691159l0285514l436355J9547695L2274221L2592987J7631785
$$ plain form
43551 16976267 -3288209 -15572734 -268211 30498024 46223862 36255484 13847203
43544 13847203 -6309167 -13764711 2082027 36857857 60376008 47906134 16532963
43537 16532963 2099062 5546177 -2476491 -23555476 -21179829 17567856 51660099
43530 51660099 43819765 13882834 1436982 4780079 -2039450 -13748725 -4035381 19270561
43522 19270561 20027783 -3964861 -13546810 6784825 23151362 10378825 -7207544
43515 -7207544 -55415 18575671 21860766 16306012 22036105 29839050 18602234 -791387
43507 -791387 -1602803 8483735 -2139667 -29658709 -31449013 8070866 48132127 46080594
43499 46080594 10389435 -19896079 -23332434 -3784739 28489482 61082469 78714254
43492G8714254j120671o093777m27318k382972j4121102k1449992k1276020k0556290
43484h713888j2105100J3867873L5271318J6538204l0721664m8492931j1688164
43477d6044352L3079573L3652611J973896j4926570m624106Q634128J2117755
43470B3862935J4033009J3979163K451378j2028677r880953L216766l94449k3698983
43462A1540189l2684188n749193K8972680K7232276j2764817m6161515l4819095
43455f4433663Q888542L7470379K3220186j0680404k0775243N25430J7248097
43448h536676L163108j9740368j4868248J4483666L2130280K2016514L854177
43441C2502453l281030k864004j698660K541480N676531m185989k0903615k0020577
$$ plain form
43492 78714254 77593583 71499806 71072488 68689516 54568414 33118422 11842402 -8713888
43484 -8713888 -20818988 -6951115 28320203 44858407 14136743 -34356188 -46044352
43477 -46044352 -12964779 20687832 22661728 7735158 3111052 11745180 23862935
43470 23862935 37895944 51875107 54326485 42297808 32416855 35633621 35239172 11540189
43462 11540189 -21143999 -26893192 2079488 29311764 16546947 -29614568 -64433663
43455 -64433663 -55545121 -18074742 5145444 -5534960 -26310203 -25784773 -8536676
43448 -8536676 -5373568 -25113936 -39982184 -25498518 6631762 28648276 32502453
43441 32502453 29221423 26357419 24658759 27200239 32876770 28690781 7787166 -12233411
43433a2233411J499640J2979352k778292j7715920k045429K3953385J8285828
43426B1945153j6087593l2975663r617289K5444075L7469168K6091617R119977
43419F1389445o239782j8904953k1036969q162304R652859J9972436K1332992
43412E8003724J5857443J984806j5596258k3248013j7388771j1930647j4328750
43405f646466j1081926N870266J6503043J918003j7821244q194851K2728783K9492610
43397C2768218k006827k8755652j3212901K0363977K3381766m193101j7211909
43390A1133571L733964K4189892J0008775k1530446k8213021l341484J8004009
43383A3985260J0650124q291567r505621L933109L405829j8027396l0573773j1996044
$$ plain form
43433 -12233411 -10733771 2245581 -532711 -18248631 -20294060 3659325 21945153
43426 21945153 5857560 -27118103 -36735392 -11291317 26177851 52269468 61389445
43419 61389445 55149663 36244710 15207741 7045437 16698296 36670732 58003724
43412 58003724 73861167 75845973 60249715 37001702 19612931 7682284 -6646466
43405 -6646466 -17728392 -11858126 4644917 6562920 -11258324 -19453175 3275608 32768218
43397 32768218 30761391 2005739 -11207162 9156815 32538581 28345480 11133571
43390 11133571 14867535 39057427 49066202 27535756 -677265 -4018749 13985260
43383 13985260 24635384 16343817 6838196 10771305 14177134 -3850262 -34424035 -46420079
43375d6420079J3761767Q339312k0185271k3281765J5434874N0945016M1792287
43368D0386141J0498492K843348J2832556j295309l7303348m4403958p319312
43361b3761390K2994238Q511459j7378667r309055J5506764J2641400j1078501
43354a873752j2906423Q994542J4634959n558683j6200154j470944J0541408K434577
43346a404470m508122K685059J461356j9825306l1650616j1185480J7487274K4530971
43338b2409334K0075176K2357053J5628174j5792030m1647774k5053795J3316525
43331c3526005K2829821M81846j2222075j152012O634624m06224k049436P704109
43323a1705352R294476R70602M100477J4726261J410941l3055301m1392797o848944
$$ plain form
43375 -46420079 -32658312 -24319000 -44504271 -67786036 -52351162 -1406146 40386141
43368 40386141 50884633 53727981 66560537 65265228 27961880 -16442078 -23761390
43361 -23761390 -767152 7744307 -9634360 -18943415 -3436651 9204749 -1873752
43354 -1873752 -14780175 -5785633 8849326 3290643 -12909511 -14380455 -3839047 -1404470
43346 -1404470 -5912592 -3227533 -1766177 -21591483 -53242099 -64427579 -46940305 -22409334
43338 -22409334 -2334158 20022895 35651069 19859039 -21788735 -46842530 -33526005
43331 -33526005 -10696184 -10214338 -22436413 -23588425 -16953801 -17360025 -19409461 -11705352
43323 -11705352 -2410876 -1440274 2660203 17386464 18797405 -14257896 -55650693 -62499637
43315f2499637K3889981J4340933m774302P872726L4629610L3655335Q947473
43308E6062119m856945k247221k267749m746505P06970J63429k0694794l4640857
43300a2521553q894707K9166768K2296961k3758974m1244099l455903L5439540
43293b971967K5696426q549092j7322476K596979K0189392K1633974J2480710
43286E3753946o392228l0510986l8409564j7363387J1978795K1767737J2578196
43279G402509J520259n514689o385127R594556L7545979M3236412Q536327k9047968
43271F6888258k3449802Q391695R984408k5985088m5566890j7962314J9103920
43264h595813J9559351p782414k4659344j9335502n661416R166212K3187903K3552394
$$ plain form
43315 -62499637 -38609656 -24268723 -29043025 -21170299 13459311 47114646 56062119
43308 56062119 51205174 48957953 46690204 41943699 42650669 42814098 22119304 -12521553
43300 -12521553 -21416260 7750508 30047469 6288495 -34955604 -38411507 -2971967
43293 -2971967 22724459 14175367 -3147109 -550130 19639262 41273236 53753946
43286 53753946 47361718 16850732 -21558832 -38922219 -26943424 -5175687 7402509
43279 7402509 8922768 3408079 -2977048 6617508 44163487 87399899 95936226 66888258
43271 66888258 43438456 51830151 61814559 35829471 -9737419 -27699733 -8595813
43264 -8595813 10963538 3181124 -21478220 -40813722 -46475138 -37308926 -14121023 9431371
43256I431371M122772j2731964l211996J7455715J3699502j5187165l2076619
43249a8498384j7322142N739360J1302426P515661J3924522K5077997K0301244
43242D8040684k339885k3411481k7474743j3896859J1821222L9250192M8788589
43235H0777719K6585819j2455126l3475579k1352700P49889J944843j6484466
43228B6290399k4223405k715238K8675489L3030355j085129m3676296n4090821
43221c7794646k4558390J3631926K6640436J1032162j2052158k2349590j1718440
43214e7168700J5782190L9635396L1083584j2312997m8274480l3259174J7447021
43207d7067160M3661458J9120479j6846131j9664667K428575J4691606J0728587
$$ plain form
43256 9431371 13554143 822179 -2389817 15065898 28765400 13578235 -18498384
43249 -18498384 -35820526 -30081166 -18778740 -11263079 2661443 27739440 48040684
43242 48040684 45700799 22289318 -5185425 -19082284 -7261062 31989130 80777719
43235 80777719 107363538 94908412 61432833 40080133 40830022 42774865 26290399
43228 26290399 2066994 -648244 28027245 61057600 59972471 16296175 -37794646
43221 -37794646 -62353036 -48721110 -22080674 -11048512 -23100670 -45450260 -57168700
43214 -57168700 -41386510 -1751114 29332470 17019473 -31255007 -64514181 -47067160
43207 -47067160 -3405702 15714777 -1131354 -20796021 -18367446 -3675840 7052747
43200G052747P773893P606330l87863q053987K644503K3580244K7538586J0478324
43192G8232777n865398j3238428k3403266l2549315j8742618J3575038K5817276
43185B3826066K571745j8224130k73638L4133836L5532156k528989l7909101l5242304
43177A885641R94123M2186604N9812266L9757203m091572l4047929k6505050r73438
43169G9017848P133640o084212j6147866j2882521j0804536j7448796k0072039
43162B711518r566608O332832J9677662K9961508L0265961J0440040j7913553
43155G1909360k5731091q622167J164912j6560347l4139246j6269866K2326399
43148e922046L4212673Q100186j5580562m855963J9545192J8465087q797413k7212517
$$ plain form
43200 7052747 14826640 22432970 22045107 13991120 16635623 40215867 67754453 78232777
43192 78232777 72367379 59128951 35725685 3176370 -15566248 -1991210 23826066
43185 23826066 26397811 8173681 7900043 42033879 77566035 75037046 37127945 1885641
43177 1885641 2879764 45066368 104878634 144635837 140544265 106496336 79991286 79017848
43169 79017848 86151488 80067276 63919410 51036889 40232353 22783557 2711518
43162 2711518 -6855090 -522258 19155404 49116912 79382873 89822913 71909360
43155 71909360 46178269 37556102 38721014 22160667 -11978579 -28248445 -5922046
43148 -5922046 28290627 36390813 20810251 15954288 35499480 53964567 45167154 17954637
43140A7954637j7201107K503748P026847n1649K650808J9933364L2431997K2521397
43132H7770042m618432k9070417l6613314k7194098j0501128J649520L859052
43125a4718775K492294P505518J6503916J5881570K991474m610270O634708K3004466
43117E5684901K0897862J531281j1570880r019395p428135j8219341k5808992
43110F067301j2132866J2001127K0038102P403815m411504j862066K246880p364174
43102B1986615k1585199j9280571P4001J3279350N208297j0904688j3541158k822744
43094b7586097K694409n426849j4647838j0723680M047512J6181961J6360993
43087a9099589O421768j860710M728908K3305950K8133955j165766m3461615n1926883
$$ plain form
43140 17954637 753530 3257278 10284125 10232476 12883284 32816648 65248645 87770042
43132 87770042 83151610 54081193 17467879 -9726219 -20227347 -18577827 -14718775
43125 -14718775 -12226481 -4720963 11782953 27664523 30655997 26045727 32680435 55684901
43117 55684901 76582763 78114044 66543164 57523769 50095634 31876293 6067301
43110 6067301 -6065565 5935562 25973664 33377479 28965975 27103909 29350789 21986615
43102 21986615 401416 -18879155 -18805154 -5525804 -317507 -11222195 -24763353 -27586097
43094 -27586097 -24891688 -30318537 -44966375 -55690055 -51642543 -35460582 -19099589
43087 -19099589 -12677821 -14538531 -9809623 13496327 41630282 40464516 -2997099 -54923982
43079e4923982j5176907K3472622K5594610R756945J5026107L4871203K9018945
43072F7639543p676916l3773390k4354722m221502k464532r157130k60508K0795881
43064F526724L2129798K6640856J3469836q80621j3367367j7615559j3450122
43057C3453545j2217839j7591977j4588542N676496K4989921K1717587K393802
43050D3832993j1649150j6484432k0304231j7709821J633484K4838765K6648696
43043C0806304Q087383l752376L617744J4668516J6160213J2842826P059560q350200
43035H1139970k6918582k7356442r718634l883014k1895739k9810034L732167
43028c4710308N1694137N7488956J1380010l6723904m2519544j5364049P286505
$$ plain form
43079 -54923982 -70100889 -46628267 -21033657 -11276712 3749395 38620598 67639543
43072 67639543 59962627 26189237 1834515 -2386987 -4851519 -14008649 -14269157 6526724
43064 6526724 38656522 65297378 78767214 77886593 64519226 46903667 33453545
43057 33453545 21235706 3643729 -10944813 -5268317 19721604 41439191 43832993
43050 43832993 32183843 15699411 -4604820 -22314641 -20681157 4157608 30806304
43043 30806304 38893687 35141311 38759055 53427571 69587784 82430610 89490170 81139970
43035 81139970 54221388 26864946 17146312 13263298 -8632441 -38442475 -34710308
43028 -34710308 16983829 74472785 85852795 49128891 6609347 -8754702 -1468197
43021a468197Q905754K265226K774240R050153P963814p339238k5351261k5663185
43013b8862694m752985J5178322J3605653K35603j70140J3758035J8812692N470281
43005C3274767p322461m519824J340801m809499j1181965K105069K5823294K8685968
42997F3396150Q21519l0994712l6688086j6522878N345207J0859968L865460l26302
42989b43674M385414P792288m4533r336380j399381J7956770J5606330k3138610
42981A1578224o3211677n9062646j5682849J8494476J7333042M464968Q904238
42974g7182224K3450137K3230256L924239j6549004k1321211p182111J4178338
42967e7451580K0844744K770954j6686765n150421K6777018L1379441k723598
$$ plain form
43021 -1468197 7437557 9702783 12477023 21527176 29490990 22151752 -3199509 -28862694
43013 -28862694 -33615679 -18437357 -4831704 -4596101 -4766241 8991794 27804486 33274767
43005 33274767 25952306 21432482 22773283 17963784 6781819 8886888 34710182 63396150
42997 63396150 64217669 33222957 -3465129 -19988007 -14642800 -3782832 82628 -243674
42989 -243674 4141740 11934028 11889495 2553115 1153734 19110504 34716834 11578224
42981 11578224 -51633453 -110696099 -126378948 -107884472 -90551430 -86086462 -77182224
42974 -77182224 -53732087 -30501831 -26577592 -43126596 -64447807 -71629918 -57451580
42967 -57451580 -36606836 -33835882 -50522647 -55673068 -28896050 2483391 -240207
42960b40207k3034218R195154N1790655M0780483j0299835l1197112m498998J2900732
42952D5396654j2424487l6646454j3622473K8501776L0401143j0901010m3840680
42945a3135531l6066168n861351J4987283J6586947P787904J711008P329135J9868222
42937A3207449K0978941J593960k0998767k4107880j1289208m869199j0900568
42930c6385272j2176295K210879J9588180K3264909J5373739J0202701J2727734
42923C4806575J4343649Q332173N23646l52526J585845o755664k5094392l3002971
42915e613665j6519304P574725J1131850o131574j7019037o596476J0469930J7089615
42907e613936J5795280J4137119Q957259j761563r028874p969138o521216p240873
$$ plain form
42960 -240207 -23274425 -14079271 37711384 78491867 68192032 36994920 32495922 45396654
42952 45396654 32972167 -3674287 -17296760 11205016 41606159 30705149 -13135531
42945 -13135531 -49201699 -55063050 -40075767 -23488820 -15700916 -13989908 -6660773 13207449
42937 13207449 34186390 35780350 14781583 -9326297 -20615505 -25484704 -36385272
42930 -36385272 -48561567 -46350688 -26762508 -3497599 11876140 22078841 34806575
42923 34806575 49150224 57482397 58006043 57653517 59239362 52483698 27389306 -5613665
42915 -5613665 -22132969 -14558244 -3426394 -9557968 -26577005 -33173481 -22703551 -5613936
42907 -5613936 10181344 24318463 33275722 31514159 22485285 14516147 7994931 754058
42899G54058P26963J7409199K0593684k015733k7996328l0048856j4508762n756394
42891d0842169o764600l002266M844039K403634p951092o766691J0684576K5861570
42883b1532999K3979241J1214273K040321L833381J4483931K3194959J6576967
42876G3790074m322229j8798187j0402097J1676943K6677476K5997151J0579981
42869A15199112j7611792m3683591m0474473o333245J8618373M927547j8746014
42862A1895917r563164J8136188J6148702j3850611j9182404J6903565M6140112
42855F6628305L1155038j888093j3136545o800126o804774j0886674m436135N821591
42847E9652587N192505p56216L60548J958039r044699k7482873l8207065l6246245
$$ plain form
42899 754058 1481021 18890220 39483904 37468171 9471843 -20577013 -35085775 -40842169
42891 -40842169 -47606769 -50609035 -45764996 -43361362 -51312454 -58079145 -47394569 -21532999
42883 -21532999 2446242 13660515 15700836 19534217 34018148 57213107 73790074
42876 73790074 69467845 50669658 40267561 51944504 78621980 104619131 115199112
42869 115199112 97587320 53903729 13429256 7096011 25714384 30641931 11895917
42862 11895917 2332753 20468941 36617643 22767032 3584628 20488193 66628305
42855 66628305 97783343 95895250 82758705 75958579 69153805 58267131 53830996 59652587
42847 59652587 64845092 64088876 64449424 66407463 57362764 29879891 -8327174 -44573419
42839d4573419k3475502j585844J8005222J7411051k66877r245453r83953J525675
42831d3189100j3179403j9747375P04546K3477670J9354826L276702O073328K0383955
42823b844851J7024142r16528m639730Q478543J2577039O6416r303018o976686
42815A3465327n945174r259208l647198R209148Q451592r277356j8792876m151916
42807a9947661J7666741K3586207J4089999L811423o02647j990059m204958r361619
42799B3047426j4282082r193564Q081398J9820515P372315j9270749k9949005
42792a4373746j2736371J4648617L1664880L3281211K1259138m96735j7922272
42785E5324722j5334455J733335J0344891J694573r253613r940221o367239o655066
$$ plain form
42839 -44573419 -68048921 -69634765 -51629543 -34218492 -34485369 -43730822 -44714775 -43189100
42831 -43189100 -56368503 -76115878 -75411332 -51933662 -32578836 -29302134 -23228806 -2844851
42823 -2844851 14179291 13262763 8623033 17101576 29678615 29745031 20442013 13465327
42815 13465327 7520153 -1739055 -5386253 3822895 12274487 2997131 -15795745 -19947661
42807 -19947661 -2280920 21305287 35395286 39206709 38604062 36614003 32409045 23047426
42799 23047426 8765344 -428220 7653178 27473693 34846008 15575259 -14373746
42792 -14373746 -27110117 -12461500 19203380 52484591 73743729 73246994 55324722
42785 55324722 39990267 41723602 52068493 53763066 44509453 34569232 28201993 21546927
42777B1546927p759756p447099j2176338k2470487k4646874q539006J5724918
42770d5767715K7253567J5454127j0755711k8681082j9332331J1199392L1984982
42763a8644771K0786008q081035k2826164j2935713P922736K6786891L6346848
42756B9354800K6081240k024630j7483977L662703L3007694K0731435k6683884
42749F6645381m7613390j5310576K3616982K3782736M866437M792723J2275014
42742G3055307m461104l0921459k4721745J1130194K7776859N875544j6813243
42735D0920353o959267J5261114J2577831j1323283k0593300l265198J1370646
42728C7988896k281136k5695419k1350153Q906098J9394749j3577307m9387314
$$ plain form
42777 21546927 13787171 6340072 -5836266 -28306753 -52953627 -61492633 -45767715
42770 -45767715 -18514148 -3060021 -13815732 -42496814 -61829145 -50629753 -18644771
42763 -18644771 2141237 -5939798 -28765962 -41701675 -33778939 -6992048 29354800
42756 29354800 55436040 53411410 35927433 39590136 72597830 93329265 66645381
42749 66645381 19031991 3721415 27338397 51121133 55987570 60780293 73055307
42742 73055307 68594203 37672744 12950999 24081193 51858052 57733596 40920353
42735 40920353 33961086 49222200 61800031 50476748 29883448 26618250 37988896
42728 37988896 35707760 10012341 -11337812 -2431714 16963035 3385728 -46001586
42721d6001586l6769906R453664K9369683R508021l62926K6783906M9291110K7602706
42713F8874672r722485j6371223m057240j2104336l0630310j8221261J8432608
42706c799575K9393302N116100j0116448J537821K359902k6870899m4738768j8501929
42698f5620494J5690184J0148573j5175090o364008L4837817N3262204K5366885
42691E2146071j2227198k4991979k2770978k3644249j7381081P839114L1750524
42684i279776K7481896M637433m176432P317745J2840715k703128k0933147k0384026
42676e198720o518106L139383O486696J1050753J2961875L557888q900665p074605
42668I504499O179293R179697l888339j2812497m755141N467087L268398K71023
$$ plain form
42721 -46001586 -82771492 -73317828 -43948145 -34440124 -34803050 -8019144 41271966 68874672
42713 68874672 59152187 42780964 38723724 26619388 -4010922 -22232183 -3799575
42706 -3799575 25593727 30709827 20593379 22131200 24491102 -2379797 -47118565 -65620494
42698 -65620494 -49930310 -39781737 -54956827 -61320835 -26483018 26779186 52146071
42691 52146071 39918873 14926894 -7844084 -31488333 -48869414 -41030300 -9279776
42684 -9279776 18202120 22839553 18663121 25980866 38821581 36118453 15185306 -5198720
42676 -5198720 -11716826 -8577443 -2090747 8960006 21921881 25479769 16579104 9504499
42668 9504499 15683792 24863489 20975150 8162653 3407512 8874599 12142997 12414020
42660A2414020J0597490J9415184L568754k6953243l9162630k5446776j0754569
42653e6321770r127573n128995J1511630K3883123J8813965J2790230K1415033
42646A7835643K4548363m268903m4773058m5457929L830848N0611937M7388431
42639D9715332J1915393n215785P079201J3790762p316089l5711107m4422189
42632a0164482l5936820k4967034r515844J6708283L8821835L5667432J3666558
42625B4279928l84416J921178M629088K51129J83139O203920O58375k1041372
42617A6700969l3958288j9373140L555482M781490j2898349k1142174p511919
42610f9845929J3718292K7003586L0196820K5411816J4106092K609564j688831
$$ plain form
42660 12414020 23011510 42426694 45995448 19042205 -20120425 -45567201 -56321770
42653 -56321770 -65449343 -70578338 -59066708 -35183585 -16369620 -3579390 17835643
42646 17835643 42384006 38115103 -6657955 -52115884 -48285036 2326901 49715332
42639 49715332 61630725 56414940 63494141 77284903 69968814 34257707 -10164482
42632 -10164482 -46101302 -71068336 -80584180 -63875897 -25054062 10613370 24279928
42625 24279928 23895512 25816690 30445778 30696907 30880046 37083966 37742341 16700969
42617 16700969 -17257319 -36630459 -33074977 -28293487 -41191836 -62334010 -69845929
42610 -69845929 -56127637 -29124051 1072769 26484585 40590677 43200241 41511410
42603D1511410j078367m504317j4724668k5862244k9824378j9473246N839340
42596d8116470L0568520L1100066M735079k1533235k3416446p671186M292630
42589c0041042N136531j118151j2103810j8537049k650845L1347524M6010777
42582A8043935J8629002j9584854k5858305p710139k509823j3185391j2474644
42575d4650219M72290J347471o217909M517307K4298549J4284099j9664545k3539147
42567d9152104J4852844L7912979J0648500k2415701j4137656J0601644R281983
42560b407511j537732J3689492L3930949J5486608k5434752l3539675k874534
42553b687155K0908463J8266669J2889927J4151927M129385j3946342j2301251
$$ plain form
42603 41511410 40433043 35928726 21204058 -4658186 -34482564 -53955810 -48116470
42596 -48116470 -17547950 13552116 18287195 -3246040 -26662486 -34333672 -30041042
42589 -30041042 -24904511 -26022662 -38126472 -56663521 -59314366 -27966842 18043935
42582 18043935 36672937 17088083 -8770222 -16480361 -18990184 -32175575 -44650219
42575 -44650219 -44177929 -42830458 -49048367 -44531060 -20232511 -5948412 -25612957 -49152104
42567 -49152104 -34299260 3613719 14262219 -8153482 -22291138 -11689494 -2407511
42560 -2407511 -3945243 9744249 43675198 59161806 33727054 187379 -2687155
42553 -2687155 18221308 36487977 49377904 63529831 67659216 53712874 41411623
42546D1411623P258143R150811j4734662k9868067j7906525j901401J665316P097183
42538B172421J7984348J0617952j7483278k8712438l641819K3245987J7112728
42531B1295901n330106j0267830O89236O997939Q478856J2775957R100056j0822378
42523C2917631k7688197k2396214o789552K791059J5629911L6740371L7263887
42516F8468896j826022m2449353l6292613k85740Q722016j7120491l0364480q173573
42508e9321360J8910600K4842074K1095303J9144116R692287l996280Q59404K0225897
42500E1452041J6026936j9946875m0101525j1505378K8758977K8889871o91726
42493E2882321j2060332K171370N827937j5458249l3097648k3135147J527449
$$ plain form
42546 41411623 48669766 57820577 43085915 13217848 -4688677 -6590078 -4924762 2172421
42538 2172421 20156769 30774721 13291443 -15420995 -19062814 4183173 21295901
42531 21295901 15965795 5697965 6387201 13385140 21863996 34639953 43740009 32917631
42523 32917631 5229434 -17166780 -23956332 -21165273 -5535362 31205009 68468896
42516 68468896 66642874 24193521 -12099092 -12384832 -3662816 -20783307 -51147787 -59321360
42508 -59321360 -40410760 -15568686 5526617 24670733 34363020 30366740 31226144 51452041
42500 51452041 67478977 47532102 7430577 -4074801 24684176 53574047 52882321
42493 52882321 40821989 42993359 48821296 33363047 265399 -22869748 -21342299
42486b1342299J5117105J0091114l155065j1061430q220735l924031j1860494
42479c4355835k4387805j3332915K6731360N6530527M0376655j582917k2895787
42472B7083283j7194521j4188863j9576273q273036K0554887L2390535J4746111
42465C5542123p42989O467153J2223139m304602k0154679j0691444L390689p253342
42457A4476048k5097787j4353751J3563719J4811846j3091670k4141785K560429
42450c1272951K8947327J6731481j6314561k5247530o20773K4703995K2040264
42443A8967252j186223j5976264o408759J4211055K0785730P915878l919226J832216
42435C6221659J4141825J3156667M67856q446708j2018678j8514505k1148169
$$ plain form
42486 -21342299 -6225194 3865920 710855 -10350575 -18571310 -22495341 -34355835
42479 -34355835 -58743640 -72076555 -45345195 11185332 51561987 49979070 27083283
42472 27083283 9888762 -4300101 -23876374 -32149410 -11594523 20796012 35542123
42465 35542123 34799134 41266287 53489426 49184824 29030145 18338701 21729390 14476048
42457 14476048 -10621739 -24975490 -11411771 3400075 -9691595 -33833380 -31272951
42450 -31272951 -2325624 14405857 -1908704 -27156234 -27777007 -3073012 18967252
42443 18967252 17781029 1804765 -4603994 9607061 30392791 38308669 34389443 36221659
42435 36221659 50363484 63520151 63988007 55541299 43522621 25008116 3859947
42428C859947o684170J2967206J0963541q031330p310810K2885272M1420299J4678239
42420H4748194l0812794m4623575k0156862O612703J2189829N696357P54059l24923
42412A4082988N140214J8547864K4474852M697844k6981766l2098836q75009K7859822
42404C4847973J7688566j5756532k9144785j0799626J1215000J4263381N959556
42397B8273533K88327m285919r829118l966797J9184464L7226730K3908456j0683247
42389H0116429l0788414k5082349j6890825j8905447j1630785J5362511L3577619
42382B5758739J7339611j0061670j0021006R563006J0284169r037548j1109869
42375B2715432J1596210J9966612n448792k9990709k1397738J857851R114480
$$ plain form
42428 3859947 -2824223 10142983 21106524 13075194 5764384 28649656 70069955 84748194
42420 84748194 53935400 9311825 -10845037 -4232334 7957495 13653852 14407911 14082988
42412 14082988 19223202 37771066 62245918 66943762 39961996 7863160 6988151 34847973
42404 34847973 52536539 36780007 7635222 -3164404 8050596 22313977 28273533
42397 28273533 28561860 24275941 14446823 10480026 29664490 66891220 90799676 80116429
42389 80116429 49328015 24245666 7354841 -11550606 -23181391 -7818880 25758739
42382 25758739 43098350 33036680 23015674 32578680 42862849 33825301 22715432
42375 22715432 34311642 54278254 48829462 18838753 -2558985 -701134 8413346
42368H413346O620504J2460273J5067036k319423k0940747j3102363Q914398J2637824
42360B7750848n68552m062779K610601m405371k4838572l1579354j7258556l565601
42352e5917336j286189J390518P293059M086695n288841j725530J4703089K2654401
42344a4090134J6953541J2731975R885992n888193k2399936q378032K7513296
42337A6328509L5379100J284928k4581797n151892K5696138J9157484j5723003
42330E2389467l6704209l1898971j6233327O289867L3197765M1583312J9293698
42323F7917602m067907l6354Q519872j2832698m3682175l7908633k902245J1292049
42315a3700489m884027j0708219R303880K2201168J0425997J70301P102434P687451
$$ plain form
42368 8413346 15033850 27494123 42561159 40241736 19300989 6198626 15113024 27750848
42360 27750848 27182296 23119517 25730118 21324747 -3513825 -35093179 -52351735 -55917336
42352 -55917336 -57203525 -55813007 -48519948 -44433253 -49722094 -51447624 -36744535 -14090134
42344 -14090134 2863407 15595382 25481374 19593181 -2806755 -11184787 16328509
42337 16328509 51707609 52992537 28410740 23258848 48954986 68112470 52389467
42330 52389467 15685258 -16213713 -32447040 -26157173 7040592 48623904 67917602
42323 67917602 63849695 63813341 72333213 59500515 15818340 -22090293 -24992538 -13700489
42315 -13700489 -18584516 -29292735 -19988855 2212313 12638310 12808611 19911045 27598496
42307B7598496j1328883k4001205j2965366o70451l553453N40283K5102418L8021462
42299C8743301J3158752j8458523j5321253P857836J0133671m826682l322249
42292B7964853J0623393K262715k4937247k8061420J085459J7877972j778936
42285E036789k1427845m208779K9577853L8450086K1216704O495388L013641l366215
42277G4787622j5470509k0676549j6128035j1745480j0633531p583233l323488
42270a0773203j156790M695687J7291406K1390955M291471j4867047p921250J2177264
42262B5128493K245966m1032684o2879292k6687777K6829195L4071540k191556
42255d4516115k3629286n264372J7165771J3894264N171299J6256209K9653256
$$ plain form
42307 27598496 16269613 -7731592 -20696958 -21367409 -24920862 -24380579 721839 38743301
42299 38743301 51902053 33443530 18122277 25980113 36113784 31287102 27964853
42292 27964853 38588246 40850961 15913714 -12147706 -11062247 6815725 5036789
42285 5036789 -16391056 -20599835 8978018 47428104 68644808 75140196 78153837 74787622
42277 74787622 59317113 38640564 22512529 10767049 133518 -7449715 -10773203
42270 -10773203 -11929993 -7234306 10057100 31448055 35739526 20872479 12951229 25128493
42262 25128493 27374459 -13658225 -76537517 -103225294 -76396099 -42324559 -44516115
42255 -44516115 -68145401 -73409773 -56244002 -42349738 -37178439 -20922230 8731026
42248H731026J7502216n965601n299081J6869618K2833453k48696k2240334j8885730
42240A3296871m501534j657279p005373p032029n488868j1889231j7923363r398247
42232e1599053P197492J2589063M283040k505395o76591K460973M075310R828665
42224a4346496J6184093J0106039o167802j0371548P419463K4948000J6848480
42217D4620229r029887k3103540j4013340K295994R522546P189900J0196q896158
42209H595940j0382691N019571K5577979K2343464j1345763m1763878l5841881
42202c7797259p074942M334661j0239694j9209939k650618J8317549J8210135
42195c6110107P148444J0565060K5750697K7070411Q763273n459947L21355J0534953
$$ plain form
42248 8731026 26233242 20267641 14968560 31838178 54671631 54422935 32182601 13296871
42240 13296871 8795337 7138058 132685 -6899344 -12388212 -24277443 -42200806 -51599053
42232 -51599053 -44401561 -31812498 -27529458 -30034853 -30711444 -28250471 -24175161 -14346496
42224 -14346496 1837597 11943636 5775834 -4595714 2823749 27771749 44620229
42217 44620229 35590342 12486802 -1526538 769456 10292002 17481902 17492098 8595940
42209 8595940 -1786751 3232820 28810799 51154263 39808500 -1955378 -37797259
42202 -37797259 -44872201 -40537540 -50777234 -69987173 -72637791 -54320242 -36110107
42195 -36110107 -28961663 -18396603 7354094 34424505 43187778 37727831 38049186 48584139
42187D8584139K430386k1582478l8508656l2776997r265080J5514889K6246662
42180i357135J7630554n86306r579450k4012J5963303J7557114r2917j9632813
42172A1878338k1960828q514989J772484k642406j0606211m227568J3455157J9457329
42164a388694L810804j2585224o249406J3472021J7287387l02991j4385574r744831
42156a0086508j429784l396074j784825J8540963L9269658K9065957r374573m0669171
42148B0135643m3275592k8173960r809022J2811473L6845957M4347345K7283939
42141F0165783M217634n866665r430658j8538263k2076564l849362K0964079J9692777
42133D5278761p452835k2975453p506691J0153880k038516k7788500k4753996
$$ plain form
42187 48584139 51014525 29432047 -9076609 -41853606 -51118686 -35603797 -9357135
42180 -9357135 8273419 7687113 -1892337 -1916349 14046954 31604068 31511151 11878338
42172 11878338 -10082490 -18597479 -16824995 -19467401 -30073612 -34301180 -20846023 -1388694
42164 -1388694 2422110 -10163114 -16412520 -2940499 14346888 14043897 -341677 -10086508
42156 -10086508 -11516292 -14912366 -16697191 1843772 41113430 70179387 60804814 20135643
42148 20135643 -23139949 -51313909 -61122931 -48311458 -11465501 32881844 60165783
42141 60165783 64383417 58516752 49086094 30547831 8471267 4621905 25585984 45278761
42133 45278761 37825926 14850473 7343782 17497662 15459146 -12329354 -37083350
42126c7083350J2089062M0824433L0018395m67289j0090679P885034K2380653
42119F5556259J0098398j4256126k0278737k712934J3003176M755468j8762211
42112C7403293l1200538k1625174l468766P274114R568102R121928N209556m327374
42104G955141j3019052j2808235o973478m111475k124415P918192K1940595K2720698
42096B1497971N205201j2132464j1231306Q84555M066129m888741q792809L674122
42088a717342K1272757K5073233J2690399P53551M176998J7449094K0163156K095519
42080A01957365k1698121k7492596j2873646N11114k711416j0916815m803712
42073B1972173J2371538J8719380M239380j7410117k8180227k3497608q788528
$$ plain form
42126 -37083350 -24994288 15830145 45848540 45381251 35290572 43175606 65556259
42119 65556259 75654657 61398531 41119794 38406860 51410036 56165504 37403293
42112 37403293 6202755 -15422419 -18891185 -11617071 -2048969 7072959 12282515 7955141
42104 7955141 -5063911 -17872146 -24845624 -28957099 -31081514 -23163322 -1222727 21497971
42096 21497971 26703172 14570708 3339402 4223957 8290086 3401345 -5391464 -1717342
42088 -1717342 19555415 44628648 57319047 58072598 62249596 79698690 99861846 101957365
42080 101957365 80259244 52766648 39893002 40404116 37692700 26775885 21972173
42073 21972173 34343711 53063091 57302471 39892354 11712127 -11785481 -20574009
42066b0574009Q515761J8322805J1303449q780318k4621933k4891837j6572938
42059e7299020j0427713l772676J0171869K3252381J9782872K377210o876611
42052b2791688L197083J6156970J2210518k479482o292264L981226Q752664k217101
42044A0517926j1389520J220929K5747403L1415163N119669l2302703m9720827
42037a9391960l5487130k117650K8098259L7679038K3207149k485707k0822873
42030H679126k3955188j8011536j0728983l976231L28864j732957o464209j703519
42022e7564633J5679022L0193519K5865187P338924p339525r335316m281443n14451
42014D1284k761512j2223962k1686125j6160252Q742038L4114498L7559772K1364977
$$ plain form
42066 -20574009 -12058248 6264557 17568006 8787688 -15834245 -40726082 -57299020
42059 -57299020 -67726733 -71499409 -61327540 -38075159 -18292287 -15915077 -22791688
42052 -22791688 -19594605 -3437635 8772883 6293401 1137 3982363 12735027 10517926
42044 10517926 -871594 349335 26096738 57511901 62631570 30328867 -19391960
42037 -19391960 -54879090 -56996740 -28898481 8780557 31987706 29501999 8679126
42030 8679126 -15276062 -33287598 -44016581 -47992812 -47663948 -49396905 -55861114 -57564633
42022 -57564633 -41885611 -11692092 14173095 21512019 14172494 4837178 555735 41284
42014 41284 -2720228 -14944190 -36630315 -52790567 -44048529 -9934031 27625741 48990718
42006D8990718N805136q49887o902486j4373995j3629311l849703J770250k836569
41998A4124153q617862r899440j1418123j0762599L936456K8521648L7712201
41991D3596434J9969652l951266j4101474k0456855l6786781m7663755l2055800
41984i1449845l557597Q262144O724182J8999863M1050702L5642619m579658l4516313
41976b3423903k0008280J1147373J3247272q487285j2599290Q888247J9546198
41969a1689668L49739j8012736l031080K8543043L4618640P427973j9806456k2572791
41961d173336j3772416j4959445k1790643j5868099K189022J3604270J2237281
41954d2533366J2604460K2033060K4782097O969835j7290874k2667516p711935
$$ plain form
42006 48990718 54795854 53945967 47043481 32669486 19040175 15190472 16960722 14124153
41998 14124153 5506291 -4393149 -15811272 -26573871 -22637415 5884233 43596434
41991 43596434 63566086 59614820 45513346 25056491 -11730290 -59394045 -91449845
41984 -91449845 -95007442 -86745298 -80021116 -61021253 -19970551 15672068 11092410 -23423903
41976 -23423903 -43432183 -32284810 -19037538 -27524823 -40124113 -31235866 -11689668
41969 -11689668 -11339929 -29352665 -32383745 -3840702 30777938 38205911 18399455 -4173336
41961 -4173336 -17945752 -32905197 -54695840 -70563939 -68374917 -54770647 -42533366
41954 -42533366 -29928906 -7895846 16886251 23856086 6565212 -16102304 -23814239
41947b3814239O028689P185845O346528J1669762J3525528M166393m060740L545507
41939B4593273J8333894J8458775M48510j7238395k2215946k1636663k2482698
41932b1739250j6101126M836133K6303067K7343053R943371k900190K30772N401171
41924C3317001j995070j4453052j5939926o601195J434685N678379J2738374J8604690
41916C2783886R850461j0699406j9238448m303436J0791828k283566l2759539
41909a5858220l8830860k256581M4878074N8635535L4451454L837563j2344028
41902G2512937k4609740m3402287m9579290j8947153L2467761N6493409L3007422
41895E7943059l403873j2947643l551430p717529k4285810k1912106L179571J5808696
$$ plain form
41947 -23814239 -17785550 -10599705 -4253177 7416585 20942113 25108506 21047766 24593273
41939 24593273 42927167 61385942 61834452 44596057 22380111 743448 -21739250
41932 -21739250 -37840376 -33004243 -6701176 20641877 30585248 27685058 27915830 33317001
41924 33317001 31321931 16868879 928953 -5672242 -4237557 1440822 14179196 32783886
41916 32783886 42634347 31934941 12696493 8393057 19184885 16901319 -15858220
41909 -15858220 -54689080 -56945661 -12067587 46567948 81019402 84856965 72512937
41902 72512937 47903197 4500910 -45078380 -64025533 -31557772 24935637 57943059
41895 57943059 54539186 41591543 38040113 30322584 6036774 -15875332 -12695761 3112935
41887C112935n50194j4741283M24650K1705173J3203052j5114750k5270396j1188452
41879b8419265N17376J129324P688476K0085785J4654060q998205j6343874P655278
41871b031045K8900573J4865300j5449382k3749659j1166479q374594k1077374
41864c8082660k3929071o434714J0083179Q104014r57181J750186J5597708K6834680
41856g033859K8713394K4857876J9809290J2595936k992098k9633888n3253292
41849f936641m8627674j2306828K0589211J5570035j1575690j4408731J4932892
41842d2763426L3162644J3952273j1172792o564304Q164676o642589l9360482
41835e1224000m0868720k866737K7820824K0614832J147125J929615J2641551
$$ plain form
41887 3112935 2562741 -12178542 -11753892 9951281 23154333 8039583 -17230813 -28419265
41879 -28419265 -27901889 -26772565 -19084089 1001696 15655756 6657551 -9686323 -2031045
41871 -2031045 26869528 41734828 26285446 2535787 -8630692 -17005286 -38082660
41864 -38082660 -62011731 -68446445 -58363266 -50259252 -51216433 -49466247 -33868539 -7033859
41856 -7033859 21679535 46537411 66346701 78942637 75950539 46316651 -6936641
41849 -6936641 -55564315 -67871143 -47281932 -31711897 -43287587 -57696318 -42763426
41842 -42763426 -9600782 4351491 -6821301 -13385605 -5220929 -11863518 -51224000
41835 -51224000 -92092720 -94959457 -67138633 -46523801 -45376676 -43447061 -30805510
41828c0805510O980374j0150767j3740628Q05428J6342876K1503723J6484923
41821G420419K490392j3726435j6541101k630890Q150592L122003l94008J1893761
41813b15267J7108447r185043m0684318l0215852J5412241M0897343K5110630
41806A8228181O154281J1909418J8376279J505656j7238573j1251618L835644
41799C1519268J298074q825792k714861J0804640P385442p633242j0728175k779567
41791A8325787j966448n938555M96213Q918516k413599k6544380l3504622j6347875
41783e8974963K921034J1400466J4825644J1068791q969232l2078469l0585576
41776i0392305m709739J5766751J6079510R644292M281994p207829j7075511l787570
$$ plain form
41828 -30805510 -23825136 -33975903 -47716531 -46911103 -30568227 -9064504 7420419
41821 7420419 9910811 -3815624 -20356725 -22987615 -14837023 -11715020 -12109028 -215267
41813 -215267 16893180 7708137 -32976181 -63192033 -47779792 -6882449 18228181
41806 18228181 24382462 36291880 54668159 56173815 38935242 27683624 31519268
41799 31519268 32817342 23991550 21276689 32081329 39466771 31833529 21105354 18325787
41791 18325787 16359339 10420784 10916997 19835513 17421914 -9122466 -42627088 -58974963
41783 -58974963 -56053929 -44653463 -29827819 -18759028 -27728260 -59806729 -90392305
41776 -90392305 -95102044 -79335293 -63255783 -53611491 -49329497 -56537326 -73612837 -77400407
41768g7400407K5149893L1544019M385577j9001721j0659901O096954l95817j7691037
41760e7972440j2892572J3543104L0504024K0238463o079819k7660380l0051788
41753g0371408j1617560J1390541J7158468N497660k149793L451927P346974J138152
41745c8155039j123951P892788J1245311j906517j3882599o856713R970234K0838037
41737a1978449K5933204K4260355L478579k9191986l6796695l423592L3334433
$$ plain form
41768 -77400407 -52250514 -20706495 -16320918 -35322639 -45982540 -39885586 -40281403 -57972440
41760 -57972440 -70865012 -57321908 -26817884 -6579421 -12659240 -40319620 -70371408
41753 -70371408 -81988968 -70598427 -53439959 -47942299 -50092092 -46640165 -39293191 -38155039
41745 -38155039 -39278990 -31386202 -20140891 -22047408 -35930007 -42786720 -32816486 -11978449
41737 -11978449 13954755 38215110 41693689 12501703 -24294992 -27718584 5615849
$$ [...]
##END NTUPLES=NMR SPECTRUM
##END=
