##TITLE=31Pdec_SR57_r2
 , 64 sc
 16.2.2023
##JCAMPDX= 6.0         $$ Bruker NMR JCAMP-DX V2.0
##DATA TYPE= NMR SPECTRUM
##DATA CLASS= NTUPLES
##ORIGIN= UXNMR, Bruker Analytische Messtechnik GmbH
##OWNER= root
$$ XWIN-NMR		Version 3.5
$$ Thu Feb 16 16:23:30 2023 Russian Standard Time (UT+4h)  she@DPX200
##.OBSERVE FREQUENCY= 81.013821
##.OBSERVE NUCLEUS= ^31P
##.ACQUISITION MODE= SIMULTANEOUS
##.ACQUISITION SCHEME= undefined
##.AVERAGES= 64
##.DIGITISER RES= 16
##SPECTROMETER/DATA SYSTEM= spect
##.PULSE SEQUENCE= zgpg30
##.SOLVENT NAME= CD3CN
##.SHIFT REFERENCE= (INTERNAL, CD3CN, 0, 248.564)
##AUDIT TRAIL= $$ (NUMBER, WHEN, WHO, WHERE, WHAT)
$$ ##TITLE= Audit trail, XWIN-NMR		Version 3.5
$$ ##JCAMPDX= 5.01
$$ ##ORIGIN= Bruker BioSpin GmbH
$$ ##OWNER= she
$$ F:/spectra/data/she/nmr/P31/1/pdata/1/auditp.txt
$$ ##AUDIT TRAIL=  $$ (NUMBER, WHEN, WHO, WHERE, WHAT)
(   1,<2023-02-16 16:21:41.40 +0400>,<she>,<DPX200>,
      <continue with go, POWCHK disabled, PULCHK disabled
       configuration hash MD5:
       00 E9 B6 7A A2 85 ED C7 34 08 36 98 17 FE 4E 26
       data hash MD5: 32K
       B7 78 3B 80 31 BB 8A F5 FF 3C E7 29 D4 CB A2 AA>)
(   2,<2023-02-16 16:22:06.17 +0400>,<she>,<DPX200>,
      <Start of raw data processing
       efp BC_mod = 2 LB = 1 FT_mod = 6 PKNL = 1 PHC0 = -10960.56 PHC1 = 19.81271 SI = 64K 
       data hash MD5: 64K
       FF 5C 67 DB 0F 5A D6 1A 7A 41 02 D5 17 0E 34 3C>)
(   3,<2023-02-16 16:22:21.09 +0400>,<she>,<DPX200>,
      <pk PHC0 = 3.028047 PHC1 = 6.400001 
       data hash MD5: 64K
       DE 8B 72 34 7D 54 7E 9E 33 F8 91 7A 0C FC 5A CF>)
(   4,<2023-02-16 16:22:58.37 +0400>,<she>,<DPX200>,
      <pk PHC0 = -9.573212 PHC1 = 18.6 
       data hash MD5: 64K
       54 EC 79 B2 D2 DC 2E C3 47 31 EB 40 1F 9D BB 18>)
$$ ##END=
$$ 
$$ hash MD5
$$ 35 C8 5D C7 54 4E 28 21 FE 5F 08 82 0F 1B CB FE
##$RELAX= 
##$RELAX= 
##$RELAX= 
##$RELAX= 
##$RELAX= 
##$RELAX= 
##$RELAX= 
##$RELAX= 
##$RELAX= 
$$ Bruker specific parameters
$$ --------------------------
##$DU= <F:/spectra>
##$EXPNO= 1
##$NAME= <P31>
##$PROCNO= 1
##$TYPE= <nmr>
##$USER= <she>
##$AMP= (0..31)
100 100 100 100 100 100 100 100 100 100 100 100 100 100 100 100 100 100 
100 100 100 100 100 100 100 100 100 100 100 100 100 100 
##$AQSEQ= 0
##$AQ_mod= 1
##$AUNM= <au_zg>
##$AUTOPOS= <>
##$BF1= 81.014009
##$BF2= 200.13
##$BF3= 200.13
##$BF4= 200.13
##$BF5= 200.13
##$BF6= 200.13
##$BF7= 200.13
##$BF8= 200.13
##$BYTORDA= 1
##$CFDGTYP= 0
##$CFRGTYP= 5
##$CHEMSTR= <none>
##$CNST= (0..31)
1 1 145 1 1 1 1 1 1 1 1 1 1 1 1 1 1 1 1 1 1 1 1 1 1 1 1 1 1 1 1 1 
##$CPDPRG= <waltz16>
##$CPDPRG1= <>
##$CPDPRG2= <waltz16>
##$CPDPRG3= <>
##$CPDPRG4= <mlev>
##$CPDPRG5= <mlev>
##$CPDPRG6= <mlev>
##$CPDPRG7= <mlev>
##$CPDPRG8= <mlev>
##$CPDPRGB= <>
##$CPDPRGT= <>
##$D= (0..31)
0 1 0 0 0 0 0 0 0 0 0 0.03 2e-05 3e-06 0 0 0 0 0 0 0 0 0 0 0 0 0 0 0 0 
0 0 
##$DATE= 1676550027
##$DBL= (0..7)
120 120 120 11 120 120 24 19 
##$DBP= (0..7)
150 150 150 150 150 150 150 150 
##$DBP07= 0
##$DBPNAM0= <>
$$ [...]
##$SUBNAM2= <"">
##$SUBNAM3= <"">
##$SUBNAM4= <"">
##$SUBNAM5= <"">
##$SUBNAM6= <"">
##$SUBNAM7= <"">
##$SUBNAM8= <"">
##$SUBNAM9= <"">
##$SW= 501.771253377433
##$SWIBOX= (0..15)
0 1 3 0 0 0 0 0 0 0 0 0 0 0 0 0 
##$SW_h= 40650.406504065
##$TD= 32768
##$TD0= 1
##$TE= 0
##$TE2= 300
##$TE3= 300
##$TEG= 300
##$TL= (0..7)
0 120 53 12 22 120 120 120 
##$TP= (0..7)
150 150 150 150 150 150 150 150 
##$TP07= 0
##$TPNAME0= <>
##$TPNAME1= <>
##$TPNAME2= <>
##$TPNAME3= <>
##$TPNAME4= <>
##$TPNAME5= <>
##$TPNAME6= <>
##$TPNAME7= <>
##$TPOAL= (0..7)
0.5 0.5 0.5 0.5 0.5 0.5 0.5 0.5 
##$TPOFFS= (0..7)
0 0 0 0 0 0 0 0 
##$TUNHIN= 0
##$TUNHOUT= 0
##$TUNXOUT= 0
##$USERA1= <user>
##$USERA2= <user>
##$USERA3= <user>
##$USERA4= <user>
##$USERA5= <user>
##$V9= 5
##$VALIST= <valist>
##$VCLIST= <CCCCCCCCCCCCCCC>
##$VD= 0
##$VDLIST= <DDDDDDDDDDDDDDD>
##$VPLIST= <PPPPPPPPPPPPPPP>
##$VTLIST= <TTTTTTTTTTTTTTT>
##$WBST= 1024
##$WBSW= 4
##$XGAIN= (0..3)
0 0 0 0 
##$XL= 0
##$YL= 0
##$YMAX_a= 28541
##$YMIN_a= -54174
##$ZGOPTNS= <>
##$ZL1= 120
##$ZL2= 120
##$ZL3= 120
##$ZL4= 120
##$ABSF1= 0
##$ABSF2= 0
##$ABSG= 0
##$ABSL= 0
##$ALPHA= 0
##$AQORDER= 0
##$ASSFAC= 0
##$ASSFACI= 0
##$ASSFACX= 0
##$ASSWID= 0
##$AUNMP= <proc_1d>
##$AZFE= 0.1
##$AZFW= 0.5
##$BCFW= 0
##$BC_mod= 2
##$BYTORDP= 0
##$COROFFS= 0
##$CY= -3
##$DATMOD= 1
##$DC= 0
##$DFILT= <>
##$DTYPP= 0
##$F1P= 0
##$F2P= 0
##$FCOR= 1
##$FTSIZE= 65536
##$FT_mod= 6
##$GAMMA= 0
##$GB= 0
##$INTBC= 1
##$INTSCL= 6.047779e-11
##$ISEN= 30
##$LB= 1
##$LEV0= 0
##$LPBIN= 0
##$MAXI= 10000
##$MC2= 0
##$MEAN= 0
##$ME_mod= 0
##$MI= 50
##$NCOEF= 0
##$NC_proc= -7
##$NLEV= 6
##$NOISF1= 182.463
##$NOISF2= 159.3651
##$NSP= 0
##$NTH_PI= 0
##$NZP= 0
##$OFFSET= 248.5645
##$PC= 4
##$PHC0= -10967.1
##$PHC1= 44.81271
##$PH_mod= 1
##$PKNL= yes
##$PPARMOD= 0
##$PSCAL= 0
##$PSIGN= 0
##$REVERSE= no
##$SF= 81.0140089999694
##$SI= 65536
##$SIGF1= 159.3651
##$SIGF2= -187.1042
##$SINO= 113.3802
##$SIOLD= 16384
##$SREGLST= <1H.CDCl3>
##$SSB= 0
##$STSI= 65536
##$STSR= 0
##$SW_p= 40650.406504065
##$SYMM= 0
##$S_DEV= 0
##$TDeff= 32768
##$TDoff= 0
##$TI= <>
##$TILT= no
##$TM1= 0
##$TM2= 0
##$TOPLEV= 0
##$USERP1= <user>
##$USERP2= <user>
##$USERP3= <user>
##$USERP4= <user>
##$USERP5= <user>
##$WDW= 1
##$XDIM= 65536
##$YMAX_p= 493481865
##$YMIN_p= -25417596
$$ End of Bruker specific parameters
$$ ---------------------------------
##NTUPLES= NMR SPECTRUM
##VAR_NAME=  FREQUENCY,     SPECTRUM/REAL,   SPECTRUM/IMAG
##SYMBOL=    X,             R,               I
##VAR_TYPE=  INDEPENDENT,   DEPENDENT,       DEPENDENT
##VAR_FORM=  AFFN,          ASDF,            ASDF
##VAR_DIM=   65536,         65536,           65536
##UNITS=     HZ,            ARBITRARY UNITS, ARBITRARY UNITS
##FACTOR=    0.620285442955139, 1,           1
##FIRST=     20137.2065510682, 0,            0
##LAST=      -20513.1999529968, 0,           0
##MIN=       -20513.1999529968, -25417596,   0
##MAX=       20137.2065510682, 493481865,    0
$$ Real data points
##PAGE= N=1
##DATA TABLE= (X++(R..R)), XYDATA
$$ [...]
44174D009372n03489k798209l131428r48817J853793K520099O60463j243375j225448
44165h07039k82434k51024p89603m09237O62156J034876Q23086J077021R65127
44156B022929j339263m679362n176857j654784K242095L065075J903305J475841
44148b141021J509849J80008j627969j285148Q42608J370256p03552j941906L32419
44139c464456L388219K598640j578710l659361p68590L086658K670981r99759
44131A273622k496291k12456J795576Q32404l76643R71506K707129J754034k68817
44122E980064j64129Q64032l28183k445095j884672J3374j299425m684922l635068
44113g584024K866880P086276L426506l665438o697984m664134j251216J550309
$$ plain form
44174 4009372 3505883 707674 -2423754 -3372571 -1518778 1001321 1661784 418409 -807039
44165 -807039 -1089473 -1340497 -2130100 -2539337 -1877181 -842305 -19219 1057802 2022929
44156 2022929 683666 -3995696 -9172553 -10827337 -8585242 -5520167 -3616862 -2141021
44148 -2141021 -631172 -451164 -2079133 -3364281 -2521673 -1151417 -1854969 -3796875 -3464456
44139 -3464456 -76237 2522403 943693 -2715668 -3484258 -397600 2273381 1273622
44131 1273622 -1222669 -1435125 360451 1192855 816212 1787718 4494847 6248881 5980064
44122 5980064 5815935 6679967 6351784 3906689 2022017 2035391 735966 -3948956 -7584024
44113 -7584024 -4717144 2369132 5795638 2130200 -4567784 -9231918 -10483134 -8932825
44105h932825L179747K071026j347323k678157M20784L538767J975895j467635
44097c239721j127757J942275J918220j771358l523998p76488K396976K210615
44089a971236K36299m09056L04442O48160J21660o44676j052013p60947j93945
44080c721312n76619j929912k130630k4548K149180K055071R93618J059813Q30704
44071a294635j802602m444009l034678J246790L401410K370488J687133K456352
44063E86249J825056o82138j482467N55206J696057m1692j267448N63626K274758
44054D027207L87542k602192k041886J465256L123589J042936j840845k554403
44046A007204j491197p17058j142286j991358j949739n03660J446406K367008
$$ plain form
44105 -8932825 -5753078 -3682052 -5029375 -7707532 -7286748 -3747981 -1772086 -3239721
44097 -3239721 -4367478 -2425203 -506983 -2278341 -5802339 -6578827 -4181851 -1971236
44089 -1971236 -1734937 -2143993 -1839551 -1191391 -1069731 -1714407 -2766420 -3527367 -3721312
44080 -3721312 -4297931 -6227843 -8358473 -8383021 -6233841 -4178770 -3185152 -2125339 -1294635
44071 -1294635 -3097237 -7541246 -10575924 -9329134 -5927724 -3557236 -1870103 586249
44063 586249 2411305 1729167 246700 801906 2497963 2456271 1188823 1752449 4027207
44054 4027207 4414749 1812557 -229329 1235927 4359516 5402452 3561607 1007204
44046 1007204 -483993 -1201051 -2343337 -4334695 -6284434 -6788094 -5341688 -2974680
44038b974680J541102m33960k104739j747358J266516M651665M438799p4738m275459
44029B87148l680090J61936K322983J492809L70886J43424p41745k309307k235761
44020d187717j27225J477313J357981J054776J135929m822k310660k865107l21254
44011d790786K694341L328651J918998L28383n17449l54458O73741J292583M94885
44002E068889l59902L64694J056725q24835l623093l406562o99806J69663j342183
43993c596410j211355J364775K097625l58532j348345J470779L330493M02815
43985B151845l201708k009236J943214K821973J58194j714463j095392r4832L03399
43976g37006J152590J935773N05653k945371n061528l227988J397372N030005
$$ plain form
44038 -2974680 -1433578 -1867538 -3972277 -5719635 -4453119 198546 4637345 4562607 287148
44029 287148 -3392942 -3231006 -908023 584786 955672 1099096 357351 -1951956 -4187717
44020 -4187717 -4314942 -2837629 -1479648 -424872 711057 706235 -1604425 -4469532 -4790786
44011 -4790786 -2096445 1232206 3151204 3479587 2962138 2607680 3281421 4574004 5068889
44002 5068889 4708987 5073681 6130406 5305571 1682478 -1724084 -2423890 -2254227 -3596410
43993 -3596410 -4807765 -3442990 -1345365 -1703897 -3052242 -1581463 1749030 2151845
43985 2151845 -1049863 -3059099 -1115885 1706088 1864282 149819 -945573 -1040405 -737006
43976 -737006 415584 2351357 2857010 -88361 -5149889 -8377877 -6980505 -1950500
43968a950500M780018J441379j285456j326440r36157k683317m462882k593209
43960i016564J346232K277101R158m09736K448702L899696J426171j236770j071499
43951c27509m52133j624197k592512j849667j219290q99059J734186N219070L645961
43942A634850k684319m802824J073473O052907K351498l919181l000619K814817
43934d79398M374707R06965j161664o49343j647767l613879k189326J470637K054469
43925i34599k74044p96955M62773m15050k359102p72405L021112L432153R83848
43916B347731J004354K432154j037004p841051q205195K49437P385975N397090
43908A733491p40426k837462j235812r33017k341618k131469O32235L892682N499713
$$ plain form
43968 -1950500 2829518 4270897 2985441 1659001 722844 -1960473 -6423355 -9016564
43960 -9016564 -7670332 -5393231 -5384073 -5793809 -3345107 554589 1980760 743990 -327509
43951 -327509 -779642 -2403839 -4996351 -6846018 -8065308 -8964367 -7230181 -2011111 1634850
43942 1634850 -1049469 -5852293 -4778820 1274087 3625585 -293596 -3294215 -479398
43934 -479398 3895309 4802274 3640610 2991267 1343500 -2270379 -4459705 -2989068 -934599
43925 -934599 -1208643 -2005598 -1542825 -1957875 -4316977 -5089382 -2068270 1363883 2347731
43916 2347731 3352085 5784239 4747235 -3093816 -11299011 -11049574 -3663599 1733491
43908 1733491 993065 -1844397 -3080209 -4013226 -6354844 -8486313 -7854078 -3961396 1538317
43899A538317M097233o6605l918943m377478k672777k107279k269138m41387K287692
43890g930365K441673Q76283J329444K954890J732928j240950j132940J186162
43882B17125J13268l939214m492324p17370J071465o85977l59345K889722K449747
43873c452903k515259l432068K487221N693322L56145m912708j709086L736512
43865c748824J931866l395829k748559K326593L001047j057529k489533J01963
43857f078805J320697J46690P30532K730762J321387k991436m112188o04675K433364
43848e103672K555630K848935M468214M065178N53008k296282k072493q93534
43840D124984o94837m66543L60810L45194r31298k063101k472937k404416j006158
$$ plain form
43899 1538317 5635550 5568945 1650002 -2727476 -5400253 -7507532 -9776670 -10218057 -7930365
43890 -7930365 -5488692 -4612409 -3282965 -328075 1404853 163903 -969037 217125
43882 217125 330393 -3608821 -8101145 -8818515 -7747050 -8433027 -8792372 -5902650 -3452903
43873 -3452903 -5968162 -9400230 -6913009 -1219687 -863542 -5776250 -7485336 -3748824
43865 -3748824 -1816958 -5212787 -7961346 -5634753 -2633706 -3691235 -6180768 -6078805
43857 -6078805 -4758108 -4611418 -3880886 -1150124 171263 -2820173 -6932361 -7537036 -5103672
43848 -5103672 -2548042 300893 4769107 8834285 9387293 7091011 5018518 4124984
43840 4124984 3430147 2963604 3324414 3669608 2738310 675209 -1797728 -4202144 -5208302
43831e208302J633886K134132j476201m483035j212355N206868O159404N29969
43823C284366l557362j375000J945302O26366l113552l894997j125074K318352
43815d891599M872082N512350K285471l802025o867407l082918K988928L995761
43807A010643q0045k710489r03266J287710L28981j163069N08369L281330K122294
43798C682458k859773n767297k932937K317003M641316L229816Q19934j150823
43790A979697k839610l120184n91052K889389L556858R68815j484076j578323
43782b18486l90877P75433J836469J853552l96310k990474k320492R21384J824826
43773H95025j170027l695173k511866q3876N74095N17742J066888M59354j723350
$$ plain form
43831 -5208302 -3574416 -1440284 -2916485 -7399520 -8611875 -3405007 2754397 3284366
43823 3284366 -272996 -1647996 297306 923672 -2189880 -6084877 -7209951 -4891599
43815 -4891599 -19517 5492833 7778304 3976279 -2891128 -5974046 -2985118 1010643
43807 1010643 930598 -1779891 -2683157 -1395447 -1066466 -2229535 -1721166 1560164 3682458
43798 3682458 822685 -4944612 -7877549 -5560546 -919230 2310586 3130520 1979697
43790 1979697 -859913 -3980097 -4571149 -1681760 1875098 2843913 1359837 -218486
43782 -218486 -609363 166070 2002539 3856091 3459781 469307 -1851185 -929801 895025
43773 895025 -275002 -3970175 -6482041 -6565917 -5991822 -5474080 -4407192 -3947838 -5671188
43764e671188j681651K335776N307591K342470l266473m462762k78482L919680
43756a455039L996559L98318m005117n563856j827720M543126O930095L260538
43748F276904o79398k51284R82927j468165m340562k436600J625756J853203n88165
43739I74616k04193K237450J408295k081211k712604p87494j932199n509583m092742
43730a2699665L307797P630741L352205l128801l744599l9649J542960q6510j229934
43721e095455n12070J04973m58925j205603j156179l35342N44001N89755N9171
43712g465674O17833K367745K340304q07938k933282j21380L957210K884556j799611
43703i60237k600237J358275K595982k018327n656263k564806K991395M113805
$$ plain form
43764 -5671188 -7352839 -5017063 290528 2632998 -633475 -5096237 -5374719 -1455039
43756 -1455039 2541520 2939838 -1065279 -6629135 -8456855 -3913729 3016366 6276904
43748 6276904 5597506 5346222 6329149 4860984 520422 -1916178 -290422 1562781 974616
43739 974616 770423 3007873 4416168 2334957 -377647 -1165141 -3097340 -8606923 -12699665
43730 -12699665 -9391868 -1761127 1591078 -1537723 -5282322 -5321971 -3779011 -3865521 -5095455
43721 -5095455 -5607525 -5502552 -5961477 -7167080 -8323259 -8658601 -8114600 -7524845 -7465674
43712 -7465674 -6847841 -4480096 -2139792 -2947730 -5881012 -6002392 -2045182 839374 -960237
43703 -960237 -3560474 -2202199 393783 -1624544 -7280807 -9845613 -6854218 -2740413
43695b740413J480056K74090J338376J341064p70286k523852k062724k69260O50719
43686c282230n77906k348552r75398L958651O680590K478516l702886l037786
43678h07001L201442M440890k590106p953272l876192L278936L579490j517377
43670b243190l454351m88569J858336J178838L45742O64949L90282l90247K53698
43661a884512J489028O90516j320468j255148P17505J129596p24372j750752l66346
43652c274953J624330K811348L554635L164033J32765l830566m312753n35266
43644f66427K504968O48129l538477m399654r38148K327860J940211j33724r0286
43635b345548J784021J530516k235624n438517l643406J942648N995381N376921
$$ plain form
43695 -2740413 -1260357 -986267 352109 1693173 922887 -1600965 -3663689 -3932949 -3282230
43686 -3282230 -3860136 -6208688 -7184086 -3225435 3455155 5933671 2230785 -807001
43678 -807001 2394441 6835331 4245225 -3708047 -7584239 -4305303 -725813 -2243190
43670 -2243190 -5697541 -6186110 -4327774 -3148936 -2803194 -2138245 -1747963 -2138210 -1884512
43661 -1884512 -395484 295032 -1025436 -2280584 -1563079 -433483 -1157855 -2908607 -3274953
43652 -3274953 -1650623 1160725 4715360 7879393 8012158 4181592 -131161 -666427
43644 -666427 1838541 2486670 -1051807 -5451461 -6389609 -4061749 -2121538 -2255262 -2345548
43635 -2345548 -561527 968989 -1266635 -6705152 -10348558 -8405910 -2410529 2966392
43627B966392J422265k951932n475708m690324j229462J371981L63870k092155
43619a0315073j817321J077295K885922K718484L173331M448500L390936l36366
43611E225708k627554j453333R6669m60201j221225m06200K47154n01156o52050
43602a752188P16871J009892q04260j353782J307516L613024K160053q65182k015824
43593B016120k056345k788307k663461l28317J405786J39434j260517M65488K850297
43584b219822K014339k27502L59496K711248K331707r14352k968533k452989j780297
43575c146705k035253j744113l76054J080856K376351L342884K444329n22098
43567A420197k348075q62619R78102l20507k810042k544663l71285J43595p00072
$$ plain form
43627 2966392 4388657 1436725 -4038983 -8729307 -9958769 -8586788 -8222918 -10315073
43619 -10315073 -12132394 -11055099 -8169177 -5450693 -2277362 2171138 5562074 5225708
43611 5225708 2598154 1144821 1241490 781289 -439936 -846136 -598982 -1100138 -1752188
43602 -1752188 -1035317 -25425 -829685 -2183467 -875951 2737073 4897126 4031944 2016120
43593 2016120 -40225 -2828532 -5491993 -5820310 -4414524 -4275090 -5535607 -5070119 -2219822
43584 -2219822 -205483 -432985 -73489 2637759 4969466 4055114 1086581 -1366408 -3146705
43575 -3146705 -5181958 -6926071 -7302125 -6221269 -3844918 -502034 1942295 1420197
43567 1420197 -927878 -1790497 -812395 -1132902 -3942944 -6487607 -6858892 -6715297 -7415369
43558g415369K8751J905015K193942J345194J728601K411693J023693p57511K28445
43549B692454K065201M37803l266816l623388l33382J593435P14278N67897J639210
43540B486692o5123m557108n719496p92462M582374M533997P99761j297900k52275
43531b81540J736756K698880J811743o78945k508310j295817J521861K112490
43523E117118J53080r92651n24524j329302l652885l577765j37040J937019j45511
43514c152461k373425p98564J806194J126048j077032l18868K447782K160961
43506a79365j866751m361239j614859L531834N667749L252032m22358j595781
43498B411262j74107P95122m47663j734411j76604L040716L761665P43894k510131
$$ plain form
43558 -7415369 -7386618 -5481603 -3287661 -1942467 -213866 2197827 3221520 2464009 2692454
43549 2692454 4757655 5195458 1928642 -1694746 -2028128 -434693 279585 847482 2486692
43540 2486692 2421569 -2135539 -7855035 -8647497 -4065123 468874 1268635 -29265 -281540
43531 -281540 1455216 4154096 5965839 5286894 2778584 1482767 3004628 5117118
43523 5117118 5270198 4277547 3753023 2423721 -1229164 -4806929 -4943969 -3006950 -3152461
43514 -3152461 -5525886 -6324450 -4518256 -3392208 -4469240 -4788108 -2340326 -179365
43506 -179365 -2046116 -6407355 -8022214 -4490380 1177369 4429401 4007043 2411262
43498 2411262 2237155 3032277 2584614 850203 673599 3714315 7475980 8219874 5709743
43489E709743k690320q08963L4585j040201k276797j937379r0558J668352J813136
43480C81598O31702j8787O55237J169123L28370p45440r55389j397599k633023
43471b584208k386525L79800J771151j615511n631612l245305M427420Q551204
43463c33586M810501j332434l479580k220969j264333j003522J25497J583805
43455c114621J780441R27970K52357J20307L55856M87541p08021l325757m354147
43446g578074j274889K867795K894127j54412j59514L734157M923878Q6523m799137
43437E40454l557334P88212J174882k962672n866477l854256J108319M961746
43429g667126N338472K747353p425o58173k00830o91779j018441J091447L499771
$$ plain form
43489 5709743 3019423 2210460 2245045 1204844 -1071953 -3009332 -3099890 -1431538 381598
43480 381598 1013300 994513 1649750 2818873 3147243 2401803 1446414 48815 -2584208
43471 -2584208 -4970733 -4590933 -2819782 -4435293 -10066905 -13312210 -8884790 -333586
43463 -333586 4476915 3144481 -335099 -2556068 -3820401 -4823923 -4698426 -3114621
43455 -3114621 -1334180 -406210 -153853 -33546 322310 809851 101830 -3223927 -7578074
43446 -7578074 -8852963 -5985168 -3091041 -3245453 -3404967 329190 5253068 5339591 540454
43437 540454 -3016880 -2228668 -1053786 -4016458 -9882935 -13737191 -12628872 -7667126
43429 -7667126 -2328654 418699 411274 -246899 -447729 -1139508 -2157949 -1066502 2433269
43420B433269J904612k200264k852455K9860r8093m345549m963632J331511O190464
43411b570277K868910k212190l32974M634815L272539k910049m327145K07046
43403a369325K322753r04440k645295J025000M591932K875900j070176k157333
43395B669016q77335m83610j456149k476993l195679l194319j355414J703390
43387h667093L467088L080411K119441J198348p09434k963164l049015n77068
43379f100486J976229L118036L473478K929257O45293j844154j850568j69806
43371B177279O0425p35671O98877L267187J700557m034474o519308j933526L215614
43362b103040J944085k184870j080431M569639O397810J672509k889390k176812
$$ plain form
43420 2433269 4337881 2137617 -714838 -684978 -783071 -5128620 -10092252 -8760741 -2570277
43411 -2570277 298633 -1913557 -2246531 2388284 5660823 2750774 -1576371 -1369325
43403 -1369325 953428 48988 -2596307 -1571307 3020625 5896525 4826349 2669016
43395 2669016 1791681 1308071 -148078 -2625071 -5820750 -9015069 -10370483 -8667093
43387 -8667093 -5200005 -2119594 -153 1198195 488761 -2474403 -5523418 -6100486
43379 -6100486 -4124257 -1006221 2467257 5396514 6041807 4197653 2347085 2177279
43371 2177279 2237704 1502033 2200910 5468097 7168654 3134180 -3385128 -5318654 -2103040
43362 -2103040 -158955 -2343825 -3424256 1145383 7543193 9215702 6326312 4149500
43354D149500l8464j626700m227981j838067M122614N703905K68126n028398l478376
43345a993841J598919K436464j434935l487562j050764J402872R83227J016005
43337e29615L488064L778426j288387n744327k460321M822278O096513J94511
43329H357142l766466p08356L454302K114958k339809l724632j344075R54308
43321B997372J218152K22084j491538l339398l400013p97018K161235K871997
43313D42873J787402O84505k72614j411527j772133r81911o82420j529962j232582
43304d968369J503068L695224K415627L8454P12385L214438K426159k420618o089933
43295E26435m880011j357216K54962k31302l10478Q15092J838778J872727J149891
$$ plain form
43354 4149500 4111036 2484336 -1743645 -3581712 540902 6244807 6512933 1484535 -1993841
43345 -1993841 -394922 2041542 606607 -2880955 -3931719 -2528847 -1545620 -529615
43337 -529615 2958449 6736875 5448488 -295839 -2756160 2066118 8162631 8357142
43329 8357142 4590676 3882320 7336622 9451580 7111771 3387139 2043064 2997372
43321 2997372 4215524 4437608 2946070 -393328 -3793341 -4590359 -2429124 442873
43313 442873 2230275 2914780 2642166 1230639 -541494 -1523405 -2205825 -3735787 -4968369
43304 -4968369 -3465301 229923 2645550 2684004 3396389 6610827 9036986 6616368 526435
43295 526435 -4353576 -5710792 -5455830 -5687132 -5997610 -5182518 -3343740 -1471013 -321122
43286c21122P1253p90098n03693R36519J814079O06908j718902k665109j303643
43277c873808O85367J085676o05880l007235m158273k927831J96122L443823N144306
43268d017733M805118K880395J95798j909026j898911J21407J486222k75861l816015
43259b428606n142632k807935M02157J870314K489350L643968L657067O70191
43251B353874k839186k774612L1249O98275j855547k929894K98240L896134L196186
43242G4719j83857j557161o35001r05966k929498l263399k60603L327266M563014
43233a770486L793026K670924J552076L67068k16739k26932j248587m042745o412544
43224e534939n240659l41266M952492P026206N109676J301836j795025l144782
$$ plain form
43286 -321122 -249869 -1039967 -1543660 -607141 1206938 1813846 94944 -2570165 -3873808
43277 -3873808 -3188441 -2102765 -2708645 -5715880 -9874153 -12801984 -12605862 -9162039 -4017733
43268 -4017733 787385 3667780 3863578 1954552 55641 177048 1663270 1387409 -2428606
43259 -2428606 -7571238 -10379173 -9977016 -8106702 -5617352 -1973384 1683683 2353874
43251 2353874 -485312 -3259924 -3228675 -2530400 -4385947 -7315841 -7017601 -3121467 74719
43242 74719 -109138 -1666299 -2301300 -3207266 -6136764 -9400163 -9660766 -6333500 -1770486
43233 -1770486 2022540 4693464 6245540 6612608 6395869 6168937 4920350 877605 -5534939
43224 -5534939 -10775598 -11116864 -6164372 861834 5971510 7273346 5478321 2333539
43216B333539l263781k787304j733811k05052J053516J417193J217399J143887
43208h24414J122157N01276o91057j376630p48632K82057k03034k353662l350423
43199g642362p55718L223306L707820K87776j479389J648443M664320J461645
43191E115841m995293o235120r07883L523209K415242k77942k00114P77983J6342
43182g67735l98678J420466K385554K1228k176245p11975J315039j09092k148903
43173a170341k43057K874465J407391k950969l289494J063500L825792K216940
43165C734227P0189J1415O4868r17591j278770j008788j812663k244031N45507
43156b835637L977981K506460k512555l762286j29956J256469k173485l375562
$$ plain form
43216 2333539 -930242 -3717546 -5451357 -5656409 -4602893 -3185700 -1968301 -824414
43208 -824414 297743 799019 107962 -1268668 -2017300 -1735243 -1938277 -4291939 -7642362
43199 -7642362 -8398080 -5174774 -1466954 -1179178 -2658567 -1010124 3654196 5115841
43191 5115841 120548 -6114572 -7022455 -3499246 -1084004 -1361946 -1562060 -784077 -767735
43182 -767735 -1166413 254053 2639607 2660835 484590 -227385 1087654 978562 -1170341
43173 -1170341 -1413398 1461067 2868458 -82511 -3372005 -2308505 1517287 3734227
43165 3734227 3804416 3815831 3880699 2963108 1684338 675550 -1137113 -3381144 -2835637
43156 -2835637 1142344 3648804 1136249 -2626037 -2755993 -1499524 -3673009 -7048571
43148g048571J814559O474724L721668j827436j916154K027855K358073j851771
43140C752947m206321j680330J838081K511605R36644p59475j550585r90052N35252
43131C87766J320722N94325n4262K85228k12333k381547l314447r19555J792549
43122b501554J210017r16352p60143Q83951N56254j159009o95101J739702K250885
43113F08650m6527j798285j261357m69354q57467j222952r19024r47170r98397
43104g911883N74445K898361K776110r560j649805k60505J131208n8179j358761
43095c868569N90806L932360L687199j020102n463099n339167j646284J369371
43087g757485J394721q2589l51050J254885K869221K432090J24850j732025j275515
$$ plain form
43148 -7048571 -5234012 1240712 4962380 3134944 1218790 3246645 5604718 3752947
43140 3752947 -453374 -2133704 -295623 2215982 3152626 2393151 842566 -147486 387766
43131 387766 1708488 2302813 2248551 2533779 2321446 -60101 -3374548 -4294103 -2501554
43122 -2501554 -1291537 -2207889 -2968032 -2084081 -1527827 -2686836 -3381937 -1642235 608650
43113 608650 562123 -1236162 -2497519 -2966873 -3824340 -5047292 -5966316 -6913486 -7911883
43104 -7911883 -7337438 -4439077 -1662967 -1672527 -3322332 -3582837 -2451629 -2509808 -3868569
43095 -3868569 -3277763 654597 4341796 3321694 -2141405 -7480572 -9126856 -7757485
43087 -7757485 -6362764 -6445353 -6796403 -5541518 -2672297 -240207 -115357 -1847382 -3122897
43078c122897O73707J575400N08145m79142N68561K093362R92707k171198l212276
43069b573631p42784J161514n45511k392420J12922M388624M232230l6569j870852
43060A733523P04295J926901j721999n257953l109256K171771M211179J917839
43052B576300q80382k107365k638801k519846p05959J962836L116023K036260
43044H39066K07024p47880k13077J089880R85454j871865m925221m055645J24257
43035h568007K435811J024250L2754J957074L050811L34249k373914p69852K347765
43026e29059J875311j127003k139688j056738q01550r32970O13789J885031j3484
43017b226361k370905p07849K689060J914935k079013k529734J743029M397610
$$ plain form
43078 -3122897 -2449190 -873790 -365645 -844787 -276226 1817136 2809843 638645 -2573631
43069 -2573631 -3316415 -2154901 -2700412 -5092832 -4979910 -591286 3640944 3604375 1733523
43060 1733523 2437818 4364719 2642720 -2615233 -5724489 -3552718 658461 2576300
43052 2576300 1695918 -411447 -3050248 -5570094 -6276053 -4313217 -1197194 839066
43044 839066 1046090 298210 85133 1175013 2160467 288602 -4636619 -8692264 -8568007
43035 -8568007 -6132196 -5107946 -5075192 -3118118 -67307 266942 -2106972 -2876824 -529059
43026 -529059 1346252 219249 -1920439 -2977177 -3778727 -4711697 -4097908 -2212877 -2226361
43017 -2226361 -4597266 -5305115 -2616055 -701120 -2780133 -5309867 -3566838 830772
43009H30772K020758j409424k190872j619322r60813J227682M191424L970653
43001F060858J64975k306223r66362O33767p5067l21687J712953K266009j610970
42992E558253n917681n122272k12382L391223L321901J499242k7749p54666o18014
42983A117855J9525K98599J77481K74652M5075j193695j431474J758142N671885
42974F738045M416888j995481o043536l005957K357679L134702m08455l157606
42966B036279k938123j339850L28251J541702J218684m60439r98896O02809J529899
42957A520316l62521k687693k402246m64869Q64213K065392L683071L027782j459895
42948C783550n337978l337207K265269M185956M16079l490695k725457J063411
$$ plain form
43009 830772 2851530 1442106 -748766 -2368088 -3328901 -2101219 2090205 6060858
43001 6060858 6225833 3919610 2953248 3587015 3511948 3190261 4903214 7169223 5558253
42992 5558253 -359428 -5481700 -5694082 -2302859 1019042 2518284 2490535 1735869 1117855
42983 1117855 1137380 1435979 1613460 1888112 1933187 739492 -691982 1066160 6738045
42974 6738045 11154933 9159452 3115916 109959 2467638 5602340 5193885 2036279
42966 2036279 -901844 -2241694 -1913443 -371741 846943 386504 -612392 -9583 1520316
42957 1520316 1157795 -1529898 -3932144 -4397013 -3532800 -1467408 2215663 5243445 3783550
42948 3783550 -1554428 -4891635 -2626366 1559590 1975669 -1515026 -4240483 -3177072
42940c177072L571495L498583K622459K547688K931673K137934o53880l759512
42932I719368m442742k483866m04267N14162J614390L070094K377453j021911
42924H942681l393171k235826n33504j583054l195465j864483N87184K95375j323306
42915d303569o3373K925502K602818p80901j336253K540037M900342J473304l781255
42906D176652m848424j862556O19406L57421j071520j522383l46909J498844J966454
42897a033015P7442j867308o90421K546595L167369k32518l268363k204558P12072
42888b792705J300987k61078q30688K47721J019347R67448J297608J648566J91187
42879B788393k695200m039372k361436M69291K303309L130795L305987J950540
$$ plain form
42940 -3177072 394423 3893006 6515465 9063153 11994826 14132760 13478880 9719368
42932 9719368 5276626 2792760 2388493 2902655 4517045 7587139 9964592 8942681
42924 8942681 5549510 3313684 2780180 1197126 -1998339 -3862822 -3275638 -2980263 -4303569
42915 -4303569 -4366942 -1441440 1161378 380477 -955776 1584261 6484603 7957907 4176652
42906 4176652 -671772 -2534328 -1914922 -1557501 -2629021 -4151404 -4498313 -2999469 -1033015
42897 -1033015 -955573 -2822881 -3513302 -966707 2200662 1968144 -1300219 -3504777 -2792705
42888 -2792705 -1491718 -1752796 -2583484 -2335763 -1316416 -348968 948640 2597206 2788393
42879 2788393 93193 -3946179 -6307615 -5838324 -3535015 -404220 2901767 4852307
42871D852307q80313k532406r62213J631954J437693j190635j989265O66962L085351
42862D119435J919700p76846j151439L47735L75831j335468j834014l48344O54972
42853A971562K19275K57579J148505N37943j682974j830945J423075L766114J712731
42844G522865j629525j692626J32112m52065k749380k332061R80876K605391Q06299
42835C191886r20733j36053J103134Q26205M64370J199550J026745j619228m375402
42826G60474m085792j237587J369832K574806L008239K816091J671089J03371
42818F980523j136656k156990k792829j699569J437671L972093L080557k8201
42810G656599j300954N62095K235109N64768k853096l861309j456197J023976
$$ plain form
42871 4852307 3971994 1439588 477375 2109329 3547022 2356387 367122 1034084 4119435
42862 4119435 6039135 5262289 4110850 4458585 4834416 3498948 1664934 1316590 1971562
42853 1971562 2190837 2448416 3596921 4134864 2451890 620945 2044020 5810134 7522865
42844 7522865 5893340 4200714 4332826 3880761 1131381 -1200680 -219804 2385587 3191886
42835 3191886 2271153 2135100 3238234 4064439 4528809 5728359 6755104 5135876 760474
42826 760474 -3325318 -4562905 -3193073 -618267 2389972 5206063 6877152 6980523
42818 6980523 5843867 3686877 894048 -805521 632150 4604243 7684800 7656599
42810 7656599 6355645 6917740 9152849 9717617 6864521 3003212 1547015 2570991
42802B570991O35839j292123j295421J382695L782330K920132p85692m005707
42794C913044l686709J93879M414361N361056K744824k07459r80046p02363j336243
42785I714344j960459q63046L19824j138410l378498j756889L120953M855900
42777H913719P61383l638247k871929Q14092K268695J340246Q57438M96555j526596
42768G415356l350640k007846P40718Q33416j175802j238885J133433K479848
42760D829598J461968J05468m72649o03257O81111L630824M381670k45349n773937
42751G995447n046050N25161K714248m04131k125561N91386K159274q15754l090710
42742B503310m40842K608871J158530j275877L57167L249116K189308p43342l61443
$$ plain form
42802 2570991 3206830 1914707 619286 2001981 5784311 8704443 7918751 3913044
42794 3913044 226335 420214 4834575 10195631 12940455 12732996 11752950 11050587 9714344
42785 9714344 7753885 6890839 7210663 6072253 2693755 936866 4057819 8913719
42777 8913719 9675102 6036855 3164926 3979018 6247713 7587959 8445397 8941952 7415356
42768 7415356 4064716 2056870 2797588 3631004 2455202 1216317 2349750 4829598
42760 4829598 6291566 6397034 5924385 5321128 6002239 9633063 14014733 13769384 7995447
42751 7995447 2949397 3474558 6188806 5784675 3659114 4250500 6409774 5594020 2503310
42742 2503310 2062468 4671339 5829869 4553992 4911159 8160275 10349583 9606241 9244798
42733I244798J825397O54217k872345l564413j680317j718068k968386n19021
42725a598138M535851N310370P22431k239010j59450J736013k84091j818780R65237
42716G170433L622903J158955k683327j702582J692656M64380m464915m933431
42708C25072J033038N441267K547784k790446l368017j48433J265070L86497J163718
42699E855550L558410L104894p31318k536280M05810L324000J590484j783189
42691A2788361j443787J196251O27487k844173l119704J345793M297673J296649
42683A4144550l451215l754713j71813K503088K780644K356064J129862j955079
42675A3581388m429816k446782K501357M290787O53767l669766l915222j264983
$$ plain form
42733 9244798 11070195 11724412 8852067 5287654 3607337 1889269 -1079117 -1598138
42725 -1598138 2937713 8248083 8970514 6731504 6572054 8308067 8023976 6205196 7170433
42716 7170433 10793336 11952291 9268964 7566382 9259038 9723418 5258503 325072
42708 325072 1358110 6799377 9347161 6556715 3188698 3040265 4305335 4691832 5855550
42699 5855550 9413960 12518854 11787536 9251256 9657066 12981066 14571550 12788361
42691 12788361 11344574 12540825 13168312 10324139 7204435 8550228 12847901 14144550
42683 14144550 10693335 6938622 6766809 9269897 12050541 14406605 15536467 13581388
42675 13581388 9151572 6704790 9206147 13496934 14150701 10480935 6565713 5300730
42667E300730M57293M70288M41399Q60511J201487J925228L254505L290998N33037
42658A7735476k621945k377343O23942J680545r18939l002691q36665K925615
42650A3207995L120455j79889k151011q24220M88661o94154k043593r85284O16397
42641A0555357q2932j678037j076505O67714M2826k231201j601104K611036N154863
42632A2362017K550411j642444k246830L09924J714362L53651j412499j351579
42624A0637013L10398K062964K332914J25064l648482o064966m984611j335213
42616e64919K402010M722127N072237L244759N18371n16609O33477J043746j139056
42607A5416143l030669j154127K506830K849121o22109k986775j394607J056917
$$ plain form
42667 5300730 5758023 6228311 6669710 7530221 8731708 10656936 13911441 17202439 17735476
42658 17735476 15113531 12736188 13360130 15040675 14121736 11119045 10282380 13207995
42650 13207995 16328450 16148561 13997550 13173330 13661991 12967837 10924244 9938960 10555357
42641 10555357 10472425 8794388 7717883 8385597 8428423 6197222 4596118 7207154 12362017
42632 12362017 14912428 13269984 11023154 11333078 13047440 13401091 11988592 10637013
42624 10637013 10947411 13010375 15343289 15468353 11819871 5754905 770294 -564919
42616 -564919 1837091 6559218 11631455 14876214 15394585 14877976 15511453 16555199 15416143
42607 15416143 12385474 11231347 13738177 16587298 15965189 12978414 11583807 12640724
42599A2640724O91642j305924j649289m20191k51811j340068r53037J775683L658232
42590A2845961J691067k368858l919161j510456J297716P28728k364131l958543
42582B442323k126974J085557K834805K650905J937875J685154J521818N20445
42574A2551908j389756k694644j644370J078527K341548O58944j163404J68127
42566I906880L277850L999715J658818m18761o37542r98593k375339k520669o90617
42557A1201742J44174j537357k481116o869K919003K296084n9043N94435L695436
42548A6766489L549275j937235p470883p218199k261003J332577M48382j638831
42540A570572j99917M366634O957716M648946L98640j656086j687095j918223
$$ plain form
42599 12640724 13332366 12026442 10377153 9956962 9705151 8365083 7412046 9187729 12845961
42590 12845961 14537028 12168170 8249009 6738553 8036269 8764997 6400866 2442323
42582 2442323 315349 1400906 4235711 6886616 8824491 10509645 12031463 12551908
42574 12551908 11162152 8467508 6823138 7901665 10243213 10902157 9738753 9906880
42566 9906880 13184730 17184445 18843263 18424502 17786960 16788367 14413028 11892359 11201742
42557 11201742 11345916 9808559 7327443 7320574 10239577 12535661 12476618 13071053 16766489
42548 16766489 20315764 18378529 10907646 3689447 1428444 2761021 3209403 1570572
42540 1570572 1370655 5737289 12695005 17343951 17742591 16086505 14399410 12481187
42532A2481187j747286J48183J073577k103358n857897l823970K409532M620771
42524G200739J130062p32031K023154K690253k040994m417785R74154O029960
42516A2857512J860584n484194m455241K864967M773095m78241l360821l19182
42508H258479J655425r59811k610774j70557J476672n80790j846453N94665K675140
42499H491996J429694K28220J507781K082284J22913p36936J202245J610941j764280
42490A4174858m087374j706910J370527P71928q71258L86196K602232K350288
42482A4990487J095675J453269J882568M51095q73538o53750j495524m125646
42474A2724636l851846J219853M543799P35342m811612l928014J426044L012432
$$ plain form
42532 12481187 10733901 10882084 11955661 9852303 3994406 170436 2579968 7200739
42524 7200739 8330801 7598770 9621924 12312177 10271183 5853398 6827552 12857512
42516 12857512 14718096 9233902 4778661 7643628 12416723 11938482 8577661 8258479
42508 8258479 9913904 8954093 6343319 6172762 7649434 7068644 5222191 5816856 8491996
42499 8491996 9921690 10149910 11657691 13739975 13862888 13125952 14328197 15939138 14174858
42490 14174858 10087484 8380574 9751101 10523029 9651771 10037967 12640199 14990487
42482 14990487 16086162 17539431 19421999 19873094 18999556 18345806 16850282 12724636
42474 12724636 8872790 10092643 14636442 15371784 10560172 6632158 8058202 11070634
42466A1070634l72278k466700n05782J921494K231232J560139M28245j757420
42458A2109564l234015j848818K14262n88971k552343j208913K508636L192413
42450H591815q6696k239268l29291K526184K731381Q10826r84599j727535j255190
42441H037627L40842J894186K156491J617266J524150K012115K756942L550756
42433B3890375K824066j062789n236696l880004K570387N660215J018700m122460
42425B1661794j967400L632621M451248J755221K595655O293402O129120K511441
42417D7063102K821722Q411025J2779506J3376232J4969974K0551049K8696409
42410A48669019L9577336N1860026N3598476L0947492r891120m3119307n2017008
$$ plain form
42466 11070634 10698356 8231656 7725874 9647368 11878600 13438739 13866984 12109564
42458 12109564 8875549 7026731 7240993 6652022 4099679 2890766 5399402 8591815
42450 8591815 8505119 6265851 5936560 8462744 11194125 12004951 11020352 9292817 8037627
42441 8037627 8378469 10272655 12429146 14046412 15570562 17582677 20339619 23890375
42433 23890375 26714441 25651652 20414956 16534952 19105339 24765554 25784254 21661794
42425 21661794 19694394 23327015 27778263 29533484 32129139 38422541 44551661 47063102
42417 47063102 49884824 58295849 71075355 84451587 99421561 119972610 148669019
42410 148669019 188246355 240106381 293704857 324652349 314761229 271641922 219624914
42403B19624914m5148351l7886469l1653092k1521171j1740972r464806j0772987
42396E1437066p025603m67142l47308o370742q816602m405245k27719q72320k210012
42387B0694373m70808J468795L59622j891428k606401k775145l673140l425428
42379G680440l53758L358206M351635K462575J91786p76930p88783p04755m47920
42370A4972496O91482K371599K574975J59456k384628j441472K147377L563880
42362B2655165J287640l08201J920568M485748K799019j488385l200099r87825
42354B7163630K518977N484981P152721N707604J053437k124365L79095N222597
42346E2558677N485192R69648j642027Q12882L743394K606662p09363k036656
$$ plain form
42403 219624914 174476563 136590094 104937002 83415831 71674859 62210053 51437066
42396 51437066 44411463 43944321 43597013 37226271 28409669 24004424 23776705 22904385 20694373
42387 20694373 20223565 21692360 22051982 20160554 17554153 14779008 11105868 7680440
42379 7680440 7326682 10684888 15036523 17499098 17690884 16913954 16125171 15420416 14972496
42370 14972496 15663978 18035577 20610552 20770008 18385380 16943908 19091285 22655165
42362 22655165 23942805 23634604 25555172 30040920 32839939 31351554 28151455 27163630
42354 27163630 29682607 35167588 42320309 48027913 49081350 46956985 47336080 52558677
42346 52558677 58043869 59013517 57371490 58184372 61927766 64534428 63825065 61788409
42338F1788409j026650O7714N30153R94531J159622K93865j174438k309949k916868
42329E7406389l058547k486284j433497q86655j353512k289106l112103l783380
42321C9003305m136683l683221k396454r47176j3870K20267Q9336J57631L70425
42312B8663560k70978j923267k376523J58095L031230J773903k640818m069038
42304B2346164p07336J421878j539549l786509J059913Q110296P310833p66579
42296C3449111m933716J05426O460108N498899n2712j518393L340891Q801383
42288E1150997R589308O594986M955468Q561978J6076766K2701064K7541527L6761937
42280A83934031N3793152O7260212N7312902J8386255l0069901o0922986o4128456
$$ plain form
42338 61788409 60761759 60829473 61359626 62354157 63513779 63807644 62633206 60323257 57406389
42329 57406389 54347842 51861558 50428061 49541406 48187894 45898788 42786685 39003305
42321 39003305 34866622 31183401 28786947 27839771 27825901 28046168 28135504 28293135 28663560
42312 28663560 28392582 26469315 24092792 24250887 27282117 29056020 26415202 22346164
42304 22346164 21638828 23060706 21521157 17734648 18794561 26904857 34215690 33449111
42296 33449111 28515395 28620821 35080929 40579828 40527116 39008723 42349614 51150997
42288 51150997 60740305 67335291 72290759 80852737 96929503 119630567 147172094 183934031
42280 183934031 237727183 304987395 362300297 380686552 350616651 289693665 225565209
42273B25565209n0498222l5603543k6432207k1648683j7624309j2305621o645613
42266E4807011l579814m234803n901060n584855m080450l916121m687535l719950
42258A9102423o98593J608498J252918q97605l031373l884196k543853O86320
42250A1594539L135380K004279j774042m166557l137804r37519l72488r39275
42242E406513m14894J113122J227875p18927j666837J334574O232613P314366
42234A9828405K284252m094893n452789j487898K471166K703915N82464j059769
42226A5774853j269900J56725L381563O515883O494142L895398L140881N434421
42218D3523966N752304N86380n485425o189645l184676k905419n913281o709693
$$ plain form
42273 225565209 175066987 139463444 113031237 91382554 73758245 61452624 54807011
42266 54807011 51227197 46992394 41091334 35506479 31426029 27509908 22822373 19102423
42258 19102423 18403830 20012328 21265246 20367641 17336268 13452072 10908219 11594539
42250 11594539 14729919 16734198 14960156 10793599 7655795 6718276 6345788 5406513
42242 5406513 4991619 6104741 7332616 6613689 4946852 6281426 12514039 19828405
42234 19828405 22112657 18017764 12564975 11077077 13548243 16252158 16834622 15774853
42226 15774853 14504953 14661678 18043241 24559124 31053266 34948664 38089545 43523966
42218 43523966 49276270 49862650 44377225 38187580 35002904 32097485 26184204 19474511
42210A9474511l693876j617346k760074l030276J92198K933517J523511j008618
42202A2013547n08824R55402p94296l989549l465297N22229K441117R7159k675012
42193D596476k471309l70345J527774L031197L801600K382397q33655k890154
42185H773981k213331m95474N35489J140814J245663l19192k620788k397779Q12276
42176D461659L016113J785419Q2876Q54010J749319m37435l503173l241958o01445
42167D165385K20844q58676k92780K100469K683207N75635j087182r45926q41947
42158E719029q39562J212977M048498L254417r37239k679034l9174J297734k218761
42149H818885n329535k541543K578591L410878Q34055K97744J826184R39139k370117
$$ plain form
42210 19474511 15780635 14163289 11403215 8372939 8565137 11498654 13022165 12013547
42202 12013547 11504723 12460125 11665829 7676280 4210983 4733212 7174329 7271488 4596476
42193 4596476 2125167 1754822 3282596 6313793 10115393 12497790 11664135 8773981
42185 8773981 6560650 6065176 6600665 7741479 8987142 8667950 6047162 3649383 4461659
42176 4461659 7477772 9263191 9346067 10200077 11949396 11511961 8008788 4766830 4165385
42167 4165385 4386229 3527553 3234773 5335242 8018449 8594084 7506902 6560976 5719029
42158 5719029 4879467 6092444 10140942 13395359 12458120 9779086 9739912 11037646 8818885
42149 8818885 3489350 947807 3526398 6937276 7771331 8069075 9895259 10834398 8464281
42140H464281l407972r07085J669122K703087L583826L454730o6649m342279l304310
42131G846751K648990N519837J350459l638451k510230K491397M361635J360339
42123A9430727k468680l936075l161073j181017R13478J585574O28608K19240
42115A2030782J820723L506462K671162j40507k385580k989748k485691j213831
42107A0813772M18360J254204R76136J008899K107637K796599K080281J605300
42099B3061188K708437L406173J463707j036421K23513N566556J0344379J0431708
42091E6169240O238854R43037l058525n221219o024690o126531n876950n288210
42083C1755006m440532l519385k451684j298649r28945j982606l133812k240353
$$ plain form
42140 8464281 5056309 4149224 5818346 8521433 12105259 15559989 15493340 11151061 7846751
42131 7846751 10495741 16015578 17366037 13727586 11217356 13708753 18070388 19430727
42123 19430727 16962047 13025972 9864899 8683882 9597360 11182934 11811542 12030782
42115 12030782 13851505 17357967 20029129 19888622 17503042 14513294 12027603 10813772
42107 10813772 11232132 12486336 13462472 14471371 16579008 19375607 21455888 23061188
42099 23061188 25769625 29175798 30639505 29603084 29826597 35393153 45737532 56169240
42091 56169240 62408094 63351131 60292606 55071387 49046697 42920166 37043216 31755006
42083 31755006 27314474 23795089 21343405 20044756 19115811 17133205 13999393 11759040
42075A1759040L22595J582998J54330j600998r61533J381032K462373O67089k865554
42066A2901372n201894l577202J613206N492728L283742k969054n763701j790389
42058C988808L694251M674528K454874J946992L281632K399716j595913m834835
42050A6010053m264614q38420K860936M797790L496185p71039m748618n077293
42042A1464980k372763J04822J214794K359348L748652L733635J929804j43321
42034B2039951j712516l162847l840441k469768J56271J850905K364073L000264
42026A8225892L174653J020351k391282l430237j368372L59498m08887j588815
42018A3592801r76487J87038k9454r22517r45100l55756J55853J244789L098337
$$ plain form
42075 11759040 12081635 13664633 13818963 12217965 11256432 12637464 15099837 15766926 12901372
42066 12901372 7699478 4122276 5735482 11228210 14511952 11542898 5779197 3988808
42058 3988808 7683059 12357587 14812461 16759453 20041085 22440801 20844888 16010053
42050 16010053 11745439 10907019 13767955 18565745 22061930 21290891 16542273 11464980
42042 11464980 9092217 9197039 10411833 12771181 16519833 20253468 22183272 22039951
42034 22039951 20327435 17164588 13324147 10854379 11010650 12861555 15225628 18225892
42026 18225892 21400545 22420896 20029614 16599377 15231005 15590503 15181616 13592801
42018 13592801 12616314 12803352 12773898 11851381 10906281 10550525 10706378 11951167 15049504
42009A5049504L913040K443596K81121n44144m70899p56183p51923N82703J905402
42000B1652217J119562r80822j470251M49355K357609K071737K56853r94457q08772
41991B3653031m4305J25874m17209p01926L5065J190522J479777P03670n8223
41982B5966276r9619J81328M35520R22586J427413J020960l53093j419798j551388
41973B6530185j699486k221638j500941J339547L687713K127263k342349m557531
41965B1362763j664519K848706L520968J03771k194454J23483M012326M093916
41957C2206960O8513l083742k192164J42106J13838j708992k145016p64898L4429
41948B2671034m20825j09411J732049K958169J962188J31243o06193n49814r22573
$$ plain form
42009 15049504 18962544 21406140 21687261 21143117 20672218 19916035 19164112 19746815 21652217
42000 21652217 22771779 21790957 20320706 20770061 23127670 25199407 25456260 24461803 23653031
41991 23653031 23608726 23734600 23317391 22615465 22650530 23841052 25320829 26024499 25966276
41982 25966276 25866657 26047985 26483505 27406091 28833504 29854464 29501371 28081573 26530185
41973 26530185 24830699 22609061 21108120 22447667 26135380 28262643 25920294 21362763
41965 21362763 19698244 22546950 26067918 26171689 23977235 24100718 28113044 32206960
41957 32206960 32275473 29191731 26999567 27141673 27255511 25546519 23401503 22636605 22671034
41948 22671034 22250209 22140798 23872847 26831016 28793204 28924447 28318254 27768440 26845867
41939B6845867j519838j438631r42993q36882o98244N88782K683256L526609J744898
41930B9952824j210214k079005M86161L583357K871480j828394n597786m447991
41922B1730432l27015K132759J943515J492095J324987l55085l001486l195842
41914B1744360j70361K198248J013384j387832j253120J235188L017279K531092
41906B8928238O96737q89725r23840Q64961K539250J411505k095490m332232l380676
41897B2818728j327776j61624J121886L094035L321108M67272k363776k152397
41889B4817456p70620j095373j405590J166285M131240K776002j535118k766046
41881B5318236J73128J807736p99734l668433k878693j99664J412300K863141
$$ plain form
41939 26845867 25326029 23887398 22944405 22107523 21409279 21998061 24681317 28207926 29952824
41930 29952824 28742610 26663605 27149766 30733123 33604603 31776209 26178423 21730432
41922 21730432 21403417 23536176 25479691 26971786 28296773 27941688 24940202 21744360
41914 21744360 21573999 23772247 24785631 23397799 22144679 23379867 26397146 28928238
41906 28928238 29624975 28735250 27811410 28676371 31215621 32627126 30531636 26199404 22818728
41897 22818728 21490952 21329328 22451214 25545249 28866357 29333629 26969853 24817456
41889 24817456 24046836 22951463 21545873 22712158 26843398 29619400 28084282 25318236
41881 25318236 25491364 27299100 26499366 22830933 19952240 19752576 21164876 24028017
41873B4028017N397781O135828K069560l887936n671679j960875K594097L679983
41865C2384776J572181r43314k041235j607990m22452O57895J425127K135489
41857C3160477K231435M69598k589663l781798j085438K877997L640894Q53432
41849C5776934j270135M4870K343574J740474j374462k846220n51420K630487
41841C6494102K594878o51937l118445k019737R67708K448560J827001J373536
41833C9915666K442057L704769L416943J593350p70477k978745m163033l215023
41825C9945507o96568O50829o62660k031482N1752M382362N741386J963482k717491
41816D6627117l304659n31184J192547O51795P34324K619725L351406R70747j525428
$$ plain form
41873 24028017 29425798 35561626 37631186 33743250 28071571 26110696 28704793 32384776
41865 32384776 33956957 33013643 30972408 29364418 28941966 29599861 31024988 33160477
41857 33160477 35391912 35861510 33271847 29490049 28404611 31282608 34923502 35776934
41849 35776934 34506799 34551669 36895243 38635717 37261255 34415035 33863615 36494102
41841 36494102 39088980 38437043 35318598 33298861 34266569 36715129 38542130 39915666
41833 39915666 42357723 46062492 49479435 51072785 50302308 47323563 43160530 39945507
41825 39945507 39248939 39899768 39237108 37205626 37257378 41639740 47381126 49344608 46627117
41816 46627117 43322458 42791274 43983821 44635616 45369940 47989665 51341071 52311818 50786390
41807E0786390n45935K162650J969627j233657k466616Q75456M954990M810404
41799F1313309Q05766k681086l046406j413051K8379L23136r9487P908J478945
41790E6717413L138490K690901K32855j063223N13835K196994Q30436k069159
41782F3188542k725477j016916L4482k42529K72336J535166Q43469j733796k307475
41773E7847802M38028K354743K85520k619200j880923J194062J906500l56318
41765E9170214j793569n43474J156446J402675J256769J886503K207736R47166
41757F5690466r66726j536366j73862J736227K158293L18543k085775k324657
41749F2816143j74270J451618J001480J276237M830415Q325799O335737L59601
$$ plain form
41807 50786390 50240455 52403105 54372732 53139075 50672459 51547915 56502905 61313309
41799 61313309 62119075 59437989 56391583 54978532 55006911 55330047 55230560 55238468 56717413
41790 56717413 59855903 62546804 62779659 61716436 62230271 64427265 65257701 63188542
41782 63188542 60463065 59446149 59480631 59238102 59510438 61045604 61889073 60155277 57847802
41773 57847802 58285830 60640573 60926093 58306893 56425970 57620032 59526532 59170214
41765 59170214 57376645 56833171 57989617 59392292 60649061 62535564 64743300 65690466
41757 65690466 64723740 63187374 63013512 64749739 66908032 67226575 65140800 62816143
41749 62816143 62641873 64093491 65094971 66371208 71201623 79527422 85863159 86222760
41741H6222760j710879L267157Q635096P400527J983220m44741J070404J140168
41733A07563712k477792n733365n449137l930674m044178m273886k152415O28589
41725H0130854O58494j361343j395876J634869M115294L093125L07382p63055
41717H6419744L38771J373023J212772R38466J326148J439231N17191k42119Q70433
41708I4193660L469286N250431M843277L476417L345494M921027O480747O207324
41700A32187663M382514L314030M903250Q225596J0084701Q665757O195917O655976
41692A84615404J0721038J4598423J4811847J2624609J1965412J3884472J5422943
41685B78644148J4186723J1854494J1892760J4994758J8256495J8668836J6425991
$$ plain form
41741 86222760 84511881 87779038 96414134 103814661 105797881 105353140 106423544 107563712
41733 107563712 105085920 99352555 93903418 89972744 85928566 81654680 79502265 80130854
41725 80130854 80789348 79428005 78032129 79666998 83782292 86875417 87182799 86419744
41717 86419744 86758515 88131538 89344310 90282776 91608924 93048155 93565346 93323227 94193660
41708 94193660 97662946 102913377 107756654 111233071 114578565 119499592 125980339 132187663
41700 132187663 136570177 139884207 144787457 153013053 163097754 171763511 177959428 184615404
41692 184615404 195336442 209934865 224746712 237371321 249336733 263221205 278644148
41685 278644148 292830871 304685365 316578125 331572883 349829378 368498214 384924205
41678C84924205J4418169J4714632J6058096J5461570J2195748Q886474P850312
41671D74509206P788971N910087K297790k91418o04918j00372J83711R26037J863532
41662D92482626R99239j899492l904377l146641j782744k315257l643116l846208
41654D72944030m355050p467193j1704845j4031178j5165450j7725200k0076661
41647C82418453j7934153j2435490j0421383j4697989j9609016j9241867j5097447
41640B72981108j2015191j0981271j0389787j0618843j2153799j1930851p162335
41633A97729031j254783m24438m946713q727995p482033k706339K524313O933407
41625A81644450R574324R689156R368652J2137414J7228807J9026058J3871374
$$ plain form
41678 384924205 399342374 414057006 430115102 445576672 457772420 466658894 474509206
41671 474509206 482298177 488208264 490506054 490214636 489609718 489509346 489693057 490619094 492482626
41662 492482626 493481865 491582373 487677996 484531355 482748611 480433354 476790238 472944030
41654 472944030 468588980 461121787 449416942 435385764 420220314 402495114 382418453
41647 382418453 364484300 352048810 341627427 326929438 307320422 288078555 272981108
41640 272981108 260965917 249984646 239594859 228976016 216822217 204891366 197729031
41633 197729031 196474248 196049810 191103097 182375102 174893069 172186730 174711043 181644450
41625 181644450 191218774 200907930 210276582 222413996 239642803 258668861 272540235
41618B72540235L920587p046883j7304300k4724507k5746728k0651387j5783440
41611A65203577j5777815j6642771j1848589l036146J546204j146790m835593
41604A13462077l051653K640848O246124N652551M060680M701659O973112P958917
41596A48644315O557542N381467P804914J3054056J6390844J5906285J6464003
41589B30203426K2926200L1065599L0705674J8324338J106400j3033567k3643836
41582B97654234l2811707l7877932l4967217k6604296j9653947j6789454j5068394
41575A13881287j2150561q917523o168914l602243k383614m136697o839568o323646
41567F3358521k694720n56952j638256k229574j590J729454k99175l775520m719473
$$ plain form
41618 272540235 276460822 269413939 252109639 227385132 201638404 180987017 165203577
41611 165203577 149425762 132782991 120934402 117898256 119444460 118297670 113462077
41604 113462077 110410424 113051272 119297396 124949947 129010627 133712286 140685398 148644315
41596 148644315 155201857 160583324 168388238 181442294 197833138 213739423 230203426
41589 230203426 253129626 284195225 314900899 333225237 334331637 321298070 297654234
41582 297654234 264842527 226964595 191997378 165393082 145739135 128949681 113881287
41575 113881287 101730726 92813203 86644289 83042046 80658432 76521735 69682167 63358521
41567 63358521 60663801 60106849 58468593 56239019 56237429 57966883 57667708 53892188 49172715
41558D9172715l145352r75924K031308N843154P038223L391538j017246q84357
41550F1454059K138059K397649q9713Q2806L806397N252516J539040k129207n34340
41541G3917266L694758M651686J698143j079991j336245q7523J465056K864137
41533H5787287L095507J673889M66284J629866M137183M812530K544975o81153
41525A03466368k680650k973680j983604l18428R05335N57394j212274k965560
41517I2794901l384648k268948m86982N80381L3291j637107l040987l369289k716492
41508G6504120j267115N02030J136951l30656k331916k525861j595267k213275
41500F7879011l914231l083204N18474J944766j141056l483423L6718N319946
$$ plain form
41558 49172715 46027363 45051439 47082747 52925901 59964124 63355662 62338416 61454059
41550 61454059 63592118 65989767 65900054 65982860 69789257 75041773 76580813 74451606 73917266
41541 73917266 77612024 82263710 83961853 82881862 81545617 81458094 82923150 85787287
41533 85787287 88882794 90556683 91022967 92652833 96790016 101602546 104147521 103466368
41525 103466368 100785718 97812038 95828434 95510006 96415341 96972735 95760461 92794901
41517 92794901 89410253 87141305 86654323 87234704 87267995 85630888 82589901 79220612 76504120
41508 76504120 75237005 75739035 76875986 76545330 74213414 71687553 70092286 67879011
41500 67879011 63964780 60881576 61400050 63344816 62203760 58720337 58757055 64077001
41492F4077001M228558k838810o788420k881572K880600L083061j038020l083909
41484E7638489j264691L05294j396503m420290n196488k822866O41651K291803
41476D5776399L60095m307697q154228p560969k511186K985001M804910K697146
41468C4089471j51959j018611r8612Q65794J015149N27578o09271k390070l640356
41459B8589113k771099o4376K140807K089252L61937j379992k157224j692206
41451B5116212n7498J834916K496551J525662K32378l317P73301J575838J554989
41442C5049032M69235q72783q51036Q46060J867819J53109k274210j564361J892821
41433C4715686L513776J570471k8941J859413M399863L190844j082136l919157
$$ plain form
41492 64077001 68305559 65466749 58678329 55796757 58677357 61760418 60722398 57638489
41484 57638489 56373798 56679092 55282589 50862299 45665811 42842945 43484596 45776399
41476 45776399 46136494 41828797 33674569 26113600 23602414 26587415 31392325 34089471
41468 34089471 33937512 32918901 32820289 33686083 34701232 35228810 34619539 32229469 28589113
41459 28589113 25818014 25753638 27894445 29983697 30345634 28965642 26808418 25116212
41451 25116212 25058714 26893630 29390181 30915843 31148221 31144904 31918205 33494043 35049032
41442 35049032 35518267 34645484 33794448 34640508 36508327 36661436 34387226 32822865 34715686
41433 34715686 38229462 39799933 39770992 41630405 46030268 49221112 48138976 44219819
41425D4219819k957389L43945L279113L669214Q86779k700606l361288q93344
41417D2486243Q06008k57497j395119p36020p39642k653835k609006J709774N388155
41408D1999061L605507K62197J782771N890822N259891R5023k345408n2661J495776
41399E7992979L4817j35652K379608K453413k016765n063476j953752L040623
41391E6731795L311013p34856l787572l150233q4313L039050L761324Q37779l189346
41382E6734641m017299j567108J12616k98208n6652J023782p11193n159238o620523
41373C9440818k862739R19475J041398R19021K990691K802160k348459o068660
41365C6833705k330671L522855K363866m236313o657685k132825K313107J474618
$$ plain form
41425 44219819 41262430 41606375 44885488 48554702 49441481 46740875 43379587 42486243
41417 42486243 43292251 43034754 41639635 40903615 40163973 37510138 34901132 36610906 41999061
41408 41999061 45604568 45866765 47649536 53540358 58800249 58895272 56549864 56497203 57992979
41399 57992979 58027796 57892144 60271752 62725165 60708400 55644924 53691172 56731795
41391 56731795 60042808 59307952 55520380 52370147 52285834 55324884 59086208 59923987 56734641
41382 56734641 52717342 51150234 51262850 50964642 50907990 51931772 51220579 46061341 39440818
41373 39440818 36578079 37497554 38538952 39457973 42448664 45250824 42902365 36833705
41365 36833705 34503034 38025889 40389755 36153442 29495757 27362932 29676039 31150657
41357C1150657j717368k592805r94505N94386Q40150K18763K89475J996226L365715
41348C3150694J416011k140393j694609L047513M686117n08002n518581l397700
41340B9041050J450001J254742j813191n86274L543055L574396K95899M43691
41332C7203369L183961J392182l751401l060963L955889O457339L35939m360400
41324D1355915k51611N379109L637456j430345j157319K942460L185660q60786
41316E2800539k949595r10602J782915L097187L817359L529012J431601l94104
41308F2204312K17028J390460O39288j61880J738561M242048L662216J346266
41300G5278299J342840L392099L995487K983923L231110M717757M491088K306223
$$ plain form
41357 31150657 29433289 26840484 25845979 26440365 27280515 27499278 27788753 29784979 33150694
41348 33150694 34566705 32426312 30731703 33779216 38465333 37957331 32438750 29041050
41340 29041050 30491051 31745793 29932602 29346328 32889383 36463779 36759678 37203369
41332 37203369 40387330 41779512 38028111 34967148 38923037 45380376 45716315 41355915
41324 41355915 41104304 46483413 50120869 48690524 47533205 50475665 53661325 52800539
41316 52800539 49850944 48940342 50723257 53820444 57637803 61166815 62598416 62204312
41308 62204312 62421340 63811800 64451088 64289208 66027769 70269817 73932033 75278299
41300 75278299 76621139 80013238 84008725 86992648 90223758 94941515 99432603 101738826
41292A01738826J284230K823329N080841O474100P007028O586842N493099N576917
41284A42065212P522849Q476703O343247M426577O857536J1244051J1798877Q648203
41276B07383255P384551R513935J0500091Q451657P460876R617260J0556028P130200
41268B77997853L648154N099026Q648470Q053911L684799J563690L462804M447854
41260C16606561J243669k573673k410950L19396O32717k696648n978156o283428
41252B98859488m928887m470531m864679m467806l322560l195182m741189o580714
41244B62287940p357559p182453o789473o670218p284161q643667r388145p939949
41236B01032315n134996l969054n855617q721948r821894q937722p656409o853620
$$ plain form
41292 101738826 103023056 105846385 110927226 117401326 124408354 130995196 136488295 142065212
41284 142065212 149588061 158064764 164408011 168834588 175692124 186936175 198735052 207383255
41276 207383255 214767806 224281741 234781832 243233489 250694365 260311625 270867653 277997853
41268 277997853 281646007 286745033 295393503 303447414 307132213 308695903 312158707 316606561
41260 316606561 317850230 315276557 312865607 313185003 313817720 311121072 305142916 298859488
41252 298859488 293930601 289460070 284595391 280127585 276805025 273609843 268868654 262287940
41244 262287940 254930381 247747928 240958455 234288237 227004076 218360409 208972264 201032315
41236 201032315 195897319 191928265 186072648 177350700 167528806 158591084 150934675 144081055
41228A44081055o235642n476784m766499m736974n978636p672792p309696l859210
41220I8044822o64367j984551o584551q643915n835830k122218j013066j047057
41212G0149267n96155j722237m986883n572018m78131M521176K134748n038107
41204E8411660p973225m515662j088492j317162j499267P82079J645287j679985
41196D2765233m951834l272997J252075L027809R92964j191664r14396R69088
41188C8676278K123761P30791l079009o279184n467500j505809J025874J64588
41180B6389790j007196J63802J836681J437754j91692j166184j630390j689763
41172B4142802N6477K843442K615118j692866m866271k896405M16539j63325k348111
$$ plain form
41228 144081055 137845413 132368629 127602130 122865156 116886520 109213728 101904032 98044822
41220 98044822 97380455 95395904 88811353 80167438 74331608 72209390 71196324 70149267
41212 70149267 69553112 67830875 62843992 57271974 56793843 61315019 63449767 58411660
41204 58411660 50438435 45922773 44834281 43517119 42017852 42799931 44445218 42765233
41196 42765233 37813399 34540402 35792477 38820286 39813250 38621586 37707190 38676278
41188 38676278 40800039 41530830 38451821 32172637 26705137 25199328 26225202 26389790
41180 26389790 25382594 25546396 27383077 28820831 28629139 27462955 25832565 24142802
41172 24142802 24199279 27042721 29657839 27964973 23098702 20202297 20618836 20455511 18107400
41163A8107400o55117L380457L441375n51117k172598N28026K131632m45954l185621
41154B0578483k637314j217392j342205q30346J643057K484985n44585l261767
41146A4872916j608308J356479P93393j696732j595143K12805k39560j773632
41138A0322218N1078L828633L212027k289923n228557j470103L283611K171869
41130A3880853k955488n102211j970771K577620M837718M595590K968773O82810
41122A9514894j208751j430359j2402J513993J755361P53533k43898j63398M32731
41113B0911704k22205k280339k952107r6933L674165L562015p66240m487428m200409
41104A3142223j629388L51278J553103K459498K134954O89278M24306J774584
$$ plain form
41163 18107400 17452283 20832740 24274115 23722998 21550400 22078426 24210058 23764104 20578483
41154 20578483 17941169 16723777 15381572 14551226 16194283 18679268 18134683 14872916
41146 14872916 13264608 14621087 15414480 13717748 12122605 12335410 12095850 10322218
41138 10322218 10373296 14201929 17413956 15124033 9895476 8425373 11708984 13880853
41130 13880853 10925365 5823154 3852383 6430003 11267721 15863311 18832084 19514894
41122 19514894 18306143 16875784 16863382 18377375 20132736 20886269 20642371 20478973 20911704
41113 20911704 20689499 18409160 15457053 15360120 19034285 22596300 21830060 17342632 13142223
41104 13142223 11512835 11864113 13417216 15876714 18011668 18700946 19125252 20899836
41096B0899836J589018j403846l231615q66035K004034O63817k468986j909400
41088A5276823J047896L75695l482554l166264L085578O968302K459684m452362
41080A8112798m547539J165890M030281J123351j559571O11794M192536L693260
41072B6822800l78522l073691k089134L24193J721205K348847K950816K461188
41064C1087702K5317k302451j872997l9475q83919m459118n281640k57385N481323
41055B1497357N047157k77596k997554l27835K790405K244341M04657R08146K775798
41046C2064876L083677J851926Q68874L90218O7047P39363K458785L036680J314122
41037D5875568m42459j46118O43529r2602q62964L75550J694311Q5674k804421
$$ plain form
41096 20899836 22488854 21085008 17853393 16987358 18991392 19655209 17186223 15276823
41088 15276823 16324719 16700414 13217860 10051596 13137174 20105476 22565160 18112798
41080 18112798 13565259 14731149 18761430 19884781 18325210 18937004 23129540 26822800
41072 26822800 26444278 23370587 21281453 21605646 23326851 25675698 28626514 31087702
41064 31087702 31113019 28810568 26937571 26898096 26014177 21555059 16273419 16016034 21497357
41055 21497357 26544514 26266918 23269364 22941529 25731934 27976275 28380932 29289078 32064876
41046 32064876 35148553 37000479 37869353 38259571 38326618 39065981 41524766 44561446 45875568
41037 45875568 45433109 45286991 45930520 45837918 44974954 45350504 47044815 47130489 44326068
41028D4326068k723788J33530J074260j776125m656134l853968m46433K202432
41020C4279842K613873J147732j690361m855395o243353m484403p94988J941752
41012B1914699J836159l32575j843399q97755R88166O90718j871564k993881p18069
41003A6772499J490324k84023l814292l447812J346315M873319L292547n73135
40995A9655742k153435j092859J34340O80441J423995K234996J916769L48475
40987B3148464j252496j970930j771890p49891R39453K343465J959162n42242
40979B2103095l016866k314393J918167N553096M172336q92135l502802r66785
40971B3053713J898923k39219n053111n642352k46363N817225P568967N332914
$$ plain form
41028 44326068 41602280 41735810 42810070 41033945 36377811 32523843 32077410 34279842
41020 34279842 36893715 38041447 36351086 31495691 25252338 20767935 19972947 21914699
41012 21914699 23750858 23418283 21574884 20677129 21665295 22356013 20484449 17490568 16772499
41003 16772499 18262823 17978800 14164508 10716696 12063011 16936330 20228877 19655742
40995 19655742 17502307 16409448 16543788 17224229 18648224 20883220 22799989 23148464
40987 23148464 21895968 19925038 18153148 17403257 18342710 20686175 22645337 22103095
40979 22103095 19086229 16771836 18690003 24243099 28415435 27523300 24020498 23053713
40971 23053713 24952636 24713417 19660306 14017954 13771591 19588816 27157783 32490697
40963C2490697K092290L8825K88067K169174K404854j008757m114064j297340
40955C3063746N232383O715430P90325l754282L76185P803356Q418562K021798
40947F0667503k669988j386941J285001R05908o42213k4212J909545K136408k91610
40938F1889401m070779p130883p128168l239818J493483K564074j11198j806290
40930D2459822L9957J869535m55702n016248o245842k609507J577086J975747
40922C3594848q37645l110762k876551j737688j917396k768867j597853J887093
40914B0635179L937963J484173k907367l821090l70361K756032K236362K44702
40906B4195593j95279k34784k304694m893458m276427k90586L275241L669167
$$ plain form
40963 32490697 34582987 34621812 34909879 37079053 39483907 38475150 34361086 33063746
40955 33063746 38296129 45011559 45801884 42047602 42423787 50227143 58645705 60667503
40947 60667503 57997515 56610574 57895575 58801483 58159270 58135058 60044603 62181011 61889401
40938 61889401 57818622 50687739 43559571 40319753 41813236 44377310 44266112 42459822
40930 42459822 42499779 44369314 43913612 38897364 32651522 30042015 31619101 33594848
40922 33594848 32757203 29646441 26769890 25032202 23114806 20345939 18748086 20635179
40914 20635179 24573142 26057315 23149948 19328858 18958497 21714529 23950891 24195593
40906 24195593 24000314 23765530 21460836 16567378 12290951 12000365 15275606 18944773
40898A8944773J582415r96710k494221j794258M96902J297639j314708m248768
40890A1473064k892527J760996L893864J361036j416282p26970J135292P56229
40882A5344702o37727k94451O94403k18178j753995q11786J775294K359785O30514
40873A7088561r1304J301393K045457M41212j427829j116548R81930K826503K807512
40864B4856887L91747k921066l627250j54763L745675L182025o77314k002784
40856B2793157Q59615L018430R15772k408857k470835M36607L128095M185665
40848C0457649L784892J852429p19899j581597j78534R67605L28308k23982P23576
40839C5410447J238383j96398j332401J67381K542949K691580O30608j615007
$$ plain form
40898 18944773 20527188 19530478 17036257 15241999 15738901 17036540 15721832 11473064
40890 11473064 8580537 10341533 14235397 15596433 14180151 13453181 14588473 15344702
40882 15344702 14706975 14412524 15106927 14888749 13134754 12322968 14098262 16458047 17088561
40873 17088561 16997257 18298650 20344107 20785319 19357490 18240942 19222872 22049375 24856887
40864 24856887 25248634 22327568 18700318 18545555 22291230 25473255 24795941 22793157
40856 22793157 23652772 26671202 27586974 25178117 22707282 23143889 26271984 30457649
40848 30457649 34242541 36094970 35375071 33793474 33614940 34582545 34910853 34686871 35410447
40839 35410447 36648830 36452432 35120031 35287412 37830361 40521941 41152549 39537542
40831C9537542k915326k383371P81441M209553L289126j694812m187806j039837
40823C5596510K012674k15194l433088j597394J962528L08066m328324m022567
40815B6283211Q62976K268064j498924l453669p54434J173531k51302k94216K706102
40806B7041339K876035k116778n257710j858271J853297o34285m802112l181042
40798A3920473J720151K252984j174721j697688J819778L715063J681625n63766
40790B1673899q09203r78288j659080q03949J119803P76047k021406l413941j890973
40781A1992909m33507q52243r39173Q95173K670482K674731K233535K334283J178717
40772B1754907k160530m705076l283053P25223L097755J900252j243986l731246
$$ plain form
40831 39537542 36622216 34238845 35020286 39229839 42518965 40824153 36636347 35596510
40823 35596510 37609184 37393990 33960902 32363508 34326036 34634102 30305778 26283211
40815 26283211 27146187 29414251 27915327 24461658 23707224 24880755 24629453 24335237 27041339
40806 27041339 29917374 27800596 22542886 20684615 22537912 21903627 17101515 13920473
40798 13920473 15640624 17893608 16718887 15021199 16840977 20556040 22237665 21673899
40790 21673899 20864696 19886408 18227328 17423379 18543182 19319229 17297823 13883882 11992909
40781 11992909 11559402 10707159 9767986 10663159 13333641 16008372 18241907 20576190 21754907
40772 21754907 19594377 14889301 11606248 12331471 15429226 17329478 16085492 12354246
40764A2354246l778458q36827L497531N599845L121856j735519m139485k252645
40756A1830544P62631J270566N624L47168K554223K757858j189429n545631n034934
40747G758620K0370M092170L702988J119205J34302J031169J285741n52552l212521
40738A5379492m094328j773337K102012L821285J872739p85754p81827Q46317
40730A6586599J090568N49680J778665L165851P51522l622458l314827K009668
40722A8995268M103428j061042n867539k531845M611170O079574J506154j881530
40714B3953638j793840k451534m803379m488693n01102K238038J023252p60599
40706A2415781l33324J2529j874246l496974j896659J449813L128185K510189
$$ plain form
40764 12354246 8575788 7738961 11236492 16836337 19958193 18222674 14083189 11830544
40756 11830544 12593175 13863741 13869365 14216533 16770756 19528614 18339185 12793554 7758620
40747 7758620 7778990 11871160 15574148 16693353 16827655 17858824 19144565 18592013 15379492
40738 15379492 11285164 9511827 11613839 15435124 17307863 16522109 15740282 16586599
40730 16586599 17677167 18226847 20005512 23171363 23922885 20300427 16985600 18995268
40722 18995268 23098696 22037654 16170115 13638270 18249440 24329014 25835168 23953638
40714 23953638 22159798 19708264 14904885 10416192 9915090 12153128 13176380 12415781
40706 12415781 12082457 12094986 10220740 6723766 4827107 6276920 9405105 11915294
40698A1915294J498004J546131K519646K889307P46609l259555m725619p02292
40690A2427525M625077M227506j709715n511443k936565J445459K184751N55728
40682A5308323M81617J696833J652416P07440O57819P00689n89257j490626q780
40673A9116474J363959j054239n086992m548022J450061O376529N254381J143359
40665B4015510k80657R91980N51938k743882m863334k685326J652971M084706
40657B0723906L788862K863324K367020J283735q94223k843141l190984k211847
40649B1886652j329448j788218l544547m500117j910856L561619O625323L417952
40641B2418360k193643k828495J943790M812619J761929k196230j616444R06038
$$ plain form
40698 11915294 13413298 14959429 17479075 20368382 21114991 17855436 13129817 12427525
40690 12427525 17052602 21280108 19570393 14058950 11122385 12567844 14752595 15308323
40682 15308323 15789940 17486773 19139189 19846629 20504448 21205137 20615880 19125254 19116474
40673 19116474 20480433 19426194 14339202 9791180 11241241 17617770 22872151 24015510
40665 24015510 23734853 24726833 25278771 22534889 17671555 14986229 16639200 20723906
40657 20723906 24512768 27376092 29743112 31026847 30132624 27289483 24098499 21886652
40649 21886652 20557204 18768986 15224439 10724322 8813466 12375085 19000408 22418360
40641 22418360 20224717 17396222 19340012 24152631 25914560 23718330 22101886 23007924
40633B3007924P5514k929534l048392j27414J501183N23358o08309j373202l343697
40624A3677431n054194k966660J986607M550234K670706k77312j468776j659596
40616A1458440j472601J6992J821354J362027m37293L52935L563479L951326l38535
40607B0278124l891304j984258K316510L063727r4788k464329j179841J889338
40599A7933179L107004J027589j880918j373011L070832O070882L048208k358432
40591B8645333k767728J819125L982861N62218k962014j958363O74306Q20705
40583B8816443l73531n18574o45074j503244p13152J976123K206736j421594l154938
40574B4669195R25796N473438M086868k45144n29898K605493K964680l46329k339341
$$ plain form
40633 23007924 23083438 20153904 17105512 16978098 18479281 19002639 18394330 17021128 13677431
40624 13677431 8623237 5656577 7643184 12193418 14864124 14586812 13118036 11458440
40616 11458440 9985839 10002831 11824185 13186212 12748919 13101854 16665333 20616659 20278124
40607 20278124 16386820 14402562 16719072 19782799 19688011 17223682 16043841 17933179
40599 17933179 21040183 22067772 20186854 18813843 21884675 27955557 31003765 28645333
40591 28645333 25877605 27696730 31679591 32241809 29279795 27321432 27995738 28816443
40583 28816443 28442912 27924338 27279264 25776020 25062868 27038991 29245727 27824133 24669195
40574 24669195 25594991 31068429 35155297 34910153 34380255 36985748 39950428 39604099 37264758
40565C7264758q89506J490814L583103O110718P275964M507918K27007n78763
40557E8992013J886574L111914K243307K522659M157896L790189J431256J020251
40549G9156059L195541M212885L199215L670871O113280N916500J413801k289708
40541A04588444r18961K858444M417478L606114K626023J576404j64197j282880
40533A17306869o29465M30649K62699p08386j623034k512576k742382j332111
40525A08452263j5319k150373p029739r453968p017836l528317k718467l064133
40517G3474111k020187r46063j719039k311045m50902J354672n59978m587004
40509F2234565n967290l847060j515097o67305o4714O72507M75583m20J087728
$$ plain form
40565 37264758 36375252 37866066 41449169 47559887 54835851 59343769 59570776 58992013
40557 58992013 60878587 63990501 66233808 68756467 72914363 76704552 78135808 79156059
40549 79156059 82351600 86564485 89763700 93434571 99547851 105464351 106878152 104588444
40541 104588444 103669483 106527927 110945405 114551519 117177542 118753946 118589749 117306869
40533 117306869 116677404 117108053 117370752 116662366 115039332 112526756 109784374 108452263
40525 108452263 108436944 106286571 99256832 89802864 82785028 79256711 76538244 73474111
40517 73474111 71453924 70507861 68788822 66477777 66026875 67381547 66821569 62234565
40509 62234565 56267275 52420215 50905118 50237813 50173099 50845606 51321189 51320769 52408497
40500E2408497K651342J206467l457481o861824n651244j780120Q26871J169215
40492D0511723P37036L52515j33210j97846R77964K786042L475571K157259m59887
40483E0207167k989806m000556k300016J725211N037960M249885L6898k485956
40475D9480787K94556N331342O305265J856369k684612k586357N51714K481869
40467F1030933K766267L955789N954989N565570J914739j371440p92835K779994
40459H1804006N954344O988871O569049N722432M586293K989966J432588J199486
40451A17247035L034214N458000N608153K798412q4409l15468R89794J056962
40443A35792693k53012j214850j917504l522865m747188l313254o75964p51139
$$ plain form
40500 52408497 55059839 56266306 52808825 45947001 40295757 38515637 39342508 40511723
40492 40511723 41248759 41601274 41468064 41270218 42248182 45034224 48509795 50667054 50207167
40483 50207167 47217361 43216805 40916789 42642000 47679960 51929845 51966743 49480787
40475 49480787 49775343 55106685 61411950 63268319 60583707 57997350 58549064 61030933
40467 61030933 63797200 67752989 73707978 79273548 81188287 79816847 79024012 81804006
40459 81804006 87758350 94747221 101316270 107038702 111624995 114614961 116047549 117247035
40451 117247035 120281249 125739249 131347402 134145814 134061405 133745937 134735731 135792693
40443 135792693 135539681 134324831 132407327 128884462 124137274 120824020 120148056 119396917
40435A19396917l572291m991813l559255k527400l472875l585450j963478k656592
40427I3067763p188472r630227n063461J456669J545402l781943n960115k373805
40419F2071811L44527k328739o027590n383531k257531j350736k225541j219500
40411D1623170J335094J397546j945587m687188l619686l28451J719471J480929
40403C6975298K65874q14013j653317k326626k851167l383761l673821k742018
40395A9796449k32755K118711J840236r04600k630865n75092L269356M003743
40387B6685183k7325m716447m966754p37536L352171L858916J907875M44554J75953
40378B5976590k21208j089309j238302m66288n11974k344925l985159k825253
$$ plain form
40435 119396917 115824626 110832813 107273558 104746158 101273283 97687833 95724355 93067763
40427 93067763 85879291 76249064 71185603 72642272 74187674 70405731 64445616 62071811
40419 62071811 62416338 60087599 54060009 48676478 46418947 45068211 42842670 41623170
40411 41623170 42958264 44355810 42410223 37723035 34103349 33774898 35494369 36975298
40403 36975298 37241172 36427159 34773842 32447216 29596049 26212288 22538467 19796449
40395 19796449 19563694 21682405 23522641 22618041 19987176 19412084 22681440 26685183
40387 26685183 26657858 21941411 16974657 16237121 19589292 23448208 25356083 25800637 25976590
40378 25976590 25755382 24666073 23427771 22961483 22449509 20104584 16119425 13294172
40370A3294172M78233K342850O25990k923183m912968l589928L97135M764146
40362A0476447O514046M056491m35033k587488j074023O86860k67817k015026
40354A5354457j304202P25665M66794j742076j929092O70585K098612M99655l39955
40345A4500443K695550O078619M273938j777039n345356k745649K301618L860609
40337B3842733N77297l894995n441837l111085Q93810L614176L722409K090020
40329B2292528M55595j73285l1812j75545j536978l669113m517405k552688P74239
40320A0865536K157666N49563j366206p93984J476938K452872J046486r14421
40312A5474450j467342p14233K5019J56567L21311J300211K734533L111060J381384
$$ plain form
40370 13294172 13772405 16115255 16741245 13818062 8905094 5315166 5712301 10476447
40362 10476447 16990493 21046984 20611951 18024463 16950440 17637300 17369483 15354457
40354 15354457 14050255 14775920 15242714 13500638 11571546 12242131 14340743 14840398 14500443
40345 14500443 17195993 23274612 27548550 25771511 20426155 17680506 19982124 23842733
40337 23842733 24420030 20525035 15083198 11972113 12865923 16480099 20202508 22292528
40329 22292528 22748123 22574838 22543026 22367481 20830503 17161390 12643985 10091297 10865536
40320 10865536 13023202 13572765 12206559 11412575 12889513 15342385 16388871 15474450
40312 15474450 14007108 13292875 13317894 13474461 13795772 15095983 17830516 20941576 22322960
40303B2322960j378498k614399j090243J455136K153092L47885j658998j489824
40295A8047111L17992J116882j05957j216631k04595J423984P73634j636111k356946
40286A6159363n74864N81670k64480P8207L478475N743540K454363l315509m740965
40277A9599800j130117J863588J288067n7453M602j06822j088613r44752J82813
40268A9611113p90040l405029k469258L189906O822311L351539k470013l174108
40260B0666421O08227K779455J735211Q14969J040347L72484p69693K09379K444804
40251B9901604K227707m73720j687178j87535Q15590k92920j011517K58208J405188
40242C0955427P17767l33701l61522l76300r47105o01184R56960J417513j88421
$$ plain form
40303 22322960 20944462 18330063 17239820 18694956 20848048 21195933 19536935 18047111
40295 18047111 18365103 19481985 19376028 18159397 17954802 19378786 20152420 18516309 16159363
40286 16159363 15584499 16166169 15901689 15979896 19458371 25201911 27656274 24340765 19599800
40277 19599800 18469683 20333271 21621338 21563885 21568487 21461665 20373052 19428300 19611113
40268 19611113 18821073 15416044 12946786 16136692 22959003 26310542 23840529 20666421
40260 20666421 21274648 24054103 25789314 26604283 27644630 28017114 27247421 27456800 29901604
40251 29901604 32129311 31655591 29968413 29780878 30596468 30303548 29292031 29550239 30955427
40242 30955427 31673194 31339493 30977971 30601671 29654566 29053382 30010342 31427855 31239434
40233C1239434j281002J70022K195242K033888L90990j41827R17789J944121J827144
40224C9295801O65408q97465j576481k07425K102069K400373j41971k675395k629620
40215C6335294j137270p01729j540122k334140k651115k349517n00827K556593
40207B7677167L941077J926363p02983k77136K127263K475900M08366k19041K334022
40198C9690998N084415N255051L906699K736564Q55439k438103m593573l096277
40190D7401213k7338L96742j992901l239122j300586J310661J630316p9184j902155
40181D2197646k846247k440389k61936K356518K444547o02252l162725k094553
40173C5590609M98279L67884k236504k782556Q09429N324534P030569O111931
$$ plain form
40233 31239434 29958432 30128454 32323696 34357584 34748574 34606747 35524536 37468657 39295801
40224 39295801 39961209 39063744 37487263 37279838 39381907 41782280 41640309 38964914 36335294
40215 36335294 35198024 34496295 32956173 30622033 27970918 25621401 25120574 27677167
40207 27677167 31618244 33544607 32841624 32564488 34691751 37167651 37576017 37356976 39690998
40198 39690998 44775413 50030464 53937163 56673727 57529166 55091063 50497490 47401213
40190 47401213 47373875 47770617 45777716 42538594 41238008 42548669 44178985 44099801 42197646
40181 42197646 39351399 36911010 36649074 39005592 41450139 40847887 37685162 35590609
40173 35590609 36088888 36456772 34220268 31437712 32247141 37571675 44602244 50714175
40165E0714175M677312K784316j151651o814104j0821461r830305m672597n86804
40157B4298881j703506n251629m217361K705634P717368M242756l029465m535320
40149B0227358J67250K756490J05303j363079K248283N064411J630663l334784
40141B7501895k561697K148865L884311K051906J381177K091556j26101m972476
40133C1399436o721825l505618k73129p45178k485930k101446j87452J197446
40125A6576304J804544J917235J262064O25957J365974K483424J554976r19813
40117B6670665j753285l2289J995469L122307L917887L260120n83153m808737
40109C1788984m007356J112611L111054j322627n927565m216663J153091L319624
$$ plain form
40165 50714175 55391487 58175803 57024152 50210048 39388587 29558282 24885685 24298881
40157 24298881 22595375 17343746 13126385 15832019 23549387 27792143 24762678 20227358
40149 20227358 20394608 23151098 23256401 21893322 24141605 29206016 30836679 27501895
40141 27501895 24940198 27089063 30973374 33025280 34406457 36498013 36371912 31399436
40133 31399436 24677611 21171993 20898864 20153686 17667756 15566310 15378858 16576304
40125 16576304 18380848 20298083 21560147 22186104 23552078 26035502 27590478 26670665
40117 26670665 24917380 24885091 26880560 30002867 33920754 37180874 36597721 31788984
40109 31788984 27781628 28894239 32005293 30682666 24755101 20538438 21691529 25011153
40101B5011153J222923q66735q91191n63310r82047j449055j784512k058971j061135
40092A6577120J536991K811036J64345l671292l288899J732062N554902L468405
40084B4884670k216832n203056k690983J739014K727308l60511k921613j548328
40076A4409669J205273R15725j708745k111818N14846K220529J697343K819472
40068A9962294P129835R407664N183990j687241m295774k453811j541011l444064
40060B8261882m537661k432174N04784J330578L02190q55522j688598k679478
40052A8206001l757608m024229k489140N72987K785928J778527j177709j963548
40044I931209O49969K910543J853403J6679J081015L500746K856165q82718l008489
$$ plain form
40101 25011153 26234076 25367341 24476150 23912840 22930793 21481738 19697226 17638255 16577120
40092 16577120 18114111 20925147 21089492 17418200 14129301 15861363 21416265 24884670
40084 24884670 22667838 17464782 14773799 16512813 19240121 18879610 15957997 14409669
40076 14409669 15614942 16530667 14821922 12710104 13224950 15445479 17142822 19962294
40068 19962294 27092129 36499793 41683783 39996542 35700768 33246957 31705946 28261882
40060 28261882 23724221 21292047 21796831 23127409 23429599 22574077 20885479 18206001
40052 18206001 14448393 10424164 7935024 8508011 11293939 13072466 11894757 9931209
40044 9931209 10581178 13491721 15345124 15361803 16442818 19943564 22799729 21917011 18908522
40035A8908522r65465K171440J966109j954703n529787m418235J216743N920654
40027A7315278M621505p49658l381013j014885J206304o18355k963564j389378
40019A3026234J673193J283521j633088k565677j271184q08087q60267J173848
40011A0018493L867985L399365O05921l05632O45643j64480k387112k214795k88448
40002A3176940j087562l959577l263590J229613L021504K83156p29545K720151
39994A1391090M302917L0483l799560j144905L191014J929957k186183j714039
39986A2000774K390050L001415n25269j788358J381775M079248L279253J735471
39978B5554359J661771J436132L11144L32634J573323P89674k961127n877687
$$ plain form
40035 18908522 17943057 20114497 22080606 20125903 14596116 10177881 11394624 17315278
40027 17315278 21936783 21187125 17806112 16791227 17997531 17379176 14415612 13026234
40019 13026234 14699427 15982948 14349860 11784183 10512999 9704912 8844645 10018493
40011 10018493 13886478 17285843 17891764 17586132 18231775 18067295 15680183 13465388 13176940
40002 13176940 12089378 8129801 4866211 6095824 9117328 9400484 8670939 11391090
39994 11391090 15694007 15724490 11924930 10780025 13971039 15900996 13714813 12000774
39986 12000774 14390824 17392239 16866970 15078612 16460387 20539635 23818888 25554359
39978 25554359 27216130 28652262 28963406 29296040 30869363 31659037 28697910 22820223
39970B2820223m724960q42351K795463M935568N071000K770301m02200j532540
39962C0890504l16397O12127J08843k50822j54043j522107m030486m140241r34674
39953B0262704J336306m78345l533060l785538j983785q02134M86311L345912
39945A4848371M726263P27644n534539o257992Q3063O033138N447893J259468
39937B1333309k06869J656405K607597P97559j511590k465262k800001l403912
39929A6007236l737469l120771j502678J015240L543700L915671J212561j892056
39921A5441434k180810o21652m61567j102256J217209N869541O672563R86181
39913B5820643n288458n867211k615881r23803q63435N46061J637840j329295
$$ plain form
39970 22820223 18095263 17252912 20048375 24983943 30054943 32825244 32423044 30890504
39962 30890504 30574107 31186234 31295077 31044255 30890212 29368105 25337619 21197378 20262704
39953 20262704 21599010 21120665 17587605 13802067 11818282 11016148 11502459 14848371
39945 14848371 19574634 20302278 14767739 8509747 8592810 14625948 20073841 21333309
39937 21333309 21126440 22782845 25390442 26188001 24676411 22211149 19411148 16007236
39929 16007236 12269767 9148996 7646318 8661558 12205258 16120929 17333490 15441434
39921 15441434 13260624 12638972 12177405 11075149 12292358 18161899 24834462 25820643
39913 25820643 20532185 14664974 12049093 11125290 10261855 10807916 12445756 11116461
39905A1116461n452995l718458L333699O986698L255663j851414k955217k763794
39897G950643m238297l512617K426378P676827N385423j005459l174383r64843
39889A0543672o59882k597555q89016M578683O241031J230592l598668k697392
39881A2151465K84587K66868r29059J81793J299330j080659m084955k571233J996092
39872G514229L584071Q51978j950363k359798j848704r42186J661291M431885
39864A0942403L328645j510226m473174k167008J911718K906494Q58964j452196
39856A0345620l232044m548841l508104R68349N257163M561933j28065k861064
39848F854947q41527K265833K288384R1511r97077l87651R2416m5978L03804R88371
$$ plain form
39905 11116461 5663466 1945008 5278707 12265405 15521068 13669654 10714437 7950643
39897 7950643 3712346 199729 2626107 10302934 15688357 14682898 11508515 10543672
39889 10543672 9883790 7286235 6397219 10975902 17216933 18447525 14848857 12151465
39881 12151465 12436052 12702920 11773861 11955654 13254984 12174325 8089370 5518137 7514229
39872 7514229 11098300 11950278 9999915 7640117 5791413 4849227 6510518 10942403
39864 10942403 14271048 12760822 8287648 6120640 8032358 10938852 11797816 10345620
39856 10345620 7113576 2564735 -943369 24980 5282143 9844076 9716011 6854947
39848 6854947 6013420 8279253 10567637 10659148 9662071 9274420 9366836 9320858 9624662 10613033
39838A0613033M56823j259045j929578l62394J656646J816896K92450r60731r33112
39829I390988k55591K78375N95677Q25355Q29931M14276l92302j198176j296381
39820I192152l44943Q60481J137594P46247J256363K877193L386595J143958k068988
39811A8186652l123044j622078J66374Q09703P51559K45660r57546j719218k79459
39802A2458603K419898L183862J358402l6425N35404M52229k073999l981308k123896
39793A2192770R70686Q92433j261908q58995K019416K511862n49220k506787r29873
39784A2480384M37372j178476k324100L41538L423732K148922j314275j191241
39776A2823856K505743M379309K380905j80908j216407k258529l608321l031994
$$ plain form
39838 10613033 11069856 9810811 7881233 7518839 9175485 10992381 11284831 10324100 9390988
39829 9390988 9135397 9413772 10009449 10834804 11664735 12079011 11686709 10488533 9192152
39820 9192152 8847209 9707690 10845284 11591531 12847894 15725087 19111682 20255640 18186652
39811 18186652 15063608 13441530 13607904 14417607 15169166 15414826 14457280 12738062 12458603
39802 12458603 14878501 18062363 19420765 19384340 19919744 20371973 18297974 14316666 12192770
39793 12192770 13163456 14055889 12793981 11934986 13954402 16466264 15917044 13410257 12480384
39784 12480384 12917756 11739280 9415180 9756718 13180450 15329372 14015097 12823856
39776 12823856 15329599 19708908 22089813 21908905 20692498 18433969 14825648 11793654
39768A1793654p35437l6947j218034k83750L671596N535748K150467k015506j612276
39759A7249515J653051K808825J499772N99432J62391j269785j806817R65623
39751B1862007L980426K212403k567831l449420J007569M682088L553583P38724
39743C2019549j83143m15497j500951j573125J32692K63012k849525n055981k845610
39734A7991421L27638l51833k777278j629431K077306K222936k273536n378472
39726A0208751l099776J114890K307382O97499l83532Q1407N29879J29916l17584
39717A1268832j46702J90222j65227j381909k461902k108172m78495P64425R46271
39708F427343J511275L161564L610863P68302l163132m034599j540731Q46075
$$ plain form
39768 11793654 11058217 11021270 9803236 9519486 13191082 18726830 20877297 18861791 17249515
39759 17249515 18902566 21711391 23211163 23810595 23972986 22703201 20896384 21862007
39751 21862007 25842433 28054836 25487005 22037585 23045154 27727242 31280825 32019549
39743 32019549 31836406 31420909 29919958 28346833 28479525 28742537 25893012 20837031 17991421
39734 17991421 18319059 17967226 15189948 13560517 15637823 17860759 15587223 10208751
39726 10208751 7108975 8223865 10531247 11228746 10845214 10926621 11456500 11586416 11268832
39717 11268832 11122130 11312352 11147125 9765216 7303314 5195142 4716647 5481072 6427343
39708 6427343 7938618 11100182 14711045 15479347 12316215 8281616 6740885 7586960
39700G586960J516388K354568M106272M238891J317862j824393j814961O60884
39692A8142471K361052J840134J11872j609972k673719k453032r41583O96356
39684A5473579J509972J963304K595018K441990K95362k974126m734282l358467
39676A3212350q7944K005989J089115j243534j694918J61088P40026k230975n279074
39667F672123l664413J040486K754971J42824j699290j01400R64596j333182k948003
39658A828712j02536L213099J596205k002459q25326L821587M114021j236537
39650A0406766m577632j800265J396307l91114l408545j633013L128185M590777
39642G711466J888939l72831k0498P39706M79430K61493J61123j169853k853667
$$ plain form
39700 7586960 9103348 11457916 15564188 19803079 21120941 19296548 17481587 18142471
39692 18142471 20503523 22343657 22455529 20845557 18171838 15718806 14777223 15473579
39684 15473579 16983551 18946855 21541873 23983863 24279225 21305099 16570817 13212350
39676 13212350 13124406 15130395 16219510 14975976 13281058 13442146 14182172 11951197 6672123
39667 6672123 3007710 4048196 6803167 6945991 5246701 5145301 6109897 4776715 1828712
39658 1828712 1726176 4939275 6535480 4533021 3707695 7529282 11643303 10406766
39650 10406766 5829134 4028869 5425176 5034062 1625517 -7496 3120689 7711466
39642 7711466 9600405 9227574 9207076 9946782 10426212 10687705 10848828 9678975 6825308
39633F825308j900084J875982M526814L046638q46572l357265k973317j059441
39625F138063K02518m06855k038609k106846P41759M061145M131329J109955r98557
39616A0833902j04643J210326J23037k080720k417787q82717P1890m38127r67130
39607E348031n99421j38598l10883p47847j091327j444068j273876N10308L457210
39598C709529M780205K145492k945358n836220l485331J896028M887172K773672
39590G925189j439729k734050j14659K515868J545604j938649l852993k126934
39582b20353J300404L169594K416532O34045l81032o63485j108798j104482J033922
39573E076347M567055N478110J385306m238121n899723l272892p73448l39759
$$ plain form
39633 6825308 4925224 6801206 11328020 14374658 13528086 10170821 7197504 6138063
39625 6138063 6340581 5933726 3895117 1788271 2530030 6591175 10722504 11832459 10833902
39616 10833902 10729259 11939585 12062622 9981902 7564115 6681398 6753288 6315161 5348031
39607 5348031 4748610 4610012 4299129 3551282 2459955 1015887 -257989 252319 3709529
39598 3709529 8489734 10635226 7689868 1853648 -1631683 264345 5151517 7925189
39590 7925189 6485460 3751410 3636751 6152619 7698223 5759574 1906581 -220353
39582 -220353 1080051 4249645 6666177 7300222 6919190 6255705 5146907 4042425 5076347
39573 5076347 9643402 15121512 16506818 12268697 6368974 3096082 2322634 1982875
39565A982875M82446K376587J943548j507632k482959K340431O864194L432673
39557A5432163m906464p789401k378970L228336K614108p57578j126583O56839
39549D972450P53436k65122N73752K414768J993379m60471j752092j159210q09546
39540F261344j179266n48739J007613J134028o12381j549556J4483K192135K294113
39531I013774J81205k172974k901183j390824J317004K828701J477647j597961
39523F755389l679510l668426k609339j354562K83132J993625K696909K251275
39515B668493J597891Q39893q52894k901746l013448k64579L215071M730916L784128
39506I803725J482486j185091l318629l842026k713007j329755m82027R09039
$$ plain form
39565 1982875 2465321 4841908 6785456 5277824 2794865 5135296 11999490 15432163
39557 15432163 10525699 2736298 357328 3585664 6199772 5442194 4315611 4972450
39549 4972450 5725886 5460764 6034516 8449284 10442663 9982192 8230100 7070890 6261344
39540 6261344 5082078 4533339 5540952 6674980 6062599 4513043 4527526 6719661 9013774
39531 9013774 9194979 7022005 4120822 2729998 4047002 6875703 8353350 6755389
39523 6755389 3075879 -592547 -3201886 -4556448 -4273316 -2279691 417218 2668493
39515 2668493 4266384 5106277 4253383 1351637 -1661811 -1926390 1288681 6019597 9803725
39506 9803725 11286211 10101120 6782491 2940465 227458 -1102297 -1584324 -675285
39498f75285L461328M900206K294328l320102o786016m442851J289510M434243
39490A155361K371067j259982j386228J914633L652316Q45637l225219l455667
39482F11918N8221K251869J13328l341856l172568J288786N814962O066825J965245
39473A1656730k469253l287010p13877J383397N57572j075513m14090J394845
39465G032801N51530k880991m105408o24193L561740L474227P6671j713121j05415
39456E267841K190876K840604K336113J433108l14991k417514k844272j203583
39448G288182j17980j376597k619175m90646L908797N705630K643230j812086
39440A3129355k990242p44247J211209N99575j119309j812847j781354k505673
$$ plain form
39498 -675285 2786043 7686249 9980577 6660475 -125541 -4568392 -3278882 1155361
39490 1155361 3526428 2266446 880218 2794851 6447167 7292804 4067585 611918
39482 611918 670139 2922008 3035336 -306520 -3479088 -2190302 3624660 9691485 11656730
39473 11656730 9187477 5900467 5186590 6569987 7127559 6052046 5637956 7032801
39465 7032801 7584331 4703340 597932 -26261 3535479 7009706 7086377 5373256 5267841
39456 5267841 7458717 10299321 12635434 14068542 13753551 11336037 8491765 7288182
39448 7288182 7170202 5793605 3174430 2683784 6592581 12298211 14941441 13129355
39440 13129355 10139113 9394866 10606075 11205650 10086341 8273494 6492140 3986467
39432C986467l602257k886622M71861M144257M792082J830340j570469j807724
39424E357935R02256K650506Q93805j977099j976448O04696J666506l63902k244485
39415E513770j191038J110818J928179J557214J128423l14555k809200k819002
39407D104609J501265N145187K423995l578221m736502k76102K472931L36841
39399G394003j310512J009210K729025J78039k311793n55645J267637j671180
39391F728784m841566j352524N209450N304703j163111m595721r73534K972978
39383G289459J875382p24966o67175k60972j912010k113110J892059N320406K629288
39374A3328361l212004n226648l105928k198721l636008k871607J760733N606150
$$ plain form
39432 3986467 384210 -2502412 -2030551 2113706 6905788 8736128 7165659 5357935
39424 5357935 6260191 8910697 9804502 7827403 5850955 6455651 8122157 7758255 5513770
39415 5513770 4322732 5433550 7361729 8918943 10047366 9732811 6923611 4104609
39407 4104609 5605874 10751061 13175056 9596835 4860333 4584231 7057162 7394003
39399 7394003 6083491 7092701 9821726 9999765 7687972 7132327 8399964 6728784
39391 6728784 1887218 534694 5744144 11048847 9885736 5290015 4316481 7289459
39383 7289459 9164841 8439875 7772700 7511728 5599718 3486608 5378667 10699073 13328361
39374 13328361 10116357 4889709 1783781 -414940 -4050948 -6922555 -5161822 444328
39366D44328M543879M35547k355888k366484j023682J13636L73356j790K01413
39357C64315J734283L107752K090119q48923k730115k028100k61387P66400J020150
39348C214494J010548Q97560J427812L173966M083647R48587n111142p983852
39340A661620m135055J967679L593635Q14102n96059J651365L355548R40196l002769
39331F250262l806138j260705R53724O37575q99346j399705j15531J945122K891028
39322E196286J665993k64487k55696J535935J615864j631664m606129l305653
39314d9551N27747J893621j05952j711131p78492J017784K376037L807355M086253
39305A1063671O55463m572886n399809m05386L569616J277387k707167j344343
$$ plain form
39366 444328 4988207 5423754 3067866 701382 -322300 -208664 164692 162902 364315
39357 364315 2098598 5206350 7296469 6447546 3717431 1689331 1427944 2194344 3214494
39348 3214494 4225042 5122602 6550414 9724380 13808027 14756614 9645472 1661620
39340 1661620 -2473435 -505756 3087879 3901981 3305922 4957287 8312835 9253031 6250262
39331 6250262 2444124 1183419 2137143 2774718 1875372 475667 360136 2305258 5196286
39322 5196286 6862279 6597792 6342096 7878031 9493895 7862231 3256102 -49551
39314 -49551 478196 2371817 2265865 554734 -223758 794026 3170063 6977418 11063671
39305 11063671 11719134 7146248 1746439 1341053 4910669 6188056 3480889 2136546
39297B136546L519778M356693J8422l235441k216721o50291j427127k037468k57456
39288B06935J481113P25157n88490J57887J715685J501425j07193j064620r96431
39279C031468n92881L16960J697688K132569Q21380q79131j502645j209034k93335
39270C523039J524414K968248J465112k443870m126780r99375L198206L358554
39262H467548j69130k969964k756294q64852Q17800J287979J14987j605890j503400
39253H18784N22115J239960p63691j867434Q83401L891379J941316l168582m864849
39244a367601j620326J690252K230812K523589L993902L469975q78754n064321
39236D977528m524563n38181K096875J489505k64632p69161M08358K007548J975174
$$ plain form
39297 2136546 5656324 10013017 10031439 6795998 4579277 3928986 2501859 464391 206935
39288 206935 1688048 2413205 1824715 1982602 3698287 5199712 5092519 4027899 3031468
39279 3031468 2438587 2755547 4453235 6585804 7407184 6528053 5025408 3816374 3523039
39270 3523039 5047453 8015701 9480813 7036943 2910163 1910788 5108994 8467548
39262 8467548 8298418 5328454 2572160 1707308 2525108 3813087 3928074 2322184 818784
39253 818784 1340899 2580859 1817168 -50266 833135 4724514 6665830 3497248 -1367601
39244 -1367601 -2987927 -1297675 933137 3456726 7450628 10920603 10041849 4977528
39236 4977528 452965 -85216 2011659 3501164 3236532 2467371 2875729 4883277 6858451
39227F858451o00273l446362k995728N31279K399977n00394n117947o141768k661143
39218a1673908J517218K994274J896336N25736P87642K677062M205586L367020
39210F296966P85636p62169j33853N62440p09708k754777l037122j372332K24056
39201i00863N95183N69440J289154K616601L154665J556832j568212l263492j323825
39192B725483K179513K754369n75766l836104l646270j188749J063839L159156
39184B635471N261705M652638m55299n995315n914146n56738L474924K288222
$$ plain form
39227 6858451 6258178 2811816 -183912 347367 2747344 2246950 -2870997 -9012765 -11673908
39218 -11673908 -10156690 -7162416 -5266080 -4740344 -3952702 -1275640 2929946 6296966
39210 6296966 7082602 6320433 6186580 6749020 6039312 3284535 247413 -1124919 -900863
39201 -900863 -305680 263760 1552914 4169515 7324180 8881012 7312800 4049308 2725483
39192 2725483 4904996 7659365 7083599 3247495 -398775 -1587524 -523685 2635471
39184 2635471 7897176 12549814 12094515 6099200 185054 -371684 3103240 5391462
$$ [...]
##END NTUPLES=NMR SPECTRUM
##END=
