##TITLE=31Pdec_SR57(28)
 CDCl3, 24 sc
 30.04.2021
##JCAMPDX= 6.0         $$ Bruker NMR JCAMP-DX V2.0
##DATA TYPE= NMR SPECTRUM
##DATA CLASS= NTUPLES
##ORIGIN= UXNMR, Bruker Analytische Messtechnik GmbH
##OWNER= root
$$ XWIN-NMR		Version 3.5
$$ Fri Apr 30 14:49:25 2021 Russian Standard Time (UT+4h)  she@DPX200
##.OBSERVE FREQUENCY= 81.013821
##.OBSERVE NUCLEUS= ^31P
##.ACQUISITION MODE= SIMULTANEOUS
##.ACQUISITION SCHEME= undefined
##.AVERAGES= 24
##.DIGITISER RES= 16
##SPECTROMETER/DATA SYSTEM= spect
##.PULSE SEQUENCE= zgpg30
##.SOLVENT NAME= CDCl3
##.SHIFT REFERENCE= (INTERNAL, CDCl3, 0, 248.564)
##AUDIT TRAIL= $$ (NUMBER, WHEN, WHO, WHERE, WHAT)
$$ ##TITLE= Audit trail, XWIN-NMR		Version 3.5
$$ ##JCAMPDX= 5.01
$$ ##ORIGIN= Bruker BioSpin GmbH
$$ ##OWNER= she
$$ F:/spectra/data/she/nmr/P31/1/pdata/1/auditp.txt
$$ ##AUDIT TRAIL=  $$ (NUMBER, WHEN, WHO, WHERE, WHAT)
(   1,<2021-04-30 14:48:03.73 +0400>,<she>,<DPX200>,
      <created by zg, POWCHK disabled, PULCHK disabled
       configuration hash MD5:
       00 E9 B6 7A A2 85 ED C7 34 08 36 98 17 FE 4E 26
       data hash MD5: 32K
       D4 72 07 2A FB 11 74 58 05 4C 09 C6 19 02 54 CB>)
(   2,<2021-04-30 14:48:29.21 +0400>,<she>,<DPX200>,
      <Start of raw data processing
       efp BC_mod = 2 LB = 1 FT_mod = 6 PKNL = 1 PHC0 = -6397.871 PHC1 = 433.4009 SI = 64K 
       data hash MD5: 64K
       9F 9A 4F 9A 02 10 A7 92 98 7F B6 59 FC 9A 98 30>)
(   3,<2021-04-30 14:48:53.26 +0400>,<she>,<DPX200>,
      <pk PHC0 = -80.66865 PHC1 = 289 
       data hash MD5: 64K
       B0 A0 B2 F4 2E DC DC AC 71 1C 5C 77 4D AE 9B 1B>)
(   4,<2021-04-30 14:48:56.29 +0400>,<she>,<DPX200>,
      <abs ABSG = 5 
       data hash MD5: 64K
       69 25 40 C2 65 83 37 E7 57 AE 5F 91 2C DB AA 20>)
$$ ##END=
$$ 
$$ hash MD5
$$ 1D 75 6C 6F 35 69 96 E2 12 30 2C 67 65 62 89 7B
##$RELAX= 
##$RELAX= 
##$RELAX= 
##$RELAX= 
##$RELAX= 
##$RELAX= 
##$RELAX= 
##$RELAX= 
$$ Bruker specific parameters
$$ --------------------------
##$DU= <F:/spectra>
##$EXPNO= 1
##$NAME= <P31>
##$PROCNO= 1
##$TYPE= <nmr>
##$USER= <she>
##$AMP= (0..31)
100 100 100 100 100 100 100 100 100 100 100 100 100 100 100 100 100 100 
100 100 100 100 100 100 100 100 100 100 100 100 100 100 
##$AQSEQ= 0
##$AQ_mod= 1
##$AUNM= <au_zg>
##$AUTOPOS= <>
##$BF1= 81.014009
##$BF2= 200.13
##$BF3= 200.13
##$BF4= 200.13
##$BF5= 200.13
##$BF6= 200.13
##$BF7= 200.13
##$BF8= 200.13
##$BYTORDA= 1
##$CFDGTYP= 0
##$CFRGTYP= 5
##$CHEMSTR= <none>
##$CNST= (0..31)
1 1 145 1 1 1 1 1 1 1 1 1 1 1 1 1 1 1 1 1 1 1 1 1 1 1 1 1 1 1 1 1 
##$CPDPRG= <waltz16>
##$CPDPRG1= <>
##$CPDPRG2= <waltz16>
##$CPDPRG3= <>
##$CPDPRG4= <mlev>
##$CPDPRG5= <mlev>
##$CPDPRG6= <mlev>
##$CPDPRG7= <mlev>
##$CPDPRG8= <mlev>
##$CPDPRGB= <>
##$CPDPRGT= <>
##$D= (0..31)
0 1 0 0 0 0 0 0 0 0 0 0.03 2e-05 3e-06 0 0 0 0 0 0 0 0 0 0 0 0 0 0 0 0 
0 0 
##$DATE= 1619779683
##$DBL= (0..7)
120 120 120 11 120 120 24 19 
##$DBP= (0..7)
150 150 150 150 150 150 150 150 
##$DBP07= 0
##$DBPNAM0= <>
##$DBPNAM1= <>
##$DBPNAM2= <>
$$ [...]
##$SUBNAM3= <"">
##$SUBNAM4= <"">
##$SUBNAM5= <"">
##$SUBNAM6= <"">
##$SUBNAM7= <"">
##$SUBNAM8= <"">
##$SUBNAM9= <"">
##$SW= 501.771253377433
##$SWIBOX= (0..15)
0 1 3 0 0 0 0 0 0 0 0 0 0 0 0 0 
##$SW_h= 40650.406504065
##$TD= 32768
##$TD0= 1
##$TE= 0
##$TE2= 300
##$TE3= 300
##$TEG= 300
##$TL= (0..7)
0 120 53 12 22 120 120 120 
##$TP= (0..7)
150 150 150 150 150 150 150 150 
##$TP07= 0
##$TPNAME0= <>
##$TPNAME1= <>
##$TPNAME2= <>
##$TPNAME3= <>
##$TPNAME4= <>
##$TPNAME5= <>
##$TPNAME6= <>
##$TPNAME7= <>
##$TPOAL= (0..7)
0.5 0.5 0.5 0.5 0.5 0.5 0.5 0.5 
##$TPOFFS= (0..7)
0 0 0 0 0 0 0 0 
##$TUNHIN= 0
##$TUNHOUT= 0
##$TUNXOUT= 0
##$USERA1= <user>
##$USERA2= <user>
##$USERA3= <user>
##$USERA4= <user>
##$USERA5= <user>
##$V9= 5
##$VALIST= <valist>
##$VCLIST= <CCCCCCCCCCCCCCC>
##$VD= 0
##$VDLIST= <DDDDDDDDDDDDDDD>
##$VPLIST= <PPPPPPPPPPPPPPP>
##$VTLIST= <TTTTTTTTTTTTTTT>
##$WBST= 1024
##$WBSW= 4
##$XGAIN= (0..3)
0 0 0 0 
##$XL= 0
##$YL= 0
##$YMAX_a= 6271
##$YMIN_a= -5689
##$ZGOPTNS= <>
##$ZL1= 120
##$ZL2= 120
##$ZL3= 120
##$ZL4= 120
##$ABSF1= 248.5645
##$ABSF2= -253.2056
##$ABSG= 5
##$ABSL= 3
##$ALPHA= 0
##$AQORDER= 0
##$ASSFAC= 0
##$ASSFACI= 0
##$ASSFACX= 0
##$ASSWID= 0
##$AUNMP= <proc_1d>
##$AZFE= 0.1
##$AZFW= 0.5
##$BCFW= 0
##$BC_mod= 2
##$BYTORDP= 0
##$COROFFS= 0
##$CY= -3
##$DATMOD= 1
##$DC= 0
##$DFILT= <>
##$DTYPP= 0
##$F1P= 0
##$F2P= 0
##$FCOR= 1
##$FTSIZE= 65536
##$FT_mod= 6
##$GAMMA= 0
##$GB= 0
##$INTBC= 1
##$INTSCL= 5.30512e-09
##$ISEN= 30
##$LB= 1
##$LEV0= 0
##$LPBIN= 0
##$MAXI= 10000
##$MC2= 0
##$MEAN= 0
##$ME_mod= 0
##$MI= 50
##$NCOEF= 0
##$NC_proc= -6
##$NLEV= 6
##$NOISF1= 182.463
##$NOISF2= 159.3651
##$NSP= 0
##$NTH_PI= 0
##$NZP= 0
##$OFFSET= 248.5645
##$PC= 4
##$PHC0= -6478.54
##$PHC1= 722.4009
##$PH_mod= 1
##$PKNL= yes
##$PPARMOD= 0
##$PSCAL= 0
##$PSIGN= 0
##$REVERSE= no
##$SF= 81.014009
##$SI= 65536
##$SIGF1= 159.3651
##$SIGF2= -187.1042
##$SINO= 113.3802
##$SIOLD= 16384
##$SREGLST= <1H.CDCl3>
##$SSB= 0
##$STSI= 65536
##$STSR= 0
##$SW_p= 40650.406504065
##$SYMM= 0
##$S_DEV= 0
##$TDeff= 32768
##$TDoff= 0
##$TI= <>
##$TILT= no
##$TM1= 0
##$TM2= 0
##$TOPLEV= 0
##$USERP1= <user>
##$USERP2= <user>
##$USERP3= <user>
##$USERP4= <user>
##$USERP5= <user>
##$WDW= 1
##$XDIM= 65536
##$YMAX_p= 322217093
##$YMIN_p= -12826531
$$ End of Bruker specific parameters
$$ ---------------------------------
##NTUPLES= NMR SPECTRUM
##VAR_NAME=  FREQUENCY,     SPECTRUM/REAL,   SPECTRUM/IMAG
##SYMBOL=    X,             R,               I
##VAR_TYPE=  INDEPENDENT,   DEPENDENT,       DEPENDENT
##VAR_FORM=  AFFN,          ASDF,            ASDF
##VAR_DIM=   65536,         65536,           65536
##UNITS=     HZ,            ARBITRARY UNITS, ARBITRARY UNITS
##FACTOR=    0.620285442955139, 1,           1
##FIRST=     20137.2065510759, 0,            0
##LAST=      -20513.1999529892, 0,           0
##MIN=       -20513.1999529892, -12826531,   0
##MAX=       20137.2065510759, 322217093,    0
$$ Real data points
##PAGE= N=1
##DATA TABLE= (X++(R..R)), XYDATA
$$ [...]
##PAGE= N=2
##DATA TABLE= (X++(I..I)), XYDATA
$$ plain form
13114 1160916 1526410 1047777 -715132 -2581456 -3505596 -3824513 -4263777 -4694663 -4481260
13105 -4481260 -3454198 -2080659 -978268 -415658 -84409 526134 1360431 1779223 1506825
13096 1506825 984074 535717 62677 -97670 805133 2451631 3363085 3147525 3303826
13087 3303826 4630635 5508213 4348591 2154215 750826 10643 -1027263 -1822662 -1633819
13078 -1633819 -1693969 -3206675 -4468851 -3239459 -831459 -153307 -630162 570122 2706136
13069 2706136 1942569 -1752402 -3541975 -1351894 572209 -1374414 -4272972 -3651353
13061 -3651353 -611067 550536 -757386 -1558015 -720005 239177 814684 1765633 2222634
13052 2222634 652615 -1360266 -400194 3141570 4625309 1662575 -2355138 -3097898
$$ packed form
13114A160916L65494m78633j762909j866324r24140l18917m39264m30886K13403
13105d481260J027062J373539J102391N62610L31249O10543Q34297M18792k72398
13096A506825n22751m48357m73040j60347R02803J646498R11454k15560J56301
13087C303826J326809Q77578j159622k194376j403389p40183j037906p95399J88843
13078a633819o0150j512706j262176J229392K408000O78152m76855J200284K136014
13069B706136p63567l694971j789573K190081J924103j946623k898558O21619
13061c651353L040286J161603j307922q00629Q38010R59182N75507R50949M57001
13052B222634j570019k012881R60072L541764J483739k962734m017713p42760
$$ plain form
13044 -3097898 -921505 620421 -34409 -1208163 -1041308 276846 1283468 1020373 -95373
13035 -95373 -683271 211279 1977435 3019336 2494458 1015625 -273626 -724434 -427021
13026 -427021 -76709 -409607 -1229428 -1520245 -1182123 -1622259 -3341716 -4151852 -2004158
13017 -2004158 1140339 1133083 -2525719 -5636112 -5019365 -2478400 -1378130 -1736215 -1181182
13008 -1181182 758937 2080632 1571305 358047 -58153 215788 -101932 -1797379 -4099440
12999 -4099440 -5117492 -3813922 -1647470 -1182273 -2693662 -3663513 -2489285 -929568
12991 -929568 -1311546 -2877104 -3029535 -1176441 912054 1881875 1677120 219599 -2271171
12982 -2271171 -3824338 -2248378 1511623 3938245 3388422 1673176 626382 -275992
$$ packed form
13044c097898K176393J541926o54830j173754J66855J318154J006622k63095j115746
13035i5373n87898Q94550J766156J041901n24878j478833j289251m50808K97413
13026d27021L50312l32898q19821k90817L38122m40136j719457q10136K147694
13017b004158L144497p256l658802l110393O16747K540965J100270l58085N55033
13008a181182J940119J321695n09327j213258m16200K73941l17720j695447k302061
12999d099440j018052J303570K166452M65197j511389r69851J174228J559717
12991i29568l81978j565558j52431J853094K088495R69821k04755j457521k490770
12982b271171j553167J575960L760001K426622n49823j715246j046794r02374
$$ plain form
12974 -275992 -1656023 -2110466 -348595 2205082 2958983 1331313 -1138151 -2870348 -3036129
12965 -3036129 -1269008 1857337 4665840 5861730 5626392 4624950 3152342 1995227
12957 1995227 2308282 3276890 1898966 -2858219 -7469039 -7935880 -4954370 -2124697 -410468
12948 -410468 1969774 4854938 5606523 3772651 2322921 2964015 3787116 3241009 2959101
12939 2959101 4262316 4995829 2963367 82055 -407899 843609 663945 -1076360 -1332563
12930 -1332563 708991 2097018 975413 -568717 -265017 747517 526460 166159 1869204
12921 1869204 4449473 4301581 975936 -1486679 -109726 2708568 2653194 -394958 -2568325
12912 -2568325 -1868646 -688679 -1544971 -3041310 -2280162 447035 2197847 1963457 1792556
$$ packed form
12974b75992j380031m54443J761871K553677P53901j627670k469464j732197j65781
12965c036129J767121L126345K808503J195890k35338j001442j472608j157115
12957A995227L13055R68608j377924m757185m610820m66841K981510K829673J714229
12948d10468K380242K885164P51585j833872j449730O41094Q23101n46107k81908
12939B959101J303215P33513k032462k881312m89954J251508j79664j740305k56203
12930a332563K041554J388027j121605j544130L03700J012534k21057l60301J703045
12921A869204K580269j47892l325645k462615J376953K818294n5374l048152k173367
12912b568325O99679J179967q56292j496339P61148K727197J750812k34390j70901
$$ plain form
12903 1792556 3028084 4163523 3545875 1905098 646527 -419918 -1755267 -2201266
12895 -2201266 -794505 736009 24110 -1957625 -1875393 948359 3402192 3149183 1505130
12886 1505130 482500 -325024 -1833876 -2725813 -1466625 281554 -577625 -3751418 -5463713
12877 -5463713 -3541451 -1223 2140427 2188768 847732 -1545307 -4019657 -4195060 -987257
12868 -987257 2924683 3710647 1057589 -1813650 -2486212 -1594605 -757165 -443606 -423049
12859 -423049 -522096 -240002 935499 2267966 2218323 606654 -1115054 -2087796 -2831411
12850 -2831411 -3441692 -3156873 -2474140 -3234288 -5240995 -5350736 -2032195 1457783 1179238
12841 1179238 -1969469 -3872915 -3032213 -1439658 -391553 969108 2852820 3916762
$$ packed form
12903A792556J235528J135439o17648j640777j258571j066445j335349m45999
12895b201266J406761J530514p11899j981735Q2232K823752K453833k53009j644053
12886A505130j022630q07524j508852q91937J259188J748179q59179l173793j712295
12877e463713J922262L540228K141650M8341j341036k393039k474350j75403L207803
12868i87257L911940P85964k653058k871239o72562Q91607Q37440L13559K0557
12859d23049r9047K82094J175501J332467m9643j611669j721708r72742p43615
12850b831411o10281K84819O82733p60148k006707j09741L318541L489978k78545
12841A179238l148707j903446Q40702J592555J048105J360661J883712J063942
$$ plain form
12833 3916762 3821693 3869191 4309508 3584501 1152334 -1235318 -1951768 -1110855 790591
12824 790591 3430331 5198665 3985880 673293 -889972 925585 2935444 1836127
12816 1836127 -839925 -1159309 1414740 3549948 2747544 117101 -1504817 -616942 1721610
12807 1721610 2833115 1053287 -2041881 -3100849 -1255781 682160 222720 -1476068
12799 -1476068 -1715041 70094 2403750 3877262 3437127 402295 -3746709 -5462670
12791 -5462670 -3489046 -1392086 -2928206 -6502955 -7538396 -5037984 -2003563 -121528
12783 -121528 1713602 3508102 3145181 380512 -1836748 -1605183 -552000 -524476 -763745
12774 -763745 -205804 155873 -618951 -1310262 -858419 -691101 -2195117 -3680484 -2757087
$$ packed form
12833C916762r5069M7498M40317p25007k432167k387652p16450Q40913J901446
12824G90591K639740J768334j212785l312587j563265J815557K009859j099317
12816A836127k676052l19384K574049K135208q02404k630443j621918Q87875K338552
12807A721610J111505j779828l095168j058968J845068J937941m59440j698788
12799a476068k38973J785135K333656J473512m40135l034832m149004j715961
12791e462670J973624K096960j536120l574749j035441K500412L034421J882035
12783a21528J835130J794500l62921k764669k217260K31565J053183K7524k39269
12774g63745N57941L61677p74824o91311M51843J67318j504016j485367R23397
$$ plain form
12765 -2757087 -493086 -164484 -2430085 -4629215 -4787007 -3607984 -2166126 -216260
12757 -216260 2241031 3814542 3490860 2187759 1367867 1174902 1026820 1061549 1717848
12748 1717848 2553510 2789363 2656451 2955347 3471138 3112872 1703038 395166 22565
12739 22565 199882 504999 1335104 2830235 4044243 4191845 3829579 3750764 3628730 3013068
12729 3013068 2712532 3529204 4389039 3709041 2094521 1409319 1442858 181977 -2362203
12720 -2362203 -3569032 -2431942 -1456477 -2626032 -4051388 -2984084 -220945 1133562
12712 1133562 89304 -1516196 -1971922 -1200978 122272 1083202 676997 -943812 -2035999
12703 -2035999 -1488330 -424212 -59004 548771 2494772 4268918 3693544 1531884 298696
$$ packed form
12765b757087K264001L28602k265601k199130j57792J179023J441858J949866
12757b16260K457291J573511l23682j303101q19892j92965j48082L4729O56299
12748A717848Q35662K35853j32912K98896N15791l58266j409834j307872l72601
12739B2565J77317L05117Q30105J495131J214008J47602l62266p8815j22034o15662
12729C013068l00536Q16672Q59835o79998j614520o85202L3539j260881k544180
12720b362203j206829J137090R75465j169555j425356J067304K763139J354507
12712A133562j044258j605500m55726P70944J323250R60930m06205j620809j092187
12703b035999N47669J064118L65208O07775J946001J774146n75374k161660j233188
$$ plain form
12694 298696 376697 400839 664164 2463819 4375427 3305590 -182263 -1705825 431348
12685 431348 2480339 1118494 -1407882 -981869 2087140 3864628 2596254 597898
12677 597898 608438 2557422 4213806 3766749 1636187 167399 1032116 2851798 2699829
12668 2699829 210640 -1778793 -1497931 -794860 -1724826 -2826357 -1474761 1453617 2375137
12659 2375137 126603 -2545821 -3022767 -1936466 -1370054 -1823894 -2267293 -2071986 -1612290
12650 -1612290 -1443131 -1848568 -2972095 -4593040 -5754044 -5280735 -3046489 -424538 995348
12641 995348 1137049 1376532 2535520 3581393 3048246 1370945 723676 2304736 4653323
12632 4653323 5266126 3476077 1111888 288761 994596 1335141 209403 -1025673 -425875
$$ packed form
12694B98696P8001K4142K63325J799655J911608j069837l487853j523562K137173
12685D31348K048991j361845k526376M26013L069009J777488j268374j998356
12677E97898J0540J948984J656384m47057k130562j468788Q64717J819682j51969
12668B699829k489189j989433K80862P03071r29966j101531J351596K928378R21520
12659B375137k248534k672424m76946J086301N66412m53840m43399J95307M59696
12650a612290J69159m05437j123527j620945j161004M73309K234246K621951J419886
12641I95348J41701K39483J158988J045873n33147j677301o47269J581060K348587
12632D653323O12803j790049k364189q23127P05835L40545j125738j235076N99798
$$ plain form
12623 -425875 1531649 2391754 1274359 46329 179128 555987 -91681 -676255 38845
12614 38845 581731 -857843 -2563975 -1460902 1491082 2166639 -204276 -1693132 -107249
12605 -107249 1478481 20808 -2358345 -1916908 719225 2014967 1429509 1845338 4421232
12596 4421232 6610495 5991146 3386486 1144816 249867 289887 1008295 2664594 5245400
12587 5245400 7938989 9372587 8515163 5736466 2774591 1195053 1096729 1663878 2369554
12578 2369554 2868981 2287133 -93711 -3321664 -5059219 -4004064 -1466071 124722
12570 124722 -5768 -499167 -226296 -14727 -1076999 -2576642 -2560383 -1209102 -891084
12561 -891084 -2186774 -2328416 517110 3553341 2757174 -1360141 -4563783 -4781241 -3802250
$$ packed form
12623d25875J957524Q60105j117395j228030J32799L76859o47668n84574P15100
12614C8845N42886j439574j706132J103073K951984O75557k370915j488856J585883
12605a07249J585730j457673k379153M41437K636133J295742n85458M15829K575894
12596D421232K189263o19349k604660k241670q94949M0020P18408J656299K580806
12587E245400K693589J433598q57424k778697k961875j579538r8324N67149P05676
12578B369554M99427n81848k380844l227953j737555J055155K537993J590793
12570A24722j30490m93399K72871K11569j062272j499643J6259J351281L18018
12561h91084j295690j41642K845526L036231p96167m117315l203642k17458R78991
$$ plain form
12552 -3802250 -3198228 -2174033 -347539 609451 -332474 -1714120 -1964312 -1545781 -1371458
12543 -1371458 -1064921 -208789 415171 138068 -550099 -1184968 -1920581 -2309428 -1501695
12534 -1501695 -235412 -196171 -753317 643979 3730760 4601920 1561281 -1705089 -1514591
12525 -1514591 479129 690723 -495382 -239853 1413121 2026664 1365203 1302394 1841085
12516 1841085 1329182 376970 1395510 3819276 3824154 90296 -3550765 -3098317 459467
12507 459467 2980537 2546906 1050548 1083891 2774167 3940258 2919432 757966 -72135
12498 -72135 931068 1641547 722614 -150821 852287 2292555 1377922 -1609185 -3557805
12489 -3557805 -3049409 -2020431 -2435513 -3541227 -3474399 -2149715 -1352089 -2411615 -4452704
$$ packed form
12552c802250O04022J024195J826494R56990r41925j381646k50192M18531J74323
12543a371458L06537Q56132O23960k77103o88167o34869p35613l88847Q07733
12534a501695J266283L9241n57146J397296L086781Q71160l040639l266370J90498
12525a514591J993720K11594j186105K55529J652974O13543o61461o2809N38691
12516A841085n11903r52212J018540K423766M878l733858l641061M52448L557784
12507D59467K521070m33631j496358L3343J690276J166091j020826k161466q30101
12498g2135J003203P10479r18933q73435J003108J440268r14633k987107j948620
12489c557805N08396J028978m15082j105714O6828J324684P97626j059526k041089
$$ plain form
12480 -4452704 -5145630 -3410016 -1064798 -759199 -2360013 -3126678 -1847109 -550433 -1036785
12471 -1036785 -2089292 -1843911 -690121 235100 1223856 2282390 1523618 -1760684 -4462531
12462 -4462531 -3536053 -896169 -743630 -3215434 -4584629 -3051721 -516847 1012406
12454 1012406 1173948 -185679 -2644621 -3892403 -2428375 -862643 -2440509 -5108506
12446 -5108506 -4022844 375422 2574960 893333 -88570 2127165 3476799 612828
12438 612828 -2926294 -2463096 214383 204415 -2553672 -4009605 -2930848 -1999245 -2566804
12429 -2566804 -2748864 -1039446 1561232 3533336 4433317 4183147 2814193 1173170 350804
12420 350804 412784 810954 1502061 2444116 2758507 1780732 275084 -586766 -639855 -121673
$$ packed form
12480d452704o92926J735614K345218L05599j600814p66665J279569J296676m86352
12471a036785j052507K45381J153790R25221R88756J058534p58772l284302k701847
12462d462531R26478K639884J52539k471804j369195J532908K534874J529253
12454A012406J61542j359627k458942j247782J464028J565732j577866k667997
12446e108506J085662M398266K199538j681627r81903K215735J349634k863971
12438F12828l539122M63198K677479r968k758087j455933J078757R31603n67559
12429b566804j82060J709418K600678J972104Q99981k50170j368954j641023q22366
12420C50804O1980L98170O91107R42055L14391r77775j505648q61850n3089N18182
$$ plain form
12410 -121673 1095412 2489239 2650162 1582729 1581920 3887309 6119542 5470534 3063059
12401 3063059 2318705 3906628 5323414 5078217 4224896 3588674 2404180 412668 -1176418
12392 -1176418 -1714013 -1968859 -2108229 -1022823 1129098 1878447 -143390 -2348358 -1181891
12383 -1181891 2670828 4592228 1969470 -2297317 -3540905 -1237855 704631 -754223
12375 -754223 -4157432 -5850812 -4320321 -969265 2278535 4399312 4831869 3568421
12367 3568421 1872790 1346881 1958503 2325420 2081099 2334092 3467386 4325962 4262944
12358 4262944 4109927 4103327 2752734 -700248 -4267465 -5454600 -4379747 -2922067 -1806573
12349 -1806573 -481999 865589 1315100 976727 829460 812670 -127124 -1910346 -2944212
$$ packed form
12410a21673J217085J393827J60923j067433q09K305389K232233o49008k407475
12401C063059p44354J587923J416786k45197q53321o36222j184494j991512j589086
12392a176418n37595k54846j39370J085406K151921P49349k021837k204968J166467
12383a181891L852719J921400k622758m266787j243588K303050J942486j458854
12375g54223l403209j693380J530491L351056L247800K120777M32557j263448
12367C568421j695631n25909O11622L66917k44321K52993J133294Q58576o3018
12358D262944j53017o600j350593l452982l567217j187135J074853J457680J115494
12349a806573J324574J347588M49511l38373j47267j6790r39794j783222j033866
$$ plain form
12340 -2944212 -2296507 -791087 554872 1774176 2940125 3267906 2317508 1121414 814338
12331 814338 716376 -736898 -3198157 -4099798 -1871120 1656743 3241795 2049676 160104
12322 160104 -518643 -263422 -113740 -34683 493049 1217987 1655252 2037722 2569124 2510381
12312 2510381 1246970 -428951 -1317675 -1324437 -741415 904777 3589220 5382610 4431559
12303 4431559 1726678 -140117 -298850 421956 1814628 3845821 4827330 3434934 2010024
12294 2010024 3931264 7748075 8336652 4523596 794572 2286 -531218 -3119674 -5032513
12285 -5032513 -3603500 -1616325 -2661555 -4507064 -2707531 1412358 2375313 -776544
12277 -776544 -3322201 -2627037 -1529319 -2605398 -3943941 -3064811 -1366132 -1733717 -3961260
$$ packed form
12340b944212O47705J505420J345959J219304J165949L27781r50398j196094l07076
12331H14338r7962j453274k461259r01641K228678L527863J585052j192119j889572
12322A60104o78747K55221J49682P9057N27732P24938M37265L82470N31402n8743
12312B510381j263411j675921q88724o762N83022J646192K684443J793390r51051
12303D431559k704881j866795j58733P20806J392672K031193R81509j392396j424910
12294B010024J921240L816811N88577l813056l729024p92286n33504k588456j912839
12285e032513J429013J987175j045230j845509J799533M119889R62955l151857
12277g76544k545657O95164J097718j076079j338543Q79130J698679l67585k227543
$$ plain form
12268 -3961260 -5213954 -3928408 -1332303 331488 -94762 -1958606 -3566715 -3944177
12260 -3944177 -3705322 -3705620 -3634941 -3055388 -2761536 -3292920 -3100230 -679372 2100876 1820619
12250 1820619 -1304601 -3237773 -1825616 442771 740714 31960 752298 2591616 3173745
12241 3173745 1744700 -129865 -984525 -771433 -156447 39756 -888842 -2452986 -2562710
12232 -2562710 270622 4347922 5849414 2991067 -1801535 -4451180 -3403600 -645002
12224 -645002 1132163 1501179 2011921 3529442 4929770 4685925 2837582 733829 -556586
12215 -556586 -900378 -783831 -1126339 -2761568 -5113348 -5993253 -3988397 -725440 573015
12206 573015 -1238803 -4102147 -5244504 -3800315 -1122838 468238 -511570 -3069818
$$ packed form
12268c961260j252694J285546K596105J663791m26250j863844j608109l77462
12260c944177K38855k98P0679N79553K93852n31384J92690K420858K780248k80257
12250A820619l125220j933172J412157K268387K97943p08754P20338J839318N82129
12241C173745j429045j874565q54660K13092O14986J96203r28598j564144j09724
12232b562710K833332M077300J501492k858347m792602k649645J047580K758598
12224f45002J777165L69016N10742J517521J400328k43845j848343k103753j290415
12215e56586l43792J16547l42508j635229k351780q79905K004856L262957J298455
12206E73015j811818k863344j142357J444189K677477J591076r79808k558248
$$ plain form
12198 -3069818 -4290971 -2799659 -1050288 -2313295 -5801527 -7275704 -4850724 -1625277
12190 -1625277 -1360159 -3720366 -5518423 -5077400 -3385254 -1882123 -1096002 -1181185 -2123296
12181 -2123296 -3180053 -3183989 -1719453 467736 2216107 2822048 2455739 1970450 1888695
12172 1888695 1459573 -462345 -3265700 -4436835 -2495069 793373 2370140 1556890
12164 1556890 435129 692781 1499468 987783 -1148244 -3280036 -3627141 -1829180 1031707
12155 1031707 3426153 4351828 3742385 2257926 691152 -568922 -1569884 -2311129 -2382255
12146 -2382255 -1376812 310509 1512695 1426976 491601 -175864 -10290 641656 1155380
12137 1155380 1213868 918237 700372 961048 1419538 1090658 -543311 -2535610 -3315038
$$ packed form
12198c069818j221153J491312J749371j263007l488232j474177K424980L225447
12190a625277K65118k360207j798057M41023J692146J503131P86121q5183r42111
12181b123296j056757l936J464536K187189J748371O05941l66309m85289q1755
12172A888695m29122j921918k803355j171135J941766L288442J576767q13250
12164A556890j121761K57652Q06687n11685k136027k131792l47105J797961K860887
12155A031707K394446R25675o09443j484459j566774j260074j000962p41245p1126
12146b382255J005443J687321J202186q5719r35375o67465J65574O51946N13724
12137A155380N8488k95631k17865K60676M58490l28880j633969j992299p79428
$$ plain form
12128 -3315038 -2477139 -1063049 -12498 879749 2119406 3274418 3237889 1586067 -787291
12119 -787291 -2454519 -2628898 -1509771 222258 1843799 2563379 1750711 -209959 -1706340
12110 -1706340 -1429658 -25370 749729 523907 686218 1874721 2578045 1353720 -669354
12101 -669354 -992267 1069615 3731306 4944875 4036878 1444533 -1780111 -4137907 -4606562
12092 -4606562 -3721111 -2884948 -2530730 -1917227 -838161 -373256 -1410856 -3252955 -4357050
12083 -4357050 -4047580 -2961780 -1975662 -1130371 150744 1820923 2696665 1890158 486047
12074 486047 482270 1773653 1853390 -429686 -2489398 -1287770 2138885 3856094 2322108
12065 2322108 -10592 -593738 175276 656497 583012 614382 761213 664053 480874 347114
$$ packed form
12128c315038Q37899J414090J050551Q92247J239657J155012l6529j651822k373358
12119g87291j667228j74379J119127J732029J621541P19580q12668j960670j496381
12110a706340K76682J404288P75099k25822J62311J188503P03324j224325k023074
12101f69354l22913K061882K661691J213569r07997k592345l224644k357796m68655
12092d606562Q85451Q36163L54218O13503J079066M64905j037600j842099j104095
12083d357050L09470J085800R86118Q45291J281115J670179Q75742q06507j404111
12074D86047l777J291383P9737k283076k059712J201628L426655J717209j533986
12065B322108k332700n83146P69014M81221p3485L1370J46831r7160j83179j33760
$$ plain form
12055 347114 -221165 -1360301 -2103557 -1669227 -820628 -797278 -1360170 -1073616 603800
12046 603800 2502031 3145352 2376117 1452047 1789861 3525946 5196890 5157450 3441056
12037 3441056 1729941 1305893 1701410 1737455 1137582 493460 277921 620277 1472423
12028 1472423 2180159 1530791 -638337 -2381144 -1693231 504902 1204031 -493409 -2019928
12019 -2019928 -1382255 -542850 -2395998 -5636624 -5977598 -2614471 76445 -1116926 -3347099
12010 -3347099 -1990362 2452007 5435301 5162036 4071641 3535638 1583491 -2456320
12002 -2456320 -4998745 -2831081 1887034 4411779 3556148 1980800 1472843 1152634 132919
11993 132919 -925882 -1339476 -1336965 -1037691 -178412 878296 1384641 1561563 2186179 2813992
$$ packed form
12055C47114n68279j139136p43256M34330Q48599K3350n62892K86554J677416
12046F03800J898231O43321p69235r24070L37814J736085J670944l9440j716394
12037C441056j711115m24048L95517L6045n99873o44122k15539L42356Q52146
12028A472423P07736o49368k169128j742807O87913K198133O99129j697440j526519
12019b019928O37673Q39405j853148l240626l40974L363127K690916j193371k230173
12010c347099J356737M442369K983294k73265j090395n36003j952147m039811
12002b456320k542425K167664M718115K524745q55631j575348n07957l20209j019715
11993A32919j058801m13594K511K99274Q59279J056708N06345J76922O24616O27813
$$ plain form
11983 2813992 2158181 512661 -190 1659395 3693065 3562771 994804 -1901768 -3062308
11974 -3062308 -2485546 -1956260 -2874060 -4476524 -4784938 -3403008 -2257489 -2909385 -4354039
11965 -4354039 -4608021 -3402021 -1956662 -1012928 -500162 -332122 -202402 477925 1227124
11956 1227124 474398 -1654448 -2461299 -754612 348988 -2117452 -5542385 -4882022 -260992
11947 -260992 3113002 2531502 611271 -155840 -938443 -2873825 -4021997 -2576245 -15870
11938 -15870 1370303 1569584 1413563 641555 -489054 -117919 2464142 5120648 5897793
11929 5897793 5524068 5068648 3748211 1302508 -140305 738392 1817984 897494 -746218
11920 -746218 -1159989 -1472610 -3197190 -4186470 -1724286 2003970 2317709 -948174 -3616731
$$ packed form
11983B813992o55811j645520n12851J659585K033670j30294k567967k896572j160540
11974c062308N76762N29286r17800j602464l08414J381930J145519o51896j444654
11965d354039k53982J206000J445359R43734N12766J68040J29720O80327P49199
11956A227124p52726k128846q06851J706687J103600k466440l424933O60363M621030
11947b60992L373994n81500j920231p67111p82603j935382j148172J445752K560375
11938a5870J386173J99281j56021p72008j130609L71135K582061K656506P77145
11929E897793l73725m55420j320437k445703j442813Q78697J079592r20490j643712
11920g46218m13771l12621j724580r89280K462184L728256L13739l265883k668557
$$ plain form
11911 -3616731 -3986606 -4474646 -6012180 -5867450 -2659157 783909 1698107 959976 282870
11902 282870 -753119 -2360166 -2342078 646900 3943671 4207895 2260177 1405580 2183114
11893 2183114 2213376 739989 -185918 524574 1149485 253978 -826536 -295849 1027703
11884 1027703 955490 -603953 -1438898 -282722 1474304 2033784 1904133 3010051 5418517
11875 5418517 6501595 4180178 73436 -2037775 -864036 822652 87136 -2067317
11867 -2067317 -2275056 60925 1579929 -331479 -3727767 -4781118 -2938836 -1087053
11859 -1087053 -1094093 -1794507 -1797178 -1777934 -2699715 -3666704 -3184768 -1301781 889767 2677431
11849 2677431 3393994 2152074 -492092 -2127539 -1592712 -875667 -1756702 -2524647 -1118764
$$ packed form
11911c616731l69875m88040j537534J44730L208293L443066R14198p38131o77106
11902B82870j035989j607047J8088K988978L296771K64224j947718q54597P77534
11893B183114L0262j473387r25907P10492O24911q95507j080514N30687J323552
11884A027703p2213j559443q34945J156176J757026N59480j29651J105918K408466
11875E418517J083078k321417m106742k111211J173739J686688p35516k154453
11867b067317k07739K335981J519004j911408l396288j053351J842282J851783
11859a087053p040p00414k671J9244r21781r66989M81936J882987K191548J787664
11849B677431P16563j241920k644166j635447N34827P17045q81035p67945J405883
$$ plain form
11840 -1118764 335847 -1599780 -5303111 -5639755 -2039024 357219 -1021951 -2213549
11832 -2213549 187338 3031717 1908787 -1517427 -2535881 -1147218 -1369088 -4027987
11824 -4027987 -5588205 -4252270 -2496459 -2538262 -3204345 -2816222 -2040266 -2028250 -2042046
11815 -2042046 -855307 945939 1753360 1251169 680756 1054429 1841562 1599544 -68377
11806 -68377 -1505449 -880777 979123 1421916 212197 418164 3308016 5102589 2097818
11797 2097818 -2932664 -3733449 712233 4926741 4797832 2329470 1162900 1361801 1001742
11788 1001742 -191669 -1546237 -3451555 -5830702 -6321636 -2945204 2283736 5021766
11780 5021766 3542165 -17279 -2947458 -4408940 -4616312 -3658160 -1873743 -183545
$$ packed form
11840a118764J454611j935627l703331l36644L600731K396243j379170j191598
11832b213549K400887K844379j122930l426214j018454J388663k21870k658899
11824d027987j560218J335935J755811m1803o66083L88123P75956J2016j3796
11815b042046J186739J801246Q07421n02191n70413L73673P87133k42018j667921
11806f8377j437072O24672J859900M42793j209719K05967K889852J794573l004771
11797B097818n030482q00785M445682M214508j28909k468362j166570J98901l60059
11788A001742j193411j354568j905318k379147m90934L376432N228940K738030
11780E021766j479601l559444k930179j461482k07372R58152J784417J690198
$$ plain form
11772 -183545 731853 1076047 1426920 1956301 2339128 2214052 1635151 1048477 707524 297003
11762 297003 -489994 -1279781 -1577486 -1683031 -2083173 -2247494 -1437734 -575217 -1352837 -3073502
11752 -3073502 -2690211 681947 3494727 2253715 -1309664 -2452363 -90765 2025555
11744 2025555 1199187 -464332 70898 1746484 1076542 -2387045 -5277391 -5085801 -2922087
11735 -2922087 -921389 564758 1694949 1347737 -858555 -2202440 237964 4601202
11727 4601202 5611439 1786476 -2043371 -1355571 1839686 2373221 -580664 -3161914
11719 -3161914 -3087564 -2146592 -1985292 -1281841 1115249 3184581 2344033 -647771 -2707219
11710 -2707219 -2338807 -594147 1055278 1817995 991046 -1710010 -4960370 -6425757 -5081738
$$ packed form
11772a83545R15398L44194L50873N29381L82827j25076n78901n86674l40953m10521
11762B97003p86997p89787k97705j05545m00142j64321Q09760Q62517p77620j720665
11752c073502L83291L372158K812780j241012l563379j142699K361598K116320
11744B025555q26368j663519N35230J675586o69942l463587k890346J91590K163714
11735b922087K000698J486147J130191l47212k206292j343885K440404M363238
11727D601202J010237l824963l829847O87800L195257N33535k953885k581250
11719c161914P4350R40972J61300P03451K397090K069332q40548k991804k059448
11710b707219L68412J744660J649425P62717q26949k701056l250360j465387J344019
$$ plain form
11701 -5081738 -2175631 257023 1106586 436913 -1059663 -2505714 -3278125 -3338709 -2992527
11692 -2992527 -2433196 -1806662 -1462539 -1653750 -2128121 -2457173 -2593325 -2660100 -2479921 -1957726
11682 -1957726 -1740809 -2677025 -4513955 -5861146 -5726807 -4563021 -3523694 -3165607 -3167637
11673 -3167637 -2885964 -1873487 -291394 860331 482134 -1095103 -1903449 -608879 1370315
11664 1370315 1345908 -882730 -2260299 -364626 3152044 4476761 2368846 -648202
11656 -648202 -1706926 -566551 1175520 2306752 2598107 2227730 1504137 622182 -658170
11647 -658170 -2301413 -2924952 -1000249 2315983 3491949 1136913 -1581304 -1032771 1870491
11638 1870491 3366824 2486151 1776308 2598224 3232320 2547586 2177467 3167620 3322062
$$ packed form
11701e081738K906107K432654Q49563o69673j496576j446051p72411o0584L46182
11692b992527N59331O26534L44123j91211m74371l29052j36152o6775J80179N22195
11682a957726K16917r36216j836930j347191J34339J163786J039327L58087k030
11673c167637K81673J012477J582093J151725l78197j577237q08346J294570J979194
11664A370315k4407k228638j377569J895673L516670J324717k107915l017048
11656f48202j058724J140375J742071J131232K91355l70377p23593q81955j280352
11647f58170j643243o23539J924703L316232J175966k355036k718217N48533K903262
11638A870491J496333q80673p09843Q21916O34096o84734l70119R90153J54442
$$ plain form
11629 3322062 597091 -2873940 -3315708 -806803 1026929 564418 79586 1284011 2065409
11620 2065409 -315928 -4769859 -7611970 -7433354 -6317263 -6082131 -5487162 -2348944 2772017
11611 2772017 6572734 6667114 4188457 2271217 2458703 3268394 2326046 -647149 -3439959
11602 -3439959 -3780704 -1629815 1089239 2525792 2251577 1015208 -89143 -257383 467115
11593 467115 1089907 759536 91709 497847 1830149 1912646 -538239 -3589557 -4367279
11584 -4367279 -3074054 -2565898 -3750297 -3869502 -707786 3509648 4723560 2581884
11576 2581884 785324 1812082 3793557 3788764 2217924 1969174 3904630 5578433 4830671
11567 4830671 2733752 1717390 2059593 2061948 1200351 950570 2002574 2655119 1376388
$$ packed form
11629C322062k724971l471031m41768K508905J833732m62511m84832J204425P81398
11620B065409k381337m453931k842111J78616J116091K35132N94969L138218N120961
11611B772017L800717R4380k478657j917240J87486Q09691r42348k973195k792810
11602c439959l40745K150889K719054J436553k74215j236369j104351j68240P24498
11593D67115O22792l30371o67827M06138J332302Q2497k450885l051318p77722
11584d367279J293225N08156j184399j19205L161716M217434J213912k141676
11576B581884j796560J026758J981475m793j570840k48750J935456J673803p47762
11567D830671k096919j016362L42203K355q61597k49781J052004O52545j278731
$$ plain form
11558 1376388 -406397 25816 2757707 4852702 4032331 1232139 -977873 -1384150 -906977
11549 -906977 -1063632 -2236912 -3364692 -3296130 -2310555 -1546986 -856895 1162899 4071014
11540 4071014 4609915 1108381 -2824583 -2311214 1910407 4440815 3041835 1203068
11532 1203068 1824551 2854185 1762871 447878 1961709 5027936 5848165 3816607
11524 3816607 1675352 974734 936068 1202883 2257344 3327299 3118904 2576046 3755527
11515 3755527 5913796 6046907 3751649 2128208 2861281 3680552 2243629 -395239 -2123247
11506 -2123247 -3019107 -4005448 -4370920 -3209815 -1807387 -1925557 -2738638 -2195683 -818539
11497 -818539 -1147967 -3224478 -3669171 -554281 3305659 4047595 2033897 674053 744912
$$ packed form
11558A376388j782785M32213K731891K094995q20371k800192k210012m06277M77173
11549i06977j56655j173280j127780O8562R85575P63569O90091K019794K908115
11540D071014N38901l501534l932964N13369M221621K530408j398980j838767
11532A203068O21483J029634j091314j314993J513831L066227Q20229k031558
11524C816607k141255p00618l8666K66815J054461J069955k08395n42858J179481
11515C755527K158269J33111k295258j623441P33073Q19271j436923k638868j728008
11506b123247q95860r86341l65472J161105J402428j18170q13081N42955J377144
11497h18539l29428k076511m44693L114890L859940P41936k013698j359844P0859
$$ plain form
11488 744912 -695233 -4862799 -7965878 -5911508 -283331 3635409 3911340 3439626 4295353
11479 4295353 4576946 2507475 269546 955308 3875631 5838257 5699872 4820126 3941371
11470 3941371 2459604 418297 -1289585 -2578058 -3868105 -4360099 -2772989 291357
11462 291357 2756238 3733323 3852781 3270109 1600553 -297950 -901232 -580061 -1306830
11453 -1306830 -3516843 -5481207 -6077818 -5806981 -4654990 -1660972 2359872 4221265
11445 4221265 2182925 -1403074 -2865146 -1361716 1013928 2069001 1179953 -920008
11437 -920008 -2804007 -3280801 -2355952 -937800 354794 1267654 1189574 -107006 -1161192
11428 -1161192 -211028 1852759 1991921 -832905 -3941512 -4299687 -1962072 774511 2153162
$$ packed form
11488G44912j440145m167566l103079K054370N628177L918740K75931m71714Q55727
11479D295353K81593k069471k237929O85762K920323J962626j38385q79746q78755
11470C941371j481767k041307j707882j288473j290047m91994J587110L064346
11462B91357K464881R77085J19458n82672j669556j898503o03282L21171p26769
11453a306830k210013j964364n96611K70837J151991K994018M020844J861393
11445D221265k038340l585999j462072J503430K375644J055073q89048k099961
11437i20008j883999m76794R24849J418152J292594R12860p8080j296580j054186
11428a161192R50164K063787J39162k824826l108607l58175K337615K736583J378651
$$ plain form
11419 2153162 2022959 1534604 2484219 5512112 8471168 8388613 5544996 3317182 3142186
11410 3142186 2430099 -833124 -4228926 -4370449 -2069516 -689044 -618381 853507 4275944
11401 4275944 6340236 4631332 1259209 -144340 770834 1453291 727232 328716 1844593
11392 1844593 3980934 4136005 1813454 -937325 -2217236 -1967544 -821656 1083312
11384 1083312 3266276 4257937 3187075 1181697 -117470 -698535 -1481887 -2260192 -1993517
11375 -1993517 -704488 547252 1304142 1887350 2332247 2539927 2865526 3061938 1636755
11366 1636755 -1712157 -4071165 -2397178 2027961 5189064 5965072 6758530 8428915
11358 8428915 8471842 5437042 1727464 171863 507834 1092796 1721643 2794762 3638539
$$ packed form
11419B153162j30203m88355R49615L027893K959056q2555k843617k227814j74996
11410C142186p12087l263223l395802j41523K300933J380472P0663J471888L422437
11401D275944K064292j708904l372123j403549R15174O82457p26059l98516J515877
11392A844593K136341J55071k322551k750779j279911K49692J145888J904968
11384A083312K182964R91661j070862k005378j299167n81065p83352p78305K66675
11375a993517J289029J251740P56890N83208M44897K07680L25599J96412j425183
11366A636755l348912k359008J673987M425139L161103P76008P93458J670385
11358H428915M2927l034800l709578j555601L35971N84962O28847J073119Q43777
$$ plain form
11349 3638539 3554581 3093084 2887056 2675706 2508142 3159071 4347758 4490085 3260212
11340 3260212 2302863 2321710 1801882 -57062 -1601309 -1525608 -1002721 -1232097 -1308765 -576404
11330 -576404 -619605 -2404257 -3666003 -2056353 830282 1588338 -49637 -1301509 -613277
11321 -613277 772338 1092079 -226415 -2674399 -4742231 -4622614 -2463530 -900265 -1617477
11312 -1617477 -2653586 -1227218 1977348 3871732 3512317 2912396 3504295 4255257 3681571
11303 3681571 1903692 176267 -477649 80137 1050774 1370286 917992 595708 869171
11294 869171 1179234 1307653 2109304 4086373 6326679 7590209 7436728 5936472 3655164
11285 3655164 2106333 2344877 2900216 1426032 -1338396 -2187311 -575242 450014 -379802
$$ packed form
11349C638539q3958m61497k06028k11350j67564O50929J188687J42327j229873
11340C260212r57349J8847n19828j858944j544247P5701N22887k29376p6668P32361
11330e76404m3201j784652j261746J609650K886635P58056j637975j251872O88232
11321f13277J385615L19741j318494k447984k067832J19617K159084J563265p17212
11312a617477j036109J426368L204566J894384l59415n99921N91899P50962n73686
11303C681571j777879j727425o53916N57786R70637L19512m52294l22284K73463
11294H69171L10063J28419Q01651J977069K240306J263530j53481j500256k281308
11285C655164j548831K38544N55339j474184k764428q48915J612069J025256q29816
$$ plain form
11276 -379802 -320828 2062062 3435509 829547 -3196823 -4288117 -2492215 -993981 -1030198
11267 -1030198 -1795821 -3210029 -4987003 -5031604 -2546436 -551887 -1355796 -2037224 801802
11258 801802 4204397 2654506 -2715039 -5165537 -2536968 7368 -1319110 -3332725
11250 -3332725 -1573972 2830905 5125205 3107491 -1086369 -3834667 -3227837 -468505
11242 -468505 1525258 1729475 2211430 4241391 5325522 3089364 22639 163504 2563836
11233 2563836 2977587 1190732 1129788 3601759 4738473 2855116 1331754 2611656 4282464
11224 4282464 3745206 2489035 2749153 3435452 2439487 331252 -865881 -455709 1256252
11215 1256252 3828045 5765270 5287231 3349506 3082177 4881285 5286150 2458487 -625309
$$ packed form
11276c79802N8974K382890J373447k605962m026370j091294J795902J498234l6217
11267a030198p65623j414208j776974m4601K485168J994549q03909o81428K839026
11258H01802L402595j549891n369545k450498K628569K544336j326478k013615
11250c332725J758753M404877K294300k017714m193860k748298O06830K759332
11242d68505J993763K04217M81955K029961J084131k236158l066725J40865K400332
11233B563836M13751j786855o0944K471971J136714j883357j523362J279902J670808
11224D282464n37258j256171K60118O86299r95965k108235j197133M10172J711961
11215A256252K571793J937225m78039j937725k67329J799108M04865k827663l083796
$$ plain form
11206 -625309 -777197 712185 739523 -761919 -1486296 -469187 1321010 2736794 2989031
11197 2989031 1838106 535743 870610 2289368 2094651 -547863 -3271506 -4150705 -3882899
11188 -3882899 -3221740 -1365616 1588629 3670313 4121157 4413273 4809420 3481178 676822
11179 676822 -280667 1673296 3185227 2135336 918949 1077345 -286732 -4549453 -7062380
11170 -7062380 -4114358 -47462 -976629 -4931325 -5485954 -2623006 -1932192 -4168678 -4083426
11161 -4083426 -223554 2275898 778672 -401512 2063029 4575210 2914386 -647934
11153 -647934 -1320044 896702 2602070 2885607 3146919 3001561 1025021 -1345868 -930870
11144 -930870 2220149 4551884 4089286 2722170 2657131 3297983 2996001 1902050 1368220
$$ packed form
11206f25309j51888J489382K7338j501442p24377J017109J790197J415784K52237
11197B989031j150925j302363L34867J418758j94717k642514k723643q79199K67806
11188c882899O61159J856124K954245K081684M50844K92116L96147j328242k804356
11179F76822r57489J953963J511931j049891j216387J58396j364077m262721k512927
11170g062380K948022M066896r29167l954696n54629K862948O90814k236486Q5252
11161d083426L859872K499452j497226j180184K464541K512181j660824l562320
11153f47934o72110K216746J705368K83537K61312j45358j976540k370889M14998
11144i30870L151019K331735m62598j367116o5039O40852l01982j093951n33830
$$ plain form
11135 1368220 1606562 1608853 1072133 999660 2085025 3457437 3723111 2789204 1798761 1314136
11125 1314136 559378 -1069408 -2619069 -2622285 -1054903 728133 1755763 2100702 1873486
11116 1873486 791806 -832634 -1677658 -756635 1270303 2755962 2830616 2083682 1686376
11107 1686376 2268045 3529984 4447183 3801489 1166201 -2166521 -3781102 -2579993 -438508
11098 -438508 -204643 -1859939 -2257417 406920 3534863 3409164 445286 -1267754 565412
11089 565412 3822305 5115103 3423584 52824 -2976643 -3748789 -1638312 1333686
11081 1333686 2036842 28358 -1871591 -1553529 -121654 611607 877510 1641721 2597358
11072 2597358 3274894 4307663 5683875 5531663 2750865 -773374 -2684439 -3166380 -3264847
$$ packed form
11135A368220K38342K291n36720p2473J085365J372412K65674r33907r90443m84625
11125A314136p54758j628786j549661l216J567382J783036J027630L44939k27216
11116A873486j081680j624440q45024R21023K026938J485659P4654p46934l97306
11107A686376N81669J261939R17199o45694k635288l332722j614581J201109K141485
11098d38508K33865j655296l97478K664337L127943j25699k963878j713040J833166
11089E65412L256893J292798j691519l370760l029467p72146K110477K971998
11081A333686P03156k008484j899949L18062J431875P33261K65903P64211R55637
11072B597358O77536J032769J376212j52212k780798l524239j911065m81941r8467
$$ plain form
11063 -3264847 -2313165 50182 1313855 -704555 -3479813 -2817327 450211 1406140 -1148143
11054 -1148143 -2630118 223925 4524640 5751121 3589167 625304 -1867560 -3801635
11046 -3801635 -4068244 -1710165 1747982 3769114 3883288 3219702 1979189 -237285 -2282344
11037 -2282344 -2216735 -165308 1712594 2160662 1797970 1149852 -129680 -1625434 -1856487
11028 -1856487 -547256 529398 122600 -603687 -178457 465928 -667757 -3164889 -4139763
11019 -4139763 -1956210 1627064 3745405 3643483 2683466 2098182 2016505 2334523 3179089
11010 3179089 4218720 4511804 3608254 2207650 1206631 611637 18956 -300275 256341
11001 256341 1288288 1469700 367293 -705093 -387015 816079 1280884 497054 -664583
$$ packed form
11063c264847R51682K363347J263673k018410k775258O62486L267538R55929k554283
11054a148143j481975K854043M300715J226481k161954k963863k492864j934075
11046c801635k66609K358079L458147K021132J14174o63586j240513k216474k045059
11037b282344O5609K051427J877902M48068l62692o48118j279532j495754k31053
11028a856487J309231J076654m06798p26287M25230O44385j133685k497132r74874
11019d139763K183553L583274K118341j01922r60017n85284q1677L18018Q44566
11010C179089J039631K93084r03550j400604j001019n94994n92681l19231N56616
11001B56341J031947J81412j102407j072386L18078J203094M64805p83830j161637
$$ plain form
10992 -664583 -1745095 -3168240 -4487851 -3916041 -911179 2062867 2163627 -154746 -1967200
10983 -1967200 -1930027 -1378812 -1446116 -1493639 -1030799 -934273 -1689530 -2379883 -2562226 -3124571
10973 -3124571 -3935331 -2923158 514485 3372634 2939533 988701 909132 2120507 1238239
10964 1238239 -1771164 -2874041 -66238 3680455 4996170 4327181 3770888 3696884 3838022
10955 3838022 5190469 7970231 9514539 7389464 3599683 2498899 4684076 6076069
10947 6076069 3791793 154123 -844670 906095 2090596 1188117 389687 1544373 2721375
10938 2721375 1062831 -2347728 -3538574 -1473708 474609 -57546 -865769 633781
10930 633781 2609433 1819139 -533383 -350373 2600942 4087256 2153648 79052 917590
$$ packed form
10992f64583j080512j423145j319611N71810L004862K974046J00760k318373j812454
10983a967200L7173N51215o7304m7523M62840R6526p55257o90353j82343n62345
10973c124571q10760J012173L437643K858149m33101j950832p9569J211375q82268
10964A238239l009403j102877K807803L746693J315715o68989n56293p4004J41138
10955C838022J352447K779762J544308k125075l789781j100784K185177J391993
10947F076069k284276l637670r98793J750765J184501r02479p98430J154686J177002
10938B721375j658544l410559j190846K064866J948317n32155q08223J499550
10930F33781J975652p90294k352522J83010K951315J486314j933608k074596Q38538
$$ plain form
10921 917590 2937044 3090481 2061449 2651607 4910832 6054195 4592603 2003817 380442
10912 380442 315197 1252395 2495994 3440235 3523701 2399454 325636 -1430742 -1189663
10903 -1189663 1127780 3053840 2204540 -323455 -1117575 791137 2536656 1575040 -869894
10894 -869894 -1811248 -259796 2468444 4861180 6113041 5880357 4580175 3444138 3282333
10885 3282333 3583616 3396453 2514420 1375374 455321 68324 132544 95494 -224273 -71823
10875 -71823 992719 1923029 1696122 1237612 1917514 2840475 2096463 293725 -7144
10866 -7144 1554429 2461081 1216227 -828932 -2027221 -2112112 -966606 1325414 2792530
10857 2792530 1232072 -1799686 -2177316 693519 2720673 1373742 -838738 -994399
$$ packed form
10921I17590K019454J53437j029032N90158K259225J143363j461592k588786j623375
10912C80442o5245R37198J243599R44241Q3466j124247k073818j756378K41079
10903a189663K317443J926060q49300k527995p94120J908712J745519r61616k444934
10894h69894r41354J551452K728240K392736J251861k32684j300182j136037j61805
10885C282333L01283j87163q82033j139046r20053l86997O4220l7050l19767J52450
10875g1823J064542R30310k26907m58510O79902R22961p44012j802738l00869
10866g144J561573R06652j244854k045159j198289q4891J145506K292020J467116
10857B792530j560458l031758l77630K870835K027154j346931k212480j55661
$$ plain form
10849 -994399 -48450 -184500 -1319504 -2654959 -4453695 -5890853 -4464497 -105876 3386297
10840 3386297 3567754 2594819 2686335 2290156 36764 -1515443 -147072 1626945 857525
10831 857525 -476400 818954 3179444 3261641 2182825 3108988 4771216 3414915 -204031
10822 -204031 -1828549 -871655 -594576 -1528408 -834000 1487073 1803668 -616617 -1881945
10813 -1881945 65484 2311026 2277756 1596380 2334238 3378638 3214876 3030524 4347712
10804 4347712 6002960 5877974 3884864 1492902 -158510 -445321 862922 2905511
10796 2905511 4253675 4622103 4742435 4696160 4124152 3617377 3692626 3057291 659525
10787 659525 -1243890 432847 4352778 5975183 4335875 3348946 5325566 7554813
$$ packed form
10849i94399R45949j36050j135004j335455j798736j437158J426356M358621L492173
10840C386297J81457r72935R1516l96179k253392j552207J368371J774017p69420
10831H57525j333925J295354K360490Q2197j078816R26163J662228j356301l618946
10822b04031j624518R56894K77079r33832O94408K321073L16595k420285j265328
10813a881945J947429K245542l3270o81376P37858J044400j63762j84352J317188
10804D347712J655248j24986j993110k391962j651412k86811J308243K042589
10796B905511J348164L68428J20332m6275n72008n06775P5249o35335k397766
10787F59525j903415J676737L919931J622405j639308r86929J976620K229247
$$ plain form
10779 7554813 7242913 5799465 5504790 5320251 3281692 569887 -210881 778623 1308539
10770 1308539 969847 1385090 2839460 3345945 1568302 -1087624 -2106642 -796832 1012909
10761 1012909 1103666 -553424 -1749722 -816398 1240322 2223027 1717216 1228122 1627774
10752 1627774 2038704 1531421 664570 781240 2413032 4658033 5933653 5641097 5170729
10743 5170729 6306466 8382443 8641351 6213764 3766598 3762868 5142701 5700926 5652126
10734 5652126 6160167 6187485 4129733 1374636 767395 2228195 3218770 2969739 2768744
10725 2768744 2490311 707720 -1564490 -1118030 2608167 6318492 7483314 7035110 6420869
10716 6420869 5219050 3289160 2377867 3456300 4567674 3432393 745665 -959491
$$ packed form
10779G554813l11900j443448k94675j84539k038559k711805p80768R89504N29916
10770A308539l38692M15243J454370N06485j777643k655926j019018J309810J809741
10761A012909R0757j657090j196298R33324K056720R82705n05811m89094L99652
10752A627774M10930n07283q66851J16670J631792K245001J275620k92556m70368
10743E170729J135737K075977K58908k427587k447166l730J379833N58225m8800
10734E652126N08041K7318k057752k755097o07241J460800R90575k49031k00995
10725B768744k78433j782591k272210M46460L726197L710325J164822m48204o14241
10716F420869j201819j929890r11293J078433J111374j135281k686728j705156
$$ plain form
10708 -959491 -700732 318629 835466 896446 1153014 1635624 1670503 1081412 965457 2213238
10698 2213238 3348679 1691064 -2600671 -5707385 -4772988 -1389452 1210788 2308134
10690 2308134 2900003 2991154 2494606 2927181 5031955 6293417 4196780 639608 -441348
10681 -441348 1232701 2612987 2495163 2504942 3280151 3427320 2440002 1460152 981864 527918
10671 527918 436320 1403810 2738633 3517751 4513256 6361261 7270907 5678461 3615133
10662 3615133 3887373 5462898 5521579 4452345 4443121 4643722 2691127 -24543 119268
10653 119268 2678134 3518666 1391489 -729317 -789440 532222 2804800 5763845 6702471
10644 6702471 3226999 -1565123 -2044473 1868023 5001236 5107435 4777529 5090915 3808636
$$ packed form
10708i59491K58759J019361N16837O0980K56568M82610L4879n89091j15955J247781
10698B213238J135441j657615m291735l106714R34397L383536K600240J097346
10690B308134N91869R1151m96548M32575K104774J261462k096637l557172j080956
10681d41348J674049J380286j17824R779P75209J47169r87318r79850m78288m53946
10671E27918r1598R67490J334823P79118R95505J848005R09646j592446k063328
10662C615133K72240J575525N8681j069234r224K00601j952595k715670J43811
10653A19268K558866Q40532k127177k120806o0123J321662K272578K959045R38626
10644F702471l475472m792122m79350L912496L133213J06199l29906L13386j282279
$$ plain form
10635 3808636 843589 -636780 135613 507611 47598 1252125 3583266 3163364 -79619
10626 -79619 -1353750 1077716 3242715 2738473 2252033 3472517 3912474 2529461 2251544
10617 2251544 3959461 4163438 1834442 1263109 4466879 6879931 4810618 1575994
10609 1575994 1711033 4030884 4908744 4071168 3000554 1604519 142128 534621 2643201
10600 2643201 3425869 2428650 3162572 6249248 6921313 2968824 -556003 1123441 5565733
10591 5565733 8144239 8794415 8952441 6914304 1808719 -2073348 -616405 3700272
10583 3700272 5702600 4774058 3637230 2997520 2042011 1673616 2947856 4339597 3943103
10574 3943103 2321986 802475 -315632 -27438 3208054 7676577 9025007 6661579
$$ packed form
10635C808636k965047j480369P72393L71998m60013J204527K331141m19902l242983
10626g9619j274131K431466K164999n04242m86440J220484M39957j383013k77917
10617B251544J707917K03977k328996n71333L203770K413052k069313l234624
10609A575994J35039K319851Q77860q37576j070614j396035j462391L92493K108580
10600B643201P82668r97219P33922L086676O72065l952489l524827J679444M442292
10591E565733K578506O50176J58026k038137n105585l882067J456943M316677
10583C700272K002328r28542j136828o39710r55509l68395J274240J391741l96494
10574C943103j621117j519511j118107K88194L235492M468523J348430k363428
$$ plain form
10566 6661579 4898608 5766799 6088320 4111294 3128774 5225944 7131565 6004676 4144540
10557 4144540 4397690 5866662 7279775 9397871 11309081 10050654 6549379 5675238
10549 5675238 7848745 7710204 4023066 2950888 7654872 12685584 13212281 11904195
10541 11904195 11832089 10546837 6573470 4120976 5801804 7812044 7268385 6956982 8403128
10532 8403128 8341679 6356690 7177664 11098222 11753781 7763041 6012425 8907499 10087754
10523 10087754 7593896 8136481 12728418 12673500 6590395 5597271 13393327 18073690 13474327
10514 13474327 10702119 16815293 20849333 14932003 10216810 15887001 21410850 17212108
10506 17212108 13534092 19670809 24736218 19963673 18434160 29338612 36248300 27719843
$$ packed form
10566F661579j762971Q68191L21521j977026r82520K097170J905621j126889j860136
10557D144540K53150J468972J413113K118096J911210j258427l501275q74141
10549E675238K173507j38541l687138j072178M703984N030712N26697j308086
10541A1904195p2106j285252l973367k452494J680828K010240n43659l11403J446146
10532H403128o1449j984989Q20974L920558O55559l990740j750616K895074J180255
10523A0087754k493858N42585M591937n4918o083105r93124P796056M680363m599363
10514A3474327k772208O113174M034040n917330m715193N670191N523849m198742
10506A7212108l678016O136717N065409m772545j529513J0904452O909688q528457
$$ plain form
10498 27719843 23545306 38863538 50698198 39183989 31422686 54920744 78880990
10491 78880990 66730609 59400680 118710233 195567646 159067728 -14616432 -179222756
10484 -179222756 -199330716 -115397216 -58918089 -68751422 -80224776 -56876372 -34740976
10477 -34740976 -39996130 -46689333 -33343728 -19243044 -22530245 -29115366 -24365713 -18617835
10469 -18617835 -21966071 -24265040 -17506990 -12162523 -15794530 -18087155 -11236667 -5101712
10461 -5101712 -8926010 -15654087 -16334299 -14367529 -14799099 -13913087 -9258479 -6910245 -10053332
10452 -10053332 -12389133 -10200236 -9046565 -11907988 -12782318 -8723358 -6479937 -10347145
10444 -10347145 -14419899 -13518844 -11370966 -11577980 -10566099 -6006510 -2904888 -4924908
$$ packed form
10498B7719843m174537J5318232J1834660j1514209p761303K3498058K3960246
10491G8880990j2150381p329929N9309553P6857413l6499918j73684160j64606324
10484a79222756k0107960Q3933500N6479127r833333j1473354K3348404K2135396
10477c4740976n255154o693203J3345605J4100684l287201o585121M749653N747878
10469a8617835l348236k298969O758050N344467l632007k292625O850488O134955
10461e101712l824298o728077o80212J966770m31570Q86012M654608K348234l143087
10452a0053332k335801K188897J153671k861423q74330M058960K243421l867208
10444a0347145m072754R01055K147878k07014J011881M559589L101622k020020
$$ plain form
10436 -4924908 -7956801 -7873785 -6762228 -6683981 -5342919 -2459129 -2313214 -5545549 -6479383
10427 -6479383 -2871762 -287831 -2526620 -5683805 -6026408 -5855281 -7089972 -6730152 -3365494
10418 -3365494 -1060987 -2307487 -3797866 -3117072 -2855683 -4458762 -4986187 -3557035 -3861286
10409 -3861286 -6728514 -7639071 -5328626 -5080563 -9205970 -12072075 -9519507 -5735933
10401 -5735933 -5373665 -5937037 -3908009 -1966473 -3777889 -6978726 -7427322 -5912784 -5268468
10392 -5268468 -5100061 -4254327 -4300045 -6043292 -6805757 -5284291 -4614342 -6640772 -8084239
10383 -8084239 -6616603 -5489530 -7302041 -8366161 -4829167 219393 1702443 667227
10375 667227 1272296 2818303 1127957 -3982035 -8247049 -8970955 -7105610 -4443656 -2471948
$$ packed form
10436d924908l031893Q3016J111557P8247J341062K883790J45915l232335r33834
10427f479383L607621K583931k238789l157185l42603J71127j234691L59820L364658
10418c365494K304507j246500j490379O80794K61389j603079n27425J429152l04251
10409c861286k867228r10557K310445K48063m125407k866105K552568L783574
10401e735933L62268n63372K029028J941536j811416l200837m48596J514538O44316
10392e268468J68407Q45734m5718j743247p62465J521466O69949k026430j443467
10383h084239J467636J127073j812511j064120L536994N048560J483050j035216
10375F67227O05069J546007j690346n109992m265014p23906J865345K661954J971708
$$ plain form
10366 -2471948 -2722527 -4913462 -6087477 -4427242 -2171820 -2053805 -3001296 -2388516 -519453
10357 -519453 310813 -381648 -1331849 -2071798 -2909402 -3560090 -3822859 -4361400 -5264242 -5403913
10347 -5403913 -4555079 -4261275 -5290362 -6250490 -5989909 -5285960 -5008119 -4771367 -4449842
10338 -4449842 -4818117 -5800484 -6257697 -6013341 -5749840 -4917243 -2739832 -1155086 -3012640
10329 -3012640 -7086418 -8843586 -6683370 -3402516 -1097017 852426 2135354 952694
10321 952694 -1623938 -1786919 810729 1874168 -654664 -3427616 -3511646 -2536401 -2650910
10312 -2650910 -3018811 -2865556 -3516140 -4887864 -4411065 -1901742 -943905 -2940916 -4567062
10303 -4567062 -3761215 -3162454 -4503735 -4820288 -2011869 695946 2775 -2148806 -2690617
$$ packed form
10366b471948k50579k190935j174015J660235K255422J18015r47491O12780J869063
10357e19453Q30266o92461r50201p39949q37604o50688k62769n38541r02842j39671
10347e403913Q48834K93804j029087r60128K60581P03949K77841K36752L21525
10338d449842l68275r82367m57213K44356K63501Q32597K177411J584746j857554
10329c012640m073778j757168K160216L280854K305499J949443J282928j182660
10321I52694k576632j62981K597648J063439k528832k772952q4030R75245j14509
10312b650910l67901J53255o50584j371724M76799K509323R57837j997011j626146
10303d567062Q05847N98761j341281l16553K808419K707815o93171k151581n41811
$$ plain form
10294 -2690617 -2677728 -4045959 -5000343 -3250800 -613512 -25535 -811391 -824032 -455058
10285 -455058 -867222 -1120640 -468233 -488577 -1762157 -1838259 257749 1279682 -945089
10276 -945089 -3432981 -3128326 -2040295 -3005920 -4270178 -3075522 -1126320 -1517367 -3329980
10267 -3329980 -4133517 -4841483 -7119441 -8788310 -6913769 -3136113 -1198108 -1448735 -2142822
10258 -2142822 -3493142 -5893505 -6976000 -5241886 -3796884 -5548889 -7630673 -5864262
10250 -5864262 -1865139 -53490 -324427 317113 1322914 180315 -1635310 -848205 1046577
10241 1046577 -68898 -3496454 -4983354 -4302934 -4745325 -5812398 -3717465 701706
10233 701706 1887127 -1461293 -4029391 -2296967 696052 1089934 -597971 -2234673
$$ packed form
10294b690617J2889j368231r54384J749543K637288N87977p85856j2641L68974
10285d55058m12164k53418O52407k0344j273580p6102K096008J021933k224771
10276i45089k487892L04655J088031r65625j264258J194656J949202l91047j812613
10267c329980q03537p07966k277958j668869J874541L777656J938005k50627o94087
10258b142822j350320k400363j082495J734114J445002j752005k081784J766411
10250e864262L999123J811649k70937O41540J005801j142599j815625P87105J894782
10241A046577j115475l427556j486900O80420m42391j067073K094933M419171
10233G01706J185421l348420k568098J732424K993019L93882j687905j636702
$$ plain form
10225 -2234673 -3393599 -3806189 -2583182 -826765 -1286955 -3905751 -5320230 -4061055
10217 -4061055 -2590652 -2967714 -4123024 -4641249 -4675392 -3933813 -1336763 2080632 3358781
10208 3358781 1930302 477252 451132 173033 -1440358 -2751075 -2509640 -1995557 -2551320
10199 -2551320 -3664911 -4649008 -5593074 -5834084 -4336259 -2293833 -2218030 -3651951 -3232772
10190 -3232772 -158224 1968326 465544 -2462098 -3154941 -1255369 1050160 2405576
10182 2405576 2908548 2909640 2743188 2562153 1758735 -108649 -1707054 -1188103 857864
10173 857864 1984323 1557495 1289214 1861984 1874670 767047 -46493 124573 35669 -1032676
10163 -1032676 -2043821 -2361466 -2788079 -3572595 -3671961 -2830333 -2182340 -2100143 -1703589 -1093698
$$ packed form
10225b234673j158926m12590J223007J756417m60190k618796j414479J259175
10217d061055J470403l77062j155310n18225l4143P41579K597050L417395J278149
10208C358781j428479j453050k6120k78099j613391j310717K41435N14083n55763
10199b551320j113591r84097r44066k41010J497825K042426P5803j433921M19179
10190c232772L074548K126550j502782k927642o92843J899572K305529J355416
10182B405576N02972J092j66452j81035q03418j867384j598405N18951K045967
10173H57864J126459m26828k68281N72770J2686j107623q13540J71066q8904j068345
10163a032676j011145l17645m26613p84516r9366Q41628O47993Q2197L96554O09891
$$ plain form
10153 -1093698 -1662373 -3533793 -5082428 -5557387 -5748592 -5661949 -4326329 -2461913 -2330379
10144 -2330379 -4061483 -5072177 -4126933 -3032089 -3193468 -3485205 -2861397 -2159295 -1804076
10135 -1804076 -541780 1843028 3111543 1628828 -1322712 -3638108 -4565337 -3770291
10127 -3770291 -971307 2183039 2748232 617804 -732582 703098 2528320 1947091
10119 1947091 -211247 -1709916 -2405612 -3024107 -2907416 -1666689 -997140 -2236690 -3932432
10110 -3932432 -4182522 -3515040 -3194951 -2781999 -1788066 -1489977 -2331079 -1847272 1499001
10101 1499001 4479093 2969120 -1707263 -4310185 -2824522 -169824 895645 581479
10093 581479 -554980 -3084139 -6244989 -7230525 -4822276 -1551590 -454530 -1278800 -1628139
$$ packed form
10153a093698n68675j871420j548635m74959j91205Q6643J335620J864416J31534
10144b330379j731104j010694R45244J094844j61379k91737O23808P02102L55219
10135a804076J262296K384808J268515j482715k951540k315396r27229P95046
10127c770291K798984L154346N65193k130428j350386J435680J825222n81229
10119A947091k158338j498669o95696o18495J16691J240727O69549j239550j695742
10110c932432k50090O67482L20089M12952R93933K98089q41102M83807L346273
10101A499001K980092j509973m676383k602922J485663K654698J065469l14166
10093E81479j136459k529159l160850r85536K408249L270686J097060q24270l49339
$$ plain form
10084 -1628139 -721725 -176404 -1341828 -3315694 -4055228 -2829687 -940684 62760 300195
10075 300195 1000939 2346223 3051980 2313735 899842 -267970 -1386448 -2790948 -3873170
10066 -3873170 -4064280 -3970327 -4403175 -5002950 -4825188 -3644866 -1886720 -87930 852245
10057 852245 47377 -1753072 -2131301 126916 3172306 4398449 3538903 2062096 624024
10048 624024 -1122396 -3025417 -4511823 -5501991 -5657551 -3664336 723462 4722986 5015747
10039 5015747 1932876 -1149399 -2449171 -3318195 -4956970 -6334688 -6370520 -5829313 -5601007
10030 -5601007 -4942002 -3037189 -851546 294417 882662 2117812 3473349 3327791 1868577
10021 1868577 1380326 3070500 5069242 4572655 1214755 -2638653 -4656570 -4770309 -4530976
$$ packed form
10084a628139R06414N45321j165424j973866p39534J225541J889003J003444K37435
10075C00195P00744J345284P05757p38245j413893j167812j118478j404500j082222
10066c873170j91110R3953m32848n99775J77762J180322J758146J798790R40175
10057H52245q04868j800449l78229K258217L045390J226143q59546j476807j438072
10048F24024j746420j903021j486406r90168j55560J993215M387798L999524K92761
10039E015747l082871l082275j299772q69024j638775j377718l5832N41207K28306
10030e601007O59005J904813K185643J145963N88245J235150J355537j45558j459214
10021A868577m88251J690174J998742m96587l357900l853408k017917j13739K39333
$$ plain form
10012 -4530976 -4860300 -5004572 -3779729 -1410270 471277 794804 441679 1084026 2940969
10003 2940969 4499924 4497402 3281656 1858343 527533 -731228 -1288265 -524510 783144
9994 783144 1005694 -246829 -1627266 -1888058 -1249175 -676204 -787094 -1757063 -3233869
9985 -3233869 -4052419 -3303391 -2046329 -2347331 -3997677 -4270909 -2271705 -1245204 -4142699
9976 -4142699 -8651498 -9863621 -7061958 -4323182 -4278671 -4865560 -3415746 -804768 461887
9967 461887 5334 -790558 -1297574 -1629299 -1271193 92264 1084826 74667 -2177038
9958 -2177038 -3196557 -2109554 -545903 -48493 -238964 -101516 346263 511715 291477
9949 291477 -258129 -1513677 -3512626 -5129589 -5168047 -4080507 -3493408 -3984938 -4473968
$$ packed form
10012d530976l29324j44272J224843K369459J881547L23527l53125O42347J856943
10003B940969J558955k522j215746j423313j330810j258761n57037P63755J307654
9994G83144K22550j252523j380437k60792O38883N72971j10890r69969j476806
9985c233869q18550P49028J257062l01002j650346k73232J999204J026501k897495
9976d142699m508799j212123K801663K738776M4511n86889J449814K610978J266655
9967D61887m56553p95892n07016l31725L58106J363457R92562j010159k251705
9958b177038j019519J087003J563651M97410j90471J37448M47779J65452k20238
9949B91477n49606j255548j998949j616963l8458J087540N87099m91530m89030
$$ plain form
9940 -4473968 -4135287 -3759084 -4474879 -6062278 -7474697 -8282752 -8494649 -7605041 -5236293
9931 -5236293 -2439616 -935543 -1068231 -1734552 -2223062 -2772139 -3402008 -3693643 -3741613
9922 -3741613 -3857821 -3515733 -2337115 -1766416 -3403344 -5841328 -6099644 -4405975 -4036939
9913 -4036939 -5547588 -5173771 -894965 3829582 5134763 3987311 3117041 2209759 170518
9904 170518 -967037 813347 2880797 1592549 -1331489 -1444934 963650 1913511 1166158
9895 1166158 2080314 4215834 3153829 -1154075 -2909808 240716 3048685 1235782
9887 1235782 -1806682 -1290816 1177022 1187154 -1248212 -3528957 -6275175 -11421971 -16450808
9878 -16450808 -16278371 -10367610 -3321684 1261399 3436516 3853753 2334921 -96898
$$ packed form
9940d473968L38681L76203p15795j587399j412419q08055k11897Q89608K368748
9931e236293K796677J504073j32688o66321m88510n49077o29869k91635m7970
9922c741613j16208L42088J178618N70699j636928k437984k58316J693669L69036
9913d036939j510649L73817M278806M724547J305181j147452q70270r07282k039241
9904A70518j137555J780384K067450j288248k924038j13445K408584R49861p47353
9895A166158R14156K135520j062005m307904j755733L150524K807969j812903
9887A235782l042464N15866K467838J0132k435366k280745k746218n146796n028837
9878a6450808J72437N910761P045926M583083K175117M17237j518832k431819
$$ plain form
9870 -96898 -1342305 -1059997 -671310 -423889 708718 2105619 1570505 -1056849 -3143538
9861 -3143538 -3005626 -1998243 -1896223 -2371656 -2262290 -1541960 -729936 288198 1566810
9852 1566810 2185822 1226449 -835703 -2614123 -3449443 -3887909 -4483429 -4579328 -2831720
9843 -2831720 750249 3846605 4007805 1754333 55551 268014 313837 -1877482 -4670508
9834 -4670508 -4493767 -661535 3576718 4856489 2972946 17205 -2370224 -4008597
9826 -4008597 -5073418 -5030719 -3171347 6569 2734731 3788110 3700481 3422581 2668577
9817 2668577 976744 -446571 -55094 1224160 917111 -1199628 -2784119 -2713499 -2337014
9808 -2337014 -2279929 -1159036 1214015 2524640 1712164 1043061 2233270 3439003 2731617
$$ packed form
9870i6898j245407K82308L88687K47421J132607J396901n35114k627354k086689
9861c143538J37912J007383J02020m75433J09366P20330Q12024J018134J278612
9852A566810O19012r59373k062152j778420q35320m38466n95520r5899J747608
9843b831720L581969L096356J61200k253472j698782K12463M5823k191319k793026
9834d670508J76741L832232M238253J279771j883543k955741k387429j638373
9826d008597j064821M2699J859372L177916K728162J053379q7629k77900p54004
9817B668577j691833j423315L91477J279254l07049k116739j584491P0620L76485
9808b337014N7085J120893K373051J310625q12476o69103J190209J205733p07386
$$ plain form
9799 2731617 1713327 2534853 3911786 3672696 2947181 3807350 4728751 2947132 -55283
9790 -55283 -370355 1657351 1739751 -1094803 -2708846 -609454 2263452 2663672 1862010
9781 1862010 2483836 3693798 2839158 -27532 -2306919 -2519905 -1414829 -90163 943057
9772 943057 1166072 228724 -1201929 -1820486 -1008507 713700 2377359 3342817 3586437
9763 3586437 3400263 2743535 1220624 -977761 -2779778 -3593172 -4205659 -5333781 -6122682
9754 -6122682 -5416237 -3684031 -2093766 -540781 1426747 2568552 1417877 -556028
9746 -556028 -117221 3075164 5670510 5185807 2843967 934633 -214043 -1329512 -2388724
9737 -2388724 -3197579 -4057895 -4549404 -3350389 -618682 1171643 338503 -1608781 -2344548
$$ packed form
9799B731617j018290Q21526J376933k39090p25515Q60169R21401j781619l002415
9790e5283l15072K027706Q2400k834554j614043K099392K872906M00220q01662
9781A862010O21826J209962q54640k866690k279387k12986J105076J324666J033220
9772I43057K23015r37348j430653o18557Q11979J722207J663659R65458K43620
9763C586437j86174o56728j522911k198385j802017q13394o12487j128122p88901
9754f122682P06445J732206J590265J552985J967528J141805j150675j973905
9746e56028M38807L192385K595346m84703k341840j909334j148676j115469j059212
9737b388724q08855q60316m91509J199015K731707J790325q33140j947284p35767
$$ plain form
9728 -2344548 -2051298 -2458800 -3747911 -4570055 -4485108 -4282334 -4121115 -3294203 -1972134
9719 -1972134 -1489630 -2418530 -3632625 -3899391 -3481298 -3461039 -4046111 -4332673 -3703481 -2821626
9709 -2821626 -2779435 -3451080 -3371715 -1580832 980469 2494662 2234405 812564 -996887
9700 -996887 -2625005 -3236419 -2257132 -523752 276155 -351695 -1152998 -833310 611398
9691 611398 2425695 3888026 4310871 3371874 1896029 1300597 1760382 1869098 685784
9682 685784 -770684 -787264 863591 2616146 2678512 678789 -1879705 -2796578 -1289269
9673 -1289269 1203823 2834244 3422579 3812640 3891623 2896254 1356817 750725 1043747
9664 1043747 577508 -1083614 -2210852 -1686168 -801448 -1085704 -2051243 -2512452 -2563916
$$ packed form
9728b344548K93250m07502j289111q22144Q4947K02774J61219Q26912J322069
9719a972134M82504r28900j214095k66766M18093K0259n85072k86562O29192Q81855
9709b821626M2191o71645P9365J790883K561301J514193k60257j421841j809451
9700i96887j628118o11414R79287J733380P99907o27850q01303L19688J444708
9691F11398J814297J462331M22845r38997j475845n95432M59785J08716j183314
9682F85784j456468j6580J650855J752555O2366j999723k558494r16873J507309
9673a289269K493092J630421N88335L90061P8983r95369j539437o06092K93022
9664A043747m66239j661122j127238N24684Q84720k84256r65539m61209n1464
$$ plain form
9655 -2563916 -2551725 -1467079 1527550 4802023 5688380 3985577 2091341 1559207 1364411
9646 1364411 97462 -1725382 -2540189 -1929647 -839314 -48609 547974 1151547 1483586
9637 1483586 1451163 1708673 2682614 3297540 1864713 -1369458 -3651591 -2581098 1126681
9628 1126681 4552253 5556763 4006747 994315 -1756435 -2428959 -761949 1178875
9620 1178875 1411218 682644 863903 1374290 -99206 -3282753 -4753212 -2693313 454842
9611 454842 1553034 680968 -208929 -427317 -257569 702339 2486866 3259486 1387267
9602 1387267 -1581596 -2371218 -267754 2118925 2542311 1711710 1615393 2636126 3291530
9593 3291530 2378246 655024 21040 915099 1214559 -1151315 -4842335 -6256419 -4424297
$$ packed form
9655b563916J2191J084646K994629L274473Q86357j702803j894236n32134j94796
9646A364411j266949j822844q14807O10542J090333P90705N96583O03573L32039
9637A483586l2423K57510R73941O14926j432827l234171k282133J070493L707779
9628A126681L425572J004510j550016l012432k750750o72524J667010J940824
9620A178875K32343p28574J81259N10387j473496l183547j470459K059899L148155
9611D54842J098192q72066q89897k18388J69748R59908J784527P72620j872219
9602A387267k968863p89622K103464K386679M23386q30601r6317J020733O55404
9593C291530r13284j723222o33984Q94059K99460k365874l691020j414084J832122
$$ plain form
9584 -4424297 -2516372 -3201100 -4691705 -3603075 -136550 2365166 2322748 1510661 1577775
9575 1577775 1557058 -134337 -2911411 -4528758 -3728294 -1598793 -417913 -1280031 -2883875
9566 -2883875 -3095846 -1706879 -528933 -372049 371828 2851057 5120791 4516695 1635799
9557 1635799 -463125 -574650 -421153 -1409170 -2663659 -2792471 -1714068 -198449 862338
9548 862338 513263 -1244288 -2388917 -822781 2356916 3724595 2153215 172096 -102485
9539 -102485 286552 -125936 -529880 -190813 -1052501 -4731843 -8391094 -7340935 -1553351
9530 -1553351 3839862 5093558 3803055 3214613 3555655 3173708 2168363 2027608 2475755
9521 2475755 1431639 -1632668 -4395399 -4530464 -2455987 -416546 181768 -292207 -706926
$$ packed form
9584d424297J907925o84728j490605J088630L466525K501716m2418q12087O7114
9575A577775k0717j691395k777074j617347Q00464K129501J180880q62118j603844
9566b883875k11971J388967J177946J56884P43877K479229K269734o04096k880896
9557A635799k098924j11525J53497r88017j254489j28812J078403J515619J060787
9548H62338l49075j757551j144629J566136L179697J367679j571380j981119k74581
9539a02485L89037m12488m03944L39067q61688l679342l659251J050159N787584
9530a553351N393213J253696j290503n88442L41042l81947j005345j40755M48147
9521B475755j044116l064307k762731j35065K074477K039441N98314m73975m14719
$$ plain form
9512 -706926 -359649 416583 433174 -986486 -2630254 -2469515 -541332 773644 366299
9503 366299 437135 2892044 5345439 3903551 -705951 -3515479 -2325412 -528979 -1406578
9494 -1406578 -3311688 -3258255 -2173914 -2852430 -4729702 -4836200 -2931930 -1554952 -1223337
9485 -1223337 254323 3122339 4301550 2107136 -942242 -1835809 -924477 -228820 -254630
9476 -254630 -478157 -1026650 -1867720 -1934980 -856790 -13949 -252004 -304579 730691 1340735
9466 1340735 288406 -563361 1030353 3597236 3728986 1107649 -1391902 -2125481 -2025133
9457 -2025133 -1682600 -382532 1536164 2413378 2107453 2310528 3211086 2712399 175296
9448 175296 -1873192 -1458085 -111809 -135275 -1027554 -860912 473728 1657893 2232446
$$ packed form
9512g06926L47277P76232J6591j419660j643768J60739J928183J314976m07345
9503C66299P0836K454909K453395j441888m609502k809528J190067J796433q77599
9494a406578j905110N3433J084341o78516j877272j06498J904270J376978L31615
9485a223337J477660K868016J179211k194414l049378q93567R11332O95657k5810
9476b54630k23527n48493q41070o7260J078190Q42841k38055n2575J035270O10044
9466A340735j052329q51767J593714K566883J31750k621337k499551p33579J00348
9457b025133L42533J300068J918696Q77214l05925K03075R00558m98687k537103
9448A75296k048488M15107J346276k3466q92279J66642J334640J184165N74553
$$ plain form
9439 2232446 2288306 1079601 -1684883 -4031043 -3631627 -1129953 591380 172511 -1181186
9430 -1181186 -2079326 -2226315 -1426600 494765 2509170 3048420 2175275 1337334 812897
9421 812897 -529807 -2532704 -3140089 -1535969 153420 -286925 -2266365 -3903168 -4949061
9412 -4949061 -6254032 -7269479 -6272443 -3024431 465419 2147191 1850338 841634 346487
9403 346487 685152 1207230 920264 -415410 -1880149 -2413141 -1939655 -1055633 -68240
9394 -68240 928688 1419401 872779 -296731 -1077184 -1231998 -1467927 -2085090 -2414633 -2067155
9384 -2067155 -1868580 -2688912 -3822665 -3592784 -1615140 449183 783435 -634876 -2504709
9375 -2504709 -3983328 -5147472 -6106119 -6809005 -7671717 -9080177 -10003067 -8605019 -5069610
$$ packed form
9439B232446N5860j208705k764484k346160L99416K501674J721333m18869j353697
9430a181186q98140j46989P99715J921365K014405N39250q73145q37941n24437
9421H12897j342704k002897o07385J604120J689389m40345j979440j636803j045893
9412d949061j304971j015447R97036L248012L489850J681772k96853j008704m95147
9403C46487L38665N22078k86966j335674j464739n32992M73486Q84022R87393
9394f8240R96928M90713n46622j169510p80453j54814k35929o17163l29543L47478
9384b067155J98575q20332j133753K29881J977644K064323L34252j418311j869833
9375b504709j478619j164144r58647p02886q62712j408460r22890J398048L535409
$$ plain form
9366 -5069610 -2372527 -2861313 -5144164 -6008397 -4575060 -2616265 -1325844 -122883 1230570
9357 1230570 1647528 623041 -675716 -1108214 -951716 -939872 -1315949 -2394220 -4485952
9348 -4485952 -6616384 -7018291 -5729708 -4949051 -5828356 -6754449 -6029301 -4364228 -3178182
9339 -3178182 -2228173 -751862 644306 1193744 1608747 2531340 2837839 1644023 444917
9330 444917 744584 1069666 -650472 -2990418 -2858502 -738692 -232178 -2257298 -3597027
9321 -3597027 -2180848 -290753 -883335 -3549860 -5986975 -7283007 -7904561 -8084666 -7860380
9312 -7860380 -7486893 -6682902 -4702620 -1923833 142654 1095569 2096962 3338605 3172251
9303 3172251 918828 -1552883 -2506072 -2613820 -2933995 -2633490 -865510 745342 -2334
$$ packed form
9366e069610K697083m88786k282851q64233J433337J958795J290421J202961J353453
9357A230570M16958j024487j298757m32498J56498J1844l76077j078271k091732
9348d485952k130432m01907J288583P80657q79305r26093P25148J665073J186046
9339c178182R50009J476311J396168N49438M15003R22593L06499j193816j199106
9330D44917K99667L25082j720138k339946J31916K119810N06514k025120j339729
9321c597027J416179J890095n92582k666525k437115j296032o21554j80105K24286
9312g860380L73487Q03991J980282K778787K066487R52915J001393J241643j66354
9303C172251k253423k471711r53189j07748l20175L00505J767980J610852p47676
$$ plain form
9294 -2334 -2469943 -3972858 -3408906 -2017960 -937908 -50885 748632 908047 223927
9285 223927 -598641 -683359 228691 1547926 2094587 1247269 160333 748177 2898584
9276 2898584 4066912 2536000 -376820 -2484939 -3471411 -3915467 -3230327 -769191 2076061
9267 2076061 3160088 2379833 1217931 167069 -1310329 -2869360 -3613771 -3957987 -4809727
9258 -4809727 -5136966 -2976889 890223 2960492 1587583 -744923 -955847 726976 1889608
9249 1889608 1556577 988781 1484776 2809183 3802221 3742180 2882235 1823981 592161
9240 592161 -1148284 -2786205 -2709461 -509145 1702866 1695794 231169 -37640 1511601
9231 1511601 2724430 2071908 703420 295885 612291 407626 -390972 -630242 456579
$$ packed form
9294b334k467609j502915N63952J390946J080052Q87023P99517J59415o84120
9285B23927q22568q4718R12050J319235N46661q47318j086936N87844K150407
9276B898584J168328j530912k912820k108119r86472m44056O85140K461136K845252
9267B076061J084027p80255j161902j050862j477398j559031p44411l44216q51740
9258d809727l27239K160077L867112K070269j372909k332506k10924J682823J162632
9249A889608l33031n67796M95995J324407R93038o0041q59945j058254j231820
9240E92161j740445j637921P6744K200316K212011p072j464625k68809J549241
9231A511601J212829o52522j368488m07535L16406k04665p98598k39270J086821
$$ plain form
9222 456579 2307618 3411688 2504678 -89747 -2489442 -3381754 -3649857 -4694312 -5822596
9213 -5822596 -5277220 -3550197 -3159246 -4727693 -5871813 -4946490 -3358959 -2680992 -1917660
9204 -1917660 172608 2014323 1179831 -1704497 -3674777 -3524608 -2690840 -2138037 -805471
9195 -805471 2116426 5096771 5584417 2811272 -1306366 -3922895 -3933230 -2955896 -3250491
9186 -3250491 -4758071 -5307090 -3927776 -2290386 -2066785 -2712503 -3182287 -3873664 -4901276
9177 -4901276 -4371141 -1153619 2043153 1677220 -1284673 -2525962 -695298 1151431 928276
9168 928276 521251 1938908 3775419 3623329 1535343 -950681 -3135254 -4615841 -4466476
9159 -4466476 -2936217 -2110016 -2993590 -3869166 -3411407 -3104382 -4189149 -4703769 -2721681
$$ packed form
9222D56579J851039J104070r07010k594425k399695q92312k68103j044455j128284
9213e822596N45376J727023L90951j568447j144120R25323J587531O77967P63332
9204a917660K090268J841715q34492k884328j970280J50169Q33768N52803J332566
9195h05471K921897K980345M87646k773145m117638k616529j0335R77334k94595
9186c250491j507580n49019J379314J637390K23601o45718m69784o91377j027612
9177d901276N30135L217522L196772l65933k961893j241289J830664J846729k23155
9168I28276m07025J417657J836511j52090k087986k486024k184573j480587J49365
9159d466476J530259Q26201q83574q75576M57759L07025j084767n14620J982088
$$ plain form
9150 -2721681 -343917 -666327 -2460556 -2165006 -67163 244296 -1698486 -2316377 -90349
9141 -90349 2189851 2555860 2611936 3309083 2553183 -296625 -1801916 237763 2557561
9132 2557561 1558540 -525578 640722 3949088 4459278 1538264 -139743 1847803 4101734
9123 4101734 2976371 -244884 -1958644 -1201000 320602 1351726 2135036 3146325 4151007
9114 4151007 4252055 2628089 -162331 -1976671 -1403728 181193 460687 -525510 -1032723
9105 -1032723 -993532 -1930112 -3534224 -3610438 -2166491 -2181679 -4722739 -6450355 -4391569
9096 -4391569 -663799 512708 -1158716 -2165585 -613815 1422824 1249556 -928001
9088 -928001 -2576868 -1763877 1058974 3691007 4365365 3290934 1779133 278546 -1584990
$$ packed form
9150b721681K377764l22410j794229K95550K097843L11459j942782o17891K226028
9141i0349K280200L66009N6076O97147p55900k849808j505291K039679K319798
9132B557561r99021k084118J166300L308366N10190k921014j678007J987546K253931
9123D101734j125363l221255j713760P57644J521602J031124P83310J011289J004682
9114D151007J01048j623966k790420j814340N72943J584921K79494r86197n07213
9105a032723L9191r36580j604112p6214J443947j5188k541060j727616K058786
9096d391569L727770J176507j671424j006869J551770K036639j73268k177557
9088i28001j648867Q12991K822851K632033O74358j074431j511801j500587j863536
$$ plain form
9079 -1584990 -3253110 -3350956 -1932497 -652853 21134 1622098 4541411 6357378 5133585
9070 5133585 2426120 824402 186075 -1191954 -3050299 -3675528 -3134583 -3131535 -3886286
9061 -3886286 -3797334 -2305340 -740332 -61656 162511 255136 -142224 -844140 -1113751 -1109085
9051 -1109085 -1614696 -2283533 -2120097 -1815147 -3217286 -5844292 -6381943 -3065414 1345103
9042 1345103 2711550 416190 -2574215 -3751944 -3413983 -3011924 -2645137 -1110984 1809139
9033 1809139 4075672 3422691 585196 -1065847 -20030 887920 -1598902 -6010199 -7675951
9024 -7675951 -5024081 -1358995 35735 -423729 -884242 -1095716 -1396523 -1097278 -122500
9015 -122500 -327876 -2667341 -4583526 -3079117 579583 2321144 1132577 225874 1752685
$$ packed form
9079a584990j668120r7846J418459J279644O73987J600964K919313J815967j223793
9070E133585k707465j601718o38327j378029j858345o25229N40945L048p54751
9061c886286Q8952J491994J565008O78676K24167R2625l97360p01916k69611M666
9051a109085n05611o68837J63436L04950j402139k627006n37651L316529M410517
9042A345103J366447k295360k990405j177729L37961M02059L66787J534153K920123
9033A809139K266533o52981k837495j651043J045817R07950k486822m411297j665752
9024g675951K651870L665086J394730m59464m60513k11474l00807K99245R74778
9015a22500k05376k339465j916185J504409L658700J741561j188567r06703J526811
$$ plain form
9006 1752685 3490518 2560893 164041 73787 3318967 6736305 6955202 4082375 841249
8997 841249 -693460 -587401 -25336 55355 -660932 -1961386 -3157423 -3477895 -2825990
8988 -2825990 -1962544 -1647952 -1772216 -1647226 -1059984 -692438 -1378715 -3004131 -4188812
8979 -4188812 -3310150 -232048 3103682 4465576 3794607 3068290 3475040 3862900 2733751
8970 2733751 581423 -1075369 -2034925 -3015320 -3503777 -2202242 287655 1477413 412989
8961 412989 -938074 -778379 21124 72664 232790 1836647 3404490 2097084 -1629260
8952 -1629260 -3722013 -1790132 1682094 2825806 1265009 -375154 -597899 -422705 -1000895
8943 -1000895 -1982904 -2662079 -3082565 -3274835 -2648596 -1081132 224882 -76138 -1844089
$$ packed form
9006A752685J737833r29625k396852r0254L245180L417338K18897k872827l241126
8997H41249j534709J06059N62065Q0691p16287j300454j196037l20472O51905
8988b825990Q63446L14592j24264J24990N87242L67546o86277j625416j184681
8979d188812Q78662L078102L335730J361894o70969p26317M06750L87860j129149
8970B733751k152328j656792r59556r80395m88457J301535K489897J189758j064424
8961D12989j351063J59695P99503N1540J60126J603857J567843j307406l726344
8952a629260k092753J931881L472226J143712j560797j640163k22745J75194n78190
8943a000895r82009o79175m20486j92270O26239J567464J306014l01020j767951
$$ plain form
8934 -1844089 -3648608 -4209137 -3190814 -1115392 979596 2292596 3092828 4129015 4860565
8925 4860565 3519282 -107985 -3300856 -3537338 -2125338 -2541267 -5396818 -7403661 -5875128
8916 -5875128 -2212866 152984 -179506 -1790578 -2755664 -2619842 -2382009 -3039920 -4018993
8907 -4018993 -3418954 -623265 2020182 1803082 -409905 -1097045 866630 2618002 1641998
8898 1641998 -861191 -2475026 -3108698 -3921978 -4494892 -3497755 -1132485 1245927 3139339
8889 3139339 4612787 4834821 2992212 152289 -1727671 -2355539 -3004382 -4211631 -5199643
8880 -5199643 -5331396 -4691013 -3479181 -2075010 -1250566 -1149614 -737126 490911 1173635
8871 1173635 -19041 -2081688 -2980263 -2402131 -1382093 -97015 1820464 3437202 3299162
$$ packed form
8934a844089j804519n60529J018323K075422K094988J313000Q00232J036187P31550
8925D860565j341283l627267l192871k36482J412000m15929k855551k006843J528533
8916e875128L662262K365850l32490j611072r65086J35822K37833o57911r79073
8907d018993O00039K795689K643447k17100k212987o87140J963675J751372r76004
8898A641998k503189j613835o33672q13280n72914R97137K365270K378412J893412
8889C139339J473448K22034j842609k839923j879960o27868o48843j207249r88012
8880e199643j31753O40383J211832J404171Q24444J00952M12488J228037O82724
8871A173635j192676k062647q98575N78132J020038J285078J917479J616738j38040
$$ plain form
8862 3299162 1792419 680872 547188 606803 644103 1047693 1259046 319059 -1290905
8853 -1290905 -2380424 -3157862 -4372406 -4943222 -3187799 -170150 1154806 310606 -205980
8844 -205980 694379 945848 -903778 -2998174 -2881531 -721115 1821817 4115017 6171989
8835 6171989 7042706 5421202 1529879 -2581147 -4543014 -3472054 -861037 553568
8827 553568 -395486 -2113312 -2763363 -2891188 -3876497 -4906108 -3947251 -1181774 1127697
8818 1127697 2005157 2435277 2742932 1998059 337429 -625477 -202015 660438 1260732
8809 1260732 1649246 1290234 -522646 -2908119 -4146640 -3917770 -2859585 -953898 1188196
8800 1188196 1075853 -2173936 -4761346 -2909525 919129 1669046 94903 1055305 4088071
$$ packed form
8862C299162j506743j111547j33684N9615L7300M03590K11353r39987j609964
8853a290905j089519p77438j214544n70816J755423L017649J324956q44200n16586
8844b05980R00359K51469j849626k094396J16643K160416K542932K293200K056972
8835F171989Q70717j621504l891323m111026j961867J070960K611017J414605
8827E53568r49054j717826o50051j27825r85309j029611R58857K765477K309471
8818A127697Q77460M30120L07655p44873j660630r62906M23462Q62453O00294
8809A260732L88514l59012j812880k385473j238521K28870J058185J905687K142094
8800A188196j12343l249789k587410J851821L828654P49917j574143R60402L032766
$$ plain form
8791 4088071 3415161 -1712535 -4820318 -2882411 -1189559 -3676016 -6075587 -4016371
8783 -4016371 -1017651 -1964451 -4403617 -3477916 -877363 -1343046 -3755569 -3333816 -318976
8774 -318976 888713 -351047 -859063 -383417 -1584881 -3770154 -3163422 391787 2839784
8765 2839784 2335808 944479 -236058 -2350183 -4829195 -5286687 -3971488 -3621382 -4420597
8756 -4420597 -3727143 -1213865 398484 226519 221658 794699 125490 -1543105 -1613662 125975
8746 125975 1108918 1031670 2428422 5293822 6186387 4073002 2177572 2424188 2830624
8737 2830624 2123917 2067048 3205227 3183684 1611999 1742805 4599962 6181749 3675175
8728 3675175 23420 -1156586 -1048849 -2249928 -3687992 -3033815 -1095679 113995 940876
$$ packed form
8791D088071o72910n127696l107783J937907J692852k486457k399571K059216
8783d016371K998720r46800k439166R25701K600553m65683k412523M21753L014840
8774c18976J207689j239760n08016M75646j201464k185273O06732L555209K447997
8765B839784n03976j391329j180537k114125k479012m57492J315199L50106p99215
8756d420597O93454K513278J612349j71965m861N73041o69209j668595p0557J739637
8746A25975R82943p7248J396752K865400Q92565k113385j895430K46616M06436
8737B830624p06707n6869J138179k1543j571685J30806K857157J581787k506574
8728C675175l651755j180006J07737j201079j438064O54177J938136J209674Q26881
$$ plain form
8719 940876 2061025 1750701 -959823 -3124822 -1969995 295491 -2978 -1861063 -1493251
8710 -1493251 1283067 3139927 2637986 1209336 -440751 -2679609 -4220792 -3236004 -1075426
8701 -1075426 -931707 -2684233 -2927194 -552182 1505539 1083485 -55282 620467 2745230
8692 2745230 4130955 3641451 1769719 -209863 -873320 234286 1613891 1245767 -760362
8683 -760362 -2349784 -2420344 -1890428 -1704151 -1557915 -1090014 -730259 -742363 -734378 -640161
8673 -640161 -993996 -1803993 -2307385 -2253010 -2355039 -3107083 -4113597 -4831954 -5021009 -4383739
8663 -4383739 -2891375 -1551602 -1592401 -2677615 -3239796 -2848963 -2769883 -3638603 -4177289
8654 -4177289 -3269580 -2020651 -2340990 -4235941 -5906325 -6162405 -5409287 -4346950 -3026239
$$ packed form
8719I40876J120149l10324k710524k164999J154827K265486k98469j858085L67812
8710a493251K776318J856860n01941j428650j650087k238858j541183R84788K160578
8701a075426J43719j752526k42961K375012K057721m22054j138767O75749K124763
8692B745230J385725m89504j871732j979582o63457J107606J379605l68124k006129
8683g60362j589422p0560N29916J86277J46236M67901L59755j2104P985R4217
8673f40161l53835q09997n03392N4375j02029p52044j006514p18357j89055O37270
8663d383739J492364J339773m0799j085214n62181L90833P9080q68720n38686
8654d177289R07709J248929l20339j894951j670384k56080P53118J062337J320711
$$ plain form
8645 -3026239 -1511850 -399657 -104947 -378602 -1010541 -2177900 -3400126 -3115385 -630173
8636 -630173 2064910 2165775 -175754 -1721460 -358145 2285137 3445554 2818040 2044006
8627 2044006 1964816 2234124 2702940 3198988 2587809 130953 -2588103 -3134180 -1435290
8618 -1435290 371975 1003802 833971 -40580 -2001235 -4062599 -4433043 -3394397 -3137659
8609 -3137659 -4165917 -4448767 -2906287 -994377 239781 1819693 4037903 4822577 3033008
8600 3033008 1029792 1571415 3961406 5497046 5069085 3198040 305983 -2626341 -3390219
8591 -3390219 -1297812 783551 79252 -1543939 29381 4763022 7951474 6477344
8583 6477344 2471608 -314072 -1200686 -2004372 -3494010 -4440529 -3810166 -2416693 -1854747
$$ packed form
8645c026239J514389J112193K94710k73655o31939j167359j222226K84741K485212
8636f30173K695083J00865k341529j545706J363315K643282J160417o27514p74034
8627B044006p9190K69308M68816M96048o11179k456856k719056n46077J698890
8618a435290J807265O31827j69831q74551j960655k061364l70444J038646K56738
8609c137659j028258k82850J542480J911910J234158J579912K218210P84674j789569
8600C033008k003216N41623K389991J535640m27961j871045k892057k932324p63878
8591c390219K092407K081363p04299j623191J573320M733641L188452j474130
8583F477344m005736k785680q86614q03686j489638r46519O30363J393473N61946
$$ plain form
8574 -1854747 -2321024 -2350122 -1070652 163543 -377362 -1899467 -1985507 -404751 364047
8565 364047 -857117 -1909689 -670334 1842839 3512929 4104074 4098893 2674730 -530128
8556 -530128 -3336152 -3573815 -2431746 -2451281 -3404777 -3197936 -1814613 -1013200 -761203
8547 -761203 517765 2375730 2572173 1094018 516517 1771043 2791491 2184198 1129577
8538 1129577 623099 -108046 -1137924 -756133 1498680 3366157 3193097 2257975 1929677
8529 1929677 1105304 -1146551 -2800791 -1765303 204428 -160667 -2439997 -3168150 -1392989
8520 -1392989 -34539 -1079798 -2725873 -2818261 -2348757 -3170566 -4114326 -2351242 1908191
8511 1908191 4883606 3956098 795786 -1277680 -1369735 -958251 -951840 -739579 91717 847431
$$ packed form
8574a854747m66277k9098J279470J234195n40905j522105q6040J580756P68798
8565C64047j221164j052572J239355K513173J670090N91145n181j424163l204858
8556e30128k806024k37663J142069j9535r53496K06841J383323Q01413K51997
8547g61203J278968J857965J96443j478155n77501J254526J020448o07293j054621
8538A129577n06478p31145j029878L81791K254813J867477j73060r35122l28298
8529A929677q24373k251855j654240J035488J969731l65095k279330p28153J775161
8520a392989J358450j045259j646075r2388M69504q21809r43760J763084M259433
8511A908191K975415r27508l160312k073466r2055M11484O411K12261Q31296P55714
$$ plain form
8501 847431 932184 795318 1148298 1924856 2361073 1735549 89648 -1447845 -1567951 -584857
8491 -584857 -426151 -1812942 -2669634 -1078551 1385702 1791728 491461 497220 2469200
8482 2469200 3835346 3304370 2561977 2490707 1501673 -795483 -2064417 -1506227 -1918048
8473 -1918048 -4841101 -7270833 -6405015 -4292496 -4114920 -4991517 -4518720 -3488786 -3542802
8464 -3542802 -2894153 436289 3407827 1709682 -2822020 -4462244 -2315716 -675678
8456 -675678 -1114062 -727801 1152972 991169 -2504144 -5595912 -5295713 -3105800 -1231788
8447 -1231788 158121 264778 -2586857 -6447150 -6213216 -1170721 2997595 2577067 995898
8438 995898 2205508 4143347 3306683 1311926 1699620 3640771 3993802 2957127 2759104
$$ packed form
8501H47431Q4753j36866L52980P76558M36217o25524j645901j537493j20106R83094
8491e84857J58706j386791q56692J591083K464253M06026j300267N759J971980
8482B469200J366146n30976p42393p1270r89034k297156j268934N58190m11821
8473a918048k923053k429732Q65818K112519J77576q76597M72797J029934n4016
8464c542802O48649L330442K971538j698145m531702j640224K146528J640038
8456f75678m38384L86261J880773j61803l495313l091768L00199K189913J874012
8447a231788J389909J06657k851635l860293K33934N042495M168316m20528j581169
8438I95898J209610J937839q36664j994757L87694J941151L53031j036675j98023
$$ plain form
8429 2759104 2961165 1774055 110173 -165232 -164740 -1714862 -3003245 -1157901 2381114
8420 2381114 3871407 3399565 4048608 5788530 5378529 2318693 -30903 42294 213864
8411 213864 -1761195 -4933674 -6967952 -6369373 -2823919 1987382 4377397 2522529 -316597
8402 -316597 162661 2921909 3291078 358815 -2089370 -1993165 -1363114 -1525408 -1042940
8393 -1042940 252972 -78137 -2569099 -4388908 -4314248 -4706216 -6332012 -5964276 -2243407
8384 -2243407 589289 -1139458 -4419040 -4220155 -1266612 -48261 -1142272 -1028574 1165622
8375 1165622 2158723 456282 -871704 788111 3228801 2552721 -1295798 -4502860 -4163485
8366 -4163485 -1241153 1349702 2312932 2669436 3217334 2786870 208893 -2923054 -3576265
$$ packed form
8429B759104K02061j187110j663882k75405M92j550122j288383J845344L539015
8420B381114J490293m71842O49043J739922m10001l059836k349596P3197J71570
8411B13864j975059l172479k034278N98579L545454M811301K390015j854868k839126
8402c16597M79258K759248L69169k932263k448185R6205O30051j62294M82468
8393a042940J295912l31109k490962j819809P4660l91968j625796L67736L720869
8384b243407K832696j728747l279582J98885K953543J218351j094011J13698K194196
8375A165622R93101j702441j327986J659815K440690o76080l848519l207062L39375
8366d163485K922332K590855R63230L56504N47898m30464k577977l131947o53211
$$ plain form
8357 -3576265 -1423550 537804 198466 -954933 -479663 1644666 3773877 5050187 5438978
8348 5438978 4727030 3155214 1895917 1472836 941539 -115996 -435296 602027 1390050
8339 1390050 755743 234344 1375038 2746356 2455775 1778801 2790287 3889846 1896128
8330 1896128 -2060027 -3284165 -524800 2175196 1844505 665382 1594612 3424228 3096801
8321 3096801 589862 -1432035 -1464011 -205613 1285453 2349766 2244525 699095 -1338523
8312 -1338523 -2694208 -3221190 -3184362 -2292441 -496815 1050119 1116155 -27159 -1148493
8303 -1148493 -1608347 -1388296 -202253 2221523 5173235 7186764 7262746 5533986 3003589
8294 3003589 824074 -584581 -1705847 -2699096 -2521587 -532570 1570647 1501851 -1390
$$ packed form
8357c576265K152715J961354l39338j153399M75270K124329K129211J276310L88791
8348E438978p11948j571816j259297m23081n31297j057535l19300J037323P88023
8339A390050o34307n21399J140694J371318k90581o76974J011486J099559j993718
8330A896128l956155j224138K759365K699996l30691j179123R29230J829616l27427
8321C096801k506939k021897l1976J258398J491066J064313j05241j545430k037618
8312a338523j355685n26982L6828Q91921J795626J546934O6036j143314j121334
8303a148493m59854K20051J186043K423776K951712K013529P5982j728760k530397
8294C003589k179515j408655j121266r93249J77509J989017K103217o8796j503241
$$ plain form
8285 -1390 62346 2045692 2579934 -85240 -2802632 -2191941 36295 -107919 -2483341
8276 -2483341 -3180667 -737559 1827160 1607316 -766097 -3136562 -4560289 -4889257 -3760612
8267 -3760612 -1327843 1323183 3303746 4424068 4411783 3087581 1451380 894490 1045722
8258 1045722 131926 -2177072 -4072446 -4154036 -2830350 -751804 2074048 4859749 5816062
8249 5816062 4442842 2272543 384116 -1843486 -4340841 -4971818 -2510615 714836
8241 714836 1449400 -229609 -1421118 -520369 1260798 2298985 2557914 2790587 3067403
8232 3067403 2773797 1602165 172740 -434325 22732 365293 -566207 -2044442 -2109453
8223 -2109453 -177557 2174126 3220217 2700548 1333500 103903 96057 1412644 2229060
$$ packed form
8285a390O3736J983346N34242k665174k717392O10691K228236j44214k375422
8276b483341o97326K443108K564719k19844k373413k370465j423727l28968J128645
8267c760612K432769K651026J980563J120322j2285j324202j636201n56890J51232
8258A045722r13796k308998j895374q1590J323686K078546K825852K785701R56313
8249E816062j373220k170299j888427k227602k497355o30977K461203L225451
8241G14836P34564j679009j191509R00749J781167J038187K58929K32673K76816
8232C067403k93606j171632j429425o07065M57057L42561r31500j478235o5011
8223b109453J931896K351683J046091n19669j367048j229597p846J316587Q16416
$$ plain form
8214 2229060 881734 -1082191 -465576 2619802 4346327 2633085 -193196 -1618980
8206 -1618980 -2370084 -3474130 -3398883 -1172141 668294 -232886 -2009769 -1979867 -1533022
8197 -1533022 -3225729 -5284567 -4326180 -2116788 -3578574 -8149329 -9332636 -4334316
8189 -4334316 1408346 1942933 -1449321 -3473143 -2429287 -1010591 -1446356 -3105981 -4259885
8180 -4259885 -4064393 -2984517 -2199709 -2179074 -1806997 -19837 2040407 2340910 1092850
8171 1092850 181616 -329903 -2119561 -4730943 -5152852 -2383105 623665 989316 -763824
8162 -763824 -2718074 -4170240 -4810789 -3993203 -2415430 -2028222 -2824576 -2339494 271321
8153 271321 2551215 2605143 1426486 -249139 -3576123 -7707677 -8390741 -3975206 746387
$$ packed form
8214B229060j347326j963925O16615L085378J726525j713242k826281j425784
8206a618980p51104j104046P5247K226742J840435r01180j776883K9902M46845
8197a533022j692707k058838R58387K209392j461786m570755j183307M998320
8189d334316N742662N34587l392254k023822J043856J418696m35765j659625j153904
8180d259885J95492J079876P84808K0635L72077J787160K060244L00503j248060
8171A092850r11234n11519j789658k611382m21909K769747L006770L65651j753140
8162g63824j954250j452166o40549Q17586J577773L87208p96354M85082K610815
8153B71321K279894N3928j178657j675625l326984m131554o83064M415535M721593
$$ plain form
8144 746387 793841 -2014028 -2803969 -1492235 -1551552 -2978649 -2453055 134045 1049440
8135 1049440 -961571 -2803312 -2426918 -1555362 -1715658 -1672969 -525172 171063 -738051
8126 -738051 -1863143 -1700427 -758332 156505 1401343 2902571 3416131 2745903 2491622
8117 2491622 3225819 3131295 994527 -1468191 -1957403 -573919 1084815 2186720 2455136
8108 2455136 1255570 -1308340 -3494738 -3770904 -2798234 -2343625 -3057202 -4353741 -5393125
8099 -5393125 -5006109 -1895767 3440027 7819441 8212077 5261700 2561039 2445168 3738012
8090 3738012 3878022 2219127 542440 641091 2097577 2905492 2108345 942443 860021
8081 860021 1347927 886316 -525863 -1377822 -1043189 -515603 -549112 -769686 -1198683 -2914461
$$ packed form
8144G46387M7454k807869p89941J311734n9317j427097N25594K587100R15395
8135A049440k011011j841741L76394Q71556j60296M2689J147797O96235r09114
8126g38051j125092J62716R42095R14837J244838J501228N13560o70228k54281
8117B491622P34197r4524k136768k462718m89212J383484J658734J101905K68416
8108B455136j199566k563910k186398k76166R72670M54609p13577j296539j039384
8099e393125L87016L110342N335794M379414L92636k950377k700661j15871J292844
8090C738012J40010j658895j676687R8651J456486Q07915p97147j165902q2422
8081H60021M87906m61611j412179q51959L34633N27586l3509k20574m28997j715778
$$ plain form
8071 -2914461 -6028954 -8336191 -7557644 -4368324 -1745675 -1337657 -1681332 -532796 1793347
8062 1793347 2475545 -161368 -3980857 -5217906 -3040131 -279526 729887 1027791 2524528
8053 2524528 4611889 5398142 4880463 4330560 3503036 1343537 -1015901 -1129496 721399
8044 721399 1438416 -283207 -2182160 -2302401 -1800907 -2307077 -2903308 -1753803 878308
8035 878308 3059423 3581196 2717815 1618902 1667590 3142512 4127054 2552565 -391734
8026 -391734 -1409839 -231194 -301119 -2886302 -4193992 -1194807 2936154 3123560 -91998
8017 -91998 -1748343 23261 2248563 2723626 2906956 4216490 5275431 4675882 3638321
8008 3638321 3805776 4336795 3291358 770487 -1130461 -971887 725324 2542372 3579145
$$ packed form
8071b914461l114493k307237P78547L189320K622649M08018l43675J148536K326143
8062A793347O82198k636913l819489j237049K177775K760605J009413K97904J496737
8053B524528K087361P86253n17679n49903q27524k159499k359438j13595J850895
8044G21399P17017j721623j898953j20241N01494n06170n96231J149505K632111
8035H78308K181115N21773q63381j098913M8688J474922R84542j574489k944299
8026c91734j018105J178645o9925k585183j307690K999185M130961J87406l215558
8017i1998j656345J771604K225302M75063J83330J309534J058941n99549j037561
8008C638321J67455N31019j045437k520871j900948J58574J697211J817048J036773
$$ plain form
7999 3579145 3841641 3752827 3448011 2677448 1529987 809433 1182107 2341413 3559651
7990 3559651 4496304 4761885 3503099 627868 -2126287 -2720193 -1123523 1101121 3049958
7981 3049958 4822580 5962758 5357565 2929278 47810 -1933580 -2427333 -1130344 1655155
7972 1655155 4248024 4778317 3335052 1498229 -107267 -1923341 -3273506 -2614870 -576595
7963 -576595 -153088 -2575678 -5217662 -5154443 -2783256 -183322 2045874 4031043 4528188
7954 4528188 2502986 -180513 -619291 923302 1434506 -265705 -2140380 -2527045 -2355853
7945 -2355853 -2811581 -3254562 -2878944 -2343082 -2064286 -715961 2480708 5303130 4817387
7936 4817387 1622278 -504970 613530 3017739 3424241 1167936 -1484733 -2140633 -627905
$$ packed form
7999C579145K62496q8814l04816p70563j147461p20554L72674J159306J218238
7990C559651R36653K65581j258786k875231k754155n93906J596670K224644J948837
7981C049958J772622J140178o05193k428287k881468j981390m93753J296989K785499
7972A655155K592869N30293j443265j836823j605496j816074j350165O58636K038275
7963e76595M23507k422590k641984O3219K371187K599934K229196J985169M97145
7954D528188k025202k683499m38778J542593N11204j700211j874675l86665J71192
7945b355853m55728m42981L75618N35862K78796J348325L196669K822422m85743
7936D817387l195109k127248J118500K404209M06502k256305k652669o55900J512728
$$ plain form
7927 -627905 1226523 1792090 1432785 1712443 2828325 3008122 1256969 -611525 -336257
7918 -336257 1359452 1907219 971533 698581 1718165 1938238 479984 -111544 2286349
7909 2286349 5582959 6119187 3514007 207716 -2518628 -5034460 -6689251 -6041152 -3826877
7900 -3826877 -2576176 -2738957 -2125548 9065 1360977 460943 -706056 -42913 1098290
7891 1098290 288780 -1827822 -2720273 -2279812 -2802269 -4759907 -5573097 -3480014 -336137
7882 -336137 901629 46512 -601395 216979 1116683 329636 -1546227 -2090212 -171045
7873 -171045 2557195 3785628 3247853 2214421 1045536 -924767 -3074050 -3231301 -751004
7864 -751004 1869958 1944147 -62638 -1765760 -2418354 -3193183 -4335987 -4279226 -2138989
$$ packed form
7927f27905J854428N65567l59305K79658J115882J79797j751153j868494K75268
7918c36257J695709N47767r35686k72952J019584K20073j458254n91528K397893
7909B286349L296610N36228k605180l306291k726344k515832j654791O48099K214275
7900c826877J250701j62781O13409K134613J351912r00034j166999O63143J141203
7891A098290q09510k116602q92451M40461n22457j957638q13190K093083L143877
7882c36137J237766q55117o47907Q18374Q99704p87047j875863n43985J919167
7873a71045K728240J228433n37775j033432j168885j970303k149283j57251K480297
7864g51004K620962P4189k006785j703122o52594p74829j142804N6761K140237
$$ plain form
7855 -2138989 540451 1500836 381691 -1152450 -1420312 -266572 1164488 1708108 1126030
7846 1126030 -48918 -1277568 -2294943 -2829286 -2676327 -2105890 -1544692 -823037 409494
7837 409494 1447947 897259 -1326786 -3572532 -4551435 -4532956 -3864274 -2071991 443954
7828 443954 1771151 1337022 1559237 4181142 6536219 4764405 -23654 -2593854 -910973
7819 -910973 1192170 66524 -2486291 -2509892 20706 1573783 417451 -1396227 -1422894
7810 -1422894 88198 1113002 426265 -1428336 -2999209 -3294488 -2562374 -1770885 -1266181
$$ packed form
7855b138989K679440R60385j119145j534141k67862J153740J431060N43620n82078
7846A126030j174948j228650j017375n34343J52959N70437N61198P21655J232531
7837D09494J038453n50688k224045k245746r78903J8479O68682J792283K515945
7828D43954J327197m34129K22215K621905K355077j771814m788059k570200J682881
7819i10973K103143j125646k552815k3601K530598J553077j156332j813678k6667
7810a422894J511092J024804o86737j854601j570873k95279P32114P91489N04704
$$ [...]
##END NTUPLES=NMR SPECTRUM
##END=
