##TITLE=31Pdec_SR56_rm4
 , 24 sc
 11.05.2021
##JCAMPDX= 6.0         $$ Bruker NMR JCAMP-DX V2.0
##DATA TYPE= NMR SPECTRUM
##DATA CLASS= NTUPLES
##ORIGIN= UXNMR, Bruker Analytische Messtechnik GmbH
##OWNER= root
$$ XWIN-NMR		Version 3.5
$$ Tue May 11 11:13:43 2021 Russian Standard Time (UT+4h)  she@DPX200
##.OBSERVE FREQUENCY= 81.013821
##.OBSERVE NUCLEUS= ^31P
##.ACQUISITION MODE= SIMULTANEOUS
##.ACQUISITION SCHEME= undefined
##.AVERAGES= 24
##.DIGITISER RES= 16
##SPECTROMETER/DATA SYSTEM= spect
##.PULSE SEQUENCE= zgpg30
##.SOLVENT NAME= CDCl3
##.SHIFT REFERENCE= (INTERNAL, CDCl3, 0, 248.564)
##AUDIT TRAIL= $$ (NUMBER, WHEN, WHO, WHERE, WHAT)
$$ ##TITLE= Audit trail, XWIN-NMR		Version 3.5
$$ ##JCAMPDX= 5.01
$$ ##ORIGIN= Bruker BioSpin GmbH
$$ ##OWNER= she
$$ F:/spectra/data/she/nmr/P31/1/pdata/1/auditp.txt
$$ ##AUDIT TRAIL=  $$ (NUMBER, WHEN, WHO, WHERE, WHAT)
(   1,<2021-05-11 11:11:47.09 +0400>,<she>,<DPX200>,
      <created by zg, POWCHK disabled, PULCHK disabled
       configuration hash MD5:
       00 E9 B6 7A A2 85 ED C7 34 08 36 98 17 FE 4E 26
       data hash MD5: 32K
       61 D7 61 B5 9E 6B C3 C9 FC 36 60 CD 68 03 B8 04>)
(   2,<2021-05-11 11:12:00.04 +0400>,<she>,<DPX200>,
      <Start of raw data processing
       efp BC_mod = 2 LB = 1 FT_mod = 6 PKNL = 1 PHC0 = -6211.588 PHC1 = 66.00085 SI = 64K 
       data hash MD5: 64K
       FF 05 82 D3 1A E6 A5 DA A2 83 F0 59 3E EC B6 62>)
(   3,<2021-05-11 11:13:16.40 +0400>,<she>,<DPX200>,
      <pk PHC0 = 14.72599 PHC1 = -71.20001 
       data hash MD5: 64K
       40 AA 34 35 76 09 B5 89 D8 72 18 7C 53 06 6B 21>)
(   4,<2021-05-11 11:13:19.54 +0400>,<she>,<DPX200>,
      <abs ABSG = 5 
       data hash MD5: 64K
       76 94 3C C9 48 FD A0 FE 2F 13 05 09 89 79 98 95>)
$$ ##END=
$$ 
$$ hash MD5
$$ E6 B2 C4 8B F2 69 D5 85 66 0D 81 36 C9 D9 07 81
##$RELAX= 
##$RELAX= 
##$RELAX= 
##$RELAX= 
##$RELAX= 
##$RELAX= 
##$RELAX= 
##$RELAX= 
$$ Bruker specific parameters
$$ --------------------------
##$DU= <F:/spectra>
##$EXPNO= 1
##$NAME= <P31>
##$PROCNO= 1
##$TYPE= <nmr>
##$USER= <she>
##$AMP= (0..31)
100 100 100 100 100 100 100 100 100 100 100 100 100 100 100 100 100 100 
100 100 100 100 100 100 100 100 100 100 100 100 100 100 
##$AQSEQ= 0
##$AQ_mod= 1
##$AUNM= <au_zg>
##$AUTOPOS= <>
##$BF1= 81.014009
##$BF2= 200.13
##$BF3= 200.13
##$BF4= 200.13
##$BF5= 200.13
##$BF6= 200.13
##$BF7= 200.13
##$BF8= 200.13
##$BYTORDA= 1
##$CFDGTYP= 0
##$CFRGTYP= 5
##$CHEMSTR= <none>
##$CNST= (0..31)
1 1 145 1 1 1 1 1 1 1 1 1 1 1 1 1 1 1 1 1 1 1 1 1 1 1 1 1 1 1 1 1 
##$CPDPRG= <waltz16>
##$CPDPRG1= <>
##$CPDPRG2= <waltz16>
##$CPDPRG3= <>
##$CPDPRG4= <mlev>
##$CPDPRG5= <mlev>
##$CPDPRG6= <mlev>
##$CPDPRG7= <mlev>
##$CPDPRG8= <mlev>
##$CPDPRGB= <>
##$CPDPRGT= <>
##$D= (0..31)
0 1 0 0 0 0 0 0 0 0 0 0.03 2e-05 3e-06 0 0 0 0 0 0 0 0 0 0 0 0 0 0 0 0 
0 0 
##$DATE= 1620717106
##$DBL= (0..7)
120 120 120 11 120 120 24 19 
##$DBP= (0..7)
150 150 150 150 150 150 150 150 
##$DBP07= 0
##$DBPNAM0= <>
##$DBPNAM1= <>
##$DBPNAM2= <>
$$ [...]
##$SUBNAM3= <"">
##$SUBNAM4= <"">
##$SUBNAM5= <"">
##$SUBNAM6= <"">
##$SUBNAM7= <"">
##$SUBNAM8= <"">
##$SUBNAM9= <"">
##$SW= 501.771253377433
##$SWIBOX= (0..15)
0 1 3 0 0 0 0 0 0 0 0 0 0 0 0 0 
##$SW_h= 40650.406504065
##$TD= 32768
##$TD0= 1
##$TE= 0
##$TE2= 300
##$TE3= 300
##$TEG= 300
##$TL= (0..7)
0 120 53 12 22 120 120 120 
##$TP= (0..7)
150 150 150 150 150 150 150 150 
##$TP07= 0
##$TPNAME0= <>
##$TPNAME1= <>
##$TPNAME2= <>
##$TPNAME3= <>
##$TPNAME4= <>
##$TPNAME5= <>
##$TPNAME6= <>
##$TPNAME7= <>
##$TPOAL= (0..7)
0.5 0.5 0.5 0.5 0.5 0.5 0.5 0.5 
##$TPOFFS= (0..7)
0 0 0 0 0 0 0 0 
##$TUNHIN= 0
##$TUNHOUT= 0
##$TUNXOUT= 0
##$USERA1= <user>
##$USERA2= <user>
##$USERA3= <user>
##$USERA4= <user>
##$USERA5= <user>
##$V9= 5
##$VALIST= <valist>
##$VCLIST= <CCCCCCCCCCCCCCC>
##$VD= 0
##$VDLIST= <DDDDDDDDDDDDDDD>
##$VPLIST= <PPPPPPPPPPPPPPP>
##$VTLIST= <TTTTTTTTTTTTTTT>
##$WBST= 1024
##$WBSW= 4
##$XGAIN= (0..3)
0 0 0 0 
##$XL= 0
##$YL= 0
##$YMAX_a= 12105
##$YMIN_a= -14877
##$ZGOPTNS= <>
##$ZL1= 120
##$ZL2= 120
##$ZL3= 120
##$ZL4= 120
##$ABSF1= 248.5645
##$ABSF2= -253.2056
##$ABSG= 5
##$ABSL= 3
##$ALPHA= 0
##$AQORDER= 0
##$ASSFAC= 0
##$ASSFACI= 0
##$ASSFACX= 0
##$ASSWID= 0
##$AUNMP= <proc_1d>
##$AZFE= 0.1
##$AZFW= 0.5
##$BCFW= 0
##$BC_mod= 2
##$BYTORDP= 0
##$COROFFS= 0
##$CY= -3
##$DATMOD= 1
##$DC= 0
##$DFILT= <>
##$DTYPP= 0
##$F1P= 0
##$F2P= 0
##$FCOR= 1
##$FTSIZE= 65536
##$FT_mod= 6
##$GAMMA= 0
##$GB= 0
##$INTBC= 1
##$INTSCL= 5.30512e-09
##$ISEN= 30
##$LB= 1
##$LEV0= 0
##$LPBIN= 0
##$MAXI= 10000
##$MC2= 0
##$MEAN= 0
##$ME_mod= 0
##$MI= 50
##$NCOEF= 0
##$NC_proc= -6
##$NLEV= 6
##$NOISF1= 182.463
##$NOISF2= 159.3651
##$NSP= 0
##$NTH_PI= 0
##$NZP= 0
##$OFFSET= 248.5645
##$PC= 4
##$PHC0= -6196.862
##$PHC1= -5.199165
##$PH_mod= 1
##$PKNL= yes
##$PPARMOD= 0
##$PSCAL= 0
##$PSIGN= 0
##$REVERSE= no
##$SF= 81.014009
##$SI= 65536
##$SIGF1= 159.3651
##$SIGF2= -187.1042
##$SINO= 113.3802
##$SIOLD= 16384
##$SREGLST= <1H.CDCl3>
##$SSB= 0
##$STSI= 65536
##$STSR= 0
##$SW_p= 40650.406504065
##$SYMM= 0
##$S_DEV= 0
##$TDeff= 32768
##$TDoff= 0
##$TI= <>
##$TILT= no
##$TM1= 0
##$TM2= 0
##$TOPLEV= 0
##$USERP1= <user>
##$USERP2= <user>
##$USERP3= <user>
##$USERP4= <user>
##$USERP5= <user>
##$WDW= 1
##$XDIM= 65536
##$YMAX_p= 371496663
##$YMIN_p= -21163461
$$ End of Bruker specific parameters
$$ ---------------------------------
##NTUPLES= NMR SPECTRUM
##VAR_NAME=  FREQUENCY,     SPECTRUM/REAL,   SPECTRUM/IMAG
##SYMBOL=    X,             R,               I
##VAR_TYPE=  INDEPENDENT,   DEPENDENT,       DEPENDENT
##VAR_FORM=  AFFN,          ASDF,            ASDF
##VAR_DIM=   65536,         65536,           65536
##UNITS=     HZ,            ARBITRARY UNITS, ARBITRARY UNITS
##FACTOR=    0.620285442955139, 1,           1
##FIRST=     20137.2065510759, 0,            0
##LAST=      -20513.1999529892, 0,           0
##MIN=       -20513.1999529892, -21163461,   0
##MAX=       20137.2065510759, 371496663,    0
$$ Real data points
##PAGE= N=1
##DATA TABLE= (X++(R..R)), XYDATA
$$ [...]
##PAGE= N=2
##DATA TABLE= (X++(I..I)), XYDATA
13128E956664N32541j384722o59468O29506k20059k073572k078041k52341Q82996
$$ 5956664 6489205 5104483 4445015 5074521 4854462 2780890 702849 450508 1333504
13119A333504J07389j440459k238899j542829O35309K957490L016170Q9103k951945
$$ 1333504 1440893 434 -2238465 -3781294 -3145985 -188495 2827675 2916778 -35167
13110c5167k561782Q16532L108414J941394m62834p56648R28098J641779r628
$$ -35167 -2596949 -1780417 1327997 3269391 2806557 2049909 2978007 4619786 4610158
13101D610158k244521k906218j980858o42996N73795J507221J588269P81669L08517
$$ 4610158 2365637 -540581 -2521439 -3164435 -2590640 -1083419 504850 1286519 1595036
13092A595036R11615J348738L15277j151282j276765n52893n75099q32090J30698
$$ 1595036 2506651 3855389 4170666 3019384 1742619 1189726 614627 -217463 -86765
13083h6765J051155n35958l209388k741550R29974K848884Q93710q27974P41988
$$ -86765 964390 428432 -2780956 -5522506 -4592532 -1743648 -849938 -1677912 -935924
13074i35924K381412Q05942j023406O26197K843960R10548k665075j676776K908702
$$ -935924 1445488 2251430 1228024 1854221 4698181 5608729 2943654 1266878 4175580
13065D175580L856071n43888l778761j887159P82217j99394k126474p49314K157225
$$ 4175580 8031651 7487763 3709002 1821843 2604060 2404666 278192 -471122 1686103
13056A686103K099882o85448k201484j120959K08105J68400l78898l79446Q3075
$$ 1686103 3785985 3100537 899053 -221906 -13801 154599 -224299 -603745 -520670
13047e20670N85772P60675L07199l34024k56470K36456k34745j556493j697592
$$ -520670 65102 825777 1132976 798952 542482 778938 544193 -1012300 -2709892
13038b709892Q3428J761622J547434J95809r37424j719202j756488Q6768K886993
$$ -2709892 -2626464 -864842 682592 878401 -59023 -1778225 -3534713 -3447945 -560952
13029e60952L373661P23161j436258n55496N85694j208168l529894k064301J911508
$$ -560952 2812709 3535870 2099612 1544116 2129810 921642 -2608252 -4672553 -2761045
13020b761045L207097R12961o85046M73729J319966n53641k959825l034872j314544
$$ -2761045 446052 1359013 673967 1147696 2467662 1914021 -1045804 -4080676 -5395220
13011e395220K62760J306577J886114J284242j69686n58459N12282Q63920l91504
$$ -5395220 -5132460 -3825883 -1939769 -655527 -825213 -1383672 -871390 -7470 -398974
13002c98974q86832Q09185K122402O58195j380755p83991R76807J84018k478509
$$ -398974 -1285806 -476621 1645781 2303976 923221 139230 1116037 1300055 -1178454
12993a178454k750728J10855K168855J357952K53826P87381R42640p74353j822813
$$ -1178454 -3929182 -3818327 -1649472 -291520 -37694 749687 1692327 917974 -904839
12984i04839L3260K310470J657662m83167l44447J787973K123676m83017l131751
$$ -904839 -871579 1438891 3096553 2613386 2268939 4056912 6180588 5697571 2565820
12975B565820l521150k267750m95324J350761K072046O40186j087224k14686K112860
$$ 2565820 -955330 -3223080 -3718404 -2367643 -295597 344589 -742635 -957321 1155539
12966A155539J517431k601264n106694k274591K874417N047029L308122M34857
$$ 1155539 2672970 71706 -5034988 -7309579 -4435162 611867 3919989 4354846
12958D354846j524211k045021r15008P78666N89158j616199k339170K57567K577802
$$ 4354846 2830635 785614 -129394 649272 1238430 -377769 -2716939 -2459372 118430
12949A18430R01461k241817j799574J667717L063893J087168k88226R83635J911945
$$ 118430 1019891 -1221926 -3021500 -1353783 1710110 2797278 2509052 3492687 5404632
12940E404632J37906k102007k045218o44079j25605k22351N27814J798107K165479
$$ 5404632 5542538 3440531 1395313 751234 625629 403278 931092 2729199 4894678
12931D894678J401973K55380r57456k145207k733591k173257n55625J502745K781739
$$ 4894678 6296651 6552031 5594575 3449368 715777 -1457480 -2013105 -510360 2271379
12922B271379J760620j432758l929857l081732j06984J583424J242742J066632
$$ 2271379 4031999 2599241 -1330616 -4412348 -4519332 -2935908 -1693166 -626534
12914f26534J845928J795719J98204j206475j398998j471909j840953j262529
$$ -626534 1219394 3015113 3213317 2006842 607844 -864065 -2705018 -3967547
12906c967547K20670O08838m70409q37401J36589J15056j637743k096152M77543
$$ -3967547 -3746877 -3138039 -3608448 -4445849 -4309260 -4194204 -5831947 -7928099 -7450556
12897g450556K890387J742219j172275j831838m4126J200821P68705K09559O13420
$$ -7450556 -4560169 -2817950 -3990225 -5822063 -5866189 -4665368 -3896663 -3687104 -3073684
12888c073684J622616K654579K780974Q20880k233277k940376j87708K179359
$$ -3073684 -1451068 1203511 3984485 4805365 2572088 -368288 -555996 1623363
12880A623363P91064j759611j104516J512219J370517j497136k243550N11234
$$ 1623363 2414427 654816 -449700 1062519 2433036 935900 -1307650 -796416
12872g96416K403663P95090j157585n19446M14271j109928k659613n74531L063164
$$ -796416 1607247 2402337 1244752 725306 1139577 29649 -2629964 -3204495 -141331
12863a41331K820609j511141l961686r51644L608348M093241P47884j782611j543474
$$ -141331 2679278 1168137 -2793549 -3745193 -136845 3956396 4704280 2921669 1378195
12854A378195r22133j537290j608634J00019J228527m07523k430843j041071K688798
$$ 1378195 456062 -1081228 -2689862 -2589843 -1361316 -1768839 -4199682 -5240753 -2551955
12845b551955L828779Q82029k126635j857621J6793N77340J65777M50852Q69242
$$ -2551955 1276824 2158853 32218 -1825403 -1808610 -1231270 -1065493 -614641 254601
12836B54601J02744r59998p50342J07851K19446J33981Q72965J371555L91166
$$ 254601 357345 -602653 -1352995 -1245144 -1025698 -891717 -18752 1352803 1743969
12827A743969o00793K09756J234584q2640k239296j478409J789080L052398P13312
$$ 1743969 1143176 1352932 2587516 2504876 265580 -1212829 576251 3628649 4341961
12818D341961j586978j078105L7788r95481k588970j594237J350806K707161J238386
$$ 4341961 2754983 1676878 1714666 719185 -1869785 -3464022 -2113216 593945 1832331
12809A832331o63774p47229L60831P54712K2244o71577p44316j169121k552406
$$ 1832331 1168557 421328 782159 1536871 1559115 887538 143222 -1025899 -3578305
12800c578305l105879m93214M002213N636658K205698k337290k916359k19986
$$ -3578305 -6684184 -7177398 -3175185 2461473 4667171 2329881 -586478 -806464
12792h06464R41840q92201k229686o57539J735299K242061J238132K54221n34899
$$ -806464 135376 -756825 -2986511 -3644050 -1908751 333310 1571442 1825663 1290764
12783A290764r51352J81676K432798K772641k11078l331357k898489j171J392949
$$ 1290764 339412 521088 2953886 5726527 5515449 2184092 -714397 -715568 677381
12774F77381K74745q16582m00144J49375l43962r63197p22419k24120k52610m01176
$$ 677381 952126 135544 -264600 -115225 -459187 -1422384 -2144803 -2368923 -2621533 -3022709
12764c022709r1247L78862O97986J260752K079626K050881M83128j363241j575082
$$ -3022709 -3113956 -2735094 -2037108 -776356 1303270 3354151 3837279 2474038 898956
12755H98956j65993R05146M40789m70504k95812N28378K61549j344165k333996
$$ 898956 732963 1638109 2078898 1608394 1312582 1840960 2102509 758344 -1575652
12746a575652j111728J401766K988403K658255R83178j248261l253729l640136
$$ -1575652 -2687380 -1285614 1702789 4361044 5344222 4095961 842232 -2797904
12738b797904j476395J727843K899133J135465q62361l15853J812721K217706
$$ -2797904 -4274299 -2546456 352677 1488142 625781 309928 2122649 4340355
12730D340355n7291k325306k102077m62420j47906j361836j516835O92377L046424
$$ 4340355 4283064 1957758 -144319 -606739 -754645 -2116481 -3633316 -2940939 105485
12721A05485K881225Q64395k71773J35314K81403n42886q05725J16168M23087
$$ 105485 2986710 3851105 3579332 3714646 3996049 3453163 2647438 2763606 3186693
12712C186693r21845j996439j078523J93010m17816j595254m81699K193334K756769
$$ 3186693 2264848 268409 -810114 -617104 -1034920 -2630174 -3111873 -918539 1838230
12703A838230K98622j896953j327831N41248J201438L91504q72864k033666k287484
$$ 1838230 2136852 239899 -1087932 -546684 654754 1046258 173394 -1860272 -4147756
12694d147756n29523K311339L086379N25018k407796k365200j14503J181765P34605
$$ -4147756 -4677279 -2365940 720439 1245457 -1162339 -3527539 -3642042 -2460277 -1725672
12685a725672L95782Q92089O88024j104997k905661k564073Q3132L028509L858384
$$ -1725672 -1329890 -437801 250223 -854774 -3760435 -6324508 -6241376 -3212867 645517
12676F45517J845617j130347k279086j137001j03208q03956j458024K37529K956346
$$ 645517 2491134 1360787 -918299 -2055300 -2158508 -2962464 -4420488 -4182959 -1226613
12667a226613L309241J026548o61983k11072K4863j817792l569879k353494P38964
$$ -1226613 2082628 3109176 2447193 2236121 2260984 443192 -3126687 -5480181 -4741217
12658d741217K273631J502703O38735O79305K51514j075640j517909k82213O90639
$$ -4741217 -2467586 -964883 -326148 353157 604671 -470969 -1988878 -2271091 -1580452
12649a580452r6215j074246k93436J190090J180285J54409K29262J140530N58671
$$ -1580452 -1676667 -2750913 -3044349 -1854259 -673974 -519565 -290303 850227 1408898
12640A408898j582856k391535m67965J900498K308783J379811O84147q6319j668990
$$ 1408898 -173958 -2565493 -3033458 -1132960 1175823 2555634 3239781 3153462 1484472
12631A484472k787408j670430R68212K639493K194895N72416q86062j354565n51932
$$ 1484472 -1302936 -2973366 -2005154 634339 2829234 3401650 2515588 1161023 609091
12622F09091O70655O13096j014355k178694j318800L25195R50305J145342K216710
$$ 609091 1279746 1892842 878487 -1300207 -2619007 -2293812 -1343507 -198165 2018545
12613B018545L050075J687849q70680j714194m94787L59215j83823o74761n24228
$$ 2018545 5068620 6756469 5885789 4171595 3676808 4036023 3852200 3177439 2653211
12604B653211j023246k257317k264934m78768R66322P71231M99704J404523J911086
$$ 2653211 1629965 -627352 -2892286 -3371054 -2404732 -1633501 -1133797 270726 2181812
12595B181812L82663j791712k156986o32489J057941K006479K262500J643115
$$ 2181812 2564475 772763 -1384223 -2016712 -958771 1047708 3310208 4953323
12587D953323L20774m53426K5971N45663j61244j269811j334126q17694j104308
$$ 4953323 5274097 4820671 4846642 5392305 5231061 3961250 2627124 1809430 705122
12578G05122j773581j132863P86181J949928J300117J37824p4502K46039p6230
$$ 705122 -1068459 -2201322 -1415141 534787 1834904 1972728 1898226 2144265 2068035
12569B068035q66375q74385J42752Q32877J71955r14519q47199J45812L45109
$$ 2068035 1201660 327275 470027 1302904 1474859 560340 -286859 -141047 204062
12560B04062n57112p46619N85250J394008p6541j994569j406576J094717K234882
$$ 204062 -353050 -1099669 -514419 879589 803048 -1191521 -2598097 -1503380 731502
12551G31502J103261l543O8748l48468k094328l101134j656200Q18586K021664
$$ 731502 1834763 1831220 1899968 1551500 -542828 -3643962 -5300162 -4481576 -2459912
12542b459912J714334Q10595m33430j596770j311520Q07157K817872K669684O66732
$$ -2459912 -745578 65017 -368413 -1965183 -3276703 -2469546 348326 3018010 3684742
12533C684742j425440k463089k190640r26044J51320j488l78722R78811L388861
$$ 3684742 2259302 -203787 -2394427 -3320471 -3169151 -3170639 -3549361 -2570550 818311
12524H18311L641412P67499k114668k230119o45490M09616Q38599J154775M98451
$$ 818311 4459723 5227222 3112554 882435 236945 646561 1485160 2639935 3138386
12515C138386j263065j994933n38023Q73899J24946j293998j177677m54974q76314
$$ 3138386 1875321 -119612 -657635 216264 341210 -952788 -2130465 -2585439 -3461753
12506c461753j267692K36614K290870K473847J486433J359323J312964l96092
$$ -3461753 -4729445 -4492831 -2201961 271886 1758319 3117642 4430606 4034514
12498D034514k168165j220482J153040J263114q20010j644452m68193J5383r23121
$$ 4034514 1866349 645867 1798907 3062021 2242011 597559 129366 144749 -778372
12489g78372r34757N42310J100303J0576m63014M38929N32173q65699j303829
$$ -778372 -1713129 -1170819 -70516 -59940 -522954 -84025 448148 -417551 -1721380
12480a721380K95146J511970P27839k16766K82755Q15237J16778l47502N45710
$$ -1721380 -1426234 85736 813575 596809 879564 1694801 1811579 1464077 2009787
12471B009787R56449p57229k771399k419425j58463J510559J548164P93104K15084
$$ 2009787 2966236 2209007 -562392 -2981817 -3140280 -1629721 -81557 711547 926631
12462I26631L19389J061043J375278K56075j236325j080170K90714L25265j391735
$$ 926631 1246020 2307063 3682341 3938416 2702091 1621921 1912635 2237900 846165
12453H46165k285526r93842Q10950J749987K401082K554410P17820k158333k653774
$$ 846165 -1439361 -2433203 -1622253 127734 2528816 5083226 5801046 3642713 988939
12444I88939m64717M36686j474038k345913P8864J834982m22218k881453o96197
$$ 988939 524222 960908 -513130 -2859043 -2780179 -945197 -1367415 -4248868 -4945065
12435d945065L373163L175365p44095k436060m02343J082446J18729m56934M47246
$$ -4945065 -1571902 1603463 859368 -1576692 -1979035 -896589 -777860 -1234794 -787548
12426g87548J17061j852171j662811J814639L835464R36934l241165l333044m5007
$$ -787548 -670487 -2522658 -4185469 -2370830 1464634 2401568 -839597 -4172641 -4217648
12417d217648J741615N03797o26536O07616K510555K498477P63321l98891Q7555
$$ -4217648 -2476033 -1972236 -2598772 -1991156 519399 3017876 3781197 3382306 3469861
12408C469861O98002l98517k398494k629884m71236J469387J288189O33678J375564
$$ 3469861 4167863 3769346 1370852 -1259032 -1730268 -260881 1027308 1660986 3036550
12399C036550J774167m30812k880870j344416K937296M009329J54698l296745
$$ 3036550 4810717 4379905 1499035 154619 3091915 7101244 7255942 3959197
12391C959197k255804J34986o70901l068773k369601J193038K726916K15449k762173
$$ 3959197 1703393 1838379 1167478 -1901295 -4270896 -3077858 -350942 -135493 -2897666
12382b897666k419281N08138K560963J899714k98437j610766q13754R47391J409013
$$ -2897666 -5316947 -4808809 -2247846 -348132 -646569 -2257335 -3071089 -2123698 -714685
12373g14685o8966j609878j225900P18356K227660K040567M95023j109971j349541
$$ -714685 -783651 -2393529 -3619429 -2901073 -673413 1367154 1862177 752206 -597335
12364e97335Q4400J417575N19869j764712k039512P22709L067324J892605r06220
$$ -597335 -512935 904640 1424509 -340203 -2379715 -1657006 1410318 3302923 2396703
12355B396703j518566j06528O6524j511910j718410Q26863L171232K232513j078585
$$ 2396703 878137 771609 838133 -673777 -2392187 -1565324 1605908 3838421 2759836
12346B759836l517647l370409j281763J191059K539836K033126N86193j6963N87795
$$ 2759836 -757811 -4128220 -5409983 -4218924 -1679088 354038 940231 923268 1511063
12337A511063R47055J67075p45291o57851M90K80351J80204P8503j72160o00612
$$ 1511063 2458118 2625193 1879902 1222051 1222541 1502892 1683096 1761599 1589439 988827
12327I88827o13639p1387J63608l59065q03684m88812k1187j9934K934L82693
$$ 988827 375188 303801 467409 108344 -695340 -1184152 -1205339 -1225273 -1222339 -839646
12317h39646L37554l94232m52632R25867K064476J270586k83527n69885l43600
$$ -839646 -502092 -896324 -1348956 -423089 1641387 2911973 2628446 2058561 1714961
12308A714961j685188l644317k973408N56853L164074K414899L48908k72816J37105
$$ 1714961 29773 -3614544 -6587952 -6031099 -2867025 -452126 -103218 -376034 -238929
12299b38929r0630o10782k30634M86927L33082j37943L25793J252775J334390
$$ -238929 -329559 -940341 -1170975 -684048 -350966 -488909 -163116 1089659 2424049
12290B424049Q08528P55116Q53426J07844q93049p83082K5965n6769r72534j088477
$$ 2424049 3232577 3987693 4841119 4948963 4055914 3272832 3298797 3242028 2269494 1181017
12280A181017P2562J347117J954552J863264N65155k031294l843519k615299L35828
$$ 1181017 1253579 2600696 4555248 6418512 6983667 4952373 1108854 -1506445 -1170617
12271a170617J353891l34123j732167q82096P13742J302655J209994Q50641k72219
$$ -1170617 183274 -150849 -1883016 -2765112 -2051370 -748715 461279 1311920 1039701
12262A039701j308406k91637J874197J498557j837731l476850p20096K576974
$$ 1039701 -268705 -560342 1313855 2812412 974681 -2502169 -3222265 -645291
12254f45291K130774j52169l46081M25583j148520l458925k297493J283217K235841
$$ -645291 1485483 1333314 987233 1412816 264296 -3194629 -5492122 -4208905 -1973064
12245a973064J21594m32885J714887K249018m24009j872095N81958K925251J179469
$$ -1973064 -1851470 -2284355 -569468 1679550 1255541 -616554 -34596 2890655 4070124
12236D070124k123420k612291r48387l08086m77183N98996K013659J580857L54361
$$ 4070124 1946704 -665587 -1613974 -1922060 -2399243 -1800247 213412 1794269 2148630
12227B148630O63256J196578r81463m451475m610559q36181K350449K050066N28960
$$ 2148630 2811886 4008464 3027001 -1424474 -6035033 -6871214 -4520765 -2470699 -1941739
12218a941739O31962J586971J440048N44867J91629k7687j039735j916454r92579
$$ -1941739 -1309777 277194 1717242 2262109 2453738 2426051 1386316 -530138 -1522717
12209a522717J317195K719900J944496J09551r23674o74654j91111m38926r67707
$$ -1522717 -205522 2514378 4458874 4568425 3644751 2970097 2778986 2340060 1372353
12200A372353n23843J033737K144996J435452l93323j415532q71248K11717N76569
$$ 1372353 848510 1882247 4027243 5462695 5069372 3653840 2782592 2994309 3570878
12191C570878l8457j200485k363592k909020k287364n28060J566372K858128K595021
$$ 3570878 3532421 2331936 -31656 -2940676 -5228040 -5756100 -4189728 -1331600 1263421
12182A263421J027656o14828j179047p15964j48741N0808J46809K76732L15196
$$ 1263421 2291077 1676249 497202 -218762 -367503 -316695 -169886 106846 422042
12173D22042N21014J149141J504004P73447l18103m13428N6340m38313j406156
$$ 422042 943056 2092197 3596201 4369648 4051545 3638117 3694457 3256144 1849988
12164A849988p30990J303535J648233o30190k465510j601458R7891M61679O43474
$$ 1849988 1118998 2422533 4070766 3440576 975066 -626392 -528501 -66822 576652
12155E76652J919856K273607k474k262559j392452Q13706Q08282n32068q7093
$$ 576652 2496508 4770115 4767641 2505082 1112630 1926336 2734618 2202550 2115457
12146B115457J183336L0170k310993j635896J351987J472545k012802l690031
$$ 2115457 3298793 3328963 1017970 -617926 734061 2206606 193804 -3496227
12138c496227p98748K685277L066089J940414J375866m8048k857050l735206j027925
$$ -3496227 -4294975 -1609698 1456391 3396805 4772671 4724623 1867573 -1867633 -2895558
12129b895558J514363O25665j253537q59454K37478m22263q89656J146140K875145
$$ -2895558 -1381195 -755530 -2009067 -2868521 -2631043 -3053306 -3942962 -2796822 78323
12120G8323R15233j944720j028330J886409J542804j360642j315999K094161L263339
$$ 78323 993556 -951164 -1979494 -93085 1449719 89077 -1226922 867239 4130578
12111D130578K53334k083867o15481J335846O63983l16407Q75992J727367o58692
$$ 4130578 4383912 2300045 1684564 3020410 3684393 3367986 4243978 5971345 5312653
12102E312653l863014l814604j205479L41071K78865P42434J666786R46208j057454
$$ 5312653 1449639 -2364965 -3570444 -3229373 -2950508 -2208074 -541288 404920 -652534
12093f52534j480113K64508J434755N26478m53420L18613J367529N35250j334667
$$ -652534 -2132647 -1868139 -433384 93094 -360326 -41713 1325816 1861066 526399
12084E26399j720592l01456Q71536O83442J70991K15004J22415o85606j363878
$$ 526399 -1194193 -1495649 -624113 59329 230320 445324 567739 -117867 -1481745
12075a481745j186747q25743o68279M82025K970241M111048J409679k920198m176502
$$ -1481745 -2668492 -3494235 -4162514 -3680489 -710248 3400800 4810479 1890281 -2286221
12066b286221j767916K77236p9774j98013J644785K610550M92107j479959N21968
$$ -2286221 -4054137 -3776901 -3856675 -4054688 -2409903 200647 692754 -787205 -265237
12057b65237M170182M130122K24165k749529k548951j615635j606806r57596J001100
$$ -265237 3904945 8035067 8259232 5509703 2960752 1345117 -261689 -1219285 -218185
12048b18185K093062J238121M85919J140293J277733o12578k464226j672989Q64035
$$ -218185 1874877 3112998 3598917 4739210 6016943 5404365 2940139 1267150 2131185
12039B131185K165477J097505j048864k601032k575185r74257P53361Q82920j07093
$$ 2131185 4296662 5394167 4345303 1744271 -830914 -1805171 -1051810 -168890 -275983
12030b75983P413J467506J698131l91784j976301n16811J927308J695495p03288
$$ -275983 -268570 1198936 2897067 2505283 528982 12171 1939479 3634974 2931686
12021B931686j385229P86336K468874J038589j495577j647832M04476J338108
$$ 2931686 1546457 2332793 4801667 5840256 4344679 2696847 3101323 4439431
12013D439431k19032j718782p31991J168211P90769j485768k009006L84595K297915
$$ 4439431 4220399 2501617 1769626 2937837 3728606 2242838 233832 618427 2916342
12004B916342J093137r57723o65251P20639J1259k075837k155853j72066P36082
$$ 2916342 4009479 3051756 2386505 3107144 3118403 1042566 -1113287 -1285353 -549271
11995e49271o357J07206J212530N91288j419147r11516K263449K792233j253429
$$ -549271 -555628 -448422 764108 1355396 -63751 -975267 1288182 4080415 2826986
11986B826986l905835l79695M653136L950104j163654l470330j199750N57186
$$ 2826986 -1078849 -1458544 3194592 7144696 5981042 2510712 1310962 1868148
11978A868148j012338k793522j947612O8748J115103J314535J015147j60711j130237
$$ 1868148 855810 -1937712 -3885324 -3816576 -2701473 -1386938 -371791 -532502 -1662739
11969a662739p4944J757352J040405j862055k568285L58860K774002J607127l87143
$$ -1662739 -1737683 19669 1060074 -801981 -3370266 -3011406 -237404 1369723 982580
11960I82580K22199J762872R64649j061767j127434O1856o20569k532870j898535
$$ 982580 1204779 2967651 3932300 2870533 1743099 1804955 1184386 -1348484 -3247019
11951c247019J411311K937945O58457j741135q22092J355112J051182j060404
$$ -3247019 -1835708 1102237 1760694 19559 -802533 552579 1603761 543357
11943E43357j400419O09280K039661J335786Q3384m26108j065099k210154k142291
$$ 543357 -857062 -247782 1791879 3127665 3211049 2784941 1719842 -490312 -2632603
11934b632603N6812K240276K041260M12957j9619R60125J265089J39317r16148
$$ -2632603 -2575791 -335515 1705745 2118702 2099083 3059208 4324297 4463614 3547466
11925C547466r13759o52216p10745l39640P98043J599280J221469K93107n06658
$$ 3547466 2633707 1981491 1270746 931106 1729149 3328429 4549898 4843005 4336347
11916D336347j582194l010054l339963j266959K179011M276552L226528k35061
$$ 4336347 2754153 -255901 -3595864 -4862823 -2683812 1592740 4819268 4584207
11908D584207l273849l053815M39380L640634L014574m44098k303475o83567J371970
$$ 4584207 1310358 -1743457 -1304077 2336557 5351131 4907033 2603558 1919991 3291961
11899C291961O61119j673348k441065j039198P25171J831895K336295J603311
$$ 3291961 3953080 2279732 -161333 -1200531 -475360 1356535 3692830 5296141
11891E296141q31126l150020k827423l55727J069331r4154j904120k021480o58969
$$ 5296141 4465015 1314995 -1512428 -1868155 -798824 -892978 -2797098 -4818578 -5477547
11882e477547M53119N65038L02294L90319Q64792J266572J186627O59964M8214
$$ -5477547 -5024428 -4459390 -4157096 -3766777 -2901985 -1635413 -448786 211178 259392
11873B59392l76752l84404M33160J915001K524339Q21510j966853k736283p06835
$$ 259392 -117360 -501764 -68604 1846397 4370736 5192246 3225393 489110 -217725
11864b17725J137676J80774k140070k621350p02600J496255K337735J771325K51578
$$ -217725 919951 1100725 -1039345 -3660695 -4363295 -2867040 -529305 1242020 1493598
11855A493598j408912j892875r02153O928l25193q54726n01829l68612j419878
$$ 1493598 84686 -1808189 -2710342 -2703414 -3028607 -3883333 -4385162 -4753774 -6173652
11846f173652j761652O04191L643239L538801M48061j669473r22118L96169N7356
$$ -6173652 -7935304 -7331113 -3687874 -149073 298988 -1370485 -2292603 -1896434 -1839078
11837a839078j006821q94800M98168J910177K133717O11756j803101k903452j637547
$$ -1839078 -2845899 -3740699 -3242531 -1332354 801363 1413119 -389982 -3293434 -4930981
11828d930981K01338P56017J093731K592542L193112M37905l065458k408347J705234
$$ -4930981 -4729643 -3973626 -2879895 -287353 2905759 3343664 278206 -2130141 -424907
11819d24907L422040P22376j926185j453568o82376k107656k872328p6900L474482
$$ -424907 2997133 3719509 1793324 339756 -342620 -2450276 -5322604 -5399504 -1925022
11810a925022L497183P62554j091685j405110j691915j514668K12325J727503
$$ -1925022 1572161 2334715 1243030 -162080 -1853995 -3368663 -3156338 -1428835
11802a428835P84429r65961l47733J823434K022895q1297j468484j027011n64851
$$ -1428835 -644406 -1610367 -1958100 -134666 1888229 1806932 338448 -688563 -1253414
11793a253414o34086K83575J957054J910983k74706j826677j130716M9028J7103
$$ -1253414 -1887500 -1603925 353129 2264112 1989406 162729 -967987 -918959 -901856
11784i01856k13174O58803J688558J347132q9234j235724j322161l76775R27823
$$ -901856 -1115030 -456227 1232331 2579463 2490229 1254505 -67656 -444431 483392
11775D83392J192557l09821j950984j436857O65541J500742L73837k34861R81601
$$ 483392 1675949 1366128 -584856 -2021713 -1356172 144570 518407 283546 1265147
11766A265147J830780L35149j935103k444254j378802l26577P99207K663622L701490
$$ 1265147 3095927 3431076 1495973 -948281 -2327083 -2653660 -1854453 809169 4510659
11757D510659J652393k378091m303930k068369J810817L428805J737077j082576
$$ 4510659 6163052 3784961 -518969 -2587338 -776521 2652284 4389361 3306785
11749C306785k357614j305116O91886J619989Q09719n48105r30610j46742Q21470
$$ 3306785 949171 -355945 335941 1955930 2765649 2217544 1286934 1140192 1961662
11740A961662J103727N69775l28893q48835o10086l19882j008889k144608j828145
$$ 1961662 3065389 3635164 3306271 2457436 1847350 1527468 518579 -1626029 -3454174
11731c454174K52203J654922N64235j158685o29967J425931J686926m09164j652692
$$ -3454174 -3201971 -1547049 -982814 -2141499 -2771466 -1345535 341391 -67773 -1720465
11722a720465j33566J877986J751683M61878M05833J289525R37722r30883k411319
$$ -1720465 -1854031 23955 1775638 2237516 2643349 3932874 4870596 3939713 1528394
11713A528394k414754j628629o82989M74646J315475Q50450o17383j487378r81035
$$ 1528394 -886360 -2514989 -3197978 -2723332 -1407857 -557407 -1174790 -2662168 -3643203
11704c643203Q8379Q59510J346224J596804J307561O10429R0763j69141n08350
$$ -3643203 -3554824 -2695314 -1349090 247714 1555275 2165704 2256467 2087326 1578976
11695A578976p45257n15537k59627m43754k73173R68842J822483L42316k314401
$$ 1578976 833719 318182 58555 -385199 -658372 310470 2132953 2475269 160868
11686A60868k876519q08992R76732J001389J319396L174596M020984J473387k440402
$$ 160868 -2715651 -3524643 -2547911 -1546522 -227126 2947470 6968454 8441841 6001439
11677F001439l900543k305681k8177J205476J193658O5375j332195j269034L94248
$$ 6001439 2100896 -204785 -232962 972514 2166172 2231547 899352 -369682 24566
11668B4566J192527k36298j458943L800K316258K006987p49968l014620l622541
$$ 24566 1217093 980795 -478148 -474348 1841910 3848897 3098929 84309 -3538232
11659c538232l182841j227465K395833M675523K729964r07070j251256J396829
$$ -3538232 -6721073 -7948538 -5552705 -877182 1852782 945712 -305544 1091285
11651A091285K036695o88875k548234j134680N56512l4886r44975j23313P46201
$$ 1091285 3127980 2439105 -109129 -1243809 -687297 -722183 -1667158 -1790471 -1044270
11642a044270n2625q03189K24488J446860J149629O50727J191965R63798j404357
$$ -1044270 -1096895 -1900084 -1675596 -228736 920893 1571620 2763585 3727383 2323026
11633B323026l407191k306793L61737J447596R99666R24286J032941Q4781j022758
$$ 2323026 -1084165 -3390958 -3029221 -1581625 -581959 342327 1375268 1460049 437291
11624D37291o46496M76563O48168K46115M32297N82224p7985k79398P63516R05816
$$ 437291 -209205 267358 915526 1161641 1593938 2176162 2098177 1818779 2582295 3488111
11614C488111j398376l527803k591590m69239m49144j210209M85638L019841K067249
$$ 3488111 2089735 -1438068 -4029658 -4498897 -4948041 -6158250 -5672612 -2652771 -585522
11605e85522j417415k029734J061232K622525J86845k114099r12892J143665P76628
$$ -585522 -2002937 -4032671 -2971439 -348914 -162069 -2276168 -3189060 -2045395 -1268767
11596a268767m30397K13338J460241R48551k54279K8340R31727N94478k4703P50925
$$ -1268767 -1699164 -1485826 -25585 922966 668687 697027 1628754 2223232 2198529 2949454
11586B949454J478215j20284k652205k893944r73761K64992K06362O69975J649741
$$ 2949454 4427669 4307385 1655180 -1238764 -2212525 -1947533 -1741171 -1071196 578545
11577E78545J132423o06909p32615J240567K182580L93222j708901j775785j032168
$$ 578545 1710968 1104059 371444 1612011 3794591 4187813 2478912 703127 -329041
11568c29041j268718j439846j85527Q88773q0556j265821J76151K826748K725136
$$ -329041 -1597759 -3037605 -3223132 -2334359 -2414915 -3680736 -3504585 -677837 2047299
11559B047299j33849j589772m7452J245699J37363p94201P48758K176265K55734
$$ 2047299 1913450 323678 276226 1521925 1659288 865087 1613845 3790110 4045844
11550D045844l019552l247078m30375J597608J530092J659072K739301K462512
$$ 4045844 1026292 -2220786 -2651161 -1053553 476539 2135611 4874912 7337424
11542G337424n1480k339123k571352j958715j729882j044992L87573Q38921k30356
$$ 7337424 7285944 4946821 2375469 416754 -1313128 -2358120 -1970547 -1131626 -1361982
11533a361982m40331J658908L635097K705141J7207j355085r22585n00667p65083
$$ -1361982 -1802313 -143405 3491692 6196833 6214040 4858955 3936370 3435703 2670620
11524B670620q12347l68452j56285n38389j331072k212263k304897p96499J060294
$$ 2670620 1858273 1489821 1333536 795147 -535925 -2748188 -5053085 -5849584 -4789290
11515d789290P26105j514577j957741R50061L448459J896379j370842j509455
$$ -4789290 -4063185 -5577762 -7535503 -6585442 -3136983 -1240604 -2611446 -4120901
11507d120901J526734L498306K528607Q09880L8319n98702j494961j415386p6666
$$ -4120901 -2594167 904139 3432746 4242626 4280945 3682243 2187282 771896 695230
11498F95230R74224Q10290R9971o74910j660132k170382j153729P30958J661402
$$ 695230 1669454 2479744 2579715 1904805 244673 -1925709 -3079438 -2348480 -687078
11489f87078J231592M45136m08323j543052j958354o25114J089381J020661j94379
$$ -687078 544514 989650 581327 -961725 -2920079 -3545193 -2455812 -1435151 -1629530
11480a629530j11199J318987J794152P37214p3194k8764m10877j288664j132735
$$ -1629530 -1740729 -421742 1372410 2109624 2036430 2007666 1596789 308125 -824610
11471h24610k4457J19907q49865q22621P45896J798317J290834O27047O26689
$$ -824610 -849067 -729160 -1579025 -2401646 -1655750 142567 1433401 2060448 2687137
11462B687137K52989p41245j031833m28140k56435m18092N80833K135680J842762
$$ 2687137 2940126 2198881 1167048 738908 482473 64381 645214 2780894 4623656
11453D623656o4376p22332R7197o09935l131144l640704q78463J029135n57543
$$ 4623656 4559280 3836948 3934145 3324210 193066 -3447638 -4326101 -3296966 -3854509
11444c854509k146929j96692K734268K476589J11565n35509P08258J284934Q13553
$$ -3854509 -6001438 -6198130 -3463862 -987273 -875708 -1411217 -702959 581975 1395528
11435A395528M77006l40799k292787k976784k33379L249840L337723Q72614j52764
$$ 1395528 1872534 1531735 -761052 -3737836 -3971215 -721375 2616348 3488962 3336198
11426C336198N63773o8345k167789k390904m1455J526065N53298o50546j57248
$$ 3336198 3899971 3831626 1663837 -727067 -768522 757543 1310841 660295 503047
11417E03047P02530L96497l57755p02393j182873j794642j216061O74337J938952
$$ 503047 1205577 1602074 1244319 541926 -640947 -2435589 -3651650 -2977313 -1038361
11408a038361J448781M55036L01440N92513M86145n6295r00046j823512j784018
$$ -1038361 410420 865456 1166896 1759409 2245554 2189259 1289213 -534299 -2318317
11399b318317j30535J493649R12373r37717j000373J038644K150811R48876j95307
$$ -2318317 -2448852 -955203 -42830 -980547 -1980920 -942276 1208535 2157411 1962104
11390A962104N70986J518512O46448q03628o97872L44010L79252m10461m83041
$$ 1962104 2533090 4051602 4698050 3894422 3196550 3540560 3919812 3509351 3026310
11381C026310p5411p46231k130568j849023Q00637L166117K502698k55612j589406
$$ 3026310 2950899 2204668 74100 -1774923 -974286 2191831 4694529 4438917 2849511
11372B849511j53180J239873m38766l726318m292426j131382J950854K132528
$$ 2849511 2696331 3936204 3497438 -228880 -4521306 -5652688 -3701834 -1569306
11364a569306J400922K094867K158351q84608l949769k166637K587077L462574
$$ -1569306 -168384 1926483 4084834 3200226 -749543 -2916180 -329103 3133471
11356C133471o75982l199005l60442K817531J161203k257124j869371R48846Q59773
$$ 3133471 2457489 -741516 -1101958 1715573 2876776 619652 -1249719 -300873 558900
11347E58900j931044k270126Q73012K771432R66716j111549l03835J507866J295751
$$ 558900 -1372144 -3642270 -2769258 2174 968890 -142659 -446494 1061372 2357123
11338B357123k75658p38218P2993M48299k83677j299137j629956p03183J314137
$$ 2357123 2081465 1343247 1416240 1864539 1580862 281725 -1348231 -2051414 -737277
11329g37277K907059K371409K16285j252106j265432j397210k287264k142101
$$ -737277 2169782 4541191 4757476 3505370 2239938 842728 -1444536 -3586637
11321c586637r058J906922J343140n66021j306654q20967o88961p52594M48306
$$ -3586637 -3595695 -1688773 -345633 -911654 -2218308 -3039275 -3728236 -4480830 -4032524
11312d032524K432609K931276J383589k81903p00843n80462o70085m83316J67815
$$ -4032524 -1599915 1331361 2714950 2433047 1732204 1151742 481657 -1659 166156
11303A66156L91746q3837k42560K56960L04909l98521l33070J079882J769113
$$ 166156 557902 474065 231505 488465 793374 394853 61783 1141665 2910778
11294B910778K24365j414292l69317J916258J506182j661770l046555k86649K871649
$$ 2910778 3135143 1720851 1351534 3267792 4773974 3112204 65649 -221000 2650649
11285B650649J829458k313098m556107k810769L79990K302568K910751K883087
$$ 2650649 4480107 2167009 -2389098 -5199867 -4819877 -2517309 393442 3276529
11277C276529J927860K07769r39527j130839j795860l399549l788370j313114
$$ 3276529 5204389 5412158 4472631 3341792 1545932 -1853617 -5641987 -6955101
11269f955101K093342L406728K762480K376008K202396K59880k748092l152173
$$ -6955101 -4861759 -1455031 1307449 3683457 5885853 6145733 3397641 245468
11261B45468j3615K567287J286477j268810p18809K129895K612220l53297k659666
$$ 245468 231853 2799140 4085617 2816807 2097998 4227893 6840113 6486816 3827150
11252C827150j521049N55915L27544r71262j07731K365978K500953r86933m252451
$$ 3827150 2306101 2862016 3189560 2218298 2110567 4476545 6977498 5990565 1738114
11243A738114l256336Q28074L114470J182031k295641l472985j994723k14783
$$ 1738114 -1518222 -690148 2424322 3606353 1310712 -2162273 -4156996 -4371779
11235d371779R12379K451939M013624K954057j160811m086481k019125K540912
$$ -4371779 -3459400 -1007461 3006163 5960220 4799409 712928 -1306197 1234715
11227A234715L801296P85242j760882q29761R18765K66685j577841j751350l46484
$$ 1234715 5036011 5821253 4060371 3230610 4149375 4416060 2838219 1086869 740385
11218G40385P26580J022316P58052r50818l843822m701805j505975K400231K448406
$$ 740385 1466965 2489281 3247333 2296515 -1547307 -6249112 -7755087 -5354856 -2906450
11209b906450k62359q26546J603475L030832J721313N21721Q91736K11810k520320
$$ -2906450 -3168809 -3995355 -2391880 638952 2360265 2881986 3773722 3985532 1465212
11200A465212l537255m82607K687560J509544j758991j891093P94311J437682
$$ 1465212 -2072043 -2554650 132910 1642454 -116537 -2007630 -1213319 224363
11192B24363r74795k234983l32511J391680K79259j298192l73457J670430J915756
$$ 224363 -750432 -2985415 -3317926 -1926246 -1646987 -2945179 -3318636 -1648206 267550
11183B67550Q26731P24132J305729N14368j188070j285906K51003O62598p65488
$$ 267550 1094281 1818413 3124142 3638510 2450440 1164534 1415537 2078135 1312647
11174A312647j217701P54201K182727J86734k935573k606394J169054L539697
$$ 1312647 94946 849147 3031874 3218608 283035 -2323359 -1154305 2385392
11166B385392J624617j743322k383347k75742J307510N70858j135647j813974
$$ 2385392 4010009 2266687 -116660 -392402 915108 1485966 350319 -1463655
11158a463655j099766N703M54365M2396l68787K61297J527541J540496n50819
$$ -1463655 -2563421 -2557718 -2103353 -2060957 -2429744 -2168447 -640906 899590 348771
11149C48771k763228k467385K5322J782881J232777Q944J76470J303965J607070
$$ 348771 -2414457 -4881842 -4856520 -3073639 -1840862 -1831918 -1655448 -351483 1255587
11140A255587Q43193L54891O50641O82041j86262r62643n81306M00239P28835
$$ 1255587 2098780 2453671 3104312 3786353 3600091 2637448 2056142 2456381 3185216
11131C185216L25672r1527p34967k305158l764691k683329J188352M542669M338996
$$ 3185216 3510888 3419361 2684394 379236 -3385455 -6068784 -4880432 -337763 4001233
11122D001233J616856l60137n42295m16042q00053r63666o09932j91962N51353
$$ 4001233 5618089 5257952 4715657 4299615 3499562 2535896 1925964 1734002 2285355
11113B285355J821134J930479n96307l349318k399529J271528K280906q62062
$$ 2285355 4106489 6036968 5440661 2091343 -308186 963342 3244248 2382186
11105B382186k946136k11627L538663L022070m34799j904209q47151m80369j180702
$$ 2382186 -563950 -775577 2763086 5785156 5350357 3446148 2598997 2118628 937926
11096I37926m43666J408657J253993r51637j653228J61863J232474k26660j549541
$$ 937926 494260 1902917 3156910 2205273 552045 713908 1946382 1719722 170181
11087A70181l32339J661401J597294k82944j767753j843884j030398j07503L27332
$$ 170181 -162158 1499243 3096537 2813593 1045840 -798044 -1828442 -1935945 -1608613
11078a608613K36636M29359J236257J427836K52685n35435O71631J882909K06871
$$ -1608613 -1371977 -942618 293639 1721475 1974160 1438725 2110356 3993265 4200136
11069D200136k956371l558092j196886P38953R70038J399491K184068J230918
$$ 4200136 1243765 -2314327 -3511213 -2772260 -1802222 -402731 1781337 3012255
11061C012255o76393j14523K312764J806992k073259l406341L30584L337789R67353
$$ 3012255 2335862 2221339 4534103 6341095 4267836 861495 1192079 4529868 5497221
11052E497221k363579q42788K696880J778638k670525m238992j699406J29049
$$ 5497221 3133642 2290854 4987734 6766372 4095847 -143145 -1842551 -1713502
11044a713502o69617p86636J243816K372577Q87561o36428j12790Q50991M19847
$$ -1713502 -2383119 -3169755 -1925939 446638 1334199 697771 584981 1435972 1855819
11035A855819m89016m71925M8027J77980j18395p82492j561229j149188J010088
$$ 1855819 1366803 894878 942905 1120885 1002490 219998 -1341231 -2490419 -1480331
11026a480331K506462Q19238j992948j493545K048759L363841J98008k967901
$$ -1480331 1026131 1845369 -147579 -1641124 407635 3771476 3969484 1001583
11018A001583j632812K225338L627801J665854n64088j294508j628480k321404
$$ 1001583 -631229 1594109 5221910 6887764 6323676 5029168 3400688 1079284
11010A079284k284532p95641J005762J647157J077697K61571j66625k74463l05780
$$ 1079284 -1205248 -2000889 -995127 652030 1729727 1991298 1824673 1550210 1244430
11001A244430l28068l88540o46138j061030j134436m56468M79809O48991j47642
$$ 1244430 916362 527822 -118316 -1179346 -2313782 -2770250 -2290441 -1641450 -1789092
10992a789092r97449j197455j019648p87145j67385R83066J929321J895242R25603
$$ -1789092 -2786541 -3983996 -5003644 -5790789 -5958174 -4975108 -3045787 -1150545 -224942
10983b24942m25548j358608o99917J922005M355403L365561j121810n022318m717673
$$ -224942 -650490 -2009098 -2709015 -787010 3568393 6933954 5812144 789826 -3927847
10974c927847j128860K157182L151418K292198O80180n95405n81294L62708N35891
$$ -3927847 -5056707 -2899525 251893 2544091 3224271 2628866 2047572 2410280 2946171
10965B946171o79747j741747j439926o31537j94531M98530J457724J051201q03657
$$ 2946171 2266424 524677 -915249 -1546786 -1741317 -1242787 214937 1266138 462481
10956D62481j277481Q74190K435570P21022j524623m60451K185712J849750j216939
$$ 462481 -815000 59190 2494760 3215782 1691159 1230708 3416420 5266170 4049231
10947D049231k486615n08732J662877K126696J933731J187652j213237l424973
$$ 4049231 1562616 1053884 2716761 4843457 6777188 7964840 6751603 3326630
10939C326630j887382K118823K837155j124396l970642j552519K341680K329311
$$ 3326630 1439248 3558071 6395226 5270830 1300188 -252331 2089349 4418660
10931D418660n98183k035175j401745j167903j406263k63671J600626J866696
$$ 4418660 3820477 1785302 383557 -784346 -2190609 -2454280 -853654 1013042
10923A013042J069797J754899L397889K614763j076837l829724k995469n28833
$$ 1013042 2082839 3837738 7235627 9850390 8773553 4943829 1948360 1419527
10915A419527P09850Q34528J005421M77236j516445k910931j243254J971225K754987
$$ 1419527 2129377 2963905 3969326 4446562 2930117 19186 -1224068 747157 3502144
10906C502144N23607j062159O7213J238257k65729k509857k109318J32549P41402
$$ 3502144 4025751 2963592 3030805 4269062 4003333 1493476 -615842 -483293 258109
10897B58109n15358o19356J031344J568387Q6194m64805J337768K397017K31313
$$ 258109 -257249 -876605 154739 1723126 1809320 1344515 2682283 5079300 5310613
10888E310613k608700k596622o47920J43078l71706l65470m653m30111m86067
$$ 5310613 2701913 105291 -542629 -399551 -771257 -1136727 -1141380 -1571491 -2057558
10879b057558J380062L277736K220910n98264j276776N00881J093302r77539k809426
$$ -2057558 -677496 2600240 4821150 4222886 2946110 3446991 4540293 3562754 753328
10870G53328j889012N44012K003838J747916M08886r46394r90867M35524J304542
$$ 753328 -1135684 -591672 1412166 3160082 3568968 2622574 1631707 2067231 3371773
10861C371773J48866j099135r8701J307154l05033l525566l421855M80393K953641
$$ 3371773 3520639 2421504 2322803 3629957 3324924 -200642 -3622497 -3142104 -188463
10852a88463J171192j217898m89560J456751J091628q34638j107873P35071K373556
$$ -188463 982729 -235169 -724729 732022 1823650 989012 -118861 616210 2989766
10843B989766K256055O42507j452104k476384j183434J201088J650723m09359
$$ 2989766 5245821 5888328 4436224 1959840 776406 1977494 3628217 3218858
10835C218858j952136j022495L12864j68437j038732k21691Q65746j77396j993051
$$ 3218858 1266722 244227 557091 388654 -650078 -871769 -6023 -183419 -2176470
10826b176470j271437J626324K863568R81959j068150o02305J104456J329717
$$ -2176470 -3447907 -1821583 1041985 2023944 955794 353489 1457945 2787662
10818B787662j417o70258L34849J479241R99898n68626j027497N12383K239721
$$ 2787662 2786245 2115987 2450836 3930077 4929975 4361349 3333852 3846235 6085956
10809F085956J868985l72915k093845j861517o70981o1340r4075M7138M11512
$$ 6085956 7954941 7582026 5488181 3626664 2955683 2894343 2800268 2847406 3258918
10800C258918L05348l45255n95125K33032J288304R20658j035711k461281j471199
$$ 3258918 3564266 3219011 2623886 2856918 4145222 5065880 4030169 1568888 97689
10791I7689P68117J409119L6462p96350K51200J099612k54010k281916k158523
$$ 97689 865806 2274925 2311387 1515037 1766237 2865849 2611839 329923 -1828600
10782a828600J40615K194858K444328J206591m91101j375181m82924J195056J206393
$$ -1828600 -1687985 506873 2951201 4157792 3666691 2291510 1808586 3003642 4210035
10773D210035p81856k042771j082529p6626p58828j135682N42762J888701N15624
$$ 4210035 3428179 1385408 302879 226253 -532575 -1668257 -1125495 763206 1278830
10764A278830j110570J44337J935681K99396k615821j418086L050439M291819
$$ 1278830 168260 312597 2248278 2547674 -68147 -1486233 1564206 5856025
10756E856025M66998k854917j711801Q55633P79514j072857j748538q10694N11602
$$ 5856025 6323023 3468106 1756305 2611938 3391452 2318595 570057 -240637 270965
10747B70965J483961J315942n34993k341573j562766R38208J627764j89441j443175
$$ 270965 1754926 3070868 2535875 194302 -1368464 -430256 1197508 1008067 -435108
10738d35108m66066R92800J582918J929059J691907m58900l075042k785762M4863
$$ -435108 -901174 91626 1674544 3603603 5295510 4836610 1761568 -1024194 -979331
10729i79331J262241l85724j519446m05813L88118n24077o16806J325354K356694
$$ -979331 282910 -102814 -1622260 -2028073 -1639955 -2164032 -2780838 -1455484 901210
10720I01210O31738j102090k76058J407372J520306O29571j68043j512305l007308
$$ 901210 1532948 430858 154800 1562172 3082478 3712049 3544006 2031701 -975607
10711i75607k131406J391770L844525K697281L7256j323782j460086j128174J1772
$$ -975607 -3107013 -1715243 2129282 4826563 4863819 3540037 2079951 951777 963549
10702I63549J036217j55331k527139k202137J101244K924323J372841M7716J183540
$$ 963549 1999766 1844435 -682704 -2884841 -1783597 1140726 2513567 2561283 3744823
10693C744823J779382j42425j339205N34597K137325K93654k370733k313860r33149
$$ 3744823 5524205 5381780 4042575 4577172 6714497 7008151 4637418 2323558 1390409
10684A390409q03658n29375J691842L435968K012007n29186j059501n84920j300832
$$ 1390409 586751 57376 1749218 5185186 7197193 6668007 5608506 5023586 3722754
10675C722754j954724o60334J013395J054844P15469J208844N35436k244283l700626
$$ 3722754 1768030 1107696 2121091 3175935 3891404 5100248 5635684 3391401 -309225
10666c09225j511717R45372K63560j051240M59128K601204J735760l11379K10857
$$ -309225 -1820942 -875570 -612010 -1663250 -1204122 1397082 3132842 2821463 3032320
10657C032320J899811J086065j062330q38378R08729M43433j826735k226428m88769
$$ 3032320 4932131 6018196 4955866 4117488 5026217 5469650 3642915 1416487 927718
10648I27718K76717n88312q59193j36954q9870n74776N7640J369002J501463P32889
$$ 927718 1204435 616123 -243070 -380024 -469894 -1044670 -987030 381972 1883435 2616324
10638B616324Q02093J530947J333086J68058p19818q95401n57753M0408l55690
$$ 2616324 3418417 4949364 6282450 6450508 5730690 4835289 4277536 4317944 3962254
10629C962254k795087m817743k361131L414336O122367L299820L7692L91135J262341
$$ 3962254 1167167 -3650576 -6011707 -2597371 3524996 6824816 6862508 7253643 8515984
10620H515984q50167l065139j620808J043796P31487j263532j221815L67418P31293
$$ 8515984 7665817 4600678 2979870 4023666 4755153 3491621 2269806 2637224 3368517
10611C368517L8309j94201n59458j409519q91864R22829O55430j991103k219897
$$ 3368517 3406826 3212625 2653167 1243648 351784 1274613 1930043 -61060 -2280957
10602b280957J371555K980724o49435l795188j224392K966676L013465J143804
$$ -2280957 -909402 2071322 1421887 -2373301 -3597693 -631017 2382448 3526252
10594C526252J805548K661359k12585l763127l115111l32141L9365p43476M36082
$$ 3526252 5331800 7993159 7780574 4017447 902336 570195 609560 -133916 302166
10585C02166J516743o5358j080798J339402L030173J84223k792493j050017J684876
$$ 302166 1818909 1753551 672753 2012155 5042328 5226551 2434058 1384041 3068917
10576C068917N08283j240350Q12774K739386Q4521k452812L62222L547241Q91976
$$ 3068917 3577200 2336850 3149624 5889010 5973531 3520719 3882941 7430182 8322158
10567H322158k993774j385326J697149j60629k710091J80284L033607j164029
$$ 8322158 5328384 3943058 5640207 5479578 2769487 2949771 5983378 4819349
10559D819349n615871o95070P289120N834291j810641k875552K261781K746558
$$ 4819349 -796522 -1491592 5797528 11631819 9821178 6945626 9207407 11953965
10551A1953965j747509k111580J320955L07343l469808j331037L927919J967478
$$ 11953965 10206456 8094876 9415831 9723174 6253366 4922329 8850248 10817726
10543A0817726m666018l953319L216821M393672j518763l242969J123712J944410
$$ 10817726 6151708 2198389 5415210 9808882 8290119 5047150 6170862 8115272
10535H115272j960970j616911L080850K831143j992284j820558K558873J487625
$$ 8115272 6154302 4537391 7618241 10449384 8457100 6636542 9195415 10683040
10527A0683040l193961q54568N853925M454163k944674k812170L477979K226664
$$ 10683040 7489079 6634511 12488436 16942599 13997925 11185755 14663734 16890398
10519A6890398m882530l306477M914301L856242m391707k372968P644494N634481
$$ 16890398 12007868 8701391 13615692 17471934 13080227 10707259 18351753 23986234
10511B3986234p104529p663043N730650R463323j260616m700594L825766L880120
$$ 23986234 16881705 9218662 14949312 24412635 23152019 18451425 22277191 26157311
10503B6157311o026343k864114J2106102R757861r017525q182760J4542768J7162742
$$ 26157311 20130968 17266854 29372956 39130817 30113292 21930532 36473300 53636042
10495E3636042o375986p904734K1829999K5038157j0691080o173422O6607433
$$ 53636042 47260056 39355322 61185321 86223478 75532398 69358976 135966409
10488A35966409R0303282l3176953j94388684j97229532l7284422R1463686P1993248
$$ 135966409 226269691 193092738 -1295946 -198525478 -235809900 -144346214 -72352966
10481g2352966k956078j1221335K5775106K6230893n052510j0153727J0236723
$$ -72352966 -75309044 -86530379 -60755273 -34524380 -39576890 -49730617 -39493894
10474c9493894J2179071m664730n671610Q751015R571175k450629k859040O244724
$$ -39493894 -27314823 -31979553 -37651163 -28900148 -19328973 -21779602 -24638642 -18393918
10466a8393918L336216p298872m133843Q129215O847313n431753o486234L922777
$$ -18393918 -15057702 -22356574 -26490417 -18361202 -11513889 -16945642 -23431876 -19509099
10458a9509099N870433k542868m406409K306817L323473k270989j587686M916951
$$ -19509099 -13638666 -16181534 -20587943 -18281126 -14957653 -17228642 -18816328 -13899377
10450a3899377M372960k382799k543003K977839J694778m763161l039935N343208
$$ -13899377 -9526417 -11909216 -14452219 -11474380 -9779602 -14542763 -17582698 -12239490
10442a2239490N499088k958240m765503L060862O450959K34959l946738J36651
$$ -12239490 -6740402 -9698642 -14464145 -11403283 -4952324 -4717365 -8664103 -8527452
10434h527452L908869J682111o93253M12316M57911j595617q37482J656266p68926
$$ -8527452 -4618583 -2936472 -3629725 -3217409 -2759498 -4355115 -5192597 -3536331 -4305257
10425d305257o113232m910436K587372N609047J301503j253440J920535L679150
$$ -4305257 -10418489 -15328925 -12741553 -7132506 -5831003 -7084443 -5163908 -1484758
10417a484758K97903k204682m33166P01337j199296j504260J328135K367301K85689
$$ -1484758 -1186855 -3391537 -3824703 -3123366 -4322662 -5826922 -4498787 -2131486 -1845797
10408a845797l2813K163738J391305l001917m420424o77258K280052J210087P7717
$$ -1845797 -1878610 285128 1676433 -1325484 -5745908 -6423166 -4143114 -2933027 -2855310
10399b855310R42056L41359k312982k462727M97493J200171j764206l021642k42260
$$ -2855310 -1913254 -1571895 -3884877 -6347604 -5850111 -4649940 -6414146 -9435788 -9678048
10390i678048K172091J785310J569344K244201L58096l362142l046529J892651
$$ -9678048 -7505957 -5720647 -4151303 -1907102 -1549006 -4911148 -7957677 -6065026
10382f065026M463271J492888j587374q17221L14826j086812j853844K35535J789351
$$ -6065026 -1601755 -108867 -1696241 -2513462 -2198636 -3285448 -5139292 -4903757 -3114406
10373c114406N86222k20463J143718J265733j280536k041953J366027M031650
$$ -3114406 -2528184 -2748647 -1604929 -339196 -1619732 -3661685 -2295658 1735992
10365A735992J522144k839574l501537p18287J504515J509930K36002j166998
$$ 1735992 3258136 418562 -3082975 -3801262 -2296747 -786817 -550815 -1717813
10357a717813j224279R32107K939891J581519j424373j198369K000547K566236
$$ -1717813 -2942092 -2009985 929906 2511425 1087052 -111317 1889230 4455466
10349D455466r90507l348297j488049N79949n14261j865823m12751J381557N06441
$$ 4455466 3464959 116662 -1371387 -791438 -1305699 -3171522 -3584273 -2202716 -1696275
10340a696275j113731o46525N71391K29559o10094k42535K03920m81576p70045
$$ -1696275 -2810006 -3456531 -2885140 -2655581 -3265675 -3508210 -3304290 -3785866 -4555911
10331d555911N54895J821007J643516J284886J499005P43797j142213j467451
$$ -4555911 -4001016 -2180009 -536493 748393 2247398 2991195 1848982 381531
10323C81531O03790J864169K27057j814349j584739l08968q1292l50671p7818
$$ 381531 985321 2849490 3076547 1262198 -322541 -631509 -712801 -1063472 -1141290
10314a141290q821m17304N4579J257367Q55002j325634k211116o71423M44364
$$ -1141290 -1150111 -1567415 -1512836 -255469 599533 -726101 -2937217 -3608640 -3164276
10305c164276m79744j097753Q5402Q63064p3685m64337P02452O71362j479087
$$ -3164276 -3644020 -4741773 -4656371 -3793307 -3866992 -4331329 -3628877 -2957515 -4436602
10296d436602j918482J212998L309944M86992l383426k575163J340832K553974
$$ -4436602 -6355084 -5142086 -1832142 -1345150 -4728576 -7303739 -5962907 -3408933
10288c408933N05493k78217J511330K215888j14614k662619k503102l83861J293391
$$ -3408933 -2903440 -3181657 -1670327 545561 430947 -2231672 -4734774 -5118635 -3825244
10279c825244J484385O57414j04264J97001J272574J358080m53488k427346k221423
$$ -3825244 -2340859 -1683445 -1787709 -1590708 -318134 1039946 586458 -1840888 -4062311
10270d062311L9238K140625K511598J346860k54864j221961j213826r55234j120050
$$ -4062311 -4023073 -1882448 629150 1976010 1721146 499185 -714641 -1669875 -2789925
10261b789925j025102J22889J137390L38304j147353n84583J738228K552983Q88516
$$ -2789925 -3815027 -3692138 -2554748 -2216444 -3363797 -3948380 -2210152 342831 1231347
10252A231347n08655j66532k21848j882054k610223n83381J557729O93042j750262
$$ 1231347 722692 556160 334312 -1547742 -4157965 -4741346 -3183617 -2490575 -4240837
10243d240837k064924M15257L196372M241718L243146P88381j593833j991612
$$ -4240837 -6305761 -5890504 -2694132 1547586 4790732 5579113 3985280 1993668
10235A993668m34702Q63447P44173M35950N91185j37790k024293k871740j657061
$$ 1993668 1558966 2422413 3166586 3602536 4193721 4055931 2031638 -840102 -2497163
10226b497163m84123p60610o97467Q95249J781938L63960p76522Q84219K948384
$$ -2497163 -2981286 -3741896 -4439363 -3544114 -1762176 -1398216 -2174738 -1290519 1657865
10217A657865J673921j832239l356896j963647m08637j89098j87974K16279K66465
$$ 1657865 3331786 1499547 -1857349 -3820996 -4229633 -4418731 -4606705 -4390426 -4123961
10208d123961m3677J27607N54558L10494l16217l41177J25255M75755J005168
$$ -4123961 -4167638 -4040031 -3485473 -3174979 -3491196 -3832373 -3707118 -3231363 -2226195
10199b226195J841112J726312j22727k196102k620726j516939J95438K342029
$$ -2226195 -385083 1341229 1218502 -977600 -3598326 -5115265 -4919827 -2577798
10191b577798M014455L119428j28460j960256k84073J595079M4286k864203k753042
$$ -2577798 1436657 4556085 4427625 2467369 2183296 3778375 3822661 958458 -1794584
10182a794584o7290J175036J51008n10940k74642j030486k152610p79288K414159
$$ -1794584 -1861874 -686838 -535830 -1046770 -1321412 -2351898 -4504508 -5283796 -2869637
10173b869637L099926K31031j955412p47600R59300J6377j704564q30131J750730
$$ -2869637 230289 461320 -1494092 -2241692 -1282392 -1266015 -2970579 -3800710 -2049980
10164b049980K431354N47570r79611j91342J421644J340102o85570k437184j877858
$$ -2049980 381374 928944 -50667 -242009 1179635 2519737 1834167 -603017 -2480875
10155b480875M32782J978048J402892J9528m78420m90714j249728k254221j941323
$$ -2480875 -2048093 -70045 1332847 1352375 873955 383241 -866487 -3120708 -5062031
10146e062031k19696J542973K387052J924661j72759k752491k793579O84454L786730
$$ -5062031 -5281727 -3738754 -1351702 572959 400200 -2352291 -5145870 -4461416 -674686
10137f74686K404573j474101k439488M1576J163650r88577k381695j54616K417538
$$ -674686 1729887 255786 -2183702 -2142126 -978476 -1967053 -4348748 -4503364 -2085826
10128b085826J362203j686916k497773o22280J115103J474242J469311J507365
$$ -2085826 -723623 -2410539 -4908312 -5530592 -4415489 -2941247 -1471936 35429
10120C5429J116307O70655P01470L23657j289581k832271k556567j021710J04010
$$ 35429 1151736 1822391 2523861 2847518 1557937 -1274334 -3830901 -4852611 -4748601
10111d748601Q24181J885764K194265J40678k991174l894930j629514J295573
$$ -4748601 -3924420 -2038656 155609 296287 -2694887 -6589817 -8219331 -6923758
10103f923758K387331J558657o6773j568506k039889q39106J365664K982826L089015
$$ -6923758 -4536427 -2977770 -3044543 -4613049 -6652938 -7492044 -6126380 -3143554 -54539
10094e4539J785304m02892k243449j966220M23201K038872O65721j549838q62273
$$ -54539 1730765 1327873 -915576 -2881796 -2458595 -419723 245998 -1303840 -2166113
10085b166113K285083L687912J569387j314214k317775j949336j207794L18821
$$ -2166113 118970 3806882 5376269 4062055 1744280 -205056 -1412850 -1094029
10077a094029J981606J390545j467066k845372p20513J639583Q63094r72075j22712
$$ -1094029 887577 2278122 811056 -2034316 -2754829 -1115246 -252152 -1224227 -1346939
10068a346939K186585J945570n41270j245664M82050J019611q20919j671331K50820
$$ -1346939 839646 2785216 2243946 998282 1480332 2499943 1679024 7693 258513
10059B58513J901395P28218j148259j067977l49439j120860j751206M11576L761312
$$ 258513 2159908 2888126 1739867 671890 322451 -798409 -2549615 -2138039 1623273
10050A623273M133119R00108k350658k952478j748175n31891J57406K29368n38018
$$ 1623273 5756392 6656500 4305842 1353364 -394811 -926702 -769296 -539928 -1077946
10041a077946j535613j504622k51898J050060J458468J066666L45875k07693n4153
$$ -1077946 -2613559 -4118181 -4370079 -3320019 -1861551 -794885 -449010 -656703 -710856
10032g10856O82685R74354M04944Q2434P47298J110592j35371j746723j582151
$$ -710856 -28171 946183 1351127 1433561 2180859 3291451 3156080 1409357 -172794
10023a72794J7710R14192N61448J32987j71014j058764j711254n67077J415382
$$ -172794 -155084 759108 1320556 1453543 1282529 223765 -1487489 -2054566 -639184
10014f39184J572645n7074o45758M33516L99026j747573k795231m70906K493605
$$ -639184 933461 876387 230629 664145 1063171 -684402 -3479633 -3950539 -1456934
10005a456934K457400J48505j426632j818216k194515j671836J165266M274365
$$ -1456934 1000466 1148971 -277661 -2095877 -4290392 -5962228 -4796962 -522597
9997e22597M044257Q48008j359459j077512q01176j876659k031024K26366K392916
$$ -522597 3521660 4369668 3010209 1932697 1131521 -745138 -2776162 -2549796 -156880
9988a56880J717920n29231j302878l49233K97802M7056O1163M58284m389j336612
$$ -156880 1561040 1031809 -271069 -620302 -322500 -275444 -214281 244003 239614 -1096998
9978a096998j759241l66747J356565J417195l84569k452214k807437n14742L105962
$$ -1096998 -2856239 -3222986 -1866421 -449226 -833795 -3286009 -6093446 -6608188 -3502226
9969c502226M762466K367109j770137k919899J0333K582866P88581l100571l608841
$$ -3502226 1260240 3627349 1857212 -1062687 -1052354 1530512 2319093 -781478 -4390319
9960d390319K1585K756603J217401j524341q85429K258195L035641j22273l401690
$$ -4390319 -4368734 -1612131 -394730 -1919071 -2804500 -546305 2489336 2367063 -1034627
9951a034627l250151q38360O52260O67684Q38040J412855R56606o62790j562538
$$ -1034627 -4284778 -5123138 -4470878 -3803194 -2965154 -1552299 -595693 -1258483 -2821021
9942b821021p47042L36073K14144l33040R1937R15728N92997n43233o37598N71004
$$ -2821021 -3568063 -3231990 -3017846 -3350886 -3258949 -2343221 -1750224 -2293457 -2931055 -2360051
9932b360051J238764N12444o9396O55214J325298L27083j394272j774887p30194
$$ -2360051 -1121287 -608843 -678239 -23025 1302273 1629356 235084 -1539803 -2269997
9923b269997K40460O01861P54316L34091r01995j151887J393755M679141M393805
$$ -2269997 -2029537 -1427676 -673360 -339269 -1241264 -2393151 -999396 3679745 8073550
9914H073550J97720l096356k078268P36774J156737p69676k033863j736211j438563
$$ 8073550 8271270 5174914 3096646 3833420 4990157 4220481 2186618 450407 -988156
9905i88156j566581q71933O68758J321506L79428p17503n81902M23032J080146
$$ -988156 -2554737 -3426670 -2757912 -1436406 -1056978 -1774481 -2356383 -1933351 -853205
9896h53205O83810n93634j643886j003371J295440K922934J855192n93150j220378
$$ -853205 -169395 -763029 -2406915 -3410286 -2114846 808088 2663280 2070130 849752
9887H49752N63918J767026R1981k573255k492720P91821L411691J977189j544493
$$ 849752 1413670 3180696 3272677 699422 -1793298 -1001477 2410214 4387403 2842910
9878B842910j652214L280122P461827M193862m930994j0962533q403239j372818
$$ 2842910 1190696 4470818 11932645 16126507 11195513 232980 -8170259 -9543077
9870i543077K854105K750579J729154J477807O93026q10957j262084l05087L82324
$$ -9543077 -6688972 -3938393 -2209239 -731432 -38406 -849363 -2111447 -2416534 -2034210
9861b034210K27531M43084J175986R09623o35320j606478q06827P90653J895711
$$ -2034210 -1806679 -1363595 -187609 722014 86694 -1519784 -2326611 -1535958 359753
9852C59753K268970J868911O56983m38874l56777J61998m22073j520094j011059
$$ 359753 2628723 4497634 5154617 4715743 4358966 4520964 4098891 2578797 1567738
9843A567738R85845J695382j69155k392784k522432j000974J76015J95896l02525
$$ 1567738 2553583 4248965 4079810 1687026 -835406 -1836380 -1660365 -1464469 -1766994
9834a766994l70455N67197J996000K093796k81889l374834m111786k001113M53312
$$ -1766994 -2137449 -1570252 425748 2519544 2237655 -1137179 -5248965 -7250078 -6796766
9825f796766J298635R90746N28585k6670o55462r03797p35558l63764N55124J891618
$$ -6796766 -5498131 -4507385 -3978800 -4005470 -4660932 -5564729 -6300287 -6664051 -6108927 -4217309
9815d217309K053328L57147o94265J353956M352738M107707R26922r02817j85271
$$ -4217309 -2163981 -1806834 -2501099 -1147143 3205595 7313302 8240224 7337407 7152136
9806G152136k74339k569205l874459k240955m49613r19623j625731l06575J273018
$$ 7152136 6877797 4308592 434133 -1806822 -2256435 -3176058 -4801789 -5108364 -3835346
9797c835346Q42231j00692O60936J716628O56568j372693j579935p0606J050234
$$ -3835346 -2993115 -3093807 -2432871 -716243 -59675 -1432368 -3012303 -3082909 -2032675
9788b032675J367338J638066J305199j94055j227599k95264R34366P3835j909315
$$ -2032675 -665337 972729 2277928 2083873 856274 561010 1495376 1569211 -340104
9779c40104k232974o93178N21137L61544m43625j163581j090825O86147L191936
$$ -340104 -2573078 -3266256 -2745119 -2383575 -2827200 -3990781 -5081606 -4395459 -1203523
9770a203523L264665j663k876286k156084p9910l01817j697212r80714P95599
$$ -1203523 2061142 2059479 -816807 -2972891 -3052801 -3354618 -5051830 -6032544 -5236945
9761e236945R3028k094223j291804K529498M292017J994452l55212J86859J018760
$$ -5236945 -5143917 -7238140 -8529944 -6000446 -1708429 286023 -69189 117670 1136430
9752A136430n93893k359951r19548K401341L608315J760690n80594j296404m51831
$$ 1136430 542537 -1817414 -2736962 -335621 3272694 5033384 4452790 3156386 2704555
9743B704555R17723J585252M86359j907257l246989j844194J033364K604612J719580
$$ 2704555 3622278 5207530 5693889 3786632 539643 -1304551 -271187 2333425 4053005
9734D053005m35823k098188k370804j438780k81271R5587k96558m80619N8949
$$ 4053005 3617182 1518994 -851810 -2290590 -2571861 -2476274 -2772832 -3253451 -3194502
9725c194502N80429K14058o28457o92446L59809J272233O97862q81986j544316
$$ -3194502 -2614073 -2400015 -3028472 -3720918 -3361109 -2088876 -1391014 -2273000 -3817316
9716c817316n29813N74719K38776n41181M0315J341358J324012L43551N70792
$$ -3817316 -4347129 -3772410 -3533634 -4074815 -4034500 -2693142 -1369130 -1025579 -454787
9707d54787J588738O28996j920720j995656J063024K061578j697781m625915r60330
$$ -454787 1133951 1762947 -157773 -2153429 -1090405 971173 -726608 -5352523 -6312853
9698f312853N259790N324241j160084n858052l927657N16822K157488J111294
$$ -6312853 -1053063 4271178 3111094 -2746958 -6674615 -6157793 -4000305 -2889011
9690b889011j99372j105164j097564R51683L482030K684317j299015l254413p60075
$$ -2889011 -3088383 -4193547 -5291111 -4339428 -857398 1826919 527904 -2726509 -3486584
9681c486584J715430K25374j995912k88323L024003K222068k106410l611047l2931
$$ -3486584 -1771154 -1545780 -3541692 -3830015 -806012 1416056 -690354 -4301401 -4334332
9672d334332L689607L308095Q86888J76249O61321l18982k223101k055974L59599
$$ -4334332 -644725 2663370 3550258 3726507 4387828 4068846 1845745 -210229 149370
9663A49370J494279p32887l589261l103249N32161L391144L128273J355941K81722
$$ 149370 1643649 910762 -2678499 -5781748 -5249587 -1858443 1269830 2625771 2907493
9654B907493l79369j548467k146377q77242Q76658R01206p4233K97552J440142
$$ 2907493 2528124 979657 -1166720 -2043962 -1167304 -266098 -340331 -42779 1397363
9645A397363M40081k543976l511476o25550K704065K838735Q26692k37488r462
$$ 1397363 1837444 -706532 -4218008 -4843558 -2139493 699242 1525934 1288446 1278984
9636A278984m9237l26607J60355P19858J27493n43726N43597K210000J328121
$$ 1278984 1229747 903140 1063495 1783353 1910846 1367120 1910717 4120717 5448838
9627E448838k188971m553291l089741M06993K418521J881954L74962m30060j21858
$$ 5448838 3259867 -1293424 -4383165 -3976172 -1557651 324303 699265 269205 147347
9618A47347Q33858J634620J531032L95770j078381j926807j604914l56104P76446
$$ 147347 981205 2615825 4146857 4542627 3464246 1537439 -67475 -423579 352867
9609C52867O62006o25732j603689j169721j06206K18922J24942J003452K531129
$$ 352867 1014873 389141 -1214548 -2384269 -2490475 -2271553 -2146611 -1143159 1387970
9600A387970K520082L02423j666591j132920N18655L25559j585480k080423M7021
$$ 1387970 3908052 4210475 2543884 1410964 1929619 2255178 669698 -1410725 -1363704
9591a363704J980363J024822j421147k150003q62303L1397l37711j23373J735496
$$ -1363704 616659 1641481 220334 -1929669 -2791972 -2760575 -3098286 -3221659 -1486163
9582a486163L373707K638688J94814j465782j175606k5993L64721l57816j070479
$$ -1486163 1887544 4526232 4721046 3255264 2079658 2053665 2418386 2060570 990091
9573I90091n18993Q78524J052791r43880k872873j844442J378903L012184J505308
$$ 990091 471098 1349622 2402413 1458533 -1414340 -3258782 -1879879 1132305 2637613
9564B637613m97032m87623K79691o30028k702342l208299r53806K479579M464415
$$ 2637613 2140581 1652958 1932649 1302621 -1399721 -4608020 -5561826 -3082247 1382168
9555A382168L279387m64505l578313l137042k65075J095144j28364p71508R11457
$$ 1382168 4661555 4197050 618737 -2518305 -2783380 -1688236 -1816600 -2588108 -1676651
9546a676651K014566P973k599756k217793J75380J330778J129629J365069J353191
$$ -1676651 337915 345888 -2253868 -4471661 -4296281 -2965503 -1835874 -470805 882386
9537H82386m89521k377725j415652J060355J326946m78402r96284K11226M85658
$$ 882386 392865 -1984860 -3400512 -2340157 -1013211 -1491613 -2487897 -2276671 -1791013
9528a791013l21064L60734K257576K129663j35222r17472N85750Q36820j472319
$$ -1791013 -2112077 -1751343 506233 2635896 2500674 1583202 2168952 3005772 1533453
9519A533453k876475j241814Q25991J055616R99047J830431J451989j260131l631915
$$ 1533453 -1343022 -2584836 -1758845 -703229 295818 2126249 3578238 2318107 -1313808
9510a313808l444599j988696n32898J765609M101952L333089j19177j228219J383130
$$ -1313808 -4758407 -6747103 -7280001 -5514392 -1412440 1920649 1801472 573253 1956383
9501A956383K232391j615408m470224j342046K918500J543909k349636j185977
$$ 1956383 4188774 2573366 -1896858 -3238904 -320404 1223505 -1126131 -2312108
9493b312108L455391L115126k900316n798324j431085L633812L185321m1049j137435
$$ -2312108 1143283 4258409 1358093 -4440231 -5871316 -2237504 947817 906768 -230667
9484b30667j102653k697815l816981j123696L228326M298982J759077m23931m15654
$$ -230667 -1333320 -4031135 -7848116 -8971812 -5743486 -1444504 314573 -109358 -525012
9475e25012k0212k70954K01729J875296K810834J563142o80641j945494j803995
$$ -525012 -545224 -816178 -614449 1260847 4071681 5634823 4954182 3008688 1204693
9466A204693r80791k6213O51946N54533o8790n8844Q14251P61363j530589l869612
$$ 1204693 223902 197689 849635 1404168 1335378 1276534 2090785 2852148 1321559 -2548053
9456b548053k599892J799819M115305J350360k438568j636859K536741L781060
$$ -2548053 -5147945 -3348126 767179 2117539 -321029 -1957888 578853 4359913
9448D359913L19757k652856j424430P20366m21305k908851k291159O91406J341523
$$ 4359913 4679670 2026814 602384 1322750 901445 -2007406 -4298565 -3607159 -2265636
9439b265636j268612k899642p80434K568486L391778J558449j92599l6783J237737
$$ -2265636 -3534248 -6433890 -7214324 -4645838 -1254060 304389 111790 75007 1312744
9430A312744J518148k23436k551460k979167j055066J074479J725401J557782
$$ 1312744 2830892 2607456 55996 -2923171 -3978237 -2903758 -1178357 379425
9422C79425J410609N23860j298485k079341o96613N94412m16151j915812r37161
$$ 379425 1790034 2313894 1015409 -1063932 -1760545 -1166133 -1582284 -3498096 -4435257
9413d435257J513011K160491J040855R12431J698403M11598k898358l963881p30525
$$ -4435257 -2922246 -761755 279100 1191531 2889934 3301532 403174 -3560707 -4291232
9404d291232L079607L157623K84214j671764j176647O9778L41399k09527m83757
$$ -4291232 -1211625 1945998 2230212 558448 -618199 -548421 -207022 -416549 -900306
9395i00306O723N75283K57988n16091q076K070934L141257J015140k501020l737799
$$ -900306 -893583 -318300 -60312 -576403 -584479 1486455 4627712 5642852 3141832 -595967
9385e95967k110071j67736O52799J128162J398638N72189n50186Q9540J958577
$$ -595967 -2706038 -2873774 -2220975 -1092813 305825 878014 327828 417368 2375945
9376B375945K000847m57275k289091j364466N07620R73025L52448k27084r11339
$$ 2375945 4376792 3919517 1630426 265960 773580 1746605 2099053 1871969 960630
9367I60630j496391o67414J183528J348298q18489j995567j7154K153592R47000
$$ 960630 -535761 -1203175 -19647 1328651 510162 -1485405 -1502559 651033 1598033
9358A598033j898574j976935Q56348K410223N13554k308635k815675q10100J590890
$$ 1598033 -300541 -2277476 -1421128 989095 1502649 -805986 -3621661 -4431761 -2840871
9349b840871K294157N15836k546890m204419k831111K36404K503612L274609L353381
$$ -2840871 -546714 -30878 -2577768 -6782187 -9613298 -9376894 -6873282 -3598673 -245292
9340b45292K805737J089453j106090k167283j530317J19553J982678K973701J611718
$$ -245292 2560445 3649898 2543808 376525 -1153792 -1034239 948439 3922140 5533858
9331E533858j718495l556150j287139K484039K833786m62924k631471j148673
$$ 5533858 3815363 259213 -1027926 1456113 4289899 3826975 1195504 46831
9323D6831Q57403J85197j411030p46539J340855J854900R15088R46795J593044
$$ 46831 904234 1089431 -321599 -1068138 272717 2127617 3042705 3989500 5582544
9314E582544n1599l832304n506914k858202Q43158J769111Q11401R29272J756041
$$ 5582544 5530945 1698641 -3808273 -6666475 -5823317 -4054206 -3242805 -2313533 -557492
9305e57492P87445j390022j456001R75469K227895L32620j750612q09917J698349
$$ -557492 229953 -1160069 -2616070 -1640601 587294 919914 -830698 -1640615 57734
9296E7734K194172L74960r73621m11526Q05963J314492J041075J73093j094534
$$ 57734 2251906 2626866 1653245 1241719 2047682 3362174 4403249 4576342 3481808
9287C481808j807569j125213J27635M58006m6312k32237j80626q85981j931954
$$ 3481808 1674239 549026 676661 1134667 1088355 856118 675492 -210489 -2142443
9278b142443j775072l22100J006836J746100K516289K722147R76745j713066k208776
$$ -2142443 -3917515 -4239615 -3232779 -1486679 1029610 3751757 4728502 3015436 806660
9269H06660K01214K261917J266191j294837k274299r93488R05697J968241J651307
$$ 806660 1007874 3269791 4535982 3241145 966846 -26642 879055 2847296 4498603
9260D498603R8666j394196j216818J49078M31849o87157o28367J703572L344659
$$ 4498603 4597269 3203073 1986255 2135333 2567182 1880025 1251658 2955230 6299889
9251F299889J476403k177096l921265l024912j202891Q12185K831538L083244
$$ 6299889 7776292 5599196 1677931 -1346981 -2549872 -1737687 1093851 4177095
9243D177095L59491k799730k886490n86011O84370N38624J398362K864201J621606
$$ 4177095 4536586 1736856 -1149634 -1735645 -1051275 -512651 885711 3749912 5371518
9234E371518k106143l407687k58090K651942J021618k269202j823925J775340
$$ 5371518 3265375 -142312 -400402 2251540 3273158 1003956 -819969 955371
9226I55371L119545K74527k847408k488337M39823K590978K102390m68439k949406
$$ 955371 4074916 4349443 1502035 -986302 -546479 2044499 4146889 3678450 729044
9217G29044k864326Q7460K739716J810481j437638k547845k62743J597372N21
$$ 729044 -2135282 -2047822 691894 2502375 1064737 -1483108 -1745851 -148479 -147958
9208a47958k688345k502803N9009J096783o44676k218589j096331J551826L035276
$$ -147958 -2836303 -5339106 -5280097 -4183314 -4827990 -7046579 -8142910 -6591084 -3555808
9199c555808K389684M05396j740985k640739j073947K057300L396058P76365l262413
$$ -3555808 -1166124 -760728 -2501713 -5142452 -6216399 -4159099 -763041 13324 -3249089
9190c249089l779985L67160M605543M149740K5005k360601k52982L117914L138712
$$ -3249089 -7029074 -6661914 -2056371 2093369 2118374 -242227 -495209 2622705 5761417
9181E761417j60732k729865k234051n04042N4177k32988q4304n9162j172228k245878
$$ 5761417 5600685 2870820 636769 132727 186904 -46084 -130388 -189550 -1361778 -3607656
9171c607656j500674Q5927J37906q02965R2535K674697L209656M69204j644836
$$ -3607656 -5108330 -5022403 -4884497 -5687462 -5594927 -2920230 289426 758630 -886206
9162h86206j89531J852761N28666k183819j419231K298596L451239K14816k733451
$$ -886206 -1075737 777024 1305690 -878129 -2297360 1236 3452475 3667291 933840
9153I33840j616585J067885J273695l50356n23956Q61355R14135j246502l072415
$$ 933840 -682745 385140 1658835 1308479 784523 1645878 2560013 1313511 -1758904
9144a758904k351803Q443J552857J205773J02242R9706J568064K653103J450267
$$ -1758904 -4110707 -4102264 -2549407 -1343634 -1241392 -1141686 426378 3079481 4529748
9135D529748j111416k089782p14513K98735j071124k804709j972660M72612J132332
$$ 4529748 3418332 1328550 614037 912772 -158352 -2963061 -4935721 -4463109 -3330777
9126c330777l89828r49802R15921K636198J868828K18384L79575J609302J017376
$$ -3330777 -3720605 -4670407 -3754486 -1118288 750540 968924 1348499 2957801 3975177
9117C975177j475857k602574o22404J904377J646872r64441k606763j532712P90350
$$ 3975177 2499320 -103254 -725658 1178719 2825591 1861150 -745613 -2278325 -1487975
9108a487975K225924K219806J220315l50084j722157j797491n54560O53362J063842
$$ -1487975 737949 2957755 4178070 3827986 2105829 308338 -246222 407140 1470982
9099A470982J469165K172482J622586j105467l835559l664566j022248J094391
$$ 1470982 2940147 5112629 6735215 5629748 1794189 -1870377 -2892625 -1798234
9091a798234J408267J202742J133810K70363j256365j665137n46744K62036q0907
$$ -1798234 -389967 812775 1946585 2216948 960583 -704554 -1251298 -989262 -1070169
9082a070169q4069Q38983P65290j161819k427047r89219J068398P79532q65664
$$ -1070169 -1154238 -315255 450035 -711784 -3138831 -4128050 -3059652 -2280120 -3145784
9073c145784p78427R76725J508347K2087j188861p02585K87342N83914N69792
$$ -3145784 -3924211 -2947486 -1439139 -1417052 -2605913 -3308498 -3021156 -2437242 -1867450
9064a867450O37912M35666J79513N75333J090566M47041r17224j145746k1109
$$ -1867450 -1229538 -793872 -614359 -39026 1051540 1498581 581357 -564389 -585498
9055e85498O59748J90047r0344L93615L18413p67106j035491P23787K823410K909203
$$ -585498 74250 264297 173953 567568 885981 118875 -916616 -192829 2630581 5539784
9045E539784R65413j190760k056878j194184O22673J338949l99956k625803j870383
$$ 5539784 6505197 5314437 3257559 2063375 2686048 4024997 3625041 999238 -871145
9036h71145J542774L071106L80279l050212l130990q28827N23451P07475J413022
$$ -871145 671629 3742735 4123014 1072802 -2058188 -2887015 -2363564 -1656089 -243067
9027b43067J791744q5238k526377j838235J567982L255685J308402j457327k421048
$$ -243067 1548677 1463439 -1062938 -2901173 -1333191 1922494 3230896 1773569 -647479
9018f47479k050540r64088J436349L814576K814952j492641m103359j891187J727297
$$ -647479 -2698019 -3662107 -2225758 1588818 4403770 2911129 -1192230 -3083417 -1356120
9009a356120K209320M56243l0357N08499n18549k314735j638930J208962K340416
$$ -1356120 853200 1309443 1279086 1787585 1269036 -1045699 -2684629 -1475667 864749
9000H64749M47337j407414q90266O35966J230523R52459K49070r88684j720115
$$ 864749 1312086 -95328 -985594 -349628 880895 1833354 2082424 1093740 -626375
8991f26375l51938J854273J433088j744637l193699k28908L741871M103326J274754
$$ -626375 -978313 875960 2309048 564411 -2629288 -2858196 883675 4987001 6261755
8982F261755j084574j635659j619680j419323n24838K06509l57424j109997m01299
$$ 6261755 5177181 3541522 1921842 502519 -22319 184190 -173234 -1283231 -1684530
8973a684530O74977k14j419494p86672J357754J448981j239797l097230j714598
$$ -1684530 -1009553 -1009767 -2429261 -3215933 -1858179 -409198 -1648995 -4746225 -6460823
8964f460823P88992J702736J625492K186511K709661J816658K60656m81518q19198
$$ -6460823 -5671831 -3969095 -2343603 -157092 2552569 4369227 4629883 4148365 3329167
8955C329167j708462k130796o46390J516872J753935L1888j131326o08763k1350
$$ 3329167 1620705 -510091 -1156481 360391 2114326 2146214 1014888 406125 384775
8946C84775p23215j749888j662720o10131M79110J311018J809385J546271O99029
$$ 384775 -338440 -2088328 -3751048 -4361179 -3882069 -2571051 -761666 784605 1483634
8937A483634M62979J230408J335630p25804l397800l431454m09197K102472J056338
$$ 1483634 1946613 3177021 4512651 3786847 389047 -3042407 -3451604 -1349132 -292794
8928b92794j952436k856816n84943J862176J890368N69928K91992J036541R47165
$$ -292794 -2245230 -5102046 -5686989 -3824813 -1934445 -1364517 -1072525 -35984 911181
8919I11181l21534j043510j74890J213857J675243J037061k06927j724930k807744
$$ 911181 589647 -453863 -628753 585104 2260347 3297408 3090481 1365551 -1442193
8910a442193k322236k85360J476885J362069m5768j069752j187028r41357m12465
$$ -1442193 -3764429 -4049789 -2572904 -1210835 -1256603 -2326355 -3513383 -4454740 -4867205
8901d867205N57414J101955L09677o00144N69383L098495L271651k05091l274712
$$ -4867205 -4309791 -3207836 -2898159 -3498303 -2928920 169575 3441226 3236135 -38577
8892c8577j840919J904229K392749q49845k426948L24437K955545J012152k784386
$$ -38577 -1879496 24733 2417482 1567637 -859311 -534874 2420671 3432823 648437
8883F48437k959612R4674J408779j50539p42234J093788J929398j13282j830033
$$ 648437 -2311175 -2216501 -807722 -958261 -1700495 -606707 1322691 1209409 -620624
8874f20624n08669J562139J374577M4409j70454j89976j558790k619794j377312
$$ -620624 -1129293 432846 1807423 1851832 1681378 1491402 -67388 -2687182 -4064494
8865d064494M56764N04427K33954J833885L122016R65562k277834j861309J090618
$$ -4064494 -3607730 -3103303 -2869349 -1035464 2086552 3052114 774280 -1087029 3589
8856C589J103103k168635l076311L86178L091423J278724j786928j916442k75697
$$ 3589 1106692 -1061943 -4138254 -3752076 -660653 618071 -1168857 -3085299 -3360996
8847c360996K09606P4850R12759J572636O73524l39960j90368n53821k365802
$$ -3360996 -3151390 -3076540 -2163781 -591145 82379 -257581 -447949 -1001770 -3367572
8838c367572k818146j8359K677407J511177j352262j251303J471879K535253P66991
$$ -3367572 -6185718 -6204077 -3526670 -2015493 -3367755 -4619058 -3147179 -611926 155065
8829A55065j004189j267160j189384r80519N82749K845540L435043J998188M19759
$$ 155065 -849124 -2116284 -3305668 -4286187 -3703438 -857898 2577145 4575333 4995092
8820D995092n83960j760209k553734j633329Q885J06493q63888m21064J273173
$$ 4995092 4411132 2650923 97189 -1536140 -1527255 -1420762 -2284650 -2705714 -1432541
8811a432541J511225k8188o68449L09910M12211j199372j822102R595J764852
$$ -1432541 78684 50496 -617953 -308043 104168 -1095204 -2917306 -2907711 -1142859
8802a142859J197732m8410L00227J229806O26502r33312j475255j010011q69489
$$ -1142859 54873 6463 306690 1536496 2162998 1229686 -245569 -1255580 -2125069
8793b125069q80795J54294J797041K148269O66646r32146r42360J90477N35644
$$ -2125069 -3005864 -2851570 -1054529 1093740 1760386 828240 -114120 76357 612001
8784F12001p02721j780816n46473K009390K255051q04215l082678r14707L053385
$$ 612001 -90720 -1871536 -2418009 -408619 1846432 1042217 -2040461 -2955168 98217
8775I8217L413461J51301j677082k70738M76912j780067l648539j868974J274853
$$ 98217 3511678 3662979 1985897 1715159 2192071 412004 -3236535 -5105509 -3830656
8766c830656K031122R33774O04629Q85991K25302n77119r1970L54630q90277j882191
$$ -3830656 -1799534 -865760 -261131 624860 850162 273043 181073 535703 -354574 -2236765
8756b236765M2557K963223K671003n26679k091429l06199J554525P56587j337142
$$ -2236765 -2194208 769015 3440018 2913339 821910 515711 2070236 2826823 1489681
8747A489681k356744k030501r81806N17571J492775P59040o73771n11005Q84861
$$ 1489681 -867063 -2897564 -3879370 -3361799 -1869024 -1109984 -1783755 -2294760 -1409899
8738a409899P22163j229486j653629P61239K683651J469680n19490j71260R66763
$$ -1409899 -687736 -1917222 -3570851 -2809612 -125961 1343719 824229 652969 1619732
8729A619732l71896l009003k755616P77067L245781J862403j080626k026064n93808
$$ 1619732 1247836 -1761167 -4516783 -3739716 -493935 1368468 287842 -1738222 -2332030
8720b332030J149200J723785J149289K14367j38381L14648M05651j014069k823375
$$ -2332030 -1182830 540955 1690244 1904611 1766230 2080878 2486529 1472460 -1350915
8711a350915k496963K47341K503805J901701l43485j428690o69151L87259N97447
$$ -1350915 -3847878 -3600537 -1096732 804969 461484 -967206 -1636357 -1249098 -651651
8702f51651K15324l25352r60284j303470p56944M37783J254646J205908P73952
$$ -651651 -436327 -761679 -1721963 -3025433 -3782377 -3344594 -2089948 -884040 -110088
8693a10088M00995j3516l29698J09102J291666J832486M57118k024795l230366
$$ -110088 290907 277391 -52307 56795 1348461 3180947 3638065 1613270 -1617096
8684a617096j966305K75987J186293M77180j08349M47074R57058N3718j387882
$$ -1617096 -3583401 -3307414 -2121121 -1643941 -1752290 -1305216 -348158 -294440 -1682322
8675a682322j341202K35940J135872J47652j138345q13604M64365O92661j99779
$$ -1682322 -3023524 -2787584 -1651712 -1504060 -2642405 -3456009 -2991644 -2298983 -2498762
8666b498762k92606J093944K046907Q32144j331130j686196L46267K301837J839507
$$ -2498762 -2791368 -1697424 349483 1181627 -149503 -1835699 -1489432 812405 2651912
8657B651912l24373j571652r15370k9735n20002j560748j320058K17682J341267
$$ 2651912 2327539 755887 -159483 -189218 -709220 -2269968 -3590026 -3372344 -2031077
8648b031077J072681J6815r55484j226987L6522K731006M281226K025924k328607
$$ -2031077 -958396 -941581 -1897065 -3124052 -3087530 -356524 3924702 5950626 3622019
8639C622019l807597j034736J439602k7137k538551j513873J772875K403378r1118
$$ 3622019 -185578 -1220314 219288 192151 -2346400 -3860273 -2087398 315980 224862
8630B24862j291931O78557K607945J970977M10573j73013o49325j666306j574683
$$ 224862 -1067069 -388512 2219433 4190410 4600983 4427970 3778645 2112339 537656
8621E37656J45118R04779p36322k027914l74430K128089K037731R1524n11162
$$ 537656 682774 1587553 851231 -1176683 -1551113 576976 2614707 2706231 2195069
8612B195069L55258P4440j678581k322699q70127N67677M92874K27972J207069
$$ 2195069 2550327 2624767 946186 -1376513 -2246640 -1678963 -1186089 -958117 248952
8603B48952K342969J662172o64183k310313j550209O89150J786232M77676j532570
$$ 248952 2591921 4254093 3589910 1279597 -270612 418538 2204770 2682446 1149876
8594A149876j795009m01206N37168L62152M25322R19831J36172j996242k724504
$$ 1149876 -645133 -1046339 -509171 -147019 278303 1198134 1334306 -661936 -3386440
8585c386440p26547J368061J094048m3884K18922O52084q36842k559170j319679
$$ -3386440 -4112987 -2744926 -1650878 -1694762 -1475840 -823756 -1660598 -4219768 -5539447
8576e539447K008245L484930K039675L58774J06682J20801n25806j195379j671806
$$ -5539447 -3531202 -46272 1993403 2352177 2458859 2579660 2053854 858475 -813331
8567h13331k309280k119270J41995K955672L321425J130011q90011j474811j652558
$$ -813331 -3122611 -5241881 -5099886 -2144214 1177211 2307222 1417211 -57600 -1710158
8558a710158j427798M00416K750420K683314K18448j167842o91J061545J09j391485
$$ -1710158 -3137956 -2737540 12880 2696194 2914642 1746800 1746109 2807654 2807763 1416278
8548A416278j001311K28915M97199m5355n38010j013846j225102k68061J351384
$$ 1416278 414967 643882 1141081 1095726 557716 -456130 -1681232 -1949293 -597909
8539e97909J702046M23525q29831j418876k050991j878501O11739L305140K124427
$$ -597909 1104137 1527662 697831 -721045 -2772036 -4650537 -4038798 -733658 1390769
8530A390769j744505k091830K464656N110977J195065m136792m032439k80625
$$ 1390769 -353736 -2445566 19090 5130067 6325132 2188340 -1844099 -2124724
8522b124724J042595q6570O72164K866832K026596j503922k485950J76112J690908
$$ -2124724 -1082129 -1168699 -496535 2370297 4396893 2892971 407021 583133 2274041
8513B274041j48483j604590r3869J618844J011196L0872N62979N80711j566948
$$ 2274041 2125558 520968 427099 2045943 3057139 3088011 3650990 4231701 2664753
8504B664753l232064j790459N29024K27279j755685k039216m47705M99485L82330
$$ 2664753 -567311 -2357770 -1828746 -1601467 -3357152 -5396368 -5844073 -5344588 -4962258
8495d962258J083323K775080L389609K081950J39266j579124l156586l483883
$$ -4962258 -3878935 -1103855 2285754 4367704 4506970 2927846 -228740 -3712623
8487c712623q64886L350337M766923J368283l234024m097370j111600J418314
$$ -3712623 -4577509 -1227172 3539751 4908034 1674010 -2423360 -3534960 -2116646
8479b116646P69397j006523m92922K245015L772502J821677j798512l524744k383811
$$ -2116646 -1347249 -2353772 -2846694 -601679 3170823 4992500 3193988 -330756 -2714567
8470b714567o86664m57133p98960J80378K093365K754501J535875K03924M9667
$$ -2714567 -3401231 -3858364 -4657324 -4476946 -2383581 370920 1906795 2110719 2160386
8461B160386J52735n11360j027617k22171R42742O58834q06569j550733r93182
$$ 2160386 2313121 1801761 774144 551973 1494715 2153549 1346980 -203753 -1196935
8452a196935k78964R3777P53505J410040P70928r19501j665373q68735k05332
$$ -1196935 -1475899 -1382122 -628617 781423 1552351 632850 -1032523 -1901258 -2106590
8443b106590l08602N70626K874336L675737R75802k415851k553878o5374J319780
$$ -2106590 -2415192 -1844566 1029770 4705507 5681309 3265458 711580 646206 1965986
8434A965986N61391j67130L0805l03091j580443k263012j721273q95167R7171
$$ 1965986 2527377 2360247 2391052 2087961 507518 -1755494 -3476767 -4371934 -4274763
8425d274763J891789L303339K240215m04970j329987J7364N15491j323367k863623
$$ -4274763 -2382974 920365 3160580 2755610 1425623 1442987 1958478 635111 -2228512
8416b228512j833624J38864N68627k18605n89799l08594J60671P81382Q69516
$$ -2228512 -4062136 -3923272 -3354645 -3573250 -4163049 -4471643 -4310972 -3529590 -2660074
8407b660074o16906k417427j625129J458441K630950J23650k059907j63881L368222
$$ -2660074 -3276980 -5694407 -7319536 -5861095 -3230145 -3106495 -5166402 -5330283 -1962061
8398a962061L760983J026724r80897p70216k17249l84742k86455M31731P65513
$$ -1962061 1798922 2825646 1844749 1074533 857284 472542 186087 617818 1383331
8389A383331K92362m81061j304060j811137r36675J318682K786107J887384P5859
$$ 1383331 1675693 1194632 -109428 -1920565 -2857240 -1538558 1247549 3134933 3210792
8380C210792o09322o50799j255012j466377j23352J168049M82802o25816M07233
$$ 3210792 2601470 1950671 695659 -770718 -894070 273979 756781 130965 538198
8371E38198K243981J456486j490106k526256k76580K147677K193680Q16192m72316
$$ 538198 2782179 4238665 2748559 222303 -54277 2093400 4287080 5103272 4630956
8362D630956j826756l053856k642334m78098J108071P12804Q0479J162746K731685
$$ 4630956 2804200 -249656 -2891990 -3370088 -2262017 -1549213 -1468734 -305988 2425697
8353B425697K021199j069419l360596k299802O50274J665406l61375k004704j40979
$$ 2425697 4446896 3377477 16881 -2282921 -1632647 32759 -328616 -2333320 -2474299
8344b474299K899750K298780j635356l363195o62088J860572N02836j461904J46887
$$ -2474299 425451 2724231 1088875 -2274320 -2936408 -1075836 -573000 -2034904 -1888017
8335a888017K874750K034629q11562o03779K091555J979822j660026l785645k169585
$$ -1888017 986733 3021362 2209800 1606021 3697576 5677398 4017372 231727 -1937858
8326a937858l57849p42167j032957L43200J136146Q5725l30423J261004K168028
$$ -1937858 -2295707 -3037874 -4070831 -3727631 -2591485 -2505760 -2836183 -1575179 592849
8317E92849M28953j579453j291910O074J89718o9418M89544J033483Q29875J039415
$$ 592849 1021802 -557651 -1849561 -1843487 -1653769 -1723187 -1233643 -200160 629715 1669130
8307A669130J792738P97759k329323l765531r20968K864936K904300l3039j599705
$$ 1669130 3461868 4259627 1930304 -1835227 -2756195 108741 3013041 2980002 1380297
8298A380297p51004l93162j886896k997643j796221M45147J319175N07520p7807
$$ 1380297 629293 236131 -1650765 -4648408 -6444629 -5999482 -4680307 -4172787 -4250594
8289d250594J145233L200157L340888O09742k272666k219459j85829L30047j190934
$$ -4250594 -3105361 94796 3435684 4045426 1772760 -446699 -632528 -302481 -1493415
8280a493415j685444J14214J490004M40658r15687Q5107K436028L276288J901047
$$ -1493415 -3178859 -3064645 -1574641 -1133983 -2049670 -1964563 471465 3747753 5648800
8271E648800j76917j526138j527674m19157K74414p78307k158283j181855J437902
$$ 5648800 5471883 3945745 2418071 1998914 2273328 1495021 -663262 -1845117 -407215
8262d07215J786841j200191l620594k405630M75964J959748K344491K925760K623407
$$ -407215 1379626 179435 -3441159 -5846789 -5370825 -3411077 -1066586 1859174 4482581
8253D482581L79279j890448k083385j210283r29710m65764R46978J453471j33780
$$ 4482581 4861860 2971412 888027 -322256 -1251966 -1717730 -770752 682719 548939
8244E48939j319938J1428J375477k09783k559038j634172J538760K483584N11854
$$ 548939 -770999 -759571 615906 406123 -2152915 -3787087 -2248327 235257 747111
8235G47111q71655k20772K03589q59206j782643j391077m80690L93772J449584
$$ 747111 -124544 -345316 -141727 -1000933 -2783576 -4174653 -4655343 -4261571 -2811987
8226b811987J931441Q55843p14831j038529o92685j157544j492189o9712J520848
$$ -2811987 -880546 -24703 -739534 -1778063 -2470748 -3628292 -5120481 -5190193 -3669345
8217c669345O49686j127844j0396L093250L048616j194880m246230k208641J899343
$$ -3669345 -3019659 -4147503 -4157899 -1064649 1983967 789087 -3457143 -5665784 -3766441
8208c766441L369574K271402J397396J058980k86266k196367k591313j166336
$$ -3766441 -396867 1874535 3271931 4330911 4044645 1848278 -743035 -1909371
8200a909371K03048K37948l55488k28348R10545J926403J427172k96899j024795
$$ -1909371 -1706323 -1468375 -1823863 -2052211 -1141666 784737 2211909 1915010 890215
8191H90215M93052K070141O23155l041580m568182j753436K487782L925871J847590
$$ 890215 1383267 3453408 4076563 1034983 -3533199 -5286635 -2798853 1127018 2974608
8182B974608j075706k164138q18757J549399K696680J503871p56125j949105j799579
$$ 2974608 1898902 -265236 -1083993 465406 3162086 4665957 3909832 1960727 161148
8173A61148j706624j989896j331039N77014J855118R92985q89380j507830k11975
$$ 161148 -1545476 -3535372 -4866411 -4289397 -2434279 -1441294 -2330674 -3838504 -4050479
8164d050479J608403K278244J352743j69279p87022L3010J297231J640121P20264
$$ -4050479 -2442076 -163832 1188911 1019632 232610 265620 1562851 3202972 3923236
8155C923236p80905j878548j724549l82599N43997l34620j410651M37243M414547
$$ 3923236 3142331 1263783 -460766 -843365 -299368 -633988 -2044639 -1607396 2807151
8146B807151N122603n9724n956095n911477r59076K051012L57412j841670o47078
$$ 2807151 7929754 7870030 1913935 -3997542 -4956618 -2905606 -2548194 -4389864 -5036942
8137e036942K315938L443233K159679M61472o7378O38762J315526K57922k299984
$$ -5036942 -2721004 722229 2881908 3343380 3276002 3914764 5230290 5488212 3188228
8128C188228l292093p42619K425857J911693j475014l042293j544574l84347j109724
$$ 3188228 -103865 -846484 1579373 3491066 2016052 -1026241 -2570815 -2955162 -4064886
8119d064886j067900R54224J965334J11137j813654j096390O93015J254624J481352
$$ -4064886 -5132786 -4178562 -2213228 -2102091 -3915745 -5012135 -4319120 -3064496 -1583144
8110a583144K508686K445842j48109k567631j758774O23783R20550q15861j740503
$$ -1583144 925542 3371384 3223275 655644 -1103130 -479347 441203 -374658 -2115161
8101b115161j145470n30773q0371J034990J792645N62872j371537j170108J003754
$$ -2115161 -3260631 -3791404 -3871775 -2836785 -1044140 -481268 -1852805 -3022913 -2019159
8092b019159K243489J611970J123582J700593J540691m49248k381022k039007
$$ -2019159 224330 1836300 2959882 4660475 6201166 5751918 3370896 1331889
8084A331889K7185J422977Q45213q20448j706327q39724Q23248J391410M03318
$$ 1331889 1359074 2782051 3627264 2806816 1100489 260765 1084013 2475423 2878741
8075B878741n51930k25363M25135o1001j237882j685652j410263j397318j436920
$$ 2878741 2326811 2101448 2526583 2465582 1227700 -457952 -1868215 -3265533 -4702453
8066d702453n17016R02508J215206M08743L15616J504397J937404j1822k689937
$$ -4702453 -5219469 -4316961 -3101755 -2693012 -2377396 -872999 1064405 1052583 -1637354
8057a637354l063773q58766J070601P63786k26830M86364K121676J726872r69808
$$ -1637354 -4701127 -5559893 -4489292 -3725506 -3952336 -3465972 -1344296 382576 -587232
8048e87232k518967p49389J834416J881239J52886m22529J50956k89105j259276
$$ -587232 -3106199 -3855588 -2021172 -139933 12953 -409576 -258620 -547725 -1807001
8039a807001j98900K216517K220641o35174k108223j29333J775780O92021o69498
$$ -1807001 -2005901 210616 2431257 1796083 -312140 -441473 1334307 2026328 1356830
8030A356830R22575K957557R67486l810942n647054k293333K554832M565628L059415
$$ 1356830 2279405 5236962 6204448 2393506 -3253548 -5546881 -2992049 1573579 4632994
8021D632994L0893k223351k403054j219197q09558j676568j552938Q66322L094681
$$ 4632994 4663887 2440536 37482 -1181715 -1991273 -3667841 -5220779 -4354457 -1259776
8012a259776K423822K97821k12021N03897l5146j339296p74590J180960J257698
$$ -1259776 1164046 1461867 1249846 1753743 1718597 379301 -395289 785671 2043369
8003B043369q27181j614508Q5272R41814j246431l589195k459488J082969L140434
$$ 2043369 1216188 -398320 -313048 628766 -617665 -4206860 -6666348 -5583379 -2442945
7994b442945K414967J046064R20932J469490J102105n50310k138172k004598j16320
$$ -2442945 -27978 1018086 1939018 3408508 4510613 3960303 1822131 -182467 -298787
7985b98787J707306J944156J074209K50317p03149k300550l289269j909950R23637
$$ -298787 1408519 3352675 4426884 4677201 3974052 1673502 -1615767 -3525717 -2602080
7976b602080K164011P21267j220863j584689r17329n48359k27210Q61672K029319
$$ -2602080 -438069 283198 -937665 -2522354 -3439683 -3988042 -4215252 -3353580 -1324261
7967a324261J754033M6641j174954l80658J495648J899074k06996k682625k717665
$$ -1324261 429772 476413 -698541 -1079199 416449 2315523 2108527 -574098 -3291763
7958c291763o09932P25709J20382m13878M71327R99434l58266j699213p49633
$$ -3291763 -3901695 -3175986 -3055604 -3469482 -2998155 -1998721 -2356987 -4056200 -4805833
7949d805833J079215J148516L70621J491437L653825L174136k94762k783637j983786
$$ -4805833 -3726618 -2578102 -2207481 -716044 2937781 6111917 5817155 3033518 1049732
7940A049732k06033o4204q33709q91479o44471q89770p49467N51139J739012J376418
$$ 1049732 843699 779495 -54214 -945693 -1590164 -2479934 -3229401 -2678262 -939250 437168
7930D37168K17943j37102K77242L63207L4249P7426N03023M55023l59488j149180
$$ 437168 655111 518009 795251 1158458 1192707 1270133 1773156 2228179 1868691 719511
7920G19511j105827m90531l03800q41615j100378l43231L06675n46643j684599
$$ 719511 -386316 -876847 -1180647 -2022262 -3122640 -3465871 -3159196 -3705839 -5390438
7911e390438n42078K228465K779620P5512j836906p3218K393205J881094J08786
$$ -5390438 -5932516 -3704051 -924431 -848919 -2685825 -2759043 -365838 1515256 1624042
7902A624042L96455J139141r68342l752462k505919J342231J881261j366519k837840
$$ 1624042 2020497 3159638 2191296 -1561166 -4067085 -2724854 -843593 -2210112 -5047952
7893e047952p71625K81873j513616j746339J713351M163351K173626m73818K88413
$$ -5047952 -5819577 -5537704 -7051320 -8797659 -7084308 -2920957 -747331 -1221149 -932736
7884i32736J946128P35091j415388r23971Q36644O40502n71670k43315N21898
$$ -932736 1013392 1748483 333095 -590876 245768 886270 314600 71285 593183
7875E93183m35089j483600k08618J583925J033711m05016J4378P76759q76332
$$ 593183 158094 -1325506 -1534124 49801 1083512 678496 692874 1469633 593301
7866E93301l010656j945273J094877K149018J263895J103714R73143j264415l185042
$$ 593301 -2417355 -4362628 -3267751 -1118733 145162 1248876 2222019 957604 -2227438
7857b227438q53226L357282L444069l27523j952607j28385J02268k669775l089283
$$ -2227438 -3080664 276618 3720687 3393164 1440557 1312172 1414440 -1255335 -4344618
7848d344618J273372M878360K982235j073106k004459n95169n66650j760003j553279
$$ -4344618 -3071246 1807114 4789349 3716243 1711784 1116615 549965 -1210038 -2763317
7839b763317o4291O40439L80108J99957j30506q28109m25665J617851K764268
$$ -2763317 -2827608 -2187169 -1807061 -1607104 -1737610 -2565719 -2991384 -1373533 1390735
7830A390735Q94441j934994k246729j12661J441349P84013j016907k237109j893504
$$ 1390735 2285176 350182 -1896547 -2009208 -567859 216154 -800753 -3037862 -4931366
7821d931366j11507J484255J047277q02727j398622k5664R67208J92464o17976
$$ -4931366 -5042873 -3558618 -2511341 -3314068 -4712690 -4738354 -3771146 -3578682 -4196658
7812d196658j07800L08098k51836J82743K544474L777261J419016j665760j338880
$$ -4196658 -4304458 -3996360 -4248196 -4065453 -1520979 2256282 3675298 2009538 670658
$$ [...]
##END NTUPLES=NMR SPECTRUM
##END=
