##TITLE=31Pdec_SR56_rm3
 , 24 sc
 30.04.2021
##JCAMPDX= 6.0         $$ Bruker NMR JCAMP-DX V2.0
##DATA TYPE= NMR SPECTRUM
##DATA CLASS= NTUPLES
##ORIGIN= UXNMR, Bruker Analytische Messtechnik GmbH
##OWNER= root
$$ XWIN-NMR		Version 3.5
$$ Fri Apr 30 15:15:10 2021 Russian Standard Time (UT+4h)  she@DPX200
##.OBSERVE FREQUENCY= 81.013821
##.OBSERVE NUCLEUS= ^31P
##.ACQUISITION MODE= SIMULTANEOUS
##.ACQUISITION SCHEME= undefined
##.AVERAGES= 24
##.DIGITISER RES= 16
##SPECTROMETER/DATA SYSTEM= spect
##.PULSE SEQUENCE= zgpg30
##.SOLVENT NAME= CDCl3
##.SHIFT REFERENCE= (INTERNAL, CDCl3, 0, 248.564)
##AUDIT TRAIL= $$ (NUMBER, WHEN, WHO, WHERE, WHAT)
$$ ##TITLE= Audit trail, XWIN-NMR		Version 3.5
$$ ##JCAMPDX= 5.01
$$ ##ORIGIN= Bruker BioSpin GmbH
$$ ##OWNER= she
$$ F:/spectra/data/she/nmr/P31/1/pdata/1/auditp.txt
$$ ##AUDIT TRAIL=  $$ (NUMBER, WHEN, WHO, WHERE, WHAT)
(   1,<2021-04-30 15:13:59.17 +0400>,<she>,<DPX200>,
      <created by zg, POWCHK disabled, PULCHK disabled
       configuration hash MD5:
       00 E9 B6 7A A2 85 ED C7 34 08 36 98 17 FE 4E 26
       data hash MD5: 32K
       0A E2 49 B9 A6 43 26 B5 86 CF 4C AD 4A 4D AA 1A>)
(   2,<2021-04-30 15:14:11.51 +0400>,<she>,<DPX200>,
      <Start of raw data processing
       efp BC_mod = 2 LB = 1 FT_mod = 6 PKNL = 1 PHC0 = -6533.87 PHC1 = 722.4009 SI = 64K 
       data hash MD5: 64K
       AE 71 62 A3 07 16 3A 5C 3C 91 1A 89 97 3B 8F 14>)
(   3,<2021-04-30 15:14:36.95 +0400>,<she>,<DPX200>,
      <pk PHC0 = 140.4884 PHC1 = -264.2 
       data hash MD5: 64K
       A3 61 C0 0E B3 05 DA 4B 6B E7 8D 3B 34 8F 63 07>)
(   4,<2021-04-30 15:14:40.56 +0400>,<she>,<DPX200>,
      <abs ABSG = 5 
       data hash MD5: 64K
       2F 71 E4 E5 7C A3 24 B4 C9 84 64 9B 7A F4 2C BA>)
$$ ##END=
$$ 
$$ hash MD5
$$ F5 22 FC CB 07 D4 5E 10 DC 18 FA B4 A9 FE 5E 7E
##$RELAX= 
##$RELAX= 
##$RELAX= 
##$RELAX= 
##$RELAX= 
##$RELAX= 
##$RELAX= 
##$RELAX= 
$$ Bruker specific parameters
$$ --------------------------
##$DU= <F:/spectra>
##$EXPNO= 1
##$NAME= <P31>
##$PROCNO= 1
##$TYPE= <nmr>
##$USER= <she>
##$AMP= (0..31)
100 100 100 100 100 100 100 100 100 100 100 100 100 100 100 100 100 100 
100 100 100 100 100 100 100 100 100 100 100 100 100 100 
##$AQSEQ= 0
##$AQ_mod= 1
##$AUNM= <au_zg>
##$AUTOPOS= <>
##$BF1= 81.014009
##$BF2= 200.13
##$BF3= 200.13
##$BF4= 200.13
##$BF5= 200.13
##$BF6= 200.13
##$BF7= 200.13
##$BF8= 200.13
##$BYTORDA= 1
##$CFDGTYP= 0
##$CFRGTYP= 5
##$CHEMSTR= <none>
##$CNST= (0..31)
1 1 145 1 1 1 1 1 1 1 1 1 1 1 1 1 1 1 1 1 1 1 1 1 1 1 1 1 1 1 1 1 
##$CPDPRG= <waltz16>
##$CPDPRG1= <>
##$CPDPRG2= <waltz16>
##$CPDPRG3= <>
##$CPDPRG4= <mlev>
##$CPDPRG5= <mlev>
##$CPDPRG6= <mlev>
##$CPDPRG7= <mlev>
##$CPDPRG8= <mlev>
##$CPDPRGB= <>
##$CPDPRGT= <>
##$D= (0..31)
0 1 0 0 0 0 0 0 0 0 0 0.03 2e-05 3e-06 0 0 0 0 0 0 0 0 0 0 0 0 0 0 0 0 
0 0 
##$DATE= 1619781238
##$DBL= (0..7)
120 120 120 11 120 120 24 19 
##$DBP= (0..7)
150 150 150 150 150 150 150 150 
##$DBP07= 0
##$DBPNAM0= <>
##$DBPNAM1= <>
##$DBPNAM2= <>
$$ [...]
##$SUBNAM3= <"">
##$SUBNAM4= <"">
##$SUBNAM5= <"">
##$SUBNAM6= <"">
##$SUBNAM7= <"">
##$SUBNAM8= <"">
##$SUBNAM9= <"">
##$SW= 501.771253377433
##$SWIBOX= (0..15)
0 1 3 0 0 0 0 0 0 0 0 0 0 0 0 0 
##$SW_h= 40650.406504065
##$TD= 32768
##$TD0= 1
##$TE= 0
##$TE2= 300
##$TE3= 300
##$TEG= 300
##$TL= (0..7)
0 120 53 12 22 120 120 120 
##$TP= (0..7)
150 150 150 150 150 150 150 150 
##$TP07= 0
##$TPNAME0= <>
##$TPNAME1= <>
##$TPNAME2= <>
##$TPNAME3= <>
##$TPNAME4= <>
##$TPNAME5= <>
##$TPNAME6= <>
##$TPNAME7= <>
##$TPOAL= (0..7)
0.5 0.5 0.5 0.5 0.5 0.5 0.5 0.5 
##$TPOFFS= (0..7)
0 0 0 0 0 0 0 0 
##$TUNHIN= 0
##$TUNHOUT= 0
##$TUNXOUT= 0
##$USERA1= <user>
##$USERA2= <user>
##$USERA3= <user>
##$USERA4= <user>
##$USERA5= <user>
##$V9= 5
##$VALIST= <valist>
##$VCLIST= <CCCCCCCCCCCCCCC>
##$VD= 0
##$VDLIST= <DDDDDDDDDDDDDDD>
##$VPLIST= <PPPPPPPPPPPPPPP>
##$VTLIST= <TTTTTTTTTTTTTTT>
##$WBST= 1024
##$WBSW= 4
##$XGAIN= (0..3)
0 0 0 0 
##$XL= 0
##$YL= 0
##$YMAX_a= 9967
##$YMIN_a= -13753
##$ZGOPTNS= <>
##$ZL1= 120
##$ZL2= 120
##$ZL3= 120
##$ZL4= 120
##$ABSF1= 248.5645
##$ABSF2= -253.2056
##$ABSG= 5
##$ABSL= 3
##$ALPHA= 0
##$AQORDER= 0
##$ASSFAC= 0
##$ASSFACI= 0
##$ASSFACX= 0
##$ASSWID= 0
##$AUNMP= <proc_1d>
##$AZFE= 0.1
##$AZFW= 0.5
##$BCFW= 0
##$BC_mod= 2
##$BYTORDP= 0
##$COROFFS= 0
##$CY= -3
##$DATMOD= 1
##$DC= 0
##$DFILT= <>
##$DTYPP= 0
##$F1P= 0
##$F2P= 0
##$FCOR= 1
##$FTSIZE= 65536
##$FT_mod= 6
##$GAMMA= 0
##$GB= 0
##$INTBC= 1
##$INTSCL= 5.30512e-09
##$ISEN= 30
##$LB= 1
##$LEV0= 0
##$LPBIN= 0
##$MAXI= 10000
##$MC2= 0
##$MEAN= 0
##$ME_mod= 0
##$MI= 50
##$NCOEF= 0
##$NC_proc= -6
##$NLEV= 6
##$NOISF1= 182.463
##$NOISF2= 159.3651
##$NSP= 0
##$NTH_PI= 0
##$NZP= 0
##$OFFSET= 248.5645
##$PC= 4
##$PHC0= -6393.382
##$PHC1= 458.2009
##$PH_mod= 1
##$PKNL= yes
##$PPARMOD= 0
##$PSCAL= 0
##$PSIGN= 0
##$REVERSE= no
##$SF= 81.014009
##$SI= 65536
##$SIGF1= 159.3651
##$SIGF2= -187.1042
##$SINO= 113.3802
##$SIOLD= 16384
##$SREGLST= <1H.CDCl3>
##$SSB= 0
##$STSI= 65536
##$STSR= 0
##$SW_p= 40650.406504065
##$SYMM= 0
##$S_DEV= 0
##$TDeff= 32768
##$TDoff= 0
##$TI= <>
##$TILT= no
##$TM1= 0
##$TM2= 0
##$TOPLEV= 0
##$USERP1= <user>
##$USERP2= <user>
##$USERP3= <user>
##$USERP4= <user>
##$USERP5= <user>
##$WDW= 1
##$XDIM= 65536
##$YMAX_p= 378450907
##$YMIN_p= -41721503
$$ End of Bruker specific parameters
$$ ---------------------------------
##NTUPLES= NMR SPECTRUM
##VAR_NAME=  FREQUENCY,     SPECTRUM/REAL,   SPECTRUM/IMAG
##SYMBOL=    X,             R,               I
##VAR_TYPE=  INDEPENDENT,   DEPENDENT,       DEPENDENT
##VAR_FORM=  AFFN,          ASDF,            ASDF
##VAR_DIM=   65536,         65536,           65536
##UNITS=     HZ,            ARBITRARY UNITS, ARBITRARY UNITS
##FACTOR=    0.620285442955139, 1,           1
##FIRST=     20137.2065510759, 0,            0
##LAST=      -20513.1999529892, 0,           0
##MIN=       -20513.1999529892, -41721503,   0
##MAX=       20137.2065510759, 378450907,    0
$$ Real data points
##PAGE= N=1
##DATA TABLE= (X++(R..R)), XYDATA
$$ [...]
40933 -1269423 -898370 1051282 2420716 2075041 757207 162274 1548591 4536661 6964779
40924 6964779 6698880 3971789 1227203 308944 670904 909400 1035540 2047815 3783772
40915 3783772 4635973 3579829 1362456 -743281 -2392719 -3685748 -4060071 -2851885
40907 -2851885 -805286 151593 -855715 -2313838 -1941258 553116 2992178 3181413 1341493
40898 1341493 -385073 -636999 -279441 -810900 -2046471 -2346753 -960912 984903 2112045
40889 2112045 2350221 2348043 2362309 2507398 3062396 3491976 2310415 -526555 -2142910
40880 -2142910 133137 4656237 6983637 5540615 3081167 2018938 1385202 -140691
40872 -140691 -1212404 -328265 987330 610348 -163848 1514027 4916707 6064755 3366777
40863 3366777 -324712 -2068527 -2286341 -2527916 -2374862 -640149 1903827 3107029 2220303
40854 2220303 678321 330412 1707112 3777857 4950025 4632644 3973210 4540019 6321415
40845 6321415 7781246 7776022 6464890 4477865 2342110 648233 -373052 -1187948 -1672826
40836 -1672826 -341511 3087489 5256648 2517723 -3340647 -6461772 -4866016 -2981513
40828 -2981513 -4352615 -5973866 -3244106 2726647 6935627 7416070 6054167 4030401
40820 4030401 1024169 -1714106 -2063796 -965345 -1514941 -3675479 -3967489 -1333471 766387
40811 766387 -263870 -2344483 -2416438 -831927 341476 777977 1088165 701184 -786347
40802 -786347 -1774088 -766124 872824 692678 -1149619 -2163657 -955627 1394722 2882070
40793 2882070 2112174 -913738 -4192362 -4881938 -2523159 -41002 -58422 -1506883 -1683524
40784 -1683524 -282379 902336 1156042 1132404 737222 -494656 -1261295 391928 3638366
40775 3638366 5226275 3812688 1574774 833961 1319145 1672553 1603942 1375689 794511
40766 794511 -91974 -506310 -35588 844817 1813941 2923370 3387585 1938709 -802561
40757 -802561 -2099229 -438443 2395366 3822302 3598749 3049684 2576237 1739542 898216
40748 898216 871090 1386343 1472072 1115081 1074151 1269335 870181 28188 79356 1640012
40738 1640012 3631716 4712960 4821156 4716119 4645248 4210126 3348197 2773401 3217730
40729 3217730 4551695 5955483 6764874 6691898 5378970 2705494 -78498 -698924 1509814
40720 1509814 4150521 4477356 3004912 2479585 3478141 3544668 1432178 -334182 1037238
40711 1037238 4242041 5289612 2572993 -1445509 -3415067 -2316753 552894 3359077
40703 3359077 4977870 5314357 4966141 4491046 4008946 3479636 2912458 2199593 1377618
40694 1377618 1170268 2333562 4119485 4499137 2620527 100686 -941997 -354303 322927
40685 322927 -122320 -1497177 -2471705 -1483166 1724794 5126529 6176414 4868276 3463219
40676 3463219 2840858 1461886 -1016635 -1869485 778985 4468904 5627535 4572631
40668 4572631 4276878 5452345 6202075 5855919 5756702 6309982 6328350 5483963 4631841 3562852
40658 3562852 1246297 -1467761 -2285609 -1057783 -92467 -335854 -184701 1076426 1700533
40649 1700533 697802 -66461 1331540 4058719 5943806 5930330 4124660 1370921 -379241
40640 -379241 521894 2823288 3603886 2763757 3239093 5719145 6841909 4638822 2078125
40631 2078125 2287028 3558854 2736587 861768 1280587 3910100 5585142 5069803 3811503
40622 3811503 2435025 365788 -1358545 -698294 1752951 3155864 2855208 3197895 5256852
40613 5256852 6818673 5837260 3451035 2195665 2886418 4329091 4949879 4103432 2583034
40604 2583034 1804230 1824624 1157447 -314254 -27945 3368230 6557593 5304007 595331
40595 595331 -2633664 -2298720 -699149 492231 2228497 4399790 4681773 2657481 1162686
40586 1162686 1783767 2760318 3192538 5291701 9809353 12914727 10923689 5381260 459081
40577 459081 -2074050 -2434852 -340947 3544676 6172343 5771774 4804439 5691553 6063184
40568 6063184 2622267 -2360859 -3593660 -785903 1090622 -506819 -2611336 -1930569
40560 -1930569 1191081 4770533 7295864 7211981 4126375 1105300 1775827 4573278 4367873
40551 4367873 715059 -742579 2901578 6994531 6658376 4027818 3640959 4639720 3111114
40542 3111114 -383552 -1523128 579575 2405498 2241197 2346638 4115830 5561784
40534 5561784 5174493 4522093 4957743 4751110 1988361 -1663051 -2611715 117449 3912444
40525 3912444 5814696 5392801 4348103 4013141 3642377 1495695 -2335600 -5171587 -4727724
40516 -4727724 -1958435 451949 1630969 2753410 4334342 5489193 5801653 5764937 5241373
40507 5241373 3640705 1844016 1658120 2968320 3824334 3817172 4606771 6266207 6280360
40498 6280360 3851425 2107792 3558232 6016397 6092420 4561250 4659504 6474904 6980051
40489 6980051 5208236 3590030 3756051 4367032 3984731 3161964 2471884 1052500 -1265701
40480 -1265701 -2419167 -594810 2964082 5283346 5086870 3633510 2611569 2299540
40472 2299540 1830950 785757 237460 1637738 4251876 4826836 1339931 -3656450 -5543370
40463 -5543370 -3278408 -178673 1089483 1511451 2732402 3879190 3409109 2135297
40455 2135297 2021307 3101182 3771676 3464085 3136549 3551276 4623950 6029010 7086292
40446 7086292 6682097 4750923 3144160 3423720 4462366 4055750 2362551 1612743 2571297
40437 2571297 3579161 3477136 3300245 4145864 5151605 4921402 3813254 3430545 4339801
40428 4339801 5379603 5173568 3704196 2249435 1868481 2079899 1513643 111139 -214353
40419 -214353 1931739 5027237 6222950 5019073 3666783 3832365 4648335 4585829 3558659
40410 3558659 2307647 1217923 847300 2231917 5194812 7364064 6556889 3682723
40402 3682723 1777793 2341859 3956486 4494474 3463878 1999934 1546529 2743296 4788483
40393 4788483 5818726 4745626 2681145 1546275 1382380 543581 -1171293 -1557438 555679
40384 555679 2637393 1448898 -2185234 -4241975 -3137988 -1685406 -2414141 -3634803
40376 -3634803 -2301518 1140988 3581084 3880650 3614378 3399667 1806929 -1191188 -2711812
40367 -2711812 -768554 2551392 3796439 2489478 694653 -406599 -1132672 -1382620
40359 -1382620 -671591 164448 -294918 -1460836 -1086253 1361018 3737920 4354944 4186868
40350 4186868 4927480 6393482 7129293 6518230 5094126 3516922 2314603 2094966 3029812
40341 3029812 4377490 5151020 5023316 4250522 3220829 2506862 2806695 4221145 5837224
40332 5837224 6436677 5523339 3617223 1811623 956936 949304 1104016 1563849 3444952
40323 3444952 6556581 8080088 5624954 1162745 -718632 1160511 3117315 2288103
40315 2288103 783151 1867300 4441473 4699693 2129988 299998 1615498 4462538
40307 4462538 6371887 7314219 8433502 9644864 10378023 11291452 13104623 14329608 12364133
40298 12364133 7271743 2845395 2806949 6663180 10438336 11315289 10363955 10265183 11521116
40289 11521116 12272705 11443192 10289819 10262039 10843496 10797623 10530952 11445285 13175201
40280 13175201 13310103 10518288 6685717 4938745 6164330 8419619 9463227 8881949
40272 8881949 7621817 6393138 5284783 4525959 4610412 5398467 5893191 5530761 5131090
40263 5131090 5743324 6967299 7521756 7308750 7532222 8480676 8670855 7072580 4983374
40254 4983374 4425959 5440613 6347168 6312845 6244748 7065527 8295984 8743541 7873568
40245 7873568 6206051 4824582 4538720 5037680 4972420 3524811 1798194 1789363 3821713
40236 3821713 5860409 5819017 3901664 2112759 1918689 3059448 4445844 5435714 5937024
40227 5937024 5803715 4868376 3678122 3528905 5100916 7260628 8010546 6825329 5355775
40218 5355775 5395282 6709932 7465075 6421834 4068470 1789304 581276 581151 1253172
40209 1253172 1830659 1927204 1911081 2444012 3474403 3930954 2837616 800081 -162704
40200 -162704 1133723 3297345 3929820 3003326 3155504 5794971 8564647 8453738 6146716
40191 6146716 4761641 4985394 4644734 3280414 3513365 6358641 8493894 6810433 3255771
40182 3255771 2058377 3766219 5340859 5251398 5053136 5964441 6983699 7007247 6382188
40173 6382188 5678809 4910184 4476852 5012535 5889107 5764939 4964894 5265379 6865224
40164 6865224 7817259 7218926 6628027 7135574 7305958 5719914 3681957 3374202 4626429
40155 4626429 5538328 5461088 5492427 6485273 8117666 9641060 10393638 10000260 8997483
40146 8997483 8544139 8580555 7392344 4376555 2025539 3091498 6461563 8208657 6728329
40137 6728329 4551520 4501040 6075599 6747963 5418505 3300962 2169416 2785048 4630766
40128 4630766 6426259 7125466 6811064 6348594 6103127 5639014 4805659 4185919 4038037
40119 4038037 3746109 3006804 2665913 3453090 4683596 5396835 6125272 7975725 10200076
40110 10200076 10486833 8093625 5113846 3854198 4300371 5112848 5738846 6122080 5503887
40101 5503887 3462203 1565041 1934696 4231914 5981515 5993614 5433026 5146215 4225936
40092 4225936 2216273 589041 537627 1100184 1129085 1420778 2933999 4513103 4817106
40083 4817106 5181572 7618965 10732089 10910974 7670708 4621883 4445862 5865670 6767778
40074 6767778 7492340 9099942 10568805 10129039 8227795 7045756 7607450 8980033 9944668
40065 9944668 10132823 9756844 9247181 9020004 9060403 9139927 9666740 11309671 13302291
40056 13302291 13462580 10885506 7428870 5354670 4654895 4159533 4173080 5963556 9023065
40047 9023065 10886196 10047638 7666902 5972850 6058558 7619693 9847812 11904492 13053877
40038 13053877 13013796 12222523 11533933 11462777 11613920 11064820 9661297 8653289 9369705
40029 9369705 11491220 13595828 15238518 17125344 19135018 19902009 19029835 18047209 18133771
40020 18133771 18440720 17956106 17593429 18835686 21425978 23947566 25607775 25922015 24006377
40011 24006377 20253483 17554308 18455319 21971004 25750293 30402302 38124688 47015171
40003 47015171 50655083 44956871 32755276 20129346 10718231 5312563 4108164 6171802
39995 6171802 8183943 7075865 3781787 1898644 2657360 3628001 2792228 1537523 2424229
39986 2424229 5617573 8984361 10809192 11078350 10545635 9743847 8936719 8330371 8285747
39977 8285747 9514168 12449054 15934161 17595343 16842383 16624536 20026610 25246463
39969 25246463 26636926 21697550 14432676 9948195 8180593 5849522 2662941 1526949
39961 1526949 3135274 4636988 4454663 4541754 6300710 7784348 7199189 6179238 6836572
39952 6836572 7966919 7178780 4952356 3554717 3349551 3148288 2997179 3602370 4044609
39943 4044609 3187235 2470198 4013801 6602856 7045934 5199095 4019539 4614180 4986480
39934 4986480 4153965 3733224 4505467 5017145 4778873 5268869 6305814 5191486 1562460
39925 1562460 -570717 1527684 4827060 5050599 2990274 2377896 3422020 2984795 540468
39916 540468 -508406 1769047 4665520 4648761 2002485 -31538 644736 3255644 5793372
39907 5793372 7000147 6667788 5017137 2741365 1593862 3564502 8248934 11940747
39899 11940747 11333631 7889587 6208889 7841980 9483968 8269789 5832849 5071345
39891 5071345 5546950 5014970 3699888 3728579 5143957 5644611 4262695 2711908 2741148
39882 2741148 4090118 5397329 5742270 5234435 5022443 6135629 7427428 6119734 1974282
39873 1974282 -930317 804945 4687887 5524078 2863990 1253941 3085630 5510480
39865 5510480 5689647 5168122 6698956 9604011 10993902 9838653 7495565 5434332
39857 5434332 4405428 4834760 6233972 6966464 6112321 4913247 5088101 6380234 6965466
39848 6965466 5731349 3209987 906444 455563 2473677 5316712 6059822 3904373
39840 3904373 1620061 2213709 5010845 6663624 5554830 3496549 3019870 4373340
39832 4373340 5609956 4884488 2421227 517007 1337585 4394402 6860525 6931275 5924678
39823 5924678 6070590 7287284 7848872 7590267 8150542 9737377 9946782 7153300 3510640
39814 3510640 2691663 5246381 8022309 8240887 6491008 5083164 4897376 5123524 5265779
39805 5265779 5797879 6909560 8014385 8827809 9772465 10853290 11216770 10453058 9359034
39796 9359034 8724425 8319163 7792559 7494293 7576140 7532594 7634986 9223954 12030314
39787 12030314 12973732 10041852 6009245 5323752 8104737 10504607 10610403 10246072 10656124
39778 10656124 10462244 9104456 8396041 8780234 7783723 4677251 3032609 5315507 8169558
39769 8169558 7241315 4185416 4044867 7207808 9201993 8099469 6879344 7688224 8689371
39760 8689371 8376668 8656747 10984455 12857443 11300268 7493148 4878726 4348155 4311638
39751 4311638 4405446 5984141 9090076 11597385 11941053 10953214 10398377 10856768 11553608
39742 11553608 11522540 10543530 9242732 8351263 7915828 7753588 8637297 11787702 16535140
39733 16535140 19784226 19147937 15875131 13332721 13138701 14183516 14997446 15353357 15446131
39724 15446131 15144522 14708676 15101501 16772656 18758330 19658486 19229096 18602154 19050412
39715 19050412 20716862 22600436 23933753 25421077 28398509 32651351 36317457 38769216
39707 38769216 42173846 48528293 56315755 62607677 67974034 76054403 87360070 96461826
39699 96461826 97289403 89251473 76297169 62070429 48578625 37816409 31000303 26413836
39691 26413836 21171446 15393117 11818603 11011282 10211554 7994618 6734331 8399391
39683 8399391 10760234 10584788 8508983 7495830 7775046 6857285 4266802 2841382 4605696
39674 4605696 7965038 10023323 9756350 7979842 5863170 4481411 4570977 5843651 7341201
39665 7341201 8684770 9923181 10337309 9122510 7331128 7082140 8405587 9034134 8026509
39656 8026509 7286724 8440315 10612250 12743144 15575244 19256942 21376816 20236045
39648 20236045 18349870 19537675 23596592 27012160 28258102 29048718 30462366 31303144
39640 31303144 31121871 31915085 35426012 40822318 46337436 51662737 57681260 65105037
39632 65105037 74057870 83628838 91130524 93092671 87822254 76359030 61134531 45057068
39624 45057068 31462696 22539255 17216594 12628347 8195017 6096506 7087259 8455461
39616 8455461 7495300 4711933 2004596 -131823 -1749964 -1956181 -591639 360339 -422072
39607 -422072 -854750 1698964 5873417 7628493 5769605 3254329 2783758 3639729 3563818
39598 3563818 1790599 -609601 -2108368 -1968233 -1050833 -1251324 -3042203 -4132756 -2172990
39589 -2172990 1701970 3982659 3171436 967717 -710478 -1382863 -553473 2442291 6099493
39580 6099493 6986870 4092706 845784 880703 3516007 5540137 5990437 6553678 7962652
39571 7962652 8768103 8001467 6864012 6874641 7725436 7907547 6646955 4446317 2240342
39562 2240342 758387 512930 1676403 3638788 5045951 4923109 3942951 3959930 5753673
39553 5753673 7843243 8466236 8182427 8987129 10891101 11295696 8599632 4807876 3160879
39544 3160879 4222249 5814211 6140750 5381266 4456932 3780962 3494196 3809263 4631350
39535 4631350 5346788 5181345 3605314 800562 -1855026 -2495128 -852272 964978 890071
39526 890071 -449039 -845850 227629 1323727 1851407 2895246 4512763 4606316 2221140
39517 2221140 86945 1299815 4408040 4827803 1391806 -1548624 -76894 3723013
39509 3723013 4835674 2598753 1493309 4369393 8200736 8468718 5408445 3078286
39501 3078286 3384940 4245444 3769728 3138926 4032169 5624426 6115547 5654343 5602699
39492 5602699 5899190 5392051 4321121 4203096 5146848 5379237 4032735 2638041 2917427
39483 2917427 4427616 5429216 5145779 4184860 3440081 3497093 4590049 6275006 7451243
39474 7451243 7346087 6219293 4732869 3172086 1739703 887401 618969 136525 -870538
39465 -870538 -1157573 606154 3524900 5040513 4120966 2667086 3019399 4923054 5943647
39456 5943647 4531958 1736738 -147845 127425 2068596 4380762 6062346 6854542
39448 6854542 7203194 7819054 8897332 9766695 9694814 8974431 8604251 8855118 9037916
39439 9037916 9048974 10008750 12327525 14047875 12767622 9011682 6004390 5775651 7019132
39430 7019132 7395724 6433057 5090291 3744696 2161999 856364 959869 2719043 5082833
39421 5082833 6800407 7307560 6780414 5992702 5813474 6136337 5674650 3608896 1007827
39412 1007827 -389454 -481537 -696545 -1620471 -2007974 -606572 1912554 3459390 2643829
39403 2643829 134848 -1929482 -1931914 -317548 1126003 1553420 1805025 2548331 2981564
39394 2981564 2444748 2069396 3145418 4731360 4870753 3618419 2687765 2455242 1819058
39385 1819058 1053473 1992018 4692074 6630307 6354137 5409163 5279082 5044145 3996499
39376 3996499 4037727 6775278 10060487 10347651 7381087 3867632 1488443 20241 -369124
39367 -369124 937313 2834786 3077590 1417909 -13257 367838 2247166 4744973 6823178
39358 6823178 6695271 3599313 163251 -3863 2579217 3756661 2017815 781458
39350 781458 2959361 6632506 8321203 7678439 6462813 5373089 4578331 5112188 6820870
39341 6820870 6961359 3996443 918133 1235662 3249572 2467895 -1217261 -3356108 -1937674
39332 -1937674 112277 415757 634874 2448319 3929986 2868980 872991 954100 2873689
39323 2873689 3961834 3373467 2639532 2672610 2904721 3139647 3833847 4445244 3615787
39314 3615787 1334775 -794983 -1756528 -2038096 -2089045 -1478309 -177482 704309 288127
39305 288127 -867815 -1526047 -1021074 538557 2414054 3277571 2190325 95426 -671315
39296 -671315 912162 3187964 3941065 3112184 2458556 3075993 4273999 4695988 3757064
39287 3757064 2035457 716654 483533 742833 441505 -233100 6455 1279445 1874094
39278 1874094 982476 596488 2752230 5965954 6878471 4976709 2979356 2481593 2167402
39269 2167402 1077359 603878 1638616 2422373 1431505 216925 845082 2295817 2224851
39260 2224851 969313 791523 2055679 3245008 4118365 5506229 6290685 4367450 1066988
39251 1066988 718922 4397707 7602823 6259078 2090793 -477019 -351405 183903 -233811
39242 -233811 -754069 -585830 11656 807285 1794426 2537446 2732805 2939800 3535591 3753219
39232 3753219 3070415 2550525 3264165 4375749 4484053 3897932 3782678 4004478 3747876
39223 3747876 3281621 2969606 1583955 -1758808 -4749041 -4055060 -245871 2515599 2106379
39214 2106379 834306 1365382 3086094 3993193 3921233 4007565 4380034 4159863 3132473
39205 3132473 2220718 2489214 4009949 5411758 4986445 3077501 2447268 4632096 7010632
39196 7010632 6156204 3417933 3546576 7452613 10419766 9128766 6526289 6860465 9085956
39187 9085956 9012094 6012566 3473988 3300654 3814692 3341720 2584219 2538068 2646270
39178 2646270 2274690 2169863 3167586 4712670 5797115 6483988 7478963 8750080 9477603
39169 9477603 9150602 8057840 6758748 5570103 4648489 4157777 4054535 3986628 3913934
39160 3913934 4637982 6795527 9194556 9506431 7416140 5616514 6198515 7523442 6948523
39151 6948523 5384753 5856466 7996095 8014405 5004479 3192833 5769022 9954885 11153501
39142 11153501 9241266 7364368 6682571 6179741 6292747 8521089 11702183 12544806 10391577
39133 10391577 8254733 8397037 9718112 10354476 10141841 9342157 7458752 4904983 3781603
39124 3781603 5136636 6934359 6629283 4774512 4227129 6214814 8822344 9426874 7459040
39115 7459040 4538805 2731451 3005288 4839489 6874476 8097766 8702149 9733692
39107 9733692 11630681 13227230 12824945 10461329 8266736 7886073 8463122 8356423 7849485
39098 7849485 8185227 8628080 7339483 5317162 6130922 10432818 13888644 12806000 9181032
39089 9181032 7365675 7879406 7847990 6180947 4790165 5168066 6826344 8950927 10945293
39080 10945293 11552849 10008193 7887536 7396815 8142169 8090084 7243592 7472629 8960316
39071 8960316 9950963 10089934 10789909 11925187 11502965 9450407 8544709 10356287 13045796
39062 13045796 14400496 14411103 13627652 11681433 8980738 7443844 7887745 8684591 8314248
39053 8314248 7201531 5939603 4074466 1919262 1081933 1738250 1900114 929172 1028247
39044 1028247 3325002 5285680 4480859 2434758 2029351 3286982 4548593 5751150
39036 5751150 7429957 8304330 7237003 6123025 7289790 9201908 8601634 6234475
39028 6234475 6220392 9452386 11787571 10214737 7298665 7139484 9311986 9728592 6677107
39019 6677107 3293284 3325688 6090783 7311451 4827820 1646496 2031810 5900458 9359561
39010 9359561 10145746 9529874 8673153 6695668 3728630 2355021 3675803 5022357 4344622
39001 4344622 3861344 5917200 8101445 6908087 4053479 4030295 6660689 7607115 5961986
38992 5961986 5546045 7836355 9270770 7553750 5510570 5866245 6700790 5568343 4279587
38983 4279587 5461915 7342326 6535043 4067066 3871526 6205314 7291685 5635430
38975 5635430 4247819 5498699 7707558 8747782 9615407 11661489 12952595 11045175
38967 11045175 7986532 8431035 12641588 15338759 13012727 8895431 7968214 9793368
38959 9793368 10155636 8237632 7467847 9174697 10173310 8303920 6185529 6732161 8325514
38950 8325514 7878154 6136605 6051171 7528087 7805429 6224118 4848903 4651287 4560471
38941 4560471 4268461 4704830 5591189 5565329 4828293 4743065 4991769 4354487 3948685 5810825
38931 5810825 8410789 8220666 6230314 7572383 13027560 16457678 13729551 9093966
38923 9093966 8530482 11084248 11842079 10165247 9329970 10088861 10268704 9744102 10476716
38914 10476716 11989454 11837346 10600594 11446863 14222660 14929146 12250701 9875373
38906 9875373 10523819 12064737 11889711 11078375 11308506 11231837 9377409 7695033 8395174
38897 8395174 9595450 8241485 5719510 6130826 9677394 12151133 11210842 9143346
38889 9143346 8594910 9305366 10405077 12401497 14817497 14905060 11423490 7494798 6860095
38880 6860095 8932156 10435827 10529973 10904944 11596915 10644495 8324519 7918609 10694175
38871 10694175 13295725 12465473 9930735 9696242 12028361 13410926 12046000 10184419
38863 10184419 10284161 11459122 11281557 9501425 8157023 8553267 9670076 9768435 8618343
38854 8618343 7557009 7637910 8339530 8425996 7790087 7806447 9674682 12871141 15503542
38845 15503542 15900031 13844528 10823202 9069095 9488689 10344499 9086258 5890016
38837 5890016 4020051 5801416 9554272 11799690 11375284 9818023 8595012 7806707
38829 7806707 7209662 6801621 6480316 6373864 7141874 8772598 9819230 9290293 8413273
38820 8413273 8756084 9617329 9516606 9228174 10380521 11674609 10045911 5783770 2913511
38811 2913511 3685602 6095890 7868924 9161227 9702054 7313322 2146774 -1050667
38803 -1050667 1420911 6747517 9426229 8424842 6563389 4700774 1514129 -1655341
38795 -1655341 -1147824 2877668 5424562 3775614 1624054 3334754 7329072 8800795
38787 8800795 7006591 5751614 7030034 8083939 6003668 2375304 1036900 2558856
38779 2558856 3545657 1591628 -1237322 -1224462 1892404 4566482 4129793 1973306 1203777
38770 1203777 2540526 3997553 3971739 3059927 2749810 3549103 4833177 5745293 5784194
38761 5784194 5001376 4048226 3780117 4507144 5722915 6693167 7184033 7467867 7702416
38752 7702416 7605005 6987583 6401165 6621392 7329700 7101399 5350537 3595124 3750358
38743 3750358 5548139 6838735 6360069 5043081 4491971 5260743 6808112 8213992 8839854
38734 8839854 9088200 10265356 12697314 14542503 13949224 11777236 10214406 9301739 7500244
38725 7500244 5428709 5585600 7718939 8180879 5489901 2999279 3726302 5887658 6630955
38716 6630955 7125219 9914808 13398912 13554975 10246418 7466628 7445657 8481256 8902707
38707 8902707 9359864 10269549 10374183 9222822 8424854 9089084 10210491 10726246 11062746
38698 11062746 11480327 10875122 8578721 5806080 4171294 4057690 5166095 7049575
38690 7049575 8287162 6993845 3511210 1120798 2509846 6398599 8994191 8243876
38682 8243876 5657435 4304581 5678139 8271978 9078161 6937512 4179271 4007495
38674 4007495 6525635 8727767 8404994 6447492 4963795 4770241 5445992 6509601 7653267
38665 7653267 8622371 9331655 9486565 8368249 6198161 5202939 7311760 10918622 12423032
38656 12423032 11413855 11489810 14643710 17603452 16105095 10924816 6887167 6680081
38648 6680081 8243768 8367678 6774807 5776574 6919981 9007868 9636322 8340477 7306709
38639 7306709 8284496 9780435 9012424 6176391 4469344 5587350 7637471 8459529 8632737
38630 8632737 9556077 10527332 9867206 7740733 5841202 4979262 4678512 4626799 5039491
38621 5039491 5906732 6952575 7931386 8268770 7233718 5197791 3659098 3224125 2864140
38612 2864140 2067638 2079250 3684912 5508348 6264233 7006379 8885453 10130031 8074223
38603 8074223 3510422 297974 744125 3598047 6418086 7685814 6752770 4149456
38595 4149456 2211083 3183370 6282572 8522354 8604236 7881147 7327997 6135902 4059011
38586 4059011 2649493 2906035 3826978 4642487 6359462 9345866 11323950 10059741 6763436
38577 6763436 4477385 3989027 3821778 3741839 5357992 8717509 10946435 9777842 6727524
38568 6727524 5035146 5471957 5979772 5008406 3403764 2818030 3767481 5748417 7957913
38559 7957913 9216507 8474480 6448016 5581536 6952838 8228617 6620754 3208134
38551 3208134 1847587 3725662 5686350 4869231 2439047 1096634 1173654 1469036 2123336
38542 2123336 3754271 4789359 2906373 -909982 -2761521 -969829 1725060 2152238
38534 2152238 682332 -245005 206215 918124 1136768 1319074 1907528 2602086 3022867
38525 3022867 3397760 4384109 6260866 8128934 8268257 6149204 3831574 3906433 5875095
38516 5875095 6422113 4085322 1611025 1997003 4003806 4163292 2185279 1223587 2755699
38507 2755699 4408113 3975169 2824728 3400537 5397083 6683190 6580075 5820811 4348059
38498 4348059 1889813 179026 1618275 5536572 8567003 9249243 9356204 9799879 8622156
38489 8622156 5057584 2397083 3624290 6466429 6487483 3706233 2193726 3714947
38481 3714947 5845807 6559705 6610837 6423943 4555001 1078039 -853201 768944 3556399
38472 3556399 4100703 2509698 1230255 1251519 2011010 3497632 5736625 7244764 6583902
38463 6583902 4775887 3910291 4009428 3479004 2060177 1028481 776691 409775 -262687
38454 -262687 -224053 1100356 3039945 4410094 4074942 1540440 -1833941 -3347850 -2187148
38445 -2187148 -796097 -1229684 -1822267 5692 3253691 4859823 4461666 3988683 3444592
38436 3444592 1384209 -695137 718805 5044494 7251827 5345838 3572679 5498013
38428 5498013 8184791 7057867 3230117 1418438 2542954 3128446 1475206 79238
38420 79238 1284683 3915427 5499891 5549347 5274403 5480689 5983471 6458574 6996151
38411 6996151 7786133 8422825 7830196 5549553 3037210 2458885 3808992 4711211 3922367
38402 3922367 3391317 5315994 8485559 9576734 7497349 4561939 3486352 4734354
38394 4734354 6842264 8109197 7852000 6863461 6617144 7502772 8306135 7958146 6928342
38385 6928342 6085801 5282261 4292789 4090380 5542279 7596475 8529330 8453281 8710969
38376 8710969 9130876 8015751 5095315 2572470 2537566 4685737 7214702 8899931 9720552
38367 9720552 10297629 11193345 12160469 11931390 9467903 5551781 2419906 1608218 2580273
38358 2580273 3450682 2791284 1142005 979194 4170706 8841475 10333987 6824419 2481700
38349 2481700 2616333 6664345 9056982 6897536 3383186 2733304 4901877 7038572
38341 7038572 7528059 6322807 3415219 -253686 -1751353 949554 5423581 6820652
38333 6820652 3637376 -719476 -2427991 -1172483 1044996 2862847 3963423 4036724
38325 4036724 3050571 1892273 1399965 1230685 850561 1019339 2718198 4943535 5564616
38316 5564616 4709296 5167554 8281786 11383342 11293318 8986367 8201026 10044418 11861460
38307 11861460 11611706 10354814 9420837 8051046 5670570 3982051 4383323 5315297 4911149
38298 4911149 4530117 6358568 8789091 8176988 4887484 3367089 5436368 7575178
38290 7575178 6572768 4178412 3562893 4216325 3661333 2123947 1857022 2896494 3037926
38281 3037926 1763440 879123 869751 -265326 -3339468 -5669914 -4336644 -283455 2770003
38272 2770003 2897977 1737493 1652923 2586820 2569867 708703 -1501185 -2119280 -1072662
38263 -1072662 344327 1604477 3114605 4383606 3894260 1502147 -717897 -1141745
38255 -1141745 -579969 -225191 669775 2912085 4578904 3080650 -465847 -2092864 -553495
38246 -553495 1069182 349310 -965350 -410366 820132 -118485 -2792235 -3724744 -1275549
38237 -1275549 2418519 4659203 5021049 4320567 2843564 812017 -830807 -1441110 -1598419
38228 -1598419 -1916291 -1782350 -557626 613157 -222001 -3043856 -5468005 -5535756 -3794558
38219 -3794558 -2023166 -887957 176474 1377350 2070020 1885894 1420520 1443871 1964816
38210 1964816 2398774 2292773 1626100 716091 83960 129522 663172 1007989 880482 960328
38200 960328 2139205 4174761 5514901 4823699 2603605 856172 830687 1473857 813476
38191 813476 -1213655 -2400803 -1250467 773616 1095507 -606023 -2285994 -2373737 -1177085
38182 -1177085 333110 1379133 1004914 -1112896 -3078991 -2217948 1045613 3025627
38174 3025627 1769167 -181235 129049 1655838 1706028 621275 686570 1717491 1534285
38165 1534285 163029 -426258 -637720 -2973064 -6756744 -7632072 -4082935 -321318 -138657
38156 -138657 -1634747 -1352315 -319043 -1623036 -4136870 -3596159 552946 3831338 2896996
38147 2896996 -504033 -2906310 -3643541 -4412647 -6089555 -7532033 -6957712 -3917498 -213344
38138 -213344 1482712 599998 -510725 245758 1852227 2092193 1069509 549037 757559
38129 757559 578706 370354 1549685 3473828 3911786 2952549 3212843 5460522 7356209
38120 7356209 7659020 8204309 9920010 10317615 7614535 4482650 4439805 6602025 7486474
38111 7486474 6559920 6249342 7000690 6084061 1996483 -2758158 -4477057 -2218854 1811646
38102 1811646 4666751 5002453 3937017 3753781 5164782 6323696 5391169 3217701 2057562
38093 2057562 2339559 2519628 1797226 1080011 1195650 1853885 2603214 3299712 3399430 2272410
38083 2272410 570147 -66955 946049 2567099 3833839 4816435 5503371 5163735 3604194
38074 3604194 2008179 1631863 2265316 2655746 2068339 987135 536926 1416934 3193252
38065 3193252 4666881 5127319 4968152 4891286 5169132 6063094 7915920 9971779 10252359
38056 10252359 7956943 5022972 3745799 3827510 3691780 3692602 5359198 7931618 8755780
38047 8755780 7479015 6790905 8011375 8896121 7487270 5515139 5613662 7043020 6878385
38038 6878385 4470177 2158436 1798111 2734364 3463315 3603776 3610625 3604626 3262981 2603817
38028 2603817 2401819 3438981 5105714 5300112 2728863 -868016 -2148578 -85795
38020 -85795 2950313 4549724 5169612 6645608 9057068 10514925 9549711 6654970 3745389
38011 3745389 2669526 3787643 5583304 6211864 5582736 5096290 5396115 5762759 5828762
38002 5828762 6039108 5891301 3852068 143119 -2425916 -1942292 86671 1369549 2155233
37993 2155233 3805490 5677994 6052390 5173124 4764720 5084469 4925794 4210615 4131294
37984 4131294 4723135 4564345 3166394 1759281 1402545 1906647 2750089 3588948 3912410
37975 3912410 3643334 3807351 5048728 5985802 4944643 2821292 1938950 2362821 1933835
37966 1933835 1469 -1644071 -2010362 -2272485 -3050714 -3073596 -1891238 -1397519 -2846669
37957 -2846669 -4362469 -3408295 -327205 2401971 3426598 3503912 3960043 5244403 6341195
37948 6341195 5205890 1077412 -3388420 -4375255 -1995350 -555033 -2384213 -4324883
37940 -4324883 -2799468 355968 747659 -1635519 -2610062 -481125 1765816 1757302 1310112
37931 1310112 2738249 4536158 3521717 -259323 -3487774 -3977695 -2853251 -2073652
37923 -2073652 -1663790 -424956 1676924 3238931 3431504 3063364 3108403 3105362 2054630
37914 2054630 401930 -185172 960856 2695342 3651169 3529061 2669567 1627797 1362111
37905 1362111 2338588 3202115 2217221 452111 1052905 4260321 6000497 3576166 121425
37896 121425 328150 3783489 6228756 6056617 5376177 5147235 3754868 1081882 -118074
37887 -118074 1581933 4004252 4847688 4543472 4160419 3412140 2490239 3011739 5134343
37878 5134343 6447856 5832477 5522571 6841524 7045485 3890168 551388 1571207 5716688
37869 5716688 7661650 5867086 3849589 3646171 3036243 376139 -2277110 -2730402 -1680184
37860 -1680184 -213955 2368160 5988461 8063711 6966638 4839657 4433973 5272264
37852 5272264 5430279 4970368 4802778 4156348 2438576 1969962 5151941 9826011 11260363
37843 11260363 8562847 5534509 4946373 5515045 5307176 4749133 4815650 4974940 4569152
37834 4569152 4111978 3841416 2978650 1633000 1304407 2191119 2319078 948938 348957
37825 348957 1965036 3236848 1245300 -2262422 -3025445 -511359 1651820 1364778 565557
37816 565557 1282756 2411735 2029674 564818 -230425 5916 233244 -189279 -948312
37807 -948312 -1350186 -611310 1597609 4131150 4839537 2969319 287518 -1019728 -671596
37798 -671596 418523 2126834 4881437 7939580 9532121 8920949 7125994 5235899
37790 5235899 3006416 -103834 -3070252 -3622082 -891990 2929681 4665843 3896593
37782 3896593 3307874 4639571 5888367 4306771 910278 -845667 -563159 -1567698
37774 -1567698 -5044797 -7105361 -4347665 360638 1351604 -1932043 -4439947 -2848558
37766 -2848558 354941 1188212 -490568 -1830884 -1198381 447640 1409042 982489 -186232
37757 -186232 -664017 299383 1491701 894965 -1502331 -3352040 -3060405 -1846602 -1698129
37748 -1698129 -2604163 -3136021 -2702207 -1760447 -603007 570207 1017309 461550 261634
37739 261634 1890513 4403538 5129308 3122778 416722 -670522 -173117 323637 101489
37730 101489 -116722 400635 1342449 1895449 1802277 1437177 913908 -253994 -2070028
37721 -2070028 -3110113 -1766528 1484804 4201472 4707392 3581968 2094035 735360
37713 735360 114384 1439973 4473445 6481494 5244392 2027642 -447021 -1791812
37705 -1791812 -3260608 -4418595 -3708388 -1850376 -1171397 -1447063 -146530 2500138 2744994
37696 2744994 -702138 -3894967 -3517926 -2044359 -3447630 -6431290 -6274098 -2122135
37688 -2122135 1817088 2204877 103560 -1764665 -2265785 -1736389 -1086423 -1688257 -4202389
37679 -4202389 -7108811 -8154417 -7282044 -6177878 -5111564 -2764233 549541 2266235
37671 2266235 1183208 -606993 -597467 1174966 3130800 4335684 4560873 3779715 2753765
37662 2753765 2739285 3739212 4554327 5205766 7170194 10085176 10717643 7351990 3235688
37653 3235688 2923849 6318428 9103196 8578858 6309347 4833002 4340306 3577098 2169735
37644 2169735 687273 -655083 -2142578 -3669396 -4456275 -3775720 -1783359 423955
37636 423955 1693706 1828704 1503532 1145837 393134 -1053221 -2533600 -2925669 -1858815
37627 -1858815 -82842 1266000 1592828 1197963 846709 1007913 1716654 3122704 5344815
37618 5344815 7346530 7144895 4367050 1591632 1379391 2692768 2442317 169472 -1425051
37609 -1425051 -719914 897440 1996505 3110877 4556605 5000618 3931836 3153377 3913593
37600 3913593 4781736 4379212 3927905 4699534 5137812 3380498 813297 7831 616531
37591 616531 584608 171686 1133155 2658727 1995616 -847718 -2589230 -1371429 1136090
37582 1136090 2936069 4115872 5338897 6608344 8319869 11030363 13419044 13016067
37574 13016067 9871925 7039169 6353983 6107756 4104372 775497 -2107841 -3794985
37566 -3794985 -4235781 -3272814 -1588876 -824289 -1425185 -1889904 -1253440 -574839 -735674
37557 -735674 -679396 531579 1626487 1011234 -551015 -1050299 -77105 1171879 1942402
37548 1942402 2331099 2262516 1603142 915415 845024 1132279 1286569 1754855 3293444 5465625
37538 5465625 6752128 6140109 4131087 2332882 2119930 3170543 3441199 1490519 -1368525
37529 -1368525 -2562548 -1747289 -974563 -1230718 -1088789 394762 1744024 1433076 273045
37520 273045 -186721 -56972 -299674 -948822 -1708678 -2927838 -4372420 -4451628 -2432226
37511 -2432226 -119389 467796 -195957 -601970 -922274 -2009023 -2939494 -2175464 -401018
37502 -401018 395155 209089 864619 2805526 4494477 4953189 4536638 3176804 349708
37493 349708 -2912543 -4456280 -4062099 -3755686 -4345241 -4083543 -1976871 -57382 -440169
37484 -440169 -1856552 -1405517 1181665 3269548 2995728 1161802 -703783 -2203993 -3206446
37475 -3206446 -2793720 -593032 1734015 2061588 661599 -165558 535133 1224395 757983
37466 757983 369862 1293137 2300946 1844440 1114824 2144546 3922330 3747756 1950395
37457 1950395 1516016 2936925 3511342 2416368 1963585 2370624 275775 -4805472 -7514363
37448 -7514363 -4318546 146335 -288227 -3729540 -3562835 709892 2982984 619837
37440 619837 -1843298 -506057 2239166 2331359 -202270 -2768689 -4006466 -3718074 -1977351
37431 -1977351 -315321 -1013860 -3487424 -4275712 -2293642 -779859 -1901098 -2923622
37423 -2923622 -770348 2641111 3268160 940362 -1334762 -2518728 -4006251 -5663272
37415 -5663272 -5377714 -2927085 -999360 -1382816 -2584426 -2345057 -690078 673908 715875
37406 715875 -273315 -1611537 -2797832 -3386396 -3017947 -1872298 -940052 -1356472 -3005471
37397 -3005471 -4120613 -3089198 -524017 1423562 1723680 1227759 792643 257680 -343407
37388 -343407 -346323 -62925 -1054489 -3500420 -4841896 -2805393 1202294 3547185 2786759
37379 2786759 1000810 696330 1721472 1804663 -366719 -3220188 -3936253 -2080051 -524807
37370 -524807 -1689782 -4001085 -4175581 -2238368 -1262535 -2108906 -2050480 247370 2129498
37361 2129498 1561298 849435 2494585 4231828 2445991 -1275534 -1768844 1932960 4996601
37352 4996601 3729805 281651 -1109327 396682 2384538 2864048 2059323 1540721 2561788
37343 2561788 4532544 5028293 2513718 -1108574 -2396014 -740913 1263566 1966564
37335 1966564 2584234 4183320 5399387 4796717 3401183 2918778 2992973 2276075 1057703
37326 1057703 669913 922298 201221 -1961723 -4039036 -4329958 -2510129 497550 3091220
37317 3091220 3639975 1809764 -731638 -1985585 -1959428 -2240511 -3325728 -3853075 -2936571
37308 -2936571 -1809676 -2054018 -3140430 -3149812 -1640658 -348595 -685839 -1794360 -2054615
37299 -2054615 -1762010 -2823051 -5657224 -7820963 -6723593 -2978841 176891 586320
37291 586320 -979196 -2790557 -4429945 -6044690 -6495311 -4206038 -16389 2565240
37283 2565240 1100363 -2728993 -5180026 -5062197 -4546392 -5208864 -5405231 -3061493 494005
37274 494005 1923112 643508 -459603 396589 1250243 -151997 -2506633 -3012928 -1877421
37265 -1877421 -1780826 -3258981 -3787478 -2165628 -892953 -2453333 -5426788 -6665087 -6004521
37256 -6004521 -6065259 -7658665 -8175820 -5464541 -1245379 925975 -42188 -2196528 -3701999
37247 -3701999 -4736486 -5951324 -6695314 -5908192 -3975616 -2464576 -2204796 -2608737 -2855085
37238 -2855085 -2788657 -2502674 -1988745 -1567045 -1770679 -2298680 -1999162 -620740 358827
37229 358827 -250458 -1307958 -844563 805717 1236664 -451605 -2196155 -1955313 -484094
37220 -484094 289219 372729 1240400 2825487 3179460 1492743 -388565 -404446 1078297
37211 1078297 2234152 2465432 2724106 3504744 3867626 2702728 154235 -2457849 -3680601
37202 -3680601 -2965995 -1230531 -245481 -831964 -1861884 -1797282 -845838 -397195 -563453
37193 -563453 1829 1502386 2101776 623461 -1522432 -2523573 -2807592 -3694148 -4626606
37184 -4626606 -4021238 -2191734 -957195 -512709 738290 2866450 3515740 1409113 -1348202
37175 -1348202 -1929348 -283086 1346188 1219954 -654135 -2896746 -3414833 -1057837 2365161
37166 2365161 3336216 1140350 -789002 208205 1949765 1080395 -1058583 -277009 3316884
37157 3316884 4569519 751629 -4336493 -5977464 -4843555 -4492332 -5061126 -3594916
37149 -3594916 175872 2511353 892967 -2516840 -4024614 -2798984 -658421 704527
37141 704527 561531 -1428727 -4664038 -7138772 -7307863 -6062537 -5310192 -5029373 -3646068
37132 -3646068 -1262104 -224716 -1628802 -3171568 -1998253 1467810 4085489 3799697
37124 3799697 1587555 -62388 441021 2654179 4539018 4336118 2563440 1445136
37116 1445136 1703218 1186799 -1892097 -5583420 -6289705 -3676123 -964667 -224453 -6086
37107 -6086 1488789 3354402 3688543 2509935 1117407 -124485 -1363951 -1558234 552407
37098 552407 3924949 5707284 4690633 2702874 1903325 2043130 1506863 168136 -347611
37089 -347611 719490 1795864 1015702 -1022645 -1787267 -34020 2674754 3958043 2992328
37080 2992328 410339 -2841277 -5452379 -5679900 -2971396 706787 2541418 1806551
37072 1806551 237008 -170744 1077576 2777131 2808292 180222 -2768749 -1907770 3289339
37063 3289339 7823280 7142744 3139551 850695 955118 78193 -2377989 -3158121 -1360595
37054 -1360595 -226328 -1171918 -1291155 875396 2212912 805794 -76255 2228404 4509384
37045 4509384 3100318 650160 1704928 4466735 3463602 -1085665 -3211083 -437164
37037 -437164 3016658 3333330 2123202 2510288 4322820 5303569 4302248 1750412 -932079
37028 -932079 -1822542 -550929 250586 -1800148 -4575071 -3793067 555311 3958860 3822619
37019 3822619 2184577 1384644 1160454 1178385 2316947 3764688 2719873 -1019411 -3740585
37010 -3740585 -3183799 -1737658 -2008269 -2749222 -1989756 -897716 -1208968 -1562767 65940
37001 65940 2478736 3337001 3315370 4533277 6150208 5243413 1583644 -1691666 -2175507
36992 -2175507 -531481 1121527 1160396 -831000 -3488655 -4347929 -2696503 -837917 -867400
36983 -867400 -1561552 -670316 1082352 1138546 -569654 -1479179 -445983 832639 716295
36974 716295 -407360 -1446708 -1945225 -1786583 -1236177 -1314053 -2450100 -2984671 -1024445
36965 -1024445 2270625 3468791 1233347 -2135108 -3869903 -3393707 -1407623 1327214
36957 1327214 3339334 2771798 -131283 -2455659 -2060160 -312145 155143 -727393 -765440
36948 -765440 946953 2774870 3065313 2343253 2234761 3108994 3670809 2621255 82339
36939 82339 -2643067 -4292089 -4451075 -3466693 -1988535 -710514 -281998 -1090887 -2927238
36930 -2927238 -4894925 -5893320 -5475121 -4289808 -3509368 -3788210 -4902819 -6121695 -6393118
36921 -6393118 -4530229 -453037 3566632 4460020 2062086 -162658 608877 2946092
36913 2946092 3569885 2005052 356774 -630866 -2170616 -4122533 -4327636 -2133736 198574
36904 198574 880040 931293 1627977 1867717 107246 -2591626 -3453565 -1239792 2545849
36895 2545849 4963169 3695323 -770459 -4533442 -3753752 484476 2893961 571472
36887 571472 -3487723 -4827200 -2940646 -279060 1779444 3413219 4523496 4950165
36879 4950165 5334911 5771109 5004226 2842860 1521506 2388905 3150157 1168913 -2111274
36870 -2111274 -3098287 -1246076 652695 533443 -1254727 -3485325 -4797089 -3890969 -1342298
36861 -1342298 53826 -946813 -1757389 -112539 1911529 1561620 501041 1627217
36853 1627217 3111936 1323819 -1867064 -1299695 2405742 3064054 -920704 -3709422
36845 -3709422 -1426892 2341033 3492082 3474037 4418621 4063352 530428 -2668995 -1889982
36836 -1889982 307235 -285262 -2019384 -642118 2430982 1777667 -3128236 -7024201
36828 -7024201 -6879111 -5030150 -3701856 -1923374 549411 1112043 -1509054 -4573901
36820 -4573901 -5149089 -3815423 -2572724 -1601402 -223037 955831 945287 6375 -1187670
36811 -1187670 -2664595 -4092969 -4108771 -2242662 -254325 63079 -596460 -364406 691555
36802 691555 503200 -2060052 -5526231 -7315033 -6125938 -2754772 823781 2953352
36794 2953352 3198093 2088589 293797 -1694945 -3322084 -4010112 -3559250 -2233367 -581994
36785 -581994 584321 588889 -89673 185197 2106987 3820920 2914513 -134030 -2232525
36776 -2232525 -1665310 64757 1099097 1867351 3274052 3953495 1854099 -1987784 -3826422
36767 -3826422 -1832875 1697619 3669455 3968113 4465772 5513277 5465152 3498050 1034462
36758 1034462 -236850 -468984 -926559 -2014708 -3034405 -3410586 -3116024 -2029689 66764
36749 66764 2601539 4179733 4011553 2956085 2617253 3547717 4695446 4530126 2444804
36740 2444804 -848090 -3943678 -5667597 -5685256 -4572985 -3371506 -2821954 -2783492 -2445992
36731 -2445992 -1295740 194025 1002446 549790 -938525 -2714571 -3739803 -3105774 -1045015
36722 -1045015 796944 1142083 876197 1730174 3412198 4023077 3512310 4116483 6234687
36713 6234687 6701482 3506996 -149382 193361 3809002 6057670 5337655 4554556 5392311
36704 5392311 5514978 3112641 491451 603772 2708072 4155224 4466195 4949435 5772072
36695 5772072 6047334 5785587 5347190 3878221 761533 -2054579 -1796948 1194278 3643983
36686 3643983 3640224 2617196 2664090 3889800 5251376 6299040 6941629 6598641 4891376
36677 4891376 2825604 2274165 4003173 6529695 7322432 5367787 2299842 489068
36669 489068 312727 305659 -145426 138359 1894423 3951294 5032676 5462348 5702015
36660 5702015 4724437 1734103 -1647025 -3071217 -2646883 -2323116 -2607288 -2120009 -264303
36651 -264303 1792505 2889477 2760347 1251444 -1267927 -2733495 -1038247 2675493
36643 2675493 4708221 3542926 1626377 1405254 1903451 852840 -1683969 -3794138
36635 -3794138 -4529251 -4328073 -3484054 -1963337 -302299 687046 767149 -30129 -1738650
36626 -1738650 -3535813 -3672688 -1779139 -158726 -957763 -2852399 -2646820 253419 3151336
36617 3151336 3784502 2596126 1106083 230900 733865 3063876 5756257 6134558 3973632
36608 3973632 2483326 3930421 6187062 5935044 3705542 2726931 3585241 3464867 983871
36599 983871 -1451707 -1287942 807197 2702331 3694399 3921815 2867038 481185 -1747265
36590 -1747265 -2861524 -4062708 -6074555 -6564925 -3223934 1714268 3628206 1954942
36582 1954942 791432 2529924 4593728 3955748 1576667 121701 -138268 -566302 -1171919
36573 -1171919 -1001280 -282465 201269 973796 2915327 5189949 6218274 6152214 6374925
36564 6374925 6970474 6674280 5148244 3493214 2503698 1889329 1157706 81749 -1316595
36555 -1316595 -2105488 -636549 2995067 5631144 4365603 640531 -1305826 136995
36547 136995 2497939 3236152 2590837 1788929 884329 -287194 -725656 695379 3641579
36538 3641579 6593181 8115452 7707989 6277079 5686523 6794783 8291862 8748748 9004242
36529 9004242 10481937 11935294 10785080 7509007 5331776 5085823 4080922 1352428
36521 1352428 149501 2802799 6548328 7693007 7187646 8238402 10368724 10229319
36513 10229319 7509016 5687243 6558514 7820228 7211032 5859160 5788303 6427095 5687458
36504 5687458 3328198 1474884 2099000 4935030 7776337 8471435 6796146 4348402
36496 4348402 2510007 1231875 379243 1011438 3707059 6476086 6601584 4493518 3424094
36487 3424094 4923704 6611907 5656488 2564740 108141 -188984 1064893 2822116
36479 2822116 4489290 5402389 4825309 2765922 163660 -1810208 -2366654 -1368823 504736
36470 504736 2082211 2610100 2255318 1620159 1137282 1008895 1156039 1089567 524894 199292
36460 199292 1000727 1986348 808837 -2817651 -5550670 -4198453 -207920 1931032 612829
36451 612829 -1113346 -428381 1180821 671683 -1520372 -1957337 744154 3968335 4744388
36442 4744388 3226791 1539302 836078 844053 1051740 837263 -622991 -2906450 -3576321
36433 -3576321 -900053 2959215 3790003 814181 -1929565 -835231 2575329 4026098
36425 4026098 2256032 131148 291400 1858480 2157084 299545 -2015664 -2759634 -1740361
36416 -1740361 -383628 260398 790904 2386311 4776674 6159530 5349027 3152543 1225292
36407 1225292 521861 1419956 4040112 7194960 8208094 5698735 1973024 523649
36399 523649 1282554 784654 -2354077 -4703439 -2557066 2593421 5645518 4381944 1911798
36390 1911798 2162676 4960322 6873095 5733195 2662104 -41783 -1325167 -1213439
36382 -1213439 301250 2850555 4791348 4293454 1552492 -1230520 -2432421 -2519006 -2559352
36373 -2559352 -2470917 -1636002 -274742 891305 1646734 1959721 1395060 -66410 -1370208
36364 -1370208 -1706320 -1630324 -1569216 -389697 2541740 4879625 3631179 -268218 -2586669
36355 -2586669 -1341331 1133022 2333205 2693666 3124383 2547091 296138 -1492213 -881584
36346 -881584 178349 -1544598 -5193080 -6486105 -3799169 -418741 169968 -1290408
36338 -1290408 -1571932 579909 3409500 4767895 4263860 2843217 1312732 -73316
36330 -73316 -841945 -52427 2426786 4843596 4955772 2542313 -616044 -3165014 -4922100
36321 -4922100 -5173487 -2737477 1307950 3580311 2771476 1553760 1974583 1773555 -1465814
36312 -1465814 -5066389 -4632203 -1114137 611857 -237876 714881 5174650 8712177 7504060
36303 7504060 4000621 2687258 3656625 3850962 2164450 -70545 -1851381 -2698556 -1580550
36294 -1580550 1504446 4107335 4103203 2749313 2527095 3188642 2658895 896644 -17154
36285 -17154 738365 1758493 1762343 984320 360573 717050 2193495 3375771 2280904
36276 2280904 -516761 -1662229 273482 2226996 1386249 -48276 1461551 4512924
36268 4512924 4845800 2502817 1742288 3896287 5432827 3958697 1387353 -257452
36260 -257452 -1696060 -3130792 -2306578 1599971 5509986 6432642 5134505 3613495 1862428
36251 1862428 -338758 -1204500 546637 3076759 3978066 3544291 3161360 2574245 1292000
36242 1292000 548743 1033497 688879 -2126028 -5068196 -4762562 -1893312 154367 678783
36233 678783 2006230 4893919 7136828 6973006 4970671 2317120 -141485 -1000540 934144
36224 934144 4512106 7054041 7664470 7790645 8331852 8269065 6618904 4055007 2114415
36215 2114415 1894963 3435675 5357699 5702420 4238775 2918026 2821010 2389576 581726
36206 581726 -358254 1823206 5257316 6695419 6825346 8671874 11796889 12810355 11254430
36197 11254430 10097647 10286976 9852190 8908917 10196468 13590924 15648490 16208145 19602936
36188 19602936 26995534 33609224 36790395 40660538 48705784 58144755 66924840 79868664
36180 79868664 101248624 127867369 158008124 199759349 256351658 306345128 316021426
36173 316021426 277016311 218765728 176256949 156309113 144632025 134991230 135417173
36166 135417173 148506200 161374698 159967991 144021121 122783033 102574597 84083378
36159 84083378 67462086 53967137 43731243 35948342 30783748 28405206 26855658 23552385
36151 23552385 18750439 15326159 14880252 15699024 14991124 11959614 8143276 5441150
36143 5441150 4333928 3870397 3111058 2304184 2350851 3388139 4646242 5663127 6636352
36134 6636352 7318539 6721662 4608338 2307781 1172032 1000260 888781 825264 1272177
36125 1272177 1801975 1542820 741921 559342 1284452 1932772 1787732 1313467 1236139 1523289
36115 1523289 1602127 1093783 236676 -87920 914078 2688048 3462192 2523240 1525874
36106 1525874 2146027 3289043 2722877 992891 937161 2934913 3663921 1071352 -2005393
36097 -2005393 -1439894 2703531 6636636 7554946 5539543 1770228 -2468210 -5299271
36089 -5299271 -5372361 -3844288 -3262203 -4137215 -4494127 -3208849 -1805666 -2075161 -3561989
36080 -3561989 -4538431 -4279580 -3318912 -2398343 -2149296 -2985201 -4303166 -4480448 -2724418
36071 -2724418 -429567 383050 -364196 -974054 -607091 -333299 -998092 -1321188 475163
36062 475163 3575324 4738976 2057749 -2659774 -6053328 -6750170 -5748623 -4352669
36054 -4352669 -3300323 -3195540 -3860698 -3619174 -1326092 1089396 607601 -2244291 -3720792
36045 -3720792 -2518323 -1658304 -3035844 -3686980 -551661 3893042 4704438 1495235 -1647356
36036 -1647356 -2384794 -2268828 -2825445 -3354191 -3244367 -3209833 -3286381 -2339072 -541433 64395
36026 64395 -1435163 -3225158 -3175671 -1403007 246560 188041 -1494917 -2647668 -753534
36017 -753534 3605518 6307068 4695941 1347222 73828 178330 -1344425 -3607517
36009 -3607517 -3102378 -503852 -331314 -3317365 -5074315 -3698214 -2589356 -3447848 -2697604
36000 -2697604 1552769 4692520 2379690 -2487475 -4454480 -3287129 -2152631 -1575390
35992 -1575390 -434944 30533 -1410690 -2227019 -150893 1545241 -1279870 -5800478
35984 -5800478 -5650299 -1022708 1515241 -781657 -3601001 -3463820 -2396206 -2757252 -3169306
35975 -3169306 -2384733 -2421759 -4640635 -6436623 -5106983 -2245331 -1274340 -2599267 -3820436
35966 -3820436 -3364759 -1780193 -314347 288452 70618 -419461 -1099229 -2605841 -4617825
35957 -4617825 -5094949 -3083551 -983964 -1396400 -2950021 -2558969 -754340 -746180 -2692003
35948 -2692003 -3350642 -1649851 -184097 -529281 -1326150 -1739060 -2429172 -2324851 694813
35939 694813 4674817 4410018 -626038 -4445259 -3224059 -545728 -726257 -2219358 -1953160
35930 -1953160 -1385166 -3013225 -4760595 -3453938 -860045 -563951 -1302216 654306 4232268
35921 4232268 4790226 1787481 -655578 -697258 -662685 -1615347 -1493785 179318 662860
35912 662860 -1192842 -2684242 -1706548 139461 816934 964472 1664676 2015953 1276706
35903 1276706 1081682 2990682 5403571 5340349 2548653 -85797 -86054 1854836 2835516
35894 2835516 1089397 -1889128 -3111784 -2032832 -1243054 -2377105 -3414039 -2159777
35886 -2159777 -406529 -1305756 -3903945 -4399674 -2497423 -2005716 -4372002 -6128187 -4580351
35877 -4580351 -1939923 -1157916 -1210394 99099 1467475 239834 -2466833 -2986602 -986732
35868 -986732 -261806 -3079817 -6909043 -8066047 -6318976 -4201985 -3165807 -2247572 -261386
35859 -261386 2104409 2929085 1358191 -1261828 -2643901 -1691831 727578 2705874 2685992
35850 2685992 582321 -1777285 -1957371 314340 2321544 1691285 -149074 62777 2346067
35841 2346067 3199693 1034771 -1120027 -58978 3033599 4901457 5092272 5494067 6236296
35832 6236296 5444467 2890375 696875 -186835 -1449944 -4257753 -6916220 -7206571 -5414091
35823 -5414091 -3498110 -2452238 -1980955 -1889129 -2276238 -2845980 -3270654 -3822410 -4536561
35814 -4536561 -4297013 -2165746 601056 1373190 -732180 -3681274 -4822995 -3443334
35806 -3443334 -788071 1405201 1892580 404875 -2027327 -3674956 -3604850 -2299457 -653325
35797 -653325 959945 2337905 3027057 2836634 2155823 1336186 448355 -123510 32263
35788 32263 109153 -1319466 -3688215 -4310714 -2220723 -89038 -240896 -873679 732775
35779 732775 3044257 2376451 -782121 -2285895 -1226050 -1127935 -3074464 -3175884 292892
35770 292892 2444233 -1101538 -6687581 -7558566 -3573976 -259405 106435 249164 1152049
35761 1152049 -57047 -4125229 -7124578 -6320206 -4198296 -3872563 -4171174 -2501718 275240
35752 275240 1367372 637537 351766 1308432 2076846 1664717 569726 -738713 -2475671
35743 -2475671 -4502732 -5978168 -6307842 -5746159 -5040646 -4756455 -4615522 -3519277 -1020322
35734 -1020322 1369100 1693871 441990 174772 1912112 3902655 4720816 5305892 6552925
35725 6552925 7051460 5221980 2111309 -3370 -584706 -515734 -56923 796637 986476
35716 986476 -343109 -2007645 -2354949 -1959803 -2490352 -3512901 -3010750 -928161 462875
35707 462875 148978 -102253 1286519 3167806 3336102 1497766 -506702 -814837 682691
35698 682691 2221331 1783719 -565494 -2319425 -1423376 1033769 2398005 2159269 2129729
35689 2129729 3066916 3494291 2540747 1663968 2085332 2239534 -179997 -4372297 -6678883
35680 -6678883 -5039831 -1857483 -1414978 -4752081 -8186733 -7656031 -3852781 -1426556
35672 -1426556 -2852115 -5179626 -4315902 -653644 2057877 2275019 1899728 2125773 1479531
35663 1479531 -936352 -3136011 -2960211 -1067447 518982 1213841 1517231 1298299 265317
35654 265317 -864171 -1289790 -1373539 -1621930 -1531534 -946272 -1314958 -3629665 -6047184
35645 -6047184 -5786686 -2957458 -398429 61220 -897562 -2241840 -3975134 -5860745 -6759396
35636 -6759396 -6200557 -5218882 -4752332 -4330946 -3162852 -1560806 -455223 -155528 -248905
35627 -248905 -206813 342055 1387327 2237691 2019517 771761 -522867 -1202644 -1555144
35618 -1555144 -1950014 -2097075 -1616208 -850419 -741178 -2109046 -4934716 -7894889 -9028704
35609 -9028704 -7831091 -6365757 -6955766 -8882943 -9101401 -6524014 -3596544 -2666109 -2772950
35600 -2772950 -1723140 259514 1212738 841783 749848 1443079 1529117 350091 -787644
35591 -787644 -967222 -1318476 -2866523 -4237343 -3485198 -1436141 -1005770 -3052970 -4911452
35582 -4911452 -3951771 -1103094 601511 98037 -894232 -1043347 -1472136 -3673380 -6633668
35573 -6633668 -7608006 -5490410 -2125070 -120471 -320338 -1616896 -2309321 -1268180 1367621
35564 1367621 4039958 4920826 3774933 2154609 1263815 382949 -1688434 -4217946 -4973291
35555 -4973291 -3262974 -1286390 -1525885 -3410007 -3861471 -1429043 1344429 930824 -2286525
35546 -2286525 -3969960 -1357549 2871148 3908461 892228 -2557617 -3496611 -2825194
35538 -2825194 -2833033 -3994944 -5420776 -6571410 -7070568 -6368310 -5032996 -4838351 -6001473
35529 -6001473 -6021173 -3288806 -215942 -115105 -2211814 -2945418 -1617112 -1148248 -2880373
35520 -2880373 -4198804 -2721756 59611 1222350 295136 -1296305 -2914568 -4636272
35512 -4636272 -5611726 -4685319 -2292899 -155816 713677 608131 149163 -227711 -177186
35503 -177186 280353 743753 1263216 2445600 4078626 4748893 3917107 3250466 4316885
35494 4316885 5831045 5244655 2816418 1839863 4162468 7326754 7528361 4406587 1330707
35485 1330707 1055622 2472356 2380214 -246607 -2955811 -2981576 -644927 1365373 1530529
35476 1530529 915067 921541 1116175 284824 -1191708 -1381709 664027 3336996 4050924
35467 4050924 2163247 -364056 -1491706 -1491478 -1759607 -1902108 -196765 2630830 2868181
35458 2868181 -1027494 -5137346 -4956360 -1826992 -738982 -2742609 -4089579 -3010279
35450 -3010279 -2408808 -4325650 -6316933 -5888150 -4627847 -4831598 -5302828 -3950375 -1814245
35441 -1814245 -873339 -165207 2113596 4566759 4604598 3041553 2854898 4597236 6819085
35432 6819085 9720885 14142882 17900070 17701702 14334952 11465191 9574810 5993802
35424 5993802 1126885 -802246 1430176 3625856 2744157 1318278 2601841 5413634
35416 5413634 7033414 7752881 8934030 9249915 6698480 2680485 621305 1501649 3452128
35407 3452128 4806846 5151835 4330510 2756850 1983803 2964070 4481928 4972289 4813822
35398 4813822 4992584 4669432 2320137 -1347085 -3718290 -3388452 -1527777 -371275 -1260723
35389 -1260723 -3542320 -4675358 -2532271 1609273 3828426 2299215 -504110 -1627221
35381 -1627221 -1547070 -2254435 -3388246 -3045270 -1316541 -238636 -657837 -1466662 -1698433
35372 -1698433 -1370478 -482524 983619 2211345 2240265 1303438 259098 -746770 -1804185
35363 -1804185 -2227043 -1467791 -347379 -46852 -626746 -1596969 -2702878 -3002487 -1019827
35354 -1019827 2448464 3780097 1235163 -1771263 -1198530 1533194 1757999 -1218224
35346 -1218224 -3355826 -2212253 108744 981631 488985 -433045 -1693462 -2561325 -1577987
35337 -1577987 494077 498753 -2512251 -5083732 -3893026 -344515 1673930 948328 -571902
35328 -571902 -1276706 -1357355 -1149344 -267589 1210171 2171292 1735385 391102 -654499
35319 -654499 -984899 -1305577 -2028027 -2040930 30978 3265528 4703941 3053253 513048
35310 513048 -581204 -1215254 -3417291 -5941712 -5581473 -2440579 -358346 -1439330 -3375445
35301 -3375445 -3423506 -2133409 -1369678 -1065690 -143171 991336 1034016 -84511 -1361198
35292 -1361198 -2303067 -3000126 -3272600 -2895494 -2144719 -1303731 -268977 707595 698787 -756559
35282 -756559 -2873373 -4507764 -5151976 -4795228 -3718652 -2686334 -2356769 -2347444 -1948281
35273 -1948281 -1678549 -2672800 -4536146 -5569034 -5272277 -4687280 -4021739 -2256473 272035
35264 272035 1411895 473473 -372107 567806 1941442 1830710 782568 360437 338151
35255 338151 -518059 -2128168 -3574280 -4828881 -6114912 -6548316 -5335963 -3497122 -2566798
35246 -2566798 -2346018 -1732352 -1055873 -1657923 -3545574 -5229684 -5720576 -5249307 -4243308
35237 -4243308 -2914290 -1699111 -1021399 -793388 -863213 -1366123 -1908147 -1340598 609813
35228 609813 2369414 2318135 780231 -837258 -2001181 -2997063 -3783320 -4108925 -4089230
35219 -4089230 -3739310 -2788960 -1692448 -1553887 -2199506 -1930988 -305136 729182 -12591
35210 -12591 -705490 470179 1942945 970298 -2197100 -5084683 -6706026 -7619686 -7329577
35201 -7329577 -4927401 -1900200 -1000651 -2179715 -2648390 -1375038 -627910 -2230254 -4789111
35192 -4789111 -5736720 -4233243 -1176172 1993498 3734527 3164306 1105513 -716210
35184 -716210 -1727442 -2544959 -3085011 -2317522 -133559 2052662 2846774 1842705 -762312
35175 -762312 -4059108 -6147009 -5583377 -3078198 -485680 1310328 2058699 933083 -1900198
35166 -1900198 -3525518 -1286929 2784951 3973782 1483561 -544018 625968 2645037
35158 2645037 2322389 219046 -1225774 -1539985 -1703015 -1642581 -627082 1000811 2322287
35149 2322287 3161679 3683427 3816651 4002430 4967860 5808753 4255569 228642 -2864638
35140 -2864638 -2237726 496745 1630977 107324 -2080616 -3199462 -3386533 -3428204 -3638810
35131 -3638810 -3815936 -3338188 -1779220 -58995 -17202 -2094318 -4561572 -5770536 -5785112
35122 -5785112 -5063806 -3394441 -1335870 -714352 -1918392 -2434497 -145905 3290385 4500477
35113 4500477 2742288 150013 -1387660 -1531179 -517578 1021936 1823388 1343089 732104
35104 732104 970665 1131777 263687 -408066 456579 1290914 -404459 -3763908 -5345404
35095 -5345404 -4068896 -2353243 -2154808 -2875603 -3710076 -4977771 -6030316 -4761565 -981662
35086 -981662 2029559 1438733 -1275853 -2446206 -1093027 373545 -227639 -2422600 -4271388
35077 -4271388 -4513663 -3221576 -1352720 -143226 -348562 -1530634 -2239589 -1350074 594626
35068 594626 1675248 690485 -1190926 -1593349 187321 2418298 3346090 3132756 2596268
35059 2596268 1421674 -812020 -2796291 -2703431 -954075 154085 -329526 -1024798 -866765
35050 -866765 -861535 -2199326 -4019035 -4360857 -2611187 111320 2557534 4304972 5263829
35041 5263829 5215614 4262969 3280809 3288248 4203682 4667527 3599062 1628190 190010
35032 190010 -608123 -1948268 -3873816 -4466177 -2486386 386539 1371889 -91002 -2136652
35023 -2136652 -2970688 -2333000 -1123031 -874472 -2869102 -6231751 -7638018 -4856572 -172016
35014 -172016 1869469 105700 -2076963 -1595552 646914 2028740 2157923 2688377 4154932
35005 4154932 4929125 3528074 809238 -818093 -130861 1522264 1890036 478133 -1235320
34996 -1235320 -2069456 -2393974 -2853684 -3284607 -3563127 -4034239 -4221375 -2837407 -277605
34987 -277605 911032 -191928 -748787 1775574 5408326 6521055 5121579 3769423
34979 3769423 2780669 806090 -819795 711913 4170042 5101008 2855532 1569041
34971 1569041 2796675 2795319 -307711 -2228065 541914 4208871 3212202 -1060036 -2603621
34962 -2603621 169502 3106963 3059676 1009744 -1257092 -3086953 -3340697 -960151 2133637
34953 2133637 2235041 -1132496 -4329485 -4483970 -2533496 -729111 87464 -246276 -2010852
34944 -2010852 -4327217 -5196037 -4128683 -3006432 -3196050 -3505002 -2276854 -81580 1131854
34935 1131854 715512 -69783 220219 1584818 2558917 1752662 -357808 -1631084 -826996
34926 -826996 782860 1334461 942366 858414 958511 107554 -1397520 -1896151 -857068
34917 -857068 586683 1545415 1988494 1661888 424776 -498221 241267 1793880 2313978
34908 2313978 2111822 2818423 3754373 2708783 549660 857542 3799991 4813715 1663738
34899 1663738 -1482274 -438235 2280412 1573560 -2094477 -3768858 -1880519 109191
34891 109191 -187274 -1138960 -1083716 -1007695 -1686804 -1719519 -429120 162626 -1429952 -3175989
34881 -3175989 -2243336 869265 3342081 4105404 4438334 5011867 4832905 3454958 2166622
34872 2166622 2067815 2410165 1999636 1267585 1534738 2642608 2940094 1940946 1404652
34863 1404652 2632617 3910608 2567198 -823897 -2588202 -861037 1820228 2205366
34855 2205366 790898 526183 2254668 3970111 4285280 4070571 4147634 3640292 1815751
34846 1815751 -89166 -397454 598131 1193517 783467 517220 1459008 3089066 3953157
34837 3953157 3275446 1581721 -79356 -1176375 -1763343 -1728322 -642920 1255916 2564281
34828 2564281 2084278 493619 -303628 461578 1655951 2064872 1981374 2357125 3092278
34819 3092278 3046324 1574405 -615360 -2287822 -3045484 -3556332 -4297230 -4417389 -2676772
34810 -2676772 263163 1670581 11850 -2450906 -2116651 1058856 3153730 1394350
34802 1394350 -2183698 -3516261 -1647994 587248 419675 -1951356 -4300799 -4919251
34794 -4919251 -3808633 -2144154 -1103303 -1042737 -1514532 -1832035 -1410068 125585 2431570
34785 2431570 4078818 3641610 1483172 -392228 -656914 34674 454865 465807 612191
34776 612191 1023325 1468316 1618678 664479 -2113163 -5592760 -7108161 -5676633 -3419092
34767 -3419092 -2313987 -1317439 1142934 3547470 3218616 845977 -382497 157493 -15485
34758 -15485 -1665170 -2327866 -817912 457170 -278075 -882549 1018910 3611734 3336600
34749 3336600 166553 -2609754 -2935021 -1643944 -333049 -101609 -1839009 -5271458
34741 -5271458 -7985066 -7621174 -4849036 -2205615 -505460 1301875 3134407 3374070
34733 3374070 1723284 37699 -260358 370086 1074542 1539057 1126604 -797295 -3188388
34724 -3188388 -4026447 -3160160 -2312816 -1859935 -241089 2519478 3586189 1357531 -1682116
34715 -1682116 -2317186 -903792 -45736 -561414 -1279875 -1779915 -2759328 -4096735 -4701260
34706 -4701260 -4130403 -2736416 -697803 1413458 1799628 -681862 -4089595 -5028134 -2770512
34697 -2770512 255084 2148231 3368080 4336845 3746596 871074 -2173643 -2512398 -100133
34688 -100133 2483463 3412055 3107972 2397710 1002283 -1246892 -2957557 -2445285 -166285
34679 -166285 1475584 1009422 -576978 -1748445 -2665626 -4345859 -6405646 -7248085 -6334310
34670 -6334310 -4775757 -3583748 -2797856 -2568167 -3439547 -4913410 -5323610 -4184963 -3306942
34661 -3306942 -4243083 -5659033 -4788831 -1069047 2999865 4552302 3069109 505848
34653 505848 -661466 389377 2252661 2975236 2170323 996861 481916 903958 2391638
34644 2391638 4536990 5646615 4387970 2219371 1849007 3013460 2583768 -404050
34636 -404050 -2984893 -2868316 -1506024 -659669 613467 2892568 3797901 1967497 412592
34627 412592 1648668 2416898 -1458920 -7088249 -7536327 -2110927 2526481 1940132 -1215974
34618 -1215974 -3078556 -3715949 -4267030 -3805222 -1766077 261446 1505537 3354331 5818039
34609 5818039 6373569 4446919 3172808 4208631 4715652 2477340 162644 812384 2454341
34600 2454341 1408042 -1669327 -3320977 -2846249 -2116554 -1453820 88636 1432104 556334
34591 556334 -1704506 -2646761 -2076396 -2242065 -3636609 -4192476 -2786573 -725315 414161
34582 414161 170105 -1269970 -2814132 -2541856 -311540 912381 -965315 -3367075 -2677432
34573 -2677432 -320789 -854955 -4568204 -6794975 -5126336 -2632594 -2481832 -3535104
34565 -3535104 -3393637 -2366102 -1951336 -1972219 -1538884 -893897 -403168 480558 1603292
34556 1603292 1302404 -1088592 -3587235 -4090511 -3100228 -2342345 -2027446 -1145050 523470
34547 523470 2191896 3224464 3479119 3123285 2726379 2758317 2678440 1547018 -333470
34538 -333470 -1680243 -2094236 -2047138 -1230985 845890 2684475 2083744 45032 129000
34529 129000 2861258 4361586 2485145 673136 2535045 5614240 4725172 -167877
34521 -167877 -3751189 -2686423 655020 2227736 996036 -1313819 -2811295 -2704754
34513 -2704754 -1429423 -267094 40505 332819 1660952 3179568 2825982 64151 -3348625
34504 -3348625 -5340038 -5165389 -3306183 -1016460 115039 -642301 -2361487 -3647050
34496 -3647050 -4220206 -4467798 -4260077 -3552169 -3320447 -4233209 -5147061 -4834896 -4417132
34487 -4417132 -5631908 -7197329 -5911067 -1612519 2077894 2896287 2746361 3796015
34479 3796015 4725819 3403710 1045875 545941 1855156 2191418 449854 -1552578 -2377427
34470 -2377427 -2717148 -3172302 -2847608 -1409992 -392771 -810879 -1194177 98368 1978887
34461 1978887 2310433 1575828 2189427 4276899 4998759 2935861 555374 561203 1739032
34452 1739032 773216 -2898022 -6533437 -7988502 -7661645 -6330751 -3613829 196506
34444 196506 2712979 1750320 -1772137 -4762683 -5410900 -4467985 -3357195 -2356724 -961536
34435 -961536 869946 2410378 2860341 2157935 1222645 1287682 2637298 4000410 3614337
34426 3614337 1171026 -1495460 -2113300 -550546 717149 -704197 -4139877 -6413010
34418 -6413010 -5537775 -2764849 -446815 765388 1388893 1088975 -720581 -2818034 -3071401
34409 -3071401 -1577380 -713315 -1514462 -2165880 -1082153 561692 847541 15227 -368161
34400 -368161 31156 259288 -238259 -1282863 -2483609 -2837719 -971033 2585364 4528599
34391 4528599 2390160 -1667574 -3063453 -675849 1880476 1259898 -1534199 -3023729
34383 -3023729 -1527874 1610074 3937600 3887283 1508547 -1788564 -4297022 -5171121 -4524720
34374 -4524720 -2820806 -900080 -181602 -1472792 -3424880 -3481472 -858101 2472860 4226647
34365 4226647 4139687 3295880 2357015 1521335 1346680 2253801 3467671 3562970 2109451
34356 2109451 26712 -1644444 -2535908 -2489244 -1267035 707340 1962483 1262663 -725790
34347 -725790 -1857597 -966669 754181 1484873 1299859 1763687 3107934 3373136 1167886
34338 1167886 -1911535 -2926284 -1078998 1731272 3549058 4217145 4492467 4564606 4076677
34329 4076677 2991143 1838888 1110120 420095 -1521126 -5295355 -8845428 -8532324 -3461458
34320 -3461458 2290759 3743645 816406 -2130136 -2340582 -1459733 -1653380 -2037912 -962791
34311 -962791 559192 461246 -784350 -1072140 -356241 -440298 -1288882 -671327 1918378
34302 1918378 3864960 3164318 1096940 -326336 -1298346 -2641814 -3362613 -2354714 -1108632
34293 -1108632 -1805626 -3490781 -3178711 -554002 1543983 1625827 1287929 1478741 387146
34284 387146 -2955379 -5909706 -5917082 -4768404 -5835000 -8471685 -8978965 -6667902 -4961459
34275 -4961459 -5783231 -6613389 -4873145 -2105131 -1208865 -1734029 -1022734 1081485 1875857
34266 1875857 165751 -1854099 -2007054 -1178500 -1335977 -1983267 -791753 2501301 4973967
34257 4973967 4172748 1407035 -79392 561684 1096161 -225134 -2341397 -3297511 -2813160
34248 -2813160 -1831058 -909081 -439812 -1233164 -3192380 -4381213 -3301479 -1405434 -1352598
34239 -1352598 -3272311 -4878585 -4980088 -4548057 -4249334 -3320168 -1460691 181519 635511
34230 635511 151444 -724651 -1548507 -1424786 53180 1323657 469800 -1702110 -2633812
34221 -2633812 -2018481 -1909481 -2693304 -2438577 -884414 -200595 -580331 688336 3799959
34212 3799959 4586045 1160062 -1866056 -7952 3771937 3386207 -1179470 -4345478
34204 -4345478 -3319506 -796717 362085 403872 311715 193206 590065 2076847 3296288
34195 3296288 2482984 873107 1343517 3768537 5178152 4545864 3833871 4073159 4068448
34186 4068448 3433164 3264343 3226736 1636749 -884203 -1658869 -707504 -1246428 -4245826
34177 -4245826 -6633607 -6548751 -6104320 -6656351 -5605720 -1147957 3401409 3857299 1148783
34168 1148783 -651010 -257188 451575 409128 202850 -11717 -300874 470406 2953419
34159 2953419 5030870 4079663 863667 -1582719 -2293110 -2662492 -2919194 -1681564 656855
34150 656855 1384935 -479083 -2215340 -1172989 1329197 1792140 -798207 -3985133 -5283221
34141 -5283221 -4954806 -4832498 -5516078 -5874370 -5027491 -3575143 -2466395 -1731998 -1101248
34132 -1101248 -833693 -782454 339362 3041439 5143926 3977907 377512 -1731248 -70411
34123 -70411 3554559 5831735 5032850 1348755 -3565208 -6804377 -6228893 -3080640 -644241
34114 -644241 77303 868855 2114477 1530895 -1429190 -3322719 -1407418 2053376 3021054
34105 3021054 1176030 -735565 -1440851 -1969417 -2861835 -3305297 -2693194 -1089608 1251330
34096 1251330 3269724 3165115 855281 -979219 -346751 958293 45087 -2633976 -4271110
34087 -4271110 -4135958 -4038402 -4804451 -5194733 -4409054 -3146747 -1908097 -429366 881786
34078 881786 938912 -146848 -812353 -95818 1299469 2187623 2066419 1069095 -312492
34069 -312492 -1497303 -2376159 -3186317 -3558742 -2834883 -1744004 -1927164 -2877672 -1701717
34060 -1701717 2343178 5511626 4377652 953567 -123157 1997584 4166762 4346331
34052 4346331 3298305 1703630 -673194 -2759277 -2492081 6612 2296625 3058219
34044 3058219 3104069 2861036 1799810 773180 1802262 4606498 6199060 5088213 3215085
34035 3215085 2399894 1572186 -533162 -2254820 -1246312 1355585 1752784 -1359993 -4463479
34026 -4463479 -3156726 2318912 6884828 6405700 2417975 -454218 -869724 -1679110 -4267986
34017 -4267986 -5749574 -3799265 -852370 -225553 -773997 582694 3028785 3159801 1049860
34008 1049860 233770 1774558 2858176 1717644 -215110 -1739937 -3459225 -4978918
34000 -4978918 -4375263 -1735176 146595 -211416 -1391320 -2322462 -3613605 -4677881 -3327646
33991 -3327646 270251 2817266 2717142 2254226 3275173 4272665 3781637 3165494 3625042
33982 3625042 3624994 1846239 -143155 -618914 -424978 -692839 -586294 425357 894562 253602
33972 253602 274060 1307287 561169 -2942273 -5345711 -3597622 -711187 -1028626 -3222148
33963 -3222148 -3028921 -680763 -91480 -1874371 -2691693 -1320805 -230774 -646721 -714547
33954 -714547 354466 393924 -1887425 -4352239 -4356904 -2013064 594130 1627541 305916
33945 305916 -2748990 -5522894 -6415936 -5953345 -5293124 -3972751 -1439552 158356 -1974266
33936 -1974266 -6466902 -8426191 -5743970 -1875071 -1075028 -3254118 -5087763 -4507298
33928 -4507298 -2511265 -1401205 -2307836 -4214655 -5285848 -5346479 -6129299 -8179746 -8994482
33919 -8994482 -6204332 -1460740 1366159 1161468 40971 -629609 -1569612 -2880435 -3266600
33910 -3266600 -2752351 -3292058 -5484067 -7057279 -5867361 -2454150 1306043 4091847
33902 4091847 4868632 3036058 103289 -842938 1190505 3612338 3649267 1544831 -812952
33893 -812952 -2503775 -3208145 -2090337 772256 3046711 2502201 170214 -844894 484812
33884 484812 2009255 1718473 532299 775587 2652845 3614090 1735214 -1171868 -1339654
33875 -1339654 1911799 4805201 4079737 1553030 1284871 3320426 3593311 179605 -3773695
33866 -3773695 -4613433 -2767433 -918310 -19461 488587 269777 -1323121 -3057198 -2753557
33857 -2753557 -336129 1991444 2685796 2361124 2196807 2345489 2407600 2406988 2645573 3066049
33847 3066049 3141184 2284032 476361 -1303746 -1637451 -132942 1838074 2285954 440814
33838 440814 -2620785 -4825358 -4525473 -1760064 1518241 3035529 2443924 1512543 1826099
33829 1826099 3045850 3894443 3927538 3469749 2601354 1439872 992472 2294115 4573161
33820 4573161 5544862 4068001 1580359 185229 10548 -575666 -2418661 -4309585 -4507745
33811 -4507745 -2745209 -261285 1563210 2034756 1165641 -257764 -868933 65400 1598301
33802 1598301 2104407 1336539 542212 513457 752818 850913 1221732 1713886 946663 -1667150
33792 -1667150 -4293539 -4630923 -2958162 -1773346 -2565481 -4178134 -4490822 -2940596 -1248142
33783 -1248142 -1807885 -4911648 -7622518 -6697665 -3010624 -1197384 -3696689 -7101336
33775 -7101336 -6557412 -2291676 1000098 601833 -1230858 -876915 2407311 6319849 7816811
33766 7816811 5359515 511917 -2684221 -1688847 1215287 1496232 -1764632 -4821672
33758 -4821672 -4395590 -1515933 585708 354251 -1450878 -3359532 -4184811 -3452129 -1752926
33749 -1752926 -50650 1521503 3238200 4384712 3772030 1627618 -575955 -2105586
33741 -2105586 -3124825 -3178942 -1707504 23200 36755 -1044050 -528342 1862520 2910384
33732 2910384 540934 -3003960 -4208846 -2448113 313495 2077223 1777657 -386885
33724 -386885 -2329589 -1680480 863354 1899591 131504 -1702202 -1200595 124867 -190020
33715 -190020 -1457901 -1330816 377633 1910117 2277832 1579073 -86240 -2033674 -2643292
33706 -2643292 -1359706 387331 1663261 3325362 5237774 4988523 1842343 -849913
33698 -849913 -334218 1098236 22022 -2267494 -2235260 -442916 -344974 -1946171 -2045164
33689 -2045164 -486241 -681677 -3278342 -4551150 -2546698 -106718 127859 -539494 -313493
33680 -313493 -182057 -1177293 -1846691 -1290424 -1646714 -4415688 -6876426 -5584169 -1608122
33671 -1608122 1060266 1065418 454309 642817 684800 -462145 -2366448 -4069246 -4933367
33662 -4933367 -4599637 -3503544 -3061327 -3830451 -3993393 -1553390 2139584 3162783 -107897
33653 -107897 -4564499 -5797857 -2947585 862944 2311099 1013102 -1017563 -1972383
33645 -1972383 -1663826 -896462 -465919 -890231 -2100255 -2862632 -1545424 1554312 3559252
33636 3559252 2135560 -1279993 -3066331 -2070401 -853146 -1962211 -4668776 -6224357
33628 -6224357 -5141130 -2329157 270424 1462713 1578624 1771852 2398225 2561125 1779702
33619 1779702 1123991 1466264 1647722 266935 -1541366 -1509885 62941 772636 176835
33610 176835 365735 2093543 3549637 3842504 4402693 5559603 5063519 1965233 -1152175
33601 -1152175 -2091168 -2142196 -2672360 -1867259 1589217 4482764 3191181 -120494 -308814
33592 -308814 2774593 4181483 1686246 -1286094 -1508816 -185222 419324 691673 1710075
33583 1710075 2601050 2299057 1701864 1921795 2326702 2246416 2657966 4078355 4653698
33574 4653698 2823233 472307 728077 3335337 4781099 2899566 -787434 -3512970
33566 -3512970 -4291060 -4048082 -3964492 -4262862 -4186455 -3097035 -1671190 -1321707 -2120285
33557 -2120285 -2485379 -1723503 -1415628 -2794895 -4108274 -2802393 418332 2243506 1385705
33548 1385705 38487 224598 1107809 1018244 50008 -899159 -2017415 -3657446 -4683697
33539 -4683697 -3800554 -2009854 -1725631 -3349325 -4472940 -3094181 -397353 518925 -1860745
33530 -1860745 -5830723 -8110796 -6915386 -3596336 -1283208 -1710496 -3552353 -4162349
33522 -4162349 -2614509 -512030 -74829 -2032798 -5172524 -7324486 -7018389 -4810822
33514 -4810822 -2755307 -2075602 -2008266 -1644847 -1698628 -2797433 -3150340 -618976 3144593
33505 3144593 3807516 379982 -2978502 -2756508 -788444 -809173 -2793795 -3774509 -2618741
33496 -2618741 -767396 775486 2092677 2679581 2105038 1804661 3261576 4975838 4434976
33487 4434976 2514355 2200528 3244390 2413614 -561147 -1979749 -310956 1374146
33479 1374146 1021811 949488 2901663 4321648 3063373 1621553 2487455 3122685 459095
33470 459095 -2901494 -2574889 68378 287363 -1906858 -2423738 -871565 -866046 -2552486
33461 -2552486 -1743687 2323255 4985468 3854774 2223475 2255117 1080967 -2793012 -5221982
33452 -5221982 -3232610 -840619 -2537554 -5304421 -3396636 2042656 4823542 3323575
33444 3323575 1607647 1623199 813138 -1859445 -3459557 -2394675 -1269468 -2124022 -2761544
33435 -2761544 -523332 3087806 4253177 1699977 -2261443 -4535936 -3866033 -1534698
33427 -1534698 -84391 -562673 -1208176 -74995 1795320 1946341 604102 279333 1303483
33418 1303483 1103352 -1232090 -2913588 -1600903 1096534 2197025 1256800 -272089
33410 -272089 -1700301 -2914896 -2930525 -927389 1918665 3488103 3268215 2508799 2179182
33401 2179182 1935261 997092 -691441 -2146830 -2061380 -213027 2019933 3240433 3653868
33392 3653868 4026255 3839493 2359757 848657 1097009 2001904 741859 -2300435 -3330141
33383 -3330141 -1008902 1046409 -388261 -3558024 -5037852 -4744666 -4608937 -4581950 -3312098
33374 -3312098 -1202751 302732 1186207 1834425 1089937 -1657520 -3948831 -3239399 -1192375
33365 -1192375 -1322631 -3256636 -3384082 -978956 511098 -1082491 -3649601 -4444929 -3668470
33356 -3668470 -3077218 -3478154 -4775113 -6459307 -7207270 -5917614 -3683728 -2743618 -3202357
33347 -3202357 -3082930 -1816320 -938601 -842312 131433 2372341 3753869 3087619 2020729
33338 2020729 1846679 1152745 -1285042 -3703660 -3924440 -2851281 -2820708 -3774773 -3624802
33329 -3624802 -1744314 98122 118957 -1629203 -3564877 -3836174 -1832511 880004 1937190
33320 1937190 931515 -426649 -1210316 -2369273 -4048259 -4134279 -1318918 2169114 3089605
33311 3089605 1339514 -437491 -566296 251121 762786 743510 850012 1811232 3370729
33302 3370729 3702688 1158133 -2800969 -4248696 -1672553 1534515 1159576 -2716090
33294 -2716090 -6478726 -7490088 -5885842 -3102859 -792731 -416939 -1931653 -3391527
33286 -3391527 -3342971 -2718109 -2904236 -3263927 -2481719 -1085430 -381455 38626 1287016
33277 1287016 2507662 1789531 -663532 -2634116 -2907774 -2112000 -955196 238993 623839
33268 623839 -372183 -1560414 -1235078 437111 1988775 2839708 3031312 1977848 -70767
33259 -70767 -604465 2004366 4938993 4113977 323690 -1761261 -656072 246615 -1229259
33250 -1229259 -2745022 -2051117 -932553 -1954884 -4276568 -5474849 -5318090 -5041458 -4509379
33241 -4509379 -2674254 67925 2050585 2408618 1718018 1097237 1355580 2270494 2479787
33232 2479787 1209195 -99161 324807 1394455 514966 -1820217 -2074323 858171 3665358
33223 3665358 3610886 2145388 1506979 1032666 -434778 -1421702 -406246 741029 -616180
33214 -616180 -3410259 -4386315 -2953595 -1407848 -1198408 -1872220 -2965183 -4187127 -4412762
33205 -4412762 -3073839 -1782796 -2055466 -2477516 -1009390 1001025 583379 -1745687 -2484486
33196 -2484486 -775005 393139 -629731 -1496730 47528 2499427 3001824 1210234
33188 1210234 -1075717 -2463640 -2603540 -1696542 -682514 -670221 -1204911 -523964 1550463
33179 1550463 2669588 1149002 -1529661 -2940530 -2988024 -3148493 -3618349 -3395666 -2635503
33170 -2635503 -2629787 -3236599 -2373716 970541 4577697 5185360 2355500 -1016829 -2118955
33161 -2118955 -1154801 -357196 -851814 -1592967 -1306447 -278519 383292 455234 689819
33152 689819 1527236 2453908 2629366 1782558 533489 -133665 -25844 -226527 -1723282
33143 -1723282 -3676970 -4168836 -2756853 -916635 319809 1439288 2577501 2646746 1520351
33134 1520351 979475 1778972 1883417 -81870 -1655074 113453 3639114 4726291 2703354
33125 2703354 808215 671372 519041 -554561 -730405 570103 718056 -1759484 -4084508
33116 -4084508 -3402434 -1483476 -1939937 -4549569 -5916022 -4855147 -3532103 -3248786 -2488094
33107 -2488094 -154261 1930034 1502704 -766380 -2228730 -1862632 -1193323 -1583114 -2155676
33098 -2155676 -1335915 441726 1052999 -264006 -1718344 -1629260 -928860 -1550616 -3265571
33089 -3265571 -4063600 -3366720 -2812276 -3584643 -4818203 -5211942 -4651456 -3637168 -2576317
33080 -2576317 -2204386 -3179932 -4622666 -4626405 -2961182 -1658389 -2093191 -3202932 -3595579
33071 -3595579 -3585997 -3813293 -3648778 -2659237 -2034920 -2649561 -3131228 -1997402 -479941
33062 -479941 -812030 -2586794 -3463072 -3100211 -3611768 -5778671 -7346105 -6111848 -2909978
33053 -2909978 -344519 273416 -366536 -1197426 -2034482 -3217189 -4534446 -4962777 -3813389
33044 -3813389 -1866933 -507158 197791 1186467 2003888 816736 -2093278 -3226709 -522472
33035 -522472 2778636 2015043 -2260012 -5039153 -3956513 -1850315 -1565341 -1948249 -889522
33026 -889522 677096 480049 -1280367 -2546878 -2806286 -3349796 -4498200 -4835860 -3511158
33017 -3511158 -1592335 -489272 -173676 221281 683163 210591 -1480846 -3015883 -2990355
33008 -2990355 -2182457 -2732623 -4798212 -5777379 -4066719 -1825271 -1866283 -3215565 -2710219
32999 -2710219 -251239 1058618 76365 -848611 -312793 82806 -332176 613803 3357985
32990 3357985 4118856 685192 -2847276 -1899788 843355 -612657 -5495673 -6945236
32982 -6945236 -2955565 395152 -1178190 -3612746 -1879643 1392854 225326 -5125130
32974 -5125130 -8851130 -8343081 -6561150 -5881364 -4926726 -2647777 -1006411 -1500846 -2424237
32965 -2424237 -1956905 -1404963 -2852196 -5498298 -6907129 -6564463 -5593071 -3853024 -318980
32956 -318980 3598836 4145432 95706 -4500460 -4650014 -718970 1876553 -415567 -4784580
32947 -4784580 -5890628 -2737016 623527 909965 -590025 -994389 -60435 691531 1270317
32938 1270317 2681498 3888455 2563358 -810180 -2563660 -577508 3123266 5659948
32930 5659948 6653861 6772027 5626333 3512657 2898187 5025567 6714256 4210427 -680497
32921 -680497 -2341517 726753 3845237 3110457 491970 -195867 862638 785935 -956450
32912 -956450 -2175037 -1713808 -559341 525872 1845937 3130334 3377209 2773891 2777851
32903 2777851 3671472 3824083 2238307 319926 38431 1399515 2790482 3071171 2360453
32894 2360453 1282450 327423 -238537 -362481 6350 1112278 2766482 3565306 1936839
32885 1936839 -1494324 -3800980 -3013085 -520897 961585 917293 885887 1390282 1097329
32876 1097329 -685797 -2576756 -3032080 -2262046 -1242792 -94045 1253843 1799418 606671
32867 606671 -1173166 -1181142 966134 2821426 2138324 -239392 -1410763 154595 3008348
32858 3008348 4379737 2869472 -474141 -3300626 -3996084 -2772038 -999105 271090
32850 271090 973253 1433591 1545386 802723 -829096 -2248098 -1918626 227715 1950488
32841 1950488 909209 -2118210 -3722981 -2400348 -903827 -2313726 -5254042 -5846311
32833 -5846311 -3760868 -2766625 -4639182 -6195718 -4375600 -1126748 -179996 -1166582 -660227
32824 -660227 1965081 3594308 2426106 489790 101785 609442 176412 -1199475 -2066956
32815 -2066956 -1680166 -558774 215420 -419461 -2533433 -4313557 -3554683 -702929 1155705
32806 1155705 265332 -1459504 -1312490 532941 1899112 1953683 1749327 2081179 2699885
32797 2699885 3466993 4654640 5966184 6469004 5655224 3782171 1371501 -820742 -1833682
32788 -1833682 -1661346 -1994401 -4384517 -7695132 -8775098 -6007009 -1147740 2625089
32780 2625089 3542292 1960853 -523798 -2045486 -1467234 679191 2549893 2810753 1874719
32771 1874719 1000868 518400 -522321 -2931425 -5962199 -7586470 -6352869 -2980142
32763 -2980142 126469 1089217 126775 -1095337 -1245881 -263728 946993 1306546 471800
32754 471800 -534426 -41647 2262861 4414853 4109095 1447549 -1074417 -1393772 102730
32745 102730 1625639 2243130 2403751 2542807 2068319 225015 -2364869 -3816866 -3026062
32736 -3026062 -1079238 28836 -240518 -738611 -555078 -22858 351515 699800 968986
32727 968986 412298 -1248127 -2992009 -3702391 -3527716 -3274245 -3137218 -2850945 -2437344
32718 -2437344 -1984818 -1331389 -738893 -1102298 -2586037 -3832279 -3527695 -2070778 -809258
32709 -809258 -507512 -1463410 -3870785 -6703812 -7545809 -5361739 -2406374 -1404499 -1865478
32700 -1865478 -1542816 -621246 -1450963 -4315536 -6585921 -6626386 -5733983 -5290286 -4569130
32691 -4569130 -2675745 -529429 528245 494686 -57585 -981171 -1843337 -1803610 -1103552
32682 -1103552 -1061649 -1801563 -1854389 -881431 -612816 -1864648 -2905717 -2374508 -1516027
32673 -1516027 -1523914 -933331 1768662 4856121 5667772 4760792 4553705 4817767 3066690
32664 3066690 -744675 -3384803 -2841779 -772654 448496 626176 555806 131683 -892822
32655 -892822 -1823111 -2103452 -2363205 -3215323 -3979459 -3775706 -3187456 -3627988 -5238552
32646 -5238552 -6308008 -5017231 -1525131 1848859 2744357 1123376 -914135 -1756857
32638 -1756857 -1796495 -1880602 -1644285 -660808 -36546 -961867 -2412762 -2406382 -1118931 -433838
32628 -433838 -513276 537186 3097395 4788031 3952852 2112605 1488528 2053486 2686607
32619 2686607 3411198 4453841 4606235 2932357 1113939 1496306 3215931 2997982 135196
32610 135196 -1965524 -433444 2945453 4200324 2605862 1321546 2628692 4763280
32602 4763280 4676538 2411406 690556 626633 278822 -1771835 -3719549 -3332368 -1817198
32593 -1817198 -2107711 -3901087 -3590799 228118 4138005 4386991 1724704 -332403 -392468
32584 -392468 104241 104088 241766 963183 1548121 1488453 1234128 1053257 499169 -407710
32574 -407710 -681822 119126 777860 -142758 -2053695 -2514654 -16089 3837750 5558957
32565 5558957 3407883 -709142 -3540621 -4171410 -4264460 -4895060 -4997245 -3639344 -2005618
32556 -2005618 -1605243 -1854378 -1314590 -408849 -717700 -1928435 -1777103 597569 3109673
32547 3109673 3245538 871120 -1968411 -3017602 -1381022 1752584 3857659 3669323
32539 3669323 2821009 3439352 4645062 3851192 1452629 947869 3265023 4350183 876756
32530 876756 -4333365 -5898823 -3141906 -77131 981307 1776341 3738587 5090306
32522 5090306 3941861 1514905 201889 137898 -356661 -1978212 -3731438 -4407297 -3596312
32513 -3596312 -1770683 -200741 -127328 -1313203 -2214181 -2187936 -2400546 -3694615 -4869772
32504 -4869772 -4404946 -2826690 -1848137 -1964748 -2441688 -2929159 -3358296 -2833728 -608397
32495 -608397 2045304 2884803 1707877 554895 785118 1720396 2360798 2532603 1991055
32486 1991055 429979 -1009433 -348526 2214457 3971445 3433723 2143175 1384983 -279336
32477 -279336 -3812348 -6360808 -4549096 48044 2311428 290155 -2747524 -3335404
32469 -3335404 -1824844 -453116 -92474 -386880 -1143576 -2049433 -2316611 -1764554 -1184651
32460 -1184651 -972051 -734873 -742920 -1920020 -3579189 -3290977 -435721 2105580 1755808
32451 1755808 105571 628818 3599538 5797705 4923790 2053787 -390688 -1264500 -1009761
32442 -1009761 -797044 -1665107 -3500919 -4861779 -4671731 -3725272 -3476965 -3936834 -4134991
32433 -4134991 -4065147 -4399752 -4592773 -3222782 -322264 2408719 3868159 4300975 3724183
32424 3724183 1701127 -867557 -1932164 -1181645 -692117 -1532248 -1822255 89191 2374001
32415 2374001 2056251 -507594 -2138245 -1556460 -953468 -2169260 -3538592 -2179691 1711757
32406 1711757 4752477 4572077 2572942 1647850 2171017 1854220 -497027 -2996021 -3490596
32397 -3490596 -2783724 -3114677 -4326787 -4023167 -1568560 563460 283887 -1368084 -2208233
32388 -2208233 -1884114 -1357356 -779209 414331 2076197 3405451 3829249 2901204 350060
32379 350060 -2690718 -3793011 -2090329 106267 209522 -1272027 -2191126 -2365720 -3130109
32370 -3130109 -4078087 -3408049 -1596396 -1512881 -3940594 -5890219 -4948433 -2793443 -2222723
32361 -2222723 -2634344 -1207538 2371913 5191644 5216265 3769335 3164698 3657591 4004567
32352 4004567 3911681 4280230 5205542 5276299 3568835 1363230 705659 1612570 2037636
32343 2037636 794959 -886092 -1427995 -1198603 -1500618 -2307523 -2640088 -2562787 -2942579
32334 -2942579 -3440914 -2738464 -1002015 -165764 -1080921 -2171474 -1912074 -1027183 -906551
32325 -906551 -1173003 -472807 1129193 2199340 2022131 1207380 358209 -586010 -1633053
32316 -1633053 -2457434 -2981084 -3337342 -3177655 -1993133 -397369 -115007 -2039630 -4872838
32307 -4872838 -6368283 -5635609 -3620652 -1560153 167496 1450143 1635037 277350
32299 277350 -1570864 -1945098 -233380 1932806 2576323 1495957 -68206 -1084743 -1156152
32290 -1156152 -60903 1819094 3025988 2420257 907350 293874 456389 -558282 -3193757
32281 -3193757 -5095062 -4302230 -2141897 -1295847 -2031318 -2278792 -1104246 -130123 -1006320
32272 -1006320 -2965364 -3958118 -3472092 -3002494 -3753589 -4963058 -5062659 -3683643 -1525074
32263 -1525074 1159372 4331629 6496677 5458692 1775781 -615359 859115 3642872
32255 3642872 3450778 257951 -2032558 -1312458 576274 1466418 1317129 393722 -1661473
32246 -1661473 -3672098 -3015190 333153 2694402 1748650 38100 890205 3237500 3560070
32237 3560070 1281375 -938646 -1239178 8972 2036739 4244831 5485877 5205994
32229 5205994 4768889 5419989 5724012 3517446 -292534 -2602007 -2377852 -1331917 -545603
32220 -545603 751478 2790849 4234347 4113440 2830460 941406 -1249044 -2870951
32212 -2870951 -3156911 -2868282 -3256738 -3976599 -4023959 -4096839 -5475101 -7000350 -6052703
32203 -6052703 -2524328 890265 2315090 1883089 -332840 -4197390 -7290838 -6552645
32195 -6552645 -2823138 -229412 -314232 -478685 851086 1711990 873235 382657 1474024
32186 1474024 1858641 21151 -1364917 236030 2528342 1853754 -971944 -2172253
32178 -2172253 -664632 1491473 2973128 3935435 3849947 2085754 124550 59764 1190863
32169 1190863 914052 -1236802 -3046763 -3013534 -1970623 -1309187 -1448339 -1992201 -2039775
32160 -2039775 -870956 595624 295098 -1744077 -2507076 -156916 3038185 4298418
32152 4298418 4509980 5688107 6545471 4687906 1680621 1314018 3441181 4139936 2056715
32143 2056715 81900 51733 109123 -1343909 -2905486 -3100166 -2805963 -2947069 -2547454
32134 -2547454 -942856 412446 171545 -729427 -644132 602563 2214565 3519750 3704062
32125 3704062 2151522 -127543 -1037522 2074 1598549 2726328 3432694 3028955 305973
32116 305973 -3615068 -5365800 -3653908 -1239626 -1132202 -2817006 -3796257 -3139439 -1860535
32107 -1860535 -955481 -430992 341573 1839992 3365106 3263120 1431899 536515 2459849
32098 2459849 4704120 3625841 411856 -402918 1773315 2716585 663890 -742616
32090 -742616 1231351 4066560 4674063 3932534 3471411 2287525 155404 209033 3895674
32081 3895674 7104003 5905871 2733836 1954529 2659638 1509126 -244459 803116
32073 803116 2736663 546543 -4732816 -6309411 -1782001 3657054 5620879 5743969
32065 5743969 6169528 4899029 329331 -4302705 -5208598 -3540314 -2845263 -3633492 -4042565
32056 -4042565 -3843614 -4244896 -4974540 -4628006 -3165568 -1671006 -385109 979414 1834655
32047 1834655 1595799 1102290 1219660 889049 -1246224 -3803489 -3630136 -49490 3790663
32038 3790663 4491520 2018456 -967431 -2388074 -2363387 -1971314 -1591021 -1077858 -949474
32029 -949474 -2161110 -4370338 -5537555 -4220810 -1611667 -200086 -818307 -2125042
32021 -2125042 -2781623 -2966956 -3613842 -4943101 -5949228 -5181471 -2454773 239103 728527
32012 728527 -193332 472783 3212936 4561394 2253178 -784080 -591628 1796186 2353710
32003 2353710 731739 482285 2905299 5073278 4583453 2359454 -110376 -2545252
31995 -2545252 -3814007 -1911759 2346892 4886407 3361198 -192950 -2936790 -4346306
31987 -4346306 -4543672 -3099174 -1204527 -1437330 -3394784 -3303680 -217308 1539058 -891882
31978 -891882 -3944992 -3383529 -1107192 -1322240 -3136099 -2652704 -235635 454875 -405207
31969 -405207 1088394 5149323 6945519 4009107 -118064 -1600279 -1318980 -1851166 -3112998
31960 -3112998 -3679458 -3643422 -3547727 -2619827 -482143 1164904 959235 591698 2618615
31951 2618615 6251391 7683756 4812728 -16664 -2625552 -1503169 1072068 2208878
31943 2208878 1725774 1442596 1790644 1099718 -1169301 -2686129 -1496324 705243 921757
31934 921757 -670900 -1307998 -134488 705099 -433878 -2593108 -3949947 -3589483 -1442526
31925 -1442526 1397750 2300232 -513092 -4950592 -6905422 -5458343 -3571329 -3139371
31917 -3139371 -2520254 -268732 1764604 1264959 -861678 -1997732 -1457430 -417260 624191
31908 624191 2123364 3790826 4416991 3326979 1076149 -957055 -1260099 540051 2575540
31899 2575540 2257694 -353553 -2245876 -1515617 49898 -6634 -949532 -303975 1889985
31890 1889985 2924217 1441124 -733614 -1397197 -849136 -908614 -2057134 -2744875 -1436913
31881 -1436913 1376731 3556944 3540575 1826624 124897 -550105 -552973 -807231 -1931859
31872 -1931859 -3809849 -5386021 -5357986 -3846394 -2766689 -3499940 -4873543 -4782458 -3087698
31863 -3087698 -1214614 397192 2215372 3428424 2525748 248979 -728219 327429
31855 327429 1248937 685643 86269 736102 1411435 680659 -641327 -1130303 -998626
31846 -998626 -1045336 -1098798 -1023323 -1456214 -2069153 -1154375 1378728 2798510 1351136 -891491
31836 -891491 -1235237 -265128 39045 -1428 960363 1975982 1075741 -1229964 -2834950
31827 -2834950 -3442514 -4003839 -3770786 -1376519 1702384 2314531 252413 -1516212 -1377078
31818 -1377078 -800592 -1302461 -2549193 -3809335 -4601496 -3707688 -329115 3503414 4471958
31809 4471958 2305006 -54527 -745242 -617663 -593846 -738172 -2145744 -5900069 -9423442
31800 -9423442 -8083434 -2034811 2597887 1630343 -1809210 -2510017 -244561 1794508
31792 1794508 2641561 3594040 4512649 4118808 3030435 3016608 3828675 3811518 3053491 2936624
31782 2936624 3064991 1753857 -551154 -1380306 -32234 1476996 1653999 1095026 287930
31773 287930 -1403389 -3473073 -3535321 -609362 2652693 2975614 667326 -976279 12529
31764 12529 2126391 2603383 679367 -1742981 -2143285 202432 3651951 5774573 5379955
31755 5379955 3140405 710405 -477459 -28989 1156851 1627533 921867 201986 778138
31746 778138 2245042 2892449 1940190 446687 -314099 -531135 -1216143 -2407304 -3018736
31737 -3018736 -2598412 -2304134 -3366198 -5041621 -5222979 -3232684 -850806 72109 -134516
31728 -134516 -263837 -690942 -2540869 -4804940 -4757302 -1915827 626751 239597 -1582866
31719 -1582866 -1486207 883183 2499669 1326516 -907902 -1069775 1301790 3225413 1515172
31710 1515172 -3563845 -8109737 -8270312 -4013361 1146125 3923366 3977108 3031346 2608691
31701 2608691 3084097 3828876 3602775 1719469 -656297 -1488671 -693772 -478574 -1866514
31692 -1866514 -2598488 -318149 3411776 4639924 2165530 -1115200 -2183451 -1188273
31684 -1188273 -75545 386747 904269 1714525 1696007 -160008 -2833149 -3705519 -1611841
31675 -1611841 1097250 1049042 -1506129 -2549535 228063 3879936 4071474 889095 -1770631
31666 -1770631 -1690645 -390413 67406 -495029 -1522826 -2726417 -3123816 -1383327 1771832
31657 1771832 3472126 2273323 141395 -410006 434279 903259 583784 431230 720985
31648 720985 782122 375142 -124579 -621612 -1113124 -964522 252179 1376804 590386
31639 590386 -2051163 -4277847 -4271645 -2672292 -1331692 -909511 -583029 260378 1031851
31630 1031851 871431 -18696 -489620 162734 1302018 1663506 814010 -389678 -876486
31621 -876486 -665724 -806935 -1978067 -3462071 -3896859 -2924246 -1475270 -257932 1153685
31612 1153685 2994373 3946709 2544550 -394248 -2430576 -2709131 -2660484 -3040192 -2436635
31603 -2436635 17955 2457032 2698097 1318441 216453 -522176 -1808654 -2696980 -1385059
31594 -1385059 1313052 2595549 1920498 1555435 2341507 2104357 -457480 -3224359 -3799847
31585 -3799847 -2811203 -2127987 -1882789 -1366203 -1057069 -1503646 -1700277 -834856 -262186
31576 -262186 -1391698 -2961720 -3072572 -2781010 -4595686 -8001542 -9691058 -8217379 -5374415
31567 -5374415 -2790855 -403643 1065195 -334776 -4085465 -6137325 -3929183 -178940
31559 -178940 923135 -511231 -1000353 818199 2839589 3371190 3343534 4060433 5142785
31550 5142785 5704582 5834104 5901815 5669109 4867242 3558525 1461857 -1637989 -4222847
31541 -4222847 -3643476 308404 4098359 4563492 3046311 3194944 5526675 6896167 5283251
31532 5283251 2300273 226988 -846977 -1571955 -1342092 223141 1435623 509800 -1533861
31523 -1533861 -2162472 -960537 287715 875243 2042240 4144762 5299006 4019009
31515 4019009 1550722 255947 761909 1856650 2304616 1663540 92813 -1470745 -1536196
31506 -1536196 306898 2280169 2122095 -128038 -2085080 -1925491 -433511 298272 -430975
31497 -430975 -1256422 -702483 849781 1664983 903586 -448258 -1233931 -1823187 -3170729
31488 -3170729 -4763624 -4991878 -3627157 -2445884 -2852287 -4172389 -5052365 -5311074 -5343423
31479 -5343423 -4772868 -3151317 -1390477 -978626 -1902274 -2608054 -2055490 -715712 527926
31470 527926 1368016 1702399 1264483 109227 -1164279 -2037880 -2425653 -2230741 -1218246
31461 -1218246 329190 1428589 1351736 396403 -651197 -1409441 -1820856 -1600976 -495333
31452 -495333 944579 1539289 790901 -385642 -744135 -370199 -616262 -2158859 -3799661
31443 -3799661 -3918964 -2719030 -1923756 -2177970 -2054095 -377212 1645785 2003115 864218
31434 864218 142518 127452 -1272626 -4918263 -7973445 -7108718 -3294533 -1026745 -2616811
31425 -2616811 -5416915 -5601337 -2877175 9389 1063918 440636 -1131022 -3101998
31417 -3101998 -4301042 -3472393 -1297535 -325603 -2034541 -5078957 -7114008 -7216129 -5853716
31408 -5853716 -3796984 -2067631 -1818549 -3054638 -4252715 -4180515 -3214479 -2103630 -783256
31399 -783256 473556 344594 -1360048 -2243841 -264633 2917258 3928633 2252999 296121
31390 296121 -477800 -637512 -334264 1067797 2623388 2227176 212609 -403967 1653773
31381 1653773 4064283 4728530 4596318 5045298 5259415 4393024 3858732 4898295 5904343
31372 5904343 4897915 3035029 2756865 3642824 3090614 524584 -1850597 -2361946 -1580576
$$ [...]
##END NTUPLES=NMR SPECTRUM
##END=
