##TITLE=31Pdec_SR56_rm2
 D2O, 24 sc
 28.04.2021
##JCAMPDX= 6.0         $$ Bruker NMR JCAMP-DX V2.0
##DATA TYPE= NMR SPECTRUM
##DATA CLASS= NTUPLES
##ORIGIN= UXNMR, Bruker Analytische Messtechnik GmbH
##OWNER= root
$$ XWIN-NMR		Version 3.5
$$ Wed Apr 28 14:29:50 2021 Russian Standard Time (UT+4h)  she@DPX200
##.OBSERVE FREQUENCY= 81.013821
##.OBSERVE NUCLEUS= ^31P
##.ACQUISITION MODE= SIMULTANEOUS
##.ACQUISITION SCHEME= undefined
##.AVERAGES= 24
##.DIGITISER RES= 16
##SPECTROMETER/DATA SYSTEM= spect
##.PULSE SEQUENCE= zgpg30
##.SOLVENT NAME= CDCl3
##.SHIFT REFERENCE= (INTERNAL, CDCl3, 0, 248.564)
##AUDIT TRAIL= $$ (NUMBER, WHEN, WHO, WHERE, WHAT)
$$ ##TITLE= Audit trail, XWIN-NMR		Version 3.5
$$ ##JCAMPDX= 5.01
$$ ##ORIGIN= Bruker BioSpin GmbH
$$ ##OWNER= she
$$ F:/spectra/data/she/nmr/P31/1/pdata/1/auditp.txt
$$ ##AUDIT TRAIL=  $$ (NUMBER, WHEN, WHO, WHERE, WHAT)
(   1,<2021-04-28 14:28:42.85 +0400>,<she>,<DPX200>,
      <created by zg, POWCHK disabled, PULCHK disabled
       configuration hash MD5:
       00 E9 B6 7A A2 85 ED C7 34 08 36 98 17 FE 4E 26
       data hash MD5: 32K
       47 0B 16 BC 34 84 98 D0 45 B2 73 7F 76 EC 47 4B>)
(   2,<2021-04-28 14:28:45.67 +0400>,<she>,<DPX200>,
      <Start of raw data processing
       efp BC_mod = 2 LB = 1 FT_mod = 6 PKNL = 1 PHC0 = -6149.617 PHC1 = 131.8008 SI = 64K 
       data hash MD5: 64K
       8E E1 6D D1 2C 56 29 42 79 AB 5C 5B 83 35 95 4E>)
(   3,<2021-04-28 14:29:11.45 +0400>,<she>,<DPX200>,
      <pk PHC0 = -304.688 PHC1 = 441.2001 
       data hash MD5: 64K
       BF 20 A2 9D FB F0 B7 93 B0 82 72 FB 3C 31 AD 77>)
(   4,<2021-04-28 14:29:14.53 +0400>,<she>,<DPX200>,
      <abs ABSG = 5 
       data hash MD5: 64K
       46 8F E1 F2 CD 7A B1 C4 22 13 6F 00 1E 26 89 F3>)
$$ ##END=
$$ 
$$ hash MD5
$$ 8D 6C AD A5 97 00 37 94 50 73 2D 61 50 63 B9 24
##$RELAX= 
##$RELAX= 
##$RELAX= 
##$RELAX= 
##$RELAX= 
##$RELAX= 
##$RELAX= 
##$RELAX= 
$$ Bruker specific parameters
$$ --------------------------
##$DU= <F:/spectra>
##$EXPNO= 1
##$NAME= <P31>
##$PROCNO= 1
##$TYPE= <nmr>
##$USER= <she>
##$AMP= (0..31)
100 100 100 100 100 100 100 100 100 100 100 100 100 100 100 100 100 100 
100 100 100 100 100 100 100 100 100 100 100 100 100 100 
##$AQSEQ= 0
##$AQ_mod= 1
##$AUNM= <au_zg>
##$AUTOPOS= <>
##$BF1= 81.014009
##$BF2= 200.13
##$BF3= 200.13
##$BF4= 200.13
##$BF5= 200.13
##$BF6= 200.13
##$BF7= 200.13
##$BF8= 200.13
##$BYTORDA= 1
##$CFDGTYP= 0
##$CFRGTYP= 5
##$CHEMSTR= <none>
##$CNST= (0..31)
1 1 145 1 1 1 1 1 1 1 1 1 1 1 1 1 1 1 1 1 1 1 1 1 1 1 1 1 1 1 1 1 
##$CPDPRG= <waltz16>
##$CPDPRG1= <>
##$CPDPRG2= <waltz16>
##$CPDPRG3= <>
##$CPDPRG4= <mlev>
##$CPDPRG5= <mlev>
##$CPDPRG6= <mlev>
##$CPDPRG7= <mlev>
##$CPDPRG8= <mlev>
##$CPDPRGB= <>
##$CPDPRGT= <>
##$D= (0..31)
0 1 0 0 0 0 0 0 0 0 0 0.03 2e-05 3e-06 0 0 0 0 0 0 0 0 0 0 0 0 0 0 0 0 
0 0 
##$DATE= 1619605722
##$DBL= (0..7)
120 120 120 11 120 120 24 19 
##$DBP= (0..7)
150 150 150 150 150 150 150 150 
##$DBP07= 0
##$DBPNAM0= <>
##$DBPNAM1= <>
##$DBPNAM2= <>
$$ [...]
##$SUBNAM3= <"">
##$SUBNAM4= <"">
##$SUBNAM5= <"">
##$SUBNAM6= <"">
##$SUBNAM7= <"">
##$SUBNAM8= <"">
##$SUBNAM9= <"">
##$SW= 501.771253377433
##$SWIBOX= (0..15)
0 1 3 0 0 0 0 0 0 0 0 0 0 0 0 0 
##$SW_h= 40650.406504065
##$TD= 32768
##$TD0= 1
##$TE= 0
##$TE2= 300
##$TE3= 300
##$TEG= 300
##$TL= (0..7)
0 120 53 12 22 120 120 120 
##$TP= (0..7)
150 150 150 150 150 150 150 150 
##$TP07= 0
##$TPNAME0= <>
##$TPNAME1= <>
##$TPNAME2= <>
##$TPNAME3= <>
##$TPNAME4= <>
##$TPNAME5= <>
##$TPNAME6= <>
##$TPNAME7= <>
##$TPOAL= (0..7)
0.5 0.5 0.5 0.5 0.5 0.5 0.5 0.5 
##$TPOFFS= (0..7)
0 0 0 0 0 0 0 0 
##$TUNHIN= 0
##$TUNHOUT= 0
##$TUNXOUT= 0
##$USERA1= <user>
##$USERA2= <user>
##$USERA3= <user>
##$USERA4= <user>
##$USERA5= <user>
##$V9= 5
##$VALIST= <valist>
##$VCLIST= <CCCCCCCCCCCCCCC>
##$VD= 0
##$VDLIST= <DDDDDDDDDDDDDDD>
##$VPLIST= <PPPPPPPPPPPPPPP>
##$VTLIST= <TTTTTTTTTTTTTTT>
##$WBST= 1024
##$WBSW= 4
##$XGAIN= (0..3)
0 0 0 0 
##$XL= 0
##$YL= 0
##$YMAX_a= 7468
##$YMIN_a= -7508
##$ZGOPTNS= <>
##$ZL1= 120
##$ZL2= 120
##$ZL3= 120
##$ZL4= 120
##$ABSF1= 248.5645
##$ABSF2= -253.2056
##$ABSG= 5
##$ABSL= 3
##$ALPHA= 0
##$AQORDER= 0
##$ASSFAC= 0
##$ASSFACI= 0
##$ASSFACX= 0
##$ASSWID= 0
##$AUNMP= <proc_1d>
##$AZFE= 0.1
##$AZFW= 0.5
##$BCFW= 0
##$BC_mod= 2
##$BYTORDP= 0
##$COROFFS= 0
##$CY= -3
##$DATMOD= 1
##$DC= 0
##$DFILT= <>
##$DTYPP= 0
##$F1P= 0
##$F2P= 0
##$FCOR= 1
##$FTSIZE= 65536
##$FT_mod= 6
##$GAMMA= 0
##$GB= 0
##$INTBC= 1
##$INTSCL= 5.30512e-09
##$ISEN= 30
##$LB= 1
##$LEV0= 0
##$LPBIN= 0
##$MAXI= 10000
##$MC2= 0
##$MEAN= 0
##$ME_mod= 0
##$MI= 50
##$NCOEF= 0
##$NC_proc= -5
##$NLEV= 6
##$NOISF1= 182.463
##$NOISF2= 159.3651
##$NSP= 0
##$NTH_PI= 0
##$NZP= 0
##$OFFSET= 248.5645
##$PC= 4
##$PHC0= -6454.305
##$PHC1= 573.0009
##$PH_mod= 1
##$PKNL= yes
##$PPARMOD= 0
##$PSCAL= 0
##$PSIGN= 0
##$REVERSE= no
##$SF= 81.014009
##$SI= 65536
##$SIGF1= 159.3651
##$SIGF2= -187.1042
##$SINO= 113.3802
##$SIOLD= 16384
##$SREGLST= <1H.CDCl3>
##$SSB= 0
##$STSI= 65536
##$STSR= 0
##$SW_p= 40650.406504065
##$SYMM= 0
##$S_DEV= 0
##$TDeff= 32768
##$TDoff= 0
##$TI= <>
##$TILT= no
##$TM1= 0
##$TM2= 0
##$TOPLEV= 0
##$USERP1= <user>
##$USERP2= <user>
##$USERP3= <user>
##$USERP4= <user>
##$USERP5= <user>
##$WDW= 1
##$XDIM= 65536
##$YMAX_p= 294456347
##$YMIN_p= -50992725
$$ End of Bruker specific parameters
$$ ---------------------------------
##NTUPLES= NMR SPECTRUM
##VAR_NAME=  FREQUENCY,     SPECTRUM/REAL,   SPECTRUM/IMAG
##SYMBOL=    X,             R,               I
##VAR_TYPE=  INDEPENDENT,   DEPENDENT,       DEPENDENT
##VAR_FORM=  AFFN,          ASDF,            ASDF
##VAR_DIM=   65536,         65536,           65536
##UNITS=     HZ,            ARBITRARY UNITS, ARBITRARY UNITS
##FACTOR=    0.620285442955139, 1,           1
##FIRST=     20137.2065510759, 0,            0
##LAST=      -20513.1999529892, 0,           0
##MIN=       -20513.1999529892, -50992725,   0
##MAX=       20137.2065510759, 294456347,    0
$$ Real data points
##PAGE= N=1
##DATA TABLE= (X++(R..R)), XYDATA
$$ [...]
13244b19559J379119N46753n29509q15934q47339j154431j118965k10609P87299
13235b183175P89432j9942n21451j57434O42670J198736J095214K88735o89404
13226D43381r80844m19504J42376J05610K6750M06899M58081n49098j449155n83684
13216b399188J280160J640355P2141r99931r7631J102948P23378l09976j41235
13207H71021Q25419Q70908n3703n94266n05277o42793r08771m16632M80922M40808
13197C67636n72771j169347p79025j85946K21646Q44392J404721J016794n0061
13188A098039n46393l56205m76049p84982j41604J001510P31515q44977j078955
13179a398101R60998K486770J167670j169754j454741j4949M63868o95300j657737
$$ y = [-219559, 1159560, 1706313, 1176804, 360870, -486469, -1640900, -2759865, -2970474, -2183175, -1393743, -1413685, -1935136, -2092570, -1449900, -251164, 844050, 1132785, 443381, -537463, -956967, -814591, -708981, -682231, -275332, 182749, -366349, -1815504, -2399188, -1119028, 521327, 593468, -406463, -504094, 598854, 1322232, 1012256, 871021, 1696440, 2567348, 2513645, 1919379, 1414102, 771309, -137462, -554094, -73172, 367636, -205135, -1374482, -2153507, -2339453, -2117807, -1273415, 131306, 1148100, 1098039, 551646, 195441, -280608, -1065590, -1207194, -205684, 525831, -319146, -1398101, -437103, 2049667, 3217337, 2047583, 592842, 577893, 1041761, 346461, -1311276]
13170a311276j292070l48304L50302P56286P14756K6002o72002n80574p6391r090
13160b442361j33653K64601P39472L88073k70246M1542J097564J434569P28739
13151A848300O1425j05809l33341n94482k48450K65040k00514j147555p20119
13142a175505J059675J737353K16453j232750m51373J151922Q91511q92627j499088
13133a94429k12953P77393R3685p13300J14573J594384J492908k53122j481640
13124A217499r68258Q6968J80539l43783k59785M29972O85469K63076n3483l266
13114A234948k36846q69410r71426j16206O85237L84911o35318j254073j015796
13105b793979j94380P42869J120134M34553o03268n21727O82366J159281Q5050
$$ y = [-1311276, -2603346, -2951650, -2601348, -1845062, -1130306, -1104304, -1776306, -2356880, -2433271, -2442361, -2576014, -2311413, -1571941, -1183868, -1454114, -1412572, -315008, 1119561, 1848300, 1909725, 1803916, 1470575, 876093, 627643, 892683, 692169, -455386, -1175505, -115830, 1621523, 1837976, 605226, 153853, 1305775, 2197286, 1304659, -194429, -407382, 370011, 463696, -249604, -135031, 1459353, 2952261, 2699139, 1217499, 249241, 336209, 516748, 172965, -86820, 343152, 1028621, 1291697, 1238214, 1234948, 998102, 128692, -842734, -958940, -273703, 111208, -524110, -1778183, -2793979, -2988359, -2245490, -1125356, -690803, -1294071, -1815798, -1133432, 25849, 110899]
13096A10899p33493K51104J489304P08385j145877j212901O51253J662368O18124
13087B399166m91381j33638M34124j46797q46622k92709O54709M39040m68146
13078A547746m63234M62368Q75981L15525k38039j72397l1330l96419j116549
13069G83652j756803j941657j275853K20463J596848J726375O98979k18923j50707
13060c17626M70543P22823L73774r7202k99972l33647m30090n22783l68673K1441
13050g81412L67382N59998P37516P59637J31778j078399j760450j016269L52327
13041a727892O03543n94685j548550p27911J173570K078590J110280l66325m35032
13032d34412J028746K149160J307912q11173k029347j352997M8644O88145M81685
$$ y = [110899, -622594, -371490, 1117814, 1826199, 680322, -532579, 118674, 1781042, 2399166, 1907785, 1774147, 2208271, 2061474, 1214852, 922143, 1576852, 2015892, 1547746, 1084512, 1546880, 2422861, 2738386, 2500347, 2327950, 2296620, 1900201, 783652, -973151, -2914808, -4190661, -3970198, -2373350, -646975, 52004, -166919, -317626, 152917, 875740, 1249514, 1152312, 852340, 518693, 88603, -434180, -802853, -781412, -414030, 145968, 883484, 1643121, 1774899, 696500, -1063950, -2080219, -1727892, -1124349, -1719034, -3267584, -3995495, -2821925, -743335, 366945, 620, -434412, 594334, 2743494, 4051406, 3240233, 1210886, -142111, -93467, 594678, 1076363]
13023A076363Q7645l23232o83482m31992M71122P93731k76015j428526r03681
13014a618067O79849J110149J1097o16980L94890J633314J365861k9145r16045
13005B014923o06717K10088N65323J10997o28510p18298P379M78585j39775j012950
12995B81045q23362J49783O25200M83817N44479O24469m7457p96894l51517M20623
12985A110186m88950k302792j893189J013131K664275R73141j131751m71494J457773
12976I30330J452128j21852o38874O1951O9611o29796l15763Q81411J053960J1554
12966B754660n25326k26814n00054j336908r92396O03911J173452j92449j410911
12957f52835p49243O73462J121684P63451M15869k24690j345644j695777m20453
$$ y = [1076363, 1164008, 840776, 157294, -274698, 196424, 990155, 714140, -714386, -1618067, -938218, 171931, 183028, -433952, -39062, 1594252, 2960113, 2930968, 2014923, 1408206, 1618294, 2183617, 2294614, 1666104, 947806, 955185, 1433770, 1293995, 281045, -542317, -392534, 232666, 716483, 1260962, 1885431, 1837974, 1041080, 689563, 1110186, 621236, -1681556, -3574745, -2561614, 102661, 1075802, -55949, -527443, 930330, 2382458, 2260606, 1621732, 1683683, 1753294, 1123498, 807735, 1689146, 2743106, 2754660, 2229334, 2002520, 1502466, 165558, -826838, -222927, 950525, 758076, -652835, -1402078, -728616, 393068, 1156519, 1572388, 1347698, 2054, -1693723, -2114176]
12948b114176J040399Q19806m94003p31913O10862J796534J415088J8842j000796
12939A360643j013804l28504L79835M80696j87728j004319j059053j90965P55504
12930h07695R26027M62286J78638L37499K73432m84646j241917j001782j8550
12921a376708N03318K46722J12637M43461L56028m38466o86919L01847J050836
12912E12756J32034j223495q89225O42154J038093M2996k06697R31183J305440
12903B285239l57763k070072j586451J99440Q87786J81091k96200O6153K78687
12894d12090j12028k07742O02860J550871J537254M67623q25754j484048j245921
12885a28975n32157k1097P834j89777l67672n50928n97456r6579Q87708J509844
$$ y = [-2114176, -1073777, -253971, -747974, -1479887, -869025, 927509, 2342597, 2361439, 1360643, 346839, 18335, 398170, 878866, 691138, -313181, -1372234, -1563199, -807695, 118332, 580618, 759256, 1096755, 1370187, 885541, -356376, -1358158, -1376708, -873390, -626668, -514031, -70570, 285458, -153008, -839927, -538080, 512756, 644790, -578705, -1467930, -825776, 212317, 255313, 48616, 979799, 2285239, 1927476, -142596, -1729047, -1529607, -641821, -460730, -756930, -690777, -412090, -524118, -731860, -129000, 1421871, 2959125, 3426748, 2600994, 1116946, -128975, -661132, -682229, -674395, -864172, -1231844, -1782772, -2380228, -2476807, -1589099, -79255]
12875g9255J110740R7137o19262o69423k85725J97765L85946j11480r97490j157902
12865b128949l0852J247618J017070o95421k084843j821262n31489L22628L35947
12856d369553L36232J011382J957187K143854J065935o28534j587815r53723P16972
12847c08063J826467J301912k06328j011701l76368O40024O76324r0641m04804
12838B046822L3042J56472n98418j250919q39089L4951K80738Q1200K76959O42292
12828H64050L13697m25939m70007R9011J08341m29240j15261J157576J406601
12819B508829l25605j927372j134992Q82642J133121p00585j851928o97849R47301
12810a166438P33375q20998j378514k75667P74140M02593m99473k92998R04933
$$ y = [-79255, 1031485, 1128622, 509360, -160063, -445788, -248023, 137923, 26443, -971047, -2128949, -2159801, -912183, 104887, -590534, -2675377, -4496639, -5028128, -4705500, -4369553, -4033321, -3021939, -1064752, 1079102, 2145037, 1516503, -71312, -1025035, -308063, 1518404, 2820316, 2613988, 1602287, 1225919, 1865943, 2542267, 2451626, 2046822, 2079864, 2236336, 1637918, 386999, -452090, -417139, -136401, -55201, 221758, 864050, 1177747, 751808, 281801, 380812, 489153, 59913, -55348, 1102228, 2508829, 2183224, 255852, -879140, 3502, 1136623, 436038, -1415890, -2113739, -1166438, -433063, -1254061, -2632575, -2908242, -2134102, -1731509, -2230982, -2523980, -1619047]
12801a619047J390798M21604o13569k00723J007329J093825k59848j262983o61799
12792g04413N16475P14963J58492J01491N47687L70995m80558o24427M76175J364485
12782B441365O61693p80321j045485O7595P89228n8057j441206j600424l41315
12773a306927R47017J188958O93857L08372K42451J12754k85651p22380q84955
12764B93496o33368k706P31635J064188O69228j71780p94159q23555m47885o3740
12754a78646J29532K00515L31623N66974O29936J93513n13914p28464j42542M78956
12744I67483K40613n90169r56954n58223j48835j79104o7545O75748J340845Q22412
12734A546271p39308j838265j258620M86765J600243R19626p15749j347568k66331
$$ y = [-1619047, -228249, 193355, -420214, -620937, 386392, 1480217, 1220369, -42614, -704413, -187938, 527025, 685517, 787008, 1334695, 1705690, 1225132, 600705, 1076880, 2441365, 3103058, 2322737, 1277252, 1344847, 2134075, 2076018, 634812, -965612, -1306927, -359910, 829048, 1522905, 1831277, 2073728, 2186482, 1900831, 1178451, 293496, -339872, -342578, 389057, 1453245, 2122473, 1950693, 1156534, 332979, -114906, -178646, -49114, 151401, 483024, 1049998, 1679934, 1873447, 1359533, 631069, 488527, 967483, 1208096, 617927, -339027, -897250, -1046085, -1225189, -1292734, -616986, 723859, 1546271, 806963, -1031302, -2289922, -1803157, -202914, 716712, 963, -1346605, -1612936]
12725a612936J074333J039202O6999j33658P23667J131625K90129o65129o75585
12716A238647m38537q19229r42164L21087J815297J252370j200333k649310j355802
12707b777974R77312J777620Q93112m0940l27935n91078r99058q62047o3863N29472
12697a485379M52768L20059O58411R87451O37834k05056q45537r45075n82688
12688a007212L2200M67733K55616l43340l70987M50588J047180M72360n98180
12679D05958q62322l45425j29290m43296m09042L07651R45168R74776P29243L93281
12669A566702l64044j275663j254301N051J247609J230361K00473q08883j238508
12660f91203r76232r1352P49089O33304j93028m29265J70623K64071o66110j116565
$$ y = [-1612936, -538603, 500599, 567598, 433940, 1157607, 2289232, 2579361, 1914232, 1238647, 800110, -19119, -961283, -640196, 1175101, 2427471, 1227138, -1422172, -2777974, -1800662, -23042, 870070, 829130, 501195, -89883, -1088941, -1950988, -2014851, -1485379, -1032611, -712552, -54141, 933310, 1571144, 1366088, 520551, -424524, -1007212, -975012, -507279, -251663, -595003, -965990, -515402, 531778, 1004138, 405958, -456364, -801789, -931079, -1374375, -1783417, -1475766, -530598, 444178, 1173421, 1566702, 1202658, -73005, -1327306, -1322255, -74646, 1155715, 1356188, 547305, -691203, -1667435, -1758787, -1009698, -376394, -569422, -998687, -828064, -563993, -1230103, -2346668]
12650b346668r2609R48267M59168n37103l23857M27222J7441r60599n53134R74865
12640a987007J495969O89022L17310P88386N32381p51395j291169m68027J02949
12631e71581k75634r0987J207248J673697K56588j016306l52613P81477L65117
12622A977006o60533l37826O31319J81820j321881j607642k06833J096002J244564
12613I95996Q95788N52344m8603o67704o63726l55603m96437n84239L82251J654197
12603A664264J384320l85264j546793j086521l13409l40550m19645K20105P11495
12594a11998J07027p39553l80200Q95811J372477L28139r84451r73583L25219
12585a61112J318753Q06492m87502p82217L80672J398544P18807j063466k048746
$$ y = [-2346668, -2439277, -1491010, -1031842, -1568945, -1892802, -1465580, -1448139, -2408738, -2961872, -1987007, -491038, 197984, 515294, 1303680, 1836061, 1084666, -206503, -674530, -571581, -847215, -938202, 269046, 1942743, 2199331, 1183025, 830412, 1611889, 1977006, 1316473, 978647, 1609966, 1791786, 469905, -1137737, -1344570, -248568, 995996, 1891784, 2444128, 2395525, 1727821, 1064095, 708492, 212055, -372184, 10067, 1664264, 3048584, 2663320, 1116527, 30006, -283403, -623953, -1043598, -823493, -111998, -4971, -744524, -1124724, -228913, 1143564, 1471703, 487252, -486331, -161112, 1157641, 1964133, 1476631, 694414, 1075086, 2473630, 3192437, 2128971, 80225]
12576H0225j428201o7658R34516J243107J000208M93145J24519O4812M9243m5562
12566B448354R3364M01823J09958r50693j593792r53951n9374l48337j365951
12557b218599j522616n46353N16888J228913J829288J801057M64600j118828j016740
12548e82390O08506J492286N78003p10529r85843o26250l07108J96761Q57655
12539E21091Q75865K35194L1171L82184n9518j448174j699763L22020K477359
12530A637429K194490J69894r31572m08032J02242m17654j210697j446782j209218
12521a519900o42788L26975J171084R76754j42606r03931n09606L81207P29380
12512a33431M91558L96142O88585P00220j23484j101752r16164M30636J113129
$$ y = [80225, -1347976, -1415634, -481118, 761989, 1762197, 2255342, 2379861, 2444673, 2493916, 2448354, 2541718, 2943541, 3053499, 2102806, 509014, -444937, -504311, -852648, -2218599, -3741215, -4287568, -3770680, -2541767, -712479, 1088578, 1553178, 434350, -582390, 26116, 1518402, 2096405, 1385876, 400033, -226217, -533325, -336564, 521091, 1396956, 1632150, 1663321, 2045505, 1985987, 537813, -1161950, -839930, 1637429, 3831919, 4001813, 3070241, 2662209, 2764451, 2346797, 1136100, -310682, -1519900, -2162688, -1835713, -664629, 312125, 169519, -734412, -1244018, -862811, -133431, 358127, 754269, 1442854, 2143074, 2019590, 917838, 1674, 432310, 1545439]
12503A545439j71217k054496k101890k23667J221059Q01952l28686o12616j00147
12494b024269M81728R71648J127165L34852r82043j232162n1667P96042J64839
12485d13867n84805J6975J042451R59244K73432J82709J09889q85347j540410
12476h39729j58723J927723J812386m18646j742555r14726L1856m23992j049396
12467a775802n15684L69694N30784N07426R31813R98051N7315q12460m25957N87600
12457D52780R73403Q38871R76132J163046O58093k72497o90233m02047L6561K66491
12447D000600J65356m59585j304634j363940k90704P01381M12755m79042m18536
12438I63651N92420R96529N5375j156561j420035q83558l89242j65903J01895
$$ y = [1545439, 1374222, -680274, -2782164, -3005831, -1784772, -982820, -1311506, -1924122, -2024269, -1542541, -570893, 556272, 891124, -90919, -1323081, -1374748, -578706, -413867, -998672, -981697, 60754, 1019998, 1293430, 1476139, 1586028, 700681, -839729, -998452, 929271, 2741657, 2323011, 580456, -334270, -302414, -726406, -1775802, -2291486, -1921792, -1391008, -883582, 48231, 1046282, 1103597, 291137, -134820, 452780, 1426183, 2265054, 3241186, 4404232, 5062325, 4789828, 4099595, 3697548, 3734109, 4000600, 4165956, 3706371, 2401737, 1037797, 747093, 1448474, 1861229, 1382187, 963651, 1556071, 2552600, 2607975, 1451414, 31379, -852179, -1241421, -1407324, -1305429]
12429a305429M05349L56118r0284m14810j99876L12201N81964N05399M16489M07170
12419I74291J45140m46898q47129o54247k05981j2786j7536K8879n3277l98820
12409a488364m80284J40380Q31730O80211l6173k62623J55636L92297J15077j89775
12399a41888l14160m73275l88216L88422J207033R12286j58361m18800M43692
12390A056733R73205M46851k9718L01750M76760l19071j227015j260866p97710
12381c79081l75888L21831J067228N69281j104405j594104K89627K129774J364090
12372B288353o31927q80354K88145J93466j208742j246048N59817J452346J63931
12363I78987r78136j75589Q80708K40387q81416m34800Q10201P07280n53104r34775
$$ y = [-1305429, -900080, -543962, -634246, -1049056, -1248932, -936731, -354767, 150632, 567121, 974291, 1119431, 672533, -174596, -828843, -1034824, -1047610, -1065146, -1036267, -1089544, -1488364, -1968648, -1828268, -996538, -316327, -352500, -615123, -459487, -67190, 47887, -141888, -456048, -929323, -1317539, -929117, 277916, 1190202, 1031841, 613041, 1056733, 2029938, 2476789, 2447071, 2748821, 3225581, 2906510, 1679495, 418629, -379081, -754969, -433138, 634090, 1203371, 98966, -1495138, -1205511, 924263, 2288353, 1656426, 776072, 1064217, 1257683, 48941, -1197107, -637290, 815056, 978987, 851, -174738, 705970, 946357, 64941, -369859, 440342, 1147622, 594518, -340257]
12353c40257j2285O41385K79061j14683J23693L60571J29254p4309L9322l6909
12343I94843m80630o11757q5997M10095K85379m4131l3320N0585j68109l00199
12333A6759O0592L70184K611m16953J36908J137276R27024p08682j942600j483961
12323a900842k89201K33322L07140P44598J085871N22328k63553j45724K67680
12314E61619l15460j197689o25875Q51793R19679m08870n57874R31851J154847
12305A314021j024351k328449l08775K176308J415012j012173j002470J103686
12297C32809J366276q19396j868469l31746R43554J24268p37538L0573O91685
12288b67984l10351j255208l22221J070123Q90980j1480J31669P07003K71698
$$ y = [-340257, -352542, 288843, 567904, 453221, 576914, 937485, 1066739, 992430, 1031752, 994843, 514213, -97544, -183541, 226554, 511933, 467802, 434482, 485067, 316958, 16759, 77351, 447535, 450146, 33193, 170101, 1307377, 2234401, 1525719, -416881, -1900842, -2190043, -1956721, -1649581, -904983, 180888, 703216, 439663, 293939, 561619, 246159, -951530, -1577405, -725612, 194067, -214803, -772677, 159174, 1314021, 289670, -2038779, -2347554, -171246, 1243766, 231593, -770877, 332809, 1699085, 879689, -988780, -1320526, -376972, -252704, -990242, -959669, -267984, -578335, -1833543, -2155764, -1085641, -194661, -206141, -74472, 632531, 904229]
12279I04229m18284Q9458R05220K88370r78359p67002O32203R71372j30949p82925
12269G13333k25261J45571m60785r28033l74777M59689P33644P09760P20259M08568
12259A901968k57062m86432M4787M38838j10648j000252r87023J00774J068417
12250G13367Q17557k16807n28201L39469Q31917m13340j997329j335303J174948
12241f13722K131941K11751j551887n17923J252496M51482j870701k049563M4551
12232b511575R58006l44183q50643J086755K762121J550530r04305j470282j40294
12223A36130P75229M31786j55438m79960r17051j216525o38832N60879J331255
12214a72527J346369J054120N02612n43448j488164j287228j06448N54649k08621
$$ y = [904229, 485945, 575403, 1480623, 1768993, 790634, 23632, 655835, 1627207, 1496258, 713333, 488072, 633643, 172858, -755175, -1129952, -670263, 63381, 773141, 1493400, 1901968, 1644906, 1158474, 1203261, 1642099, 1531451, 531199, -455824, -355050, 713367, 1530924, 1314117, 785916, 1125385, 1957302, 1543962, -453367, -1788670, -613722, 1518219, 1729970, 178083, -339840, 912656, 1364138, -506563, -2556126, -2511575, -1553569, -1897752, -2748395, -1661640, 1100481, 2651011, 1746706, 276424, 136130, 911359, 1343145, 1187707, 707747, -209304, -1425829, -2064661, -1503782, -172527, 1173842, 2227962, 2730574, 2187126, 698962, -588266, -694714, -140065, -348686]
12205c48686j451390j518841k2035J704676K036504Q02868n16578m89927N62709
12196G59300J057376K78401p47514p89260m2170L97512J44652j70963j1976L81540
12186A256898N16535L50590J91204J19452j22250n66368o75795k4908P88555O38464
12176B472377n00762j248410o98305K30870K28412l77576l11122L89648L74855
12167E59987p17061j513970r46161K61079Q28962O28250L26911J34744j73001
12158f10260m49560k95872J58662L17618J0603k30595P730L57684K70803O0383
12148d02804N79711J623743J615986j90351k024634j662947K64413J051408J2778
12139H67303o51841K65143R85860R4588q47101k66613L41309p79240j912385n12387
$$ y = [-348686, -1800076, -3318917, -3340952, -1636276, 400228, 1203096, 686518, 196591, 759300, 1816676, 2095077, 1347563, 558303, 516133, 913645, 1058297, 887334, 875358, 1256898, 1773433, 2124023, 2315227, 2434679, 2312429, 1746061, 1070266, 1045358, 1833913, 2472377, 1971615, 723205, 24900, 255770, 484182, 106606, -204516, 185132, 559987, -157074, -1671044, -2617205, -2356126, -1527164, -898914, -572003, -437259, -610260, -1059820, -1355692, -1197030, -879412, -868809, -1099404, -1091674, -733990, -463187, -402804, 176907, 1800650, 3416636, 3226285, 1201651, -461296, -196883, 854525, 867303, 215462, 480605, 1466465, 1561053, 713952, 447339, 788648, 9408, -1902977, -2415364]
12129b415364J998557K090344j25611j224177k00431M95713j37186k30893O35071
12120H86023K41184j654670j963714L30523J690252k47005k411784j257745J454548
12111b932388J883005L86789J10191J148288Q08905j109211j732054O7238J965862
12102E96625J878093M15853q84124j366636q88814K54906Q46332Q1264p63684
12093A69815l6902J303865Q97632j002651j563165J84993J760006J066147o83895
12084B095845j271107o58469k36009l47813k75910J39509L17142J1499m19495
12075f44808o07828m16757J55388Q56143J192514Q97779K46457k44312l14789
12066A119787j47010j04042k02250M228O28043Q45834j7972j013682n67080R31817
$$ y = [-2415364, -416807, 1673537, 1547926, 323749, 123318, 619031, 481845, 250952, 886023, 1127207, -527463, -2491177, -2160654, -470402, -717407, -3129191, -4386936, -2932388, -1049383, -662594, -552403, 595885, 1404790, 295579, -1436475, -1369237, 596625, 2474718, 2890571, 2006447, 639811, -249003, 5903, 852235, 933499, 169815, 132913, 1436778, 2334410, 1331759, -231406, -46413, 1713593, 2779740, 2095845, 824738, 166269, -69740, -417553, -693463, -553954, -236812, -225313, -644808, -1252636, -1669393, -1514005, -657862, 534652, 1432431, 1678888, 1434576, 1119787, 972777, 868735, 666485, 670713, 1298756, 2144590, 2126618, 1112936, 545856, 1477673]
12056A477673J318162j9021j040592l79720M16655k90095j245291n48230Q01748
12047D91289N16924r31100j036016M66373J240320L48835m48669J7755N27396
12038A193107m2174p70880m81938L39733O07081K20633l62959r64495j310241
12029a572133q81740K36447J220819J522928J191385K94060q62794j222574j46480
12020b20082J139675R24599l69185q20744j11011J94150m42587p11933j5592N18910
12010H6200L11986L32157R02710P67226m88360j236778m33105N39272K20102n17471
12000D83939j60413Q46919J056104M19964m7455j67954n01828r37377q06495n7861
11990A27543P05541R93221O05080l30726j051499p82497k2814l9335p60894p37303
$$ y = [1477673, 2795835, 2776814, 1736222, 1356502, 1773157, 1483062, 237771, -310459, 491289, 1008213, 77113, -958903, -492530, 747790, 1096625, 647956, 665711, 1193107, 1150933, 380053, -101885, 237848, 844929, 1065562, 702603, -261892, -1572133, -2453873, -2217426, -996607, 526321, 1717706, 2011766, 1148972, -73602, -220082, 919593, 1844192, 1475007, 654263, 543252, 737402, 294815, -417118, -432710, 86200, 398186, 730343, 1633053, 2400279, 1911919, 675141, 242036, 781308, 1001410, 483939, 323526, 1170445, 2226549, 2646513, 2599058, 2431104, 1929276, 991899, 185404, 127543, 833084, 1826305, 2431385, 2100659, 1049160, 266663, 243849, 204514, -556380, -1293683]
11980a293683L16004Q41703J57071k31597O85784J483539P31629n21922o65489
11971A503039k34273n45951j126922q23603j54550r7888K15148J843147L139413
11962C717560J679725j466185k719720j239271J50910k66970p88403J20442J084570
11953B72658N25493m61740j58602P67000O22115l33700o09005k32234m52485j185527
11943a246027j024213K21768J046488O45702J2917O0238K16829k41227p49492
11934a057017m38452L22869N13643P1810j56683J86057N91988O19504L72275N1456
11924A077450k45921k73239J46740O48716P11136M36916K46155j7861p25144j347200
11914F57748r32993K33907Q16067M98483L53452O98776L91749q71721j450011
$$ y = [-1293683, -977679, -135976, 21095, -210502, 475282, 1958821, 2690450, 2168528, 1503039, 1268766, 722815, -404107, -1227710, -1382260, -1480148, -1265000, 578147, 3717560, 5397285, 3931100, 1211380, -27891, 123019, -143951, -932354, -811912, 272658, 798151, 336411, 177809, 944809, 1566924, 1233224, 624219, 391985, -60500, -1246027, -2270240, -2048472, -1001984, -356282, -343365, -283127, -66298, -307525, -1057017, -1495469, -1172600, -658957, -587147, -743830, -557773, 34215, 653719, 1025994, 1077450, 831529, 558290, 705030, 1353746, 2064882, 2501798, 2747953, 2730092, 2004948, 657748, -275245, -41338, 774729, 1273212, 1626664, 2325440, 2717189, 1845468, 395457]
11905C95457l32939R17755N60354n50014o22158K9266k8119m76608l5882P39517
11895E96629L36126o07418j57707J207885J097364m53109p23095Q88459J500839
11886C685973l82114k175313j457120K42479M55651j38417L81852J329333P04256
11877B646580j064932j807844j160867n53686k75241O45004J902987J926663N35218
11868B793882o80783q72592q33041j116586j107935l96350M56049R35717J110598
11859B88959R09488J01943p81577p11325L29154J096805P04728k91552p21396
11850I25227j80738O00535N45516n09938j360562q31825M02966N70093m30847
11841b69573o83936N60368J334363Q1885j528876j081397P45261J363643L65749
$$ y = [395457, 62518, 980273, 1540627, 990613, 368455, 397721, 369602, -107006, -142888, 596629, 932755, 325337, 167630, 1375515, 2472879, 2019770, 1296675, 2185134, 3685973, 3303859, 1128546, -328574, -86095, 369556, 231139, 612991, 1942324, 2646580, 1581648, -226196, -1387063, -1940749, -2215990, -1570986, 332001, 2258664, 2793882, 2113099, 1240507, 407466, -709120, -1817055, -2213405, -1757356, -821639, 288959, 1198447, 1300390, 518813, -192512, 136642, 1233447, 1938175, 1646623, 925227, 744489, 1345024, 1890540, 1380602, 20040, -811785, -408819, 161274, -269573, -953509, -393141, 941222, 1023107, -505769, -1587166, -841905, 521738, 887487]
11832H87487l17077J01319L93967j2267j41493L03993K02222p78875j309211n96985
11822a266920L31605M52980K61425N12035Q06049M36402l51373p79237n10443
11813a07477K50513R35771P78064l18295j142146n41640P18980Q76906j62134
11804A288542p79746l47686k5934m42506o03079Q9023O38157L31681N9267N50669
11794G58388R22244L47223l18871r6272K95111j57229p30098k11640P79537P49969
11784B338362l9467l6485P86193P64049o10146j709122j268640j38558L34428
11775D20614K35202L14830M38681P4409m02702k12373L74086L39067l71623o51478
11765E58713j7173N10805n1604j062819j123503j11410O39920J88858q26953j110740
$$ y = [887487, 570410, 671729, 1065696, 1053429, 911936, 1215929, 1418151, 639276, -669935, -1266920, -935315, -482335, -220910, 291125, 1097174, 1533576, 1182203, 402966, -107477, 143036, 1078807, 1856871, 1538576, 396430, -145210, 573770, 1450676, 1288542, 508796, 161110, 135176, -307330, -910409, -821386, -183229, 148452, 207719, 758388, 1680632, 2027855, 1708984, 1612712, 1907823, 1750594, 1020496, 808856, 1588393, 2338362, 2298895, 2262410, 3048603, 3812652, 3202506, 1493384, 224744, 86186, 420614, 655816, 970646, 1409327, 1483736, 1081034, 868661, 1242747, 1581814, 1210191, 558713, 541540, 1052345, 1000741, -62078, -1185581, -1296991, -657071, -468213, -1295166, -2405906]
11755b405906k50453R52724J364974N82731o17416r55646j47009N52746k21r72523
11745a895999n63335J125307J849362M85605j118940q36856N91083R03793j01970
11736D38050n22575L63603J005533K62336p71245o33327K56398M77464j74021
11727G02216o22043k13068O17043J203742J278584P74980j83891r79069q76571
11718A701923j2757N43854J34654n20617l09646N77089P97422j76266j185221
11709A550435j025182j13299L67390K77541K61223J77360o53716j729559j582243
11700b470050n1449J249516J279556Q17696O84921M00361l70381o82088N606M90300
11690A353988k34278j033666m46232P16989O59299l83572o57159R4736M30799
$$ y = [-2405906, -2656359, -1703635, -338661, 244070, -373346, -1328992, -1476001, -923255, -923476, -1895999, -2459334, -1334027, 515335, 1000940, -118000, -954856, -363773, 540020, 438050, -84525, 279078, 1284611, 1546947, 775702, 142375, 398773, 876237, 702216, 80173, -132895, 484148, 1687890, 2966474, 3741454, 3557563, 2578494, 1701923, 1689166, 2233020, 2367674, 1847057, 1537411, 2114500, 2911922, 2735656, 1550435, 525253, 411954, 779344, 1056885, 1318108, 1495468, 841752, -887807, -2470050, -2521499, -1271983, 7573, 825269, 1510190, 1910551, 1540170, 858082, 863688, 1353988, 1119710, 86044, -360188, 356801, 1016100, 632528, -24631, 70105, 500904]
11681E00904j23480m71967j89924k28487q75540r37549K45319J511748J517239
11672I48263N48161j11362J39889P71214Q63475L9378j025916j225488n32969
11663D14645k13850q41318j157145j24034J065133Q13438j21133Q571O66469l9317
11653D71459j554005j277086R18559J978086N24823q82261q6984J138140L66956
11644A597687j206098q34074J082393J617021o3626j699773j547206m52327Q9929
11635a416074p8891l56932m18137q6797O56895J146206N95615m71166n25078P39147
11625b15212J626254P04596j074715j618401n30426N36061L31952m30953m69663
11616a140507J80047O16088O83753Q44034P87092k30789j541081j333989N17157
$$ y = [500904, 377424, -94543, -284467, -512954, -1388494, -2326043, -2080724, -568976, 948263, 1496424, 1385062, 1524951, 2296165, 3159640, 3199018, 2173102, 947614, 414645, 200795, -640523, -1797668, -1921702, -856569, -43131, -164264, -155693, 510776, 471459, -1082546, -2359632, -1441073, 537013, 1061836, 179575, 92591, 1230731, 1597687, 391589, -442485, 639908, 2256929, 2193303, 493530, -1053676, -1506003, -1416074, -1494965, -1851897, -2270034, -2356831, -1699936, -553730, 41885, -429281, -954359, -215212, 1411042, 2115638, 1040923, -577478, -1107904, -571843, -239891, -670844, -1140507, -960460, -344372, 339381, 1183415, 1970507, 1739718, 198637, -1135352, -618195]
11607f18195J665711N85081r71490o10760R35704J042897n71790j522681o46207
11598g11730M30878K66820k18320K61819J057035P93479l32894r67015o22927
11589d2855o9869j9219l33479m34109L1613Q68566J472624J378936O09596n93565
11579B868239j897327k488046j476864N71198J556547M60537r78979o99722O18374
11570a466043Q52970q9021m79838O2364K22564k85847k66084M59246O09348q7128
11560d67469l92509M2079J66541j88232r064N51374K15235o33511j84783J246794
11550C46455J235437l98425r18876M54483J016344l52315q81534Q15563J571286
11541B888418p72844k794319r10355K194120J773765j074166j499725Q24190J611117
$$ y = [-618195, 1047516, 1632597, 661107, 50347, 986051, 2028948, 1457158, -65523, -711730, -280852, -14032, -232352, 29467, 1086502, 1879981, 1547087, 580072, -42855, -112724, -131943, -465422, -899531, -867918, 648, 1473272, 2852208, 3461804, 2868239, 970912, -1517134, -2993998, -2422800, -866253, -405716, -1384695, -2084417, -1466043, -613073, -702094, -1181932, -1119568, -897004, -1182851, -1448935, -989689, -380341, -467469, -859978, -817899, -651358, -839590, -848654, -297280, -82045, -715556, -900339, 346455, 1581892, 1183467, 264591, 719074, 1735418, 1383103, 501569, 1317132, 2888418, 2115574, -678745, -1589100, 605020, 2378785, 1304619, -195106, 629084, 2240201]
11532B240201l97930j690135m43220P59699P1152n86723M16613J391334O01833
11523B362824p37632r59867o71352q81311q31875K22312J126450P22621o8858
11514B83312J13243Q32291R23019M96562L17658K70363j61362p65132j057913
11505A252041j058186q20032j43105O37230O79888K6174k48651K23547N58728
11496A107634K99593J06417K14920r2312p75829o51849L72837O33015n23792j283904
11486e93270k61588J030596N79116q44099j071151o0457M02757j44413m24497
11477a387006L3338J93628l85865o84701J2379R67367J188525O49487j48514q59168
11467d20530j131056o28803L63870J016913R22894M41727k7263m47963o88885
$$ y = [2240201, 1842271, 152136, -291084, 468615, 539767, -46956, 369657, 1760991, 2362824, 1625192, 665325, -6027, -887338, -1719213, -1496901, -370451, 352170, 283312, 396555, 1228846, 2151865, 2648427, 2966085, 3236448, 3075086, 2309954, 1252041, 193855, -626177, -769282, -132052, 547836, 574010, 325359, 548906, 1107634, 1407227, 1513644, 1728564, 1636252, 860423, 208574, 581411, 1214426, 690634, -593270, -854858, 175738, 754854, -89245, -1160396, -1220853, -818096, -962509, -1387006, -1353668, -1160040, -1545905, -2230606, -2218227, -1250860, -62335, 587152, 438638, -420530, -1551586, -2180389, -1816519, -799606, 123288, 565015, 537752, 89789, -599096]
11458e99096m02522L25818Q00683N45767j05396n23623n35263m24398m75139p00433
11448b093602q10334l91293N95007J463158J357223L13403o03185m92956L25065
11439c37514P85614M23132j76398k95995l1256R69l33514m70116k9087N39169
11429G5004N43666J0994l91004k63288J50387M69675N83561M86346J70728j70228
11419A665841k46595j26094j61100l17593j21445M39438N77335j76302j017092
11410E16393q09424K71676Q93320L56890n86860q98392m42662L14087J025222
11401F40250J331200P32406n78458j303722n12888P73741P02754p21621j460394
11392c96732l71875J096658J063037j62639r14800p19422l84516r0238P25397
$$ y = [-599096, -1001618, -675800, 124883, 670650, 565254, 41631, -493632, -918030, -1393169, -2093602, -2903936, -3295229, -2700222, -1237064, 120159, 433562, -169623, -662579, -337514, 448100, 871232, 694834, 398839, 367583, 368552, 35038, -435078, -464165, 75004, 618670, 629664, 238660, -24628, 125759, 595434, 1178995, 1665341, 1836069, 1665841, 1419246, 1293152, 1132052, 814459, 693014, 1132452, 1709787, 1533485, 516393, -293031, -21355, 871965, 1228855, 641995, -256397, -699059, -384972, 640250, 1971450, 2703856, 2125398, 821676, 308788, 1082529, 1785283, 1063662, -396732, -768607, 328051, 1391088, 1228449, 313649, -405773, -790289, -880527, -155130]
11383a55130J590701J084760p02316j571317j91951J713855J629919k35889j370392
11374A792240n39740P46630O39580o14176j450742j280164q82564p96651m72957
11365b858544N43024J420221R79972m17193j010128K6086J356300J304357J28630
11356A472725n17949N6030Q87212R07865J71765n64583p00262j60118M89106M30865
11346B472656l07915n92741J72391P85597q8091j555370j512516J72933J392396
11337I39340R02408j62781l65325J79446O52580O78405L5332j241362j995060
11328c77017r40861R54258J134149p23574j845232n52872J073022N73024r91757
11319a696860r22185Q72895K084601J577119M05192k85246m20173l29535l68184
$$ y = [-155130, 1435571, 2520331, 1818015, 246698, 54747, 1768602, 3398521, 3162632, 1792240, 1252500, 1999130, 2638710, 2024534, 573792, -706372, -1588936, -2385587, -2858544, -2315520, -895299, 84673, -332520, -1342648, -1316562, 39738, 1344095, 1472725, 954776, 1010806, 1898018, 2805883, 2977648, 2413065, 1712803, 1552685, 2041791, 2472656, 2164741, 1572000, 1744391, 2529988, 2441897, 886527, -625989, -453056, 939340, 1841748, 1678967, 1313642, 1493088, 2145668, 2824073, 2859405, 1618043, -377017, -1317878, -363620, 770529, 46955, -1798277, -2351149, -1278127, -705103, -1696860, -2619045, -1746150, 338451, 1915570, 2320762, 2035516, 1615343, 1285808, 917624]
11310I17624p91076j011819K3015J721499J737301n26356k226432j045991J061043
11301a41192R00290q59163j092238L63999O71658q42765j524977o9949J340398
11292a253939Q86457j09675N3390O37460L67365o7137M59769J148709N91815o78777
11282B035437r89664k30027O6907q16953j704696j175366N43677J749806J181829
11273F60950m46425j197631l56642N98885J46321j009380j066302R1763Q82377
11264a696084N77651J38430L43591P03232O32877L24586L491m90345r90013r38063
11254a390647l32244K11247M46843O12632O52500L68102J13603J92972j5435r55092
11244i5519j474265k84687J606875J977995O63817m30778m54128l44036m08112
$$ y = [917624, 126548, -885271, -862256, 859243, 2596544, 2070188, -156244, -1202235, -141192, 759098, -100065, -1192303, -828304, -156646, -999411, -2524388, -2594337, -1253939, -367482, -477157, -423767, 213693, 581058, 513921, 973690, 2122399, 2714214, 2035437, 1045773, 815746, 882653, 65700, -1638996, -2814362, -2270685, -520879, 660950, 214525, -983106, -1339748, -740863, -594542, -1603922, -2670224, -2578461, -1696084, -1118433, -980003, -636412, 66820, 699697, 1024283, 1027774, 537429, -452584, -1390647, -1722891, -1511644, -1064801, -452169, 200331, 568433, 682036, 875008, 859573, -95519, -1569784, -1854471, -247596, 1730399, 2394216, 1963438, 1509310, 1165274, 757162]
11235G57162J70973J017864N04415j225557j862867n92755M94395p6004q50966
11226a663340k62454P24305O89702K76146N27828O76335j70919q35963N7049J386202
11216A404891J107853m95204j402415q95839M9080O82504Q61786K57576r34147
11207F36085j263121O0168J329456N16595j478081k092130j052750m18035p93554
11198d555367l71959J595625K985541J845773o20139j732199q37076M03466N84159
11189g02176o74l71563k07132J47250M07591O27103Q68676R54564O99756K14495
11179B637890k44323n67173o75453l69659K63396N79916J51490m57791m69398
11170H48895j46134k57429n87645l16640K57768J7759q34224q00285K79115O29307
$$ y = [757162, 928135, 1945999, 2450414, 1224857, -638010, -1230765, -736370, -812374, -1663340, -1925794, -1201489, -511787, -235641, 292187, 968522, 797603, -38360, 18689, 1404891, 2512744, 2017540, 615125, -280714, -231634, 450870, 1312656, 1570232, 636085, -627036, -566868, 762588, 1279183, -198898, -2291028, -3343778, -3761813, -4555367, -4927326, -3331701, -346160, 1499613, 879474, -852725, -1689801, -1286335, -702176, -702850, -1074413, -1281545, -1134295, -726704, -99601, 769075, 1723639, 2423395, 2637890, 2393567, 1826394, 1150941, 781282, 1044678, 1624594, 1776084, 1318293, 848895, 702761, 445332, -142313, -458953, -201185, -183426, -1017650, -1817935, -1538820, -909513]
11160i09513n16719j393781m87457R88007J133620L46903K50307Q33196Q56596
11151A101159L31243L50430Q13242M79951o69580j095255q4410J118216J095817
11142C440813k9077j161698j590329j336849p98705l64433o7561L46524Q04651
11133g56664Q13447L57786J89976O04388P27794j07933j083115j036376j80397
11124d71094M69420O81088P62597M49143m66401r65841L1143J645291J920259
11115D055605O33991n04545n32132l14286o28019r34407p27513n48494p79636
11106b79436p31525P9247Q07690N05720l21222m56355K51574Q55494P55507K74565
11096A741259j16531l77029n86318o07430l07806J39028L83097K73041k0172k77847
$$ y = [-909513, -1426232, -2820013, -3307470, -2319463, -1185843, -838940, -588633, 244563, 1101159, 1432402, 1782832, 2596074, 3076025, 2406445, 1311190, 1226780, 2344996, 3440813, 3411736, 2250038, 659709, -677140, -1475845, -1840278, -1907839, -1561315, -756664, 56783, 414569, 604545, 1208933, 1936727, 1828794, 745679, -290697, -471094, -1674, 679414, 1442011, 1891154, 1424753, 458912, 490055, 2135346, 4055605, 4689596, 4185051, 3652919, 3338633, 2710614, 1776207, 1048694, 500200, -279436, -1010961, -931714, -124024, 381696, 60474, -395881, -144307, 711187, 1466694, 1741259, 1624728, 1247699, 661381, 53951, -253855, -114827, 268270, 541311, 521139, 243292]
11086B43292m96582p04182o46254p3180O17624N87009k98382j054554p85303J57667
11076b452845P75271P46308M68695J63582j93682k52428M26872J397028J549901
11067B628702N92935m73446p28793m96179o20211j132844j318387q50083j86475
11058b584781J75998K92677M31650N64125N13515L74035M11894O34811Q02319
11049A616243Q14701O94400K13191q67776k008415k054022p23859O42920N99556
11040a073061m97245r50143K6328J385137J702391Q32725j66341l12396L30066
11031A277461P63506J74290r57045j253557k41747Q58578P38828k40176p37407
11022C82731l13842L78241Q03573Q36504K82395o95730j086891k68153O93959
$$ y = [243292, -253290, -957472, -1603726, -1676906, -1059282, -472273, -770655, -1825209, -2610512, -2452845, -1677574, -931266, -462571, -298989, -492671, -745099, -318227, 1078801, 2628702, 3221637, 2748191, 2019398, 1523219, 903008, -229836, -1548223, -2398306, -2584781, -2408783, -2116106, -1684456, -1120331, -606816, -232781, 179113, 813924, 1616243, 2430944, 3125344, 3338535, 2470759, 462344, -1591678, -2315537, -1672617, -1073061, -1570306, -2520449, -2494121, -1108984, 593407, 1426132, 1259791, 947395, 1277461, 2040967, 2215257, 1258212, 4655, -237092, 621486, 1360314, 1120138, 382731, 68889, 447130, 1250703, 2087207, 2369602, 1673872, 586981, 318828, 1012787]
11013A012787M29298n03504n00668L44317M64457k92232l38416P01452J083723
11004B401214j50069j511267j452534n43082j205K47133O56186O89564j42634
10995A93306j003208q35805J34388J029652J478313J308895K82338r82795j133102
10986D71982j04318L73932o15330j557826q35448P42487J301420O16331j60068
10977B33162n23549p64244q17048m39572N265J27445K88231Q39436J306358J165628
10967A421112N86751k57520j444204k223319j285889R42512K040920Q85292n91901
10958G3754m23435M70516K25940q30429j128911n28211Q6980O23106J177136R62453
10948G08899j18120l47086J086825J922379J25019k243233j751655R66507K153306
$$ y = [1012787, 1442085, 938581, 437913, 782230, 1246687, 954455, 616039, 1317491, 2401214, 2251145, 739878, -712656, -1255738, -1256943, -1009810, -353624, 335940, 193306, -809902, -1645707, -1511319, -481667, 996646, 2305541, 2587879, 1605084, 471982, 367664, 741596, 126266, -1431560, -2267008, -1524521, -223101, 393230, 233162, -290387, -1054631, -1871679, -2311251, -2305986, -2178541, -1890310, -1050874, 255484, 1421112, 2007863, 1750343, 306139, -1917180, -3203069, -2260557, -219637, 665655, 73754, -349681, 120835, 346775, -483654, -1612565, -2140776, -2053796, -1430690, -253554, 708899, 590779, 243693, 1330518, 3252897, 3377916, 1134683, -616972, 349535, 2502841]
10939B502841O96957q02715p03874l01950n65027m13673O08284R81178o7562j011992
10929I22467o27259M3519k43533q27081o06304j0332K3166j91137J93373R05717
10919d17404R07250l3504j017053j096310k53839O01922O13338M0325j20110K23546
10909e51839L5420q32008q80347N38536J584477O90698n52135J96151J943881
10900B172834J778505l18292j494605q13292m17687j275585j343825N61940K238955
10891A088948J510905l31295q26404j71085k54408j120209r76060O30373J860300
10882A411065J201795m27015r55941J12625J125239O00455o12389n76956N45206
10873B424084M02928j706697l059700j411582J222811J420580l84647q35089Q12747
$$ y = [2502841, 3199798, 2397083, 1693209, 1391259, 826232, 412559, 1020843, 2002021, 1934459, 922467, 295208, 338727, 95194, -731887, -1338191, -1348523, -1325357, -1516494, -1323121, -417404, 489846, 456342, -560711, -1657021, -1910860, -1308938, -695600, -655275, -775385, -551839, -516419, -1348427, -2228774, -1690238, -105761, 584937, 32802, 228953, 2172834, 3951339, 3633047, 2138442, 1325150, 907463, -368122, -1711947, -1150007, 1088948, 2599853, 2268558, 1442154, 1271069, 1016661, -103548, -1079608, -449235, 1411065, 2612860, 2185845, 1229904, 1342529, 2467768, 3068223, 2455834, 1878878, 2424084, 2827012, 1120315, -1939385, -3350967, -2128156, -707576, -1092223, -1927312, -1114565]
10864a114565J791148O50732o87220o07439j53524l64907l18086N52342R32623
10855F81104J89259j14375Q71123J356134J8934j347096p55502N26464K32912
10846A658957r50794p60308N49892P08164n33175r92422K02632J248230O56049
10837A787225o17116r17265j51693N81693N28238k21291r86759q97499K62116
10828f32351J434735J256155k14257j444473j268690j18893P58533P22479J14343
10819F07581l66108l70298j12705K1229K8307K46301P32262J039686P87857J33901
10809B748013m82413p46999n43658l5519K55129m0157m67798k32401N19613O81794
10799A655604k02740j105839q70248K15849Q84288N33255k39384n38171r2133
$$ y = [-1114565, 676583, 1327315, 640095, 32656, -120868, -485775, -803861, -251519, 681104, 870363, 755988, 1627111, 2983245, 3002179, 1655083, 899581, 1426045, 1658957, 708163, -52145, 497747, 1205911, 672736, -319686, -117054, 1131176, 1787225, 1170109, 252844, 101151, 682844, 1211082, 989791, 3032, -894467, -632351, 802384, 2058539, 1844282, 399809, -868881, -987774, -229241, 493238, 607581, 241473, -128825, -241530, -220301, -191994, 54307, 786569, 1826255, 2614112, 2748013, 2265600, 1518601, 974943, 939424, 1194553, 1154396, 686598, 454197, 973810, 1655604, 1452864, 347025, -523223, -307374, 576914, 1110169, 870785, 332614, 240481]
10790B40481O05124P46827j7000j028057j154791j79225P36589M43512o44525
10781b51065j049112k03669Q21486Q57481K07364k6787K41075L5364q20390j065138
10771a253391M9684J295464J173244K17432l135M18281K8090j161031j419615
10762f54977k58782O59698L80311J32990P47718Q75964m68495j645894q50927
10753a082394P95860J011138l5821l64751M17360Q60256L52311k51053m62062
10744A240844n83179m78087K16539Q65150N69630j57518j51581L82591L65223
10735B269612j19820j64520M3506l57740r43182n54548M28996M89832m59468r57687
10725c25019m18475K93840O75578J023123J105286L75478m86020k32098O85458
$$ y = [240481, 845605, 1592432, 1575432, 547375, -607416, -786641, -50052, 393460, -251065, -1300177, -1503846, -682360, 175121, 382485, 355698, 596773, 632137, -188253, -1253391, -1203707, 91757, 1265001, 1482433, 1479298, 1897579, 1925669, 764638, -654977, -913759, -254061, 126250, 259240, 1006958, 1882922, 1414427, -231467, -1082394, -286534, 724604, 688783, 324032, 741392, 1601648, 1953959, 1702906, 1240844, 657665, 179578, 396117, 1261267, 1830897, 1673379, 1521798, 1904389, 2269612, 2149792, 1985272, 2028778, 1671038, 727856, 173308, 602304, 1092136, 632668, -325019, -743494, -449654, 225924, 1249047, 2354333, 2729811, 2243791, 2011693, 2697151]
10716B697151N12809r63221j927193j238931J27296P63585M84953l2868j24280
10707B99301M37481J005213M67943j031102j733803p61048L64638J92107k90814
10698a050084K47131P92562l0619r52700q5878J439976J231827j30732k28773
10689A232710P29871M35815j077911j466616l44729L39341J30571M20602R98991
10680A398645K30540j211119q92605Q30864J048102n11341r57686M00944Q57472
10671A193816m11690o61936J094432J752654n29477k837782k113458K91188J421257
10662h00996J021175M13472k07937q98611p24197M79000J209775P38408J91875
10653A421964Q2846n49364j502980j050245O20856J000138l83591q48016O52483
$$ y = [2697151, 3209960, 2246739, 319546, -919385, -792089, -28504, 456449, 423581, 299301, 736782, 1741995, 2209938, 1178836, -554967, -1316015, -951377, -759270, -1050084, -802953, -10391, -41010, -993710, -1079588, 360388, 1592215, 1461483, 1232710, 1962581, 2398396, 1320485, -146131, -490860, -151519, -20948, 399654, 1398645, 1629185, 418066, -474539, 356325, 1404427, 893086, -64600, 336344, 1193816, 782126, 120190, 1214622, 2967276, 2437799, -399983, -2513441, -2222253, -800996, 220179, 633651, 425714, -472897, -1197094, -718094, 491681, 1230089, 1421964, 1504810, 955446, -547534, -1597779, -976923, 23215, -360376, -1208392, -555909]
10644e55909J546681L89002m89260N08154J131840l55759j537288j1695K140204
10635B765970J788466j58327q71792m32384p27306j399593o62205J071196J709892
10626C083917Q38518j69904o41252r30322j025842p24869m55555n07561l58972
10617h91842K22503O12226N65074N12077K22573q77979j811819r23667J061269
10608a309585J669792O82375L05575R95290Q07446m60541n77806O59254O02006
10599C373806j212175j684632L27846J634180J81655j421758n77519J071137R67163
10590B659703k99924j006935j204620j235892m27900P86442O63697m18283K2426
10581d61286J863533J972094j39073j061149M67908J422088K93359l90494M82810
$$ y = [-555909, 990772, 1379774, 890514, 1398668, 2530508, 2174749, 637461, 625766, 2765970, 4554436, 4396109, 3524317, 3091933, 2364627, 965034, 302829, 1374025, 3083917, 3922435, 3752531, 3111279, 2180957, 1155115, 430246, -25309, -532870, -891842, -669339, -57113, 507961, 1020038, 1242611, 364632, -1447187, -2370854, -1309585, 360207, 1042582, 1348157, 2343447, 3150893, 2690352, 2112546, 2771800, 3373806, 2161631, 476999, 804845, 2439025, 2620680, 1198922, 621403, 1692540, 2659703, 2359779, 1352844, 148224, -1087668, -1515568, -729126, -65429, -483712, -461286, 1402247, 3374341, 3235268, 2174119, 2642027, 4064115, 4357474, 3966980, 4449790]
10572D449790L35642j472802j667028N69531J389127n58669j234091J118639K187061
10563E117200m82332k601723q26905J344885M26098q17568N96036J878648K33286
10554D867625j407830j78912J067585l38346j301852Q15455K429641L13706k043402
10545D223670q67788J102839M47294n10494O47488Q79604j748819k789766N25965
10536A909993L090862Q69273j478429N27560K589931J59220k482194n57783J783159
10527F411592k71979k560910k86191K209384Q3252k083558N20273K764831l78979
10518F407715l118363J24565L083723l53585l401997O04454M106491m65090m669982
10509B317931N95451O458942J952312m462126n76785N582940J237169n118352
$$ y = [4449790, 4785432, 3312630, 1645602, 2215133, 3604260, 3045591, 1811500, 2930139, 5117200, 4634868, 2033145, 1206240, 2551125, 2977223, 2159655, 2755691, 4634339, 4867625, 3459795, 3280883, 4348468, 4010122, 2708270, 3523725, 5953366, 6267072, 4223670, 3355882, 4458721, 4906015, 4395521, 5043009, 5922613, 4173794, 1384028, 1909993, 5000855, 5870128, 4391699, 4919259, 7509190, 7668410, 5186216, 4628433, 6411592, 6139613, 3578703, 3292512, 5501896, 5585148, 3501590, 4021863, 6786694, 6407715, 3289352, 3413917, 6497640, 6144055, 2742058, 3346512, 7453003, 6987913, 2317931, 2913382, 9372324, 11324636, 6862510, 6285725, 11868665, 13105834, 7987482]
10501G987482K37622P686782J625863p199906n59963R761225K489325q595038
10493A3433392K683271J9620567P574974j1919064J6466560P5479065P2159733
10486A95498498k3586145j12790677r6954648j3159753L0344905Q005851j4698764
10479b7340733j272862J3905713M004830p136031J133464R675680J434626o881700
10471a2477013J45825P799188J379572o463917j498014N910381K295545m236709
10463g145142j681072L338671M72226m035297o08302M796834K556315k644556
10455d950323j818458J672474M34066k244568p8133L026226P31653l002246j335906
10446g565215K719629K483624k79891j25022J499354M25502j310295K4581J877300
$$ y = [7987482, 8225104, 15911886, 17537749, 10337843, 9777880, 19539105, 22028430, 13433392, 16116663, 35737230, 43312204, 31393140, 47859700, 123338765, 195498498, 171912353, 59121676, -37832972, -50992725, -20647820, -12641969, -27340733, -28613595, -14707882, -10703052, -17839083, -16705619, -7029939, -5595313, -12477013, -12331188, -4532000, -3152428, -9616345, -11114359, -5203978, -2908433, -7145142, -8826214, -5487543, -5015317, -9050614, -9658916, -4862082, -2305767, -4950323, -6768781, -5096307, -4662241, -6906809, -6984942, -3958716, -3227063, -6229309, -7565215, -4845586, -2361962, -2641853, -2766875, -1267521, -842019, -2152314, -2127733, -250433]
10437b50433L84057j967648j337829J97980n05395j211058M77170J382657r54336
10428c784835k376581N50043L439545J532548j739728j109834J264553O29438
10420a594851j391246n18131J843435J605048l63431o58206J0494q31805j768130
10411c666823m33166J167455K37591j220841j79939J453647M77703j326221m90280
10402c980874J584979J293614n90636p31098O13173O46521o45945j100139n26533
10393c436938n5805O82253J985338K056360P0706j456046p11627J88702o26082
10384a303139j131390L41508J278870l11404j500271M27838K441601P65037k197507
10375a188857j805282R34360J520633k52417p39664P80123J495423M53112m74587
$$ y = [-250433, 133624, -1834024, -3171853, -2973873, -3479268, -4690326, -4213156, -2830499, -3784835, -6161416, -5611373, -2171828, -639280, -2379008, -3488842, -2224289, -1594851, -2986097, -3504228, -1660793, -55745, -419176, -1077382, -1066888, -1898693, -3666823, -4099989, -2932534, -2694943, -3915784, -4095723, -2642076, -2164373, -3490594, -3980874, -2395895, -1102281, -1692917, -2424015, -1810842, -1164321, -1810266, -2910405, -3436938, -3492743, -2810490, -825152, 1231208, 1301914, -154132, -865759, -677057, -1303139, -2434529, -2093021, -814151, -1125555, -2625826, -2197988, 243613, 1008650, -1188857, -2994139, -2059779, -539146, -791563, -1531227, -751104, 744319, 1197431, 722844]
10366G22844n46618p64465r93591k09285R29320R14129k599o46578j028683j268139
10356b893665l83993J420753J721030k78984j684559n35180P49861j49229j054828
10347c088794N74107K465642J220389j591170k000346j62899O12649l06238p34333
10338c010993q0593M10511O97798J373746J378904j05657j110916J60557J715827
10329A429184Q90474r68419r96377R0413k11868j214725n29565J027047P76009
10320B92173p98516j010561Q4347K48247m11875k3789Q11045l3037j666235j185473
10310c693674J159105K208508J070790j40582m76211r07560j155061P2912J754391
10301a07382J505696j83706n87472N22649P96209j36891k28802O78994L40370
$$ y = [722844, 176226, -588239, -1581830, -1791115, -861795, 52334, 49735, -596843, -1625526, -2893665, -3277658, -1856905, -135875, -414859, -2099418, -2634598, -1884737, -2033966, -3088794, -2514687, -49045, 1171344, -419826, -2420172, -2583071, -1970422, -2276660, -3010993, -3091586, -2681075, -1983277, -609531, 769373, 663716, -447200, -286643, 1429184, 2319658, 1351239, 354862, 445275, 233407, -981318, -1510883, -483836, 292173, -506343, -1516904, -1432557, -1184310, -1596185, -1619974, -808929, -841966, -2508201, -3693674, -2534569, -326061, 744729, 604147, 127936, -779624, -1934685, -1861773, -107382, 1398314, 1214608, 627136, 1149785, 1945994, 1809103, 1580301, 2259295, 2599665]
10292B599665j531941k379937j096933M02611O99482N67851M57742l91137j559002
10283b231599j335653K29354J101889O68826M43144R03945O81174n29718j226577
10274a295215q82905n95716m78517N79041K027414J730588k65823j189527J49651
10265b21009J472782P45825r28707j570235j107620m62356J56042P25469Q45207
10256c44602O69541Q60687J031654J4881j808529k436388j184988K29595L22386
10247b645763k76961m10911j69800j29517j73838N3435M92051R50028J222636
10238a088640Q76486j67037j056788j026360n09502j73619L00903J119516J215460
10229e09581J3724q80583j668J187901N05345j076078r40460N80565P40476p61119
$$ y = [2599665, 1067724, -1312213, -2409146, -2006535, -1307053, -739202, -281460, -672597, -2231599, -3567252, -3337898, -2236009, -1567183, -1124039, -220094, 461080, -68638, -1295215, -2178120, -2773836, -3252353, -2673312, -645898, 1084690, 818867, -370660, -221009, 1251773, 1997598, 1068891, -501344, -1608964, -2071320, -1915278, -1189809, -344602, 324939, 1185626, 2217280, 2232161, 423632, -2012756, -3197744, -2968149, -2645763, -2922724, -3333635, -3503435, -3632952, -3806790, -3753355, -3261304, -2311276, -1088640, -212154, -379191, -1435979, -2462339, -2971841, -3145460, -2844557, -1725041, -509581, -495857, -1376440, -1378108, -190207, 315138, -760940, -1701400, -1120835, -380359, -1141478]
10219a141478j262291J66568J271801P41717K22711Q90718J267740J48949j102381
10210A204054j008044l30782k17519j61407M16188N41836n04127j458444r67260
10201b485505K23341O62716M89666O61708R90263O11726l35488r30231q12787
10192i24591k39732N76628J259533J110886R2142p05731m67355J13409o9045p65617
10182a9473p68897J52514P59436N0776j212519j335574M2004J278890R25220q7551
10172b15174K37605J699287J856617k18717k212683j863247j17664P34134M12147
10163C12305L1307l96894j371674j939946j007374K14507j22719j039529m1920
10154e361937K375328K937778O97753j403406j092759J62950J64545n56348k42573
$$ y = [-1141478, -2403769, -2237201, -965400, -223683, -972, 889746, 2157486, 2306435, 1204054, 196010, -134772, -352291, -513698, -97510, 444326, -59801, -1518245, -2485505, -2262164, -1599448, -1109782, -448074, 542189, 1153915, 818427, -111804, -924591, -1164323, -587695, 671838, 1782724, 1874866, 1169135, 701780, 815189, 746144, -19473, -788370, -635856, 123580, 174356, -1038163, -2373737, -2331733, -1052843, -127623, -215174, 22431, 1721718, 3578335, 3359618, 1146935, -716312, -833976, -99842, 312305, 343612, -53282, -1424956, -3364902, -4372276, -4157769, -4280488, -5320017, -5361937, -2986609, -48831, 648922, -754484, -1847243, -1684293, -1519748, -2076096, -2318669]
10145b318669J010218J692196J234961K92170n23543r31261o97763m0103L01380
10136A9586Q0309o9794J93054K37754l83811r26912m42768P20378J199368K96734
10126I23898j116183j549088o59478K84836J40789l50857L08938J673888J627786
10117A284529j59736j269842k60287R28063K35460j014267n27210Q45318O31009
10108F93037q41740j074197J63721O40760j69227l32540O99008R60440l92527
10099C46735j490490j019269k49521m05848n77817J79175R23142O76714K77054
10090a340125P11084J226836P20757l33836q34951p98012q08230o98492k7540
10081b182509Q39876J156587P97714K12208j32596J8749M18211K72838o76222
$$ y = [-2318669, -1308451, 383745, 1618706, 1910876, 1387333, 456072, -241691, -281794, 19586, 99895, 30101, 223155, 460909, 77098, -849814, -1292582, -572204, 627164, 923898, -192285, -1741373, -2400851, -2116015, -1975226, -2326083, -2017145, -343257, 1284529, 1124793, -145049, -405336, 522727, 758187, -256080, -783290, 62028, 693037, -148703, -1222900, -1059179, -418419, -587646, -920186, -221178, 739262, 346735, -1143755, -2163024, -2412545, -2818393, -3396210, -3217035, -2293893, -1617179, -1340125, -629041, 597795, 1318552, 984716, 149765, -648247, -1456477, -2154969, -2182509, -1342633, -186046, 611668, 823876, 691280, 710029, 1128240, 1401078, 724856]
10072G24856j294793m62741R54263J074992j78897r57091k84581P49568R18520
10063A244096L48135l15399p74121p60548j45693M46106L24230p3381N1047K94777
10053F39249j83597q73175p16657j35277j75928k86573O33726J599274P92022
10044A293064r92550j307518k26614p9471r96075n97816J318275J893215J87678
10035D92188r97770M493R42876p0884j179223l48440R74812P49856L775M69185
10025A040868J088325J61471j151446q10804M01222M39555l00656j44234L52576
10016A076877n02329j893252j432314P27704J982046J332707L36577m5425o09069
10007I73522j510737j422451O2162J313375R38348l66926j047801o29567J74563
$$ y = [724856, -569937, -1032678, -78415, 996577, 817680, -139411, -423992, 325576, 1244096, 1592231, 1276832, 502711, -257837, -403530, 42576, 366806, 293425, 344472, 639249, 455652, -417523, -1134180, -1269457, -1445385, -1731958, -1098232, 501042, 1293064, 300514, -1007004, -1233618, -1313089, -2309164, -2906980, -1588705, 304510, 492188, -505582, -501089, 441787, 370903, -808320, -1156760, -181948, 567908, 571683, 1040868, 2129193, 2290664, 1139218, 328414, 729636, 1169191, 868535, 724301, 1076877, 574548, -1318704, -2751018, -2023314, -41268, 1291439, 1628016, 1582591, 973522, -537215, -1959666, -1897504, -584129, 354219, -12707, -1060508, -1690075, -1515512]
9998a515512M67874m7118p22892m88232P38904J614589J071811j69199p15054
9989B35171m45670k53424m47966n97033m86705j72279M47919J172250J261063
9980G13326N94529J99875N59633M86473q79655k064326j183386Q67389J372223
9971F66081k16559j436608l85732J694198K250161O18636j520509k260940j311065
9962a902337J11979P99400P07753M84977K81427j65701m94023n8007N56646m1286
9952B80828j579414j897242k06010J324147P93777m19671j5895J370961J337721
9943I89202j62165p97935J94227R16549J52230p65920m29227M00997L13513n34933
9933B76538j031900q25444k59360N14983J275337J307781L07575q39683j139362
$$ y = [-1515512, -1047638, -1094756, -1817648, -2305880, -1566976, 47613, 1119424, 950225, 235171, -210499, -463923, -911889, -1508922, -1995627, -2167906, -1719987, -547737, 713326, 1307855, 1507730, 2067363, 2553836, 1674181, -390145, -1573531, -706142, 666081, 449522, -987086, -1372818, 321380, 2571541, 3190177, 1669668, -591272, -1902337, -1790358, -990958, -283205, 201772, 483199, 317498, -176525, -234532, 322114, 280828, -1298586, -3195828, -3401838, -2077691, -1283914, -1703585, -1719480, -348519, 989202, 827037, 29102, 223329, 1139878, 1292108, 526188, 96961, 497958, 811471, 276538, -755362, -1580806, -1840166, -1325183, -49846, 1257935, 1565510, 725827, -413535]
9924d13535q71864r12461j092890m49550R58929J740830J082896n0901l22238
9915c30784J61159L41010j7813k07023m5252j77507o87290o98767P1193O01165
9905i89909K71875Q5907R32795J696599Q05213r88034j384268j5260R10793o4266
9895A261445j540670j517423l18323K01022l85838n43301O64129J843575J121874
9886G86490q89994j569583j21815R36997j78107p91578K543525P339176O879360
9877A4934471o6404o131430n103697l92676R00887j291360j454735J440559K542501
9868E378116j53780k603883j886542m66277p43990p78009J222465K707263R71958
9859C647321j936762k350167m11721J084234J138334O96143J79322l90577m29016
$$ y = [-413535, -1285399, -2197860, -3290750, -3740300, -2781371, -1040541, 42355, -8546, -330784, -169625, 171385, 153572, -53451, -98703, -276210, -963500, -1662267, -1591074, -989909, -718034, -632127, 300668, 1997267, 2802480, 1814446, 430178, 414918, 1325711, 1261445, -279225, -1796648, -2114971, -1913949, -2299787, -2843088, -2178959, -335384, 786490, -103504, -1673087, -1794902, -857905, -1036012, -1827590, 715935, 8055111, 14934471, 14868067, 8736637, 3632940, 3240264, 4141151, 2849791, 1395056, 2835615, 5378116, 5224336, 2620453, 733911, 267634, -476356, -1254365, -31900, 2675363, 3647321, 1710559, -639608, -1051329, 32905, 1171239, 1867382, 2046704, 1656127, 1227111]
9850A227111r5183o47284j747120j028923J674336K840965N68328j946603j410394
9841e64767L77726J68323r89316k06866J492156R31551j278988j625940K98144
9832a397977J448033O69756o5102K22960L00539j53668J8540O23718K32080o88664
9822A210215k14771J279211J314830m11680j410423n58360M58266M49977K25503
9813B342768J24192p42796j962256j628907L30850J524334P84877k28289j02359
9804D42414L33885J48712j02416l5007l27284r19629n95178O67297J160152K08402
9794I81348p46101p20815n89924r39650q07328K86393J129000Q23528J75847P4107
9784c33595K17470K45920L61073K37699p31498j655029q77815R76831J277336
$$ y = [1227111, 1131928, 484644, -1262476, -2291399, -617063, 2223902, 2792230, 845627, -564767, -187041, -18718, -1008034, -1214900, 277256, 1208807, -70181, -1696121, -1397977, 50056, 719812, 654710, 877670, 1178209, 1024541, 1043081, 1666799, 1898879, 1210215, 995444, 2274655, 3589485, 3177805, 1767382, 1209022, 1667288, 2117265, 2342768, 2466960, 1724164, -238092, -1866999, -1536149, -11815, 773062, 544773, 442414, 776299, 925011, 822595, 787588, 460304, -459325, -1054503, -387206, 772946, 981348, 235247, -485568, -1075492, -2015142, -2822470, -2536077, -1407077, -583549, -407702, -333595, -116125, 129795, 490868, 728567, -2931, -1657960, -2535775, -1558944, -281608]
9775b81608n03168j693091o17350Q73430O57211m45958o37271r7205Q8160J15699
9765b541151N44146P39618J54793k25621M87666J317655J002321J08946j32270
9756A456103O0939j90558n55052j65833N83513N58458k74175q51700n33127L06736
9746C95304Q14286K88257j047110j679286l73767J669597J847651j62817j680720
9737G1395q97037N62977M07547q19755r29560M62240J638240J302984j52482j508773
9727A37776j745275o72467O80040R05367m1624q00228o21416j81695m434L45171
9717a998785Q78584P30894r7466l30396L33965M74834m79213j009405j91419N34568
9707a153839l8222o58286k1315O51975j39576j176531n22145R36960R58634q0384
$$ y = [-281608, -784776, -2477867, -3095217, -2221787, -1564576, -2010534, -2647805, -2745010, -2656850, -2541151, -1997005, -1257387, -1102594, -1328215, -840549, 477106, 1479427, 1588373, 1456103, 1517042, 1326484, 771432, 605599, 1189112, 1747570, 1473395, 621695, 88568, 395304, 1209590, 1497847, 450737, -1228549, -1602316, 67281, 1914932, 1752115, 71395, -825642, -262665, 144882, -674873, -1604433, -1142193, 496047, 1799031, 1646549, 137776, -1607499, -2279966, -1599926, -694559, -736183, -1536411, -2157827, -2339522, -2343956, -1998785, -1120201, -389307, -486773, -817169, -483204, -8370, -487583, -1496988, -1688407, -1153839, -1192061, -1850347, -1871662, -1219687, -1359263, -2535794, -3057939, -2120979, -1162345, -1242729]
9697a242729J44327J729876K191326M38318j660719k198500j406752l44965N46609
9688a803209R17370L08013p55425q98297J69244J034527N26485p01367j132669
9679b335328k41745J086809J608812R93653J86336K70839R19842P47000n18130
9670B718088j390043q67256K5543O0863j80601L32588R36121M10529o34179o39157
9660G72496K02002L03986n22579q35130j37270M09476J36718j98335p9670p9607
9650b7913m77359n90618j11795K34600m4145m77415o40368p33296p23037r9215
9640c690561R93690J491310Q68324n8795l09612P7220M47183L77554j77345q90053
9630h71085j058987l45248M73150L58942l99457m98028M35765J325738J249383
$$ y = [-1242729, -1098402, 631474, 2822800, 3261118, 1600399, -598101, -2004853, -2349818, -1803209, -885839, -577826, -1333251, -2231548, -2062304, -1027777, -501292, -1202659, -2335328, -2577073, -1490264, 118548, 1112201, 1298537, 1569376, 2489218, 3236218, 2718088, 1328045, 460789, 486332, 547195, 366594, 699182, 1635303, 2045832, 1411653, 772496, 974498, 1278484, 755905, -79225, -216495, 192981, 329699, 131364, 51694, -27913, -505272, -1095890, -1207685, -973085, -1017230, -1494645, -2135013, -2868309, -3591346, -3690561, -2696871, -1205561, -337237, -396032, -705644, -628424, -181241, 196313, 18968, -871085, -1930072, -2275320, -1802170, -1443228, -1842685, -2340713, -1904948, -579210, 670173]
9621F70173M65467l70952r32641r17423j24900Q34120R20922Q5253o21432n32745
9611e24158P598N71756J037797R72539k9263j177917j099898N7205O39391J4899
9601D69949n67455k32050K14719J02828J59288P33487O14212p57035j601920l88719
9591a252696J296340Q86025j076551j643037M8423J643133J246834j63552p94265
9582A90654n16419k26726k16462k65437l06864j61239M54956J059681O52258n56532
9572A07870r49236J36423J210259R01755N7734P5046L97484l22358j403533q68906
9562f57462J149525K137237Q22396j063568j534871r46577n87846l34180O06033
9553d09313J688450J584599K52564j052191j539643j372456p36101K22695P63869
$$ y = [670173, 1135640, 764688, -167953, -1085376, -1210276, -376156, 544766, 630019, 8587, -524158, -516560, 55196, 1092993, 2065532, 2036269, 858352, -241546, -184341, 455050, 469949, -97506, -329556, -114837, -12009, 147279, 880766, 1494978, 737943, -863977, -1252696, 43644, 929669, -146882, -1789919, -1741496, -98363, 1148471, 984919, 190654, -325765, -552491, -768953, -1034390, -1341254, -1502493, -1047537, 12144, 664402, 107870, -841366, -704943, 505316, 1407071, 1464805, 1539851, 1937335, 1614977, 211444, -657462, 492063, 2629300, 3451696, 2388128, 853257, -93320, -681166, -1015346, -409313, 1279137, 2863736, 3116300, 2064109, 524466, -847990, -1584091, -1361396, -597527]
9544e97527K69931m85329j95691Q34364R36073k75863j106191k91460J117699
9535B06006J365465L88762n05780o12394l52116k32061k50591k12363J5152M59754
9525B69834Q76850Q59212L82775j16683m05345o65560q58104n94589J6343K05890
9515b9377k69404n87831j38748M51448L41256j75202j98798M35570J136291J361387
9505B326592P90517o10613j970019j851198k03223R83934K52580j041369o83977
9496b006776R44765J480345L06728o70302k52898L68697M630n50014k18420L60091
9486b33154J17497m16891j06296O13679L45630q37100j283729k12498J143827
9477h69035J269690K49805o08447m32979M06644Q90128M70091l68900p21080m09686
$$ y = [-597527, -327596, -812925, -1008616, -174252, 761821, 485958, -620233, -911693, 206006, 1571471, 1960233, 1454453, 842059, 489943, 257882, 7291, -205072, -189920, 269834, 1146684, 2005896, 2388671, 2271988, 1866643, 1201083, 342979, -251610, -235267, -29377, -298781, -886612, -1025360, -573912, -232656, -407858, -606656, -171086, 965205, 2326592, 3117109, 2506496, 536477, -1314721, -1517944, -534010, -281430, -1322799, -2006776, -1062011, 418334, 725062, 54760, -198138, 170559, 175189, -374825, -593245, -233154, -115657, -532548, -638844, -25165, 320465, -516635, -1800364, -2012862, -869035, 400655, 650460, 42013, -390966, 15678, 905806, 1375897, 1006997, 285917, -123769]
9467a23769j45371l93150o73185l99919K05023O42999R45405J155773O87903o50766
9457A250943j540908n84447J307288J686160K5980j363371o72135Q26930Q49140
9448A785580n69344j515758j172386m82311j21841L54788J102650J305430N25409
9439A212217m15895n72723o2210M22709N55792L53205j01943m45001j88602M67511
9429A225060O34551l3590p88030r01624n91009l15022K3404M96045N78239J3339
9419C41363m55686j77953K10261k16733r80438p76264M58804J328110R18900j26175
9409E24189p16842n90229j74100J20795J71674J64047M26002Q63262P81411j37244
9399A432965j016070q29777k6308K1042q27948j146768j31489J081277J020221
$$ y = [-123769, -269140, -662290, -1335475, -1735394, -1530371, -887372, 58033, 1213806, 1901709, 1250943, -289965, -874412, 432876, 2119036, 2145016, 781645, 109510, 936440, 1785580, 1216236, -299522, -1471908, -1954219, -2076060, -1721272, -618622, 686808, 1212217, 796322, 223599, 161389, 584098, 1139890, 1493095, 1391152, 946151, 757549, 1225060, 1859611, 1826021, 1037991, 136367, -454642, -769664, -746260, -250215, 328024, 341363, -114323, -292276, -82015, -298748, -1279186, -2055450, -1596646, -268536, 650364, 524189, -192653, -782882, -956982, -836187, -664513, -500466, -74464, 788798, 1570209, 1432965, 416895, -412882, -439190, -418148, -1246096, -2392864, -2524353, -1443076, -422855]
9390d22855q6015p84815m08035K76876K93308l39540p63122l28108O79901J361873
9380e20532J197240N22528m9565l26220l80631j43074L40054N84873K28243l35784
9370A117132m92008l31418l88208o90763p84132n11064r6038L27054O26873M66868
9360g55704j01063l17313J56898M04012l43599j121876n41458Q16362J084587
9351g19154J1467p17931j90522O02184P34568O24185P32017O61294K52525N8182
9341B048815J04903k77971q70550n78664L46161J62277j357676k015043o41873
9332c079621Q15531N38563o3759R81967K323828J253542j492662k367249l49448
9323a439308J595244J036312p60614j368910n99225J95348N45537Q62017R76842
$$ y = [-422855, -508870, -1293685, -1701720, -1424844, -1131536, -1471076, -2234198, -2562306, -1882405, -520532, 676708, 1199236, 1149671, 823451, 442820, 299746, 639800, 1224673, 1452916, 1117132, 625124, 293706, -94502, -785265, -1569397, -2080461, -2176499, -1849445, -1222572, -755704, -856767, -1174080, -1017182, -613170, -956769, -2078645, -2620103, -1803741, -719154, -707687, -1425618, -1616140, -1013956, -279388, 344797, 1076814, 1738108, 1990633, 2048815, 2153718, 1875747, 1005197, 426533, 772694, 934971, -422705, -2437748, -3079621, -2264090, -1725527, -1789286, -807319, 1516509, 2770051, 1277389, -1089860, -1439308, 155936, 1192248, 431634, -937276, -1536501, -1341153, -795616, 66401, 1043243]
9314A043243L24798p63310j200737n65746M36907R63420Q79182N36458J63775
9305A817990k79099p85793j066255p68086M4432P69567P67281j9541r62770j260728
9295a743002o69070J84170M30689P0367J8955O57197R78099Q2394j029231n88849
9285a608281J130866J843674N25532j036361r31553J40431K55979o95950j104979
9276a480642l21249M52847J32937o75942o28377N36904J680337J596547L50829
9267A644191q55652j108786p09108m22307l40124j55737m0440k07904m4162R66227
9257a273802J756328Q37944j086426j659247l39723Q08666M92982N2346P24218
9248C13286J293456K90767j269079j442521l42842M67496N34637N13575M97045
$$ y = [1043243, 1368041, 604731, -596006, -1161752, -724845, 238575, 1117757, 1654215, 1817990, 1538891, 753098, -313157, -1081243, -1036811, -267244, 500037, 480496, -482274, -1743002, -2412072, -2227902, -1797213, -1726846, -1707891, -1050694, -72595, 9799, -1019432, -1608281, -477415, 1366259, 1891791, 855430, -76123, 64308, 320287, -375663, -1480642, -1801891, -1349044, -1216107, -1892049, -2520426, -1983522, -303185, 1293362, 1644191, 788539, -320247, -1029355, -1451662, -1791786, -1947523, -1987963, -2195867, -2240029, -1273802, 482526, 1320470, 234044, -1425203, -1764926, -956260, -463278, -410932, 313286, 1606742, 1897509, 628430, -814091, -1156933, -689437, -154800, 358775, 855820]
9239H55820K32228K17893P63027P58311p06049k257357j839423J49384J391514
9230d34652R59546M8229l69033n50905o41705k56885L48202L45165j99532l54319
9220a105889P2784L28665J48868M5632J47847O3484j06837J24918N73585O31286
9210I24343M25229N11197O55331K14064n22226o95355l49117k28782m04737m03068
9200A26879l37411n60982o39700q2628M50465J81997k11085K40970Q22513L21559
9190C12577n16833q4183J024811O70954j183531k170873j169509K84961P81630
9181b049996Q10548J006246Q62208J68674j63173L28323Q19475O31524M9185o69471
9171A793543j513638j757075o28272Q53505P87167n76404r94703J27807P88147
$$ y = [855820, 1088048, 1305941, 2068968, 2827279, 2121230, -136127, -1975550, -1826166, -434652, 524894, 573123, 204090, -346815, -988520, -1245405, -897203, -552038, -751570, -1105889, -1033105, -704440, -555572, -509940, -362093, -298609, -405446, -280528, 293057, 924343, 1349572, 1860769, 2516100, 2730164, 2207938, 1512583, 1163466, 934684, 529947, 126879, -210532, -771514, -1411214, -1493842, -1043377, -861380, -1072465, -831495, -8982, 312577, -204256, -288439, 736372, 1407326, 223795, -1947078, -3116587, -2831626, -2049996, -1239448, -233202, 629006, 797680, 634507, 962830, 1782305, 2413829, 2463014, 1793543, 279905, -1477170, -2105442, -1251937, -464770, -1041174, -2035877, -1908070, -1119923]
9162a119923j16914r28893j37508J191605J436776Q40897L03326m25200j604648
9153e60482k086902q47944J101268J876709J055178k47737q80035m45763N90139
9144d45569J082554L89607n15690l50653K77974j59056j155624p25769Q96013
9135g06213J136119n45665j399070N5262J418980M77187j064829n69633J203708
9126E846J688007O20363l10180n33273o13698l80363M02367N73355p32205j953013
9116a232794j152340P46890J308865L40670k95786O764J19469l24565m45965l6302
9106i65094K35437L97947R09836J078630j05240j737301j820458l44011O02287
9097a747967L601p93438l62840R55022J931931J809474N52939j044831j560434
$$ y = [-1119923, -1236837, -2165730, -2303238, -1111633, 325143, 1166040, 1469366, 1044166, -560482, -2647384, -3495328, -2394060, -517351, 537827, 290090, -589945, -1035708, -445569, 636985, 1026592, 510902, 160249, 438223, 279167, -876457, -1602226, -706213, 429906, -115759, -1514829, -1459567, -40587, 436600, -628229, -1197862, 5846, 1693853, 2314216, 2004036, 1470763, 857065, 476702, 879069, 1452424, 720219, -1232794, -2385134, -1638244, -329379, 11291, -284495, -277731, -158262, -482827, -928792, -965094, -729657, -331710, 578126, 1656756, 1551516, -185785, -2006243, -2350254, -1747967, -1744366, -2537804, -2900644, -1945622, -13691, 1795783, 2348722, 1303891, -256543]
9088b56543m74548P49896M90109n64723m57035Q44326J292565o1102j638672j612454
9078a688181j61982J104565R88721l18798j368553p36358J094647J811284K95355
9069A020700j426671r02750J040522J534520K9237j151353n98462M23219N05414
9060D74376L3430k19570l97177n33310k0342R44921J041907n6501q16527j78977
9050B72230P17021M14625n34932o01173K57558O79778O2181o84071n63940K16627
9040B35904O31534R7044q44310j128764m70767K68601L19531J01781L83395Q15676
9030D09625L96202p62650j327515o04071N18521Q33654K45069m06866l76759L24317
9020g50473Q83708L88214r67517j715250q51952O67703J106896K61545m96711
$$ y = [-256543, -731091, 18805, 508914, -55809, -512844, 331482, 1624047, 1562945, -75727, -1688181, -1850163, -745598, 243123, -75675, -1444228, -2180586, -1085939, 725345, 1020700, -405971, -1308721, -268199, 1266321, 1295558, 144205, -454257, -31038, 474376, 507806, 288236, -108941, -642251, -662593, 282328, 1324235, 1267734, 451207, 272230, 989251, 1403876, 868944, 267771, 525329, 1205107, 1267288, 583217, 19277, 235904, 867438, 964482, 120172, -1008592, -1479359, -1210758, -891227, -789446, -406051, 409625, 805827, 43177, -1284338, -1888409, -1369888, -536234, -291165, -698031, -1074790, -750473, 133235, 521449, -446068, -2161318, -3013270, -2345567, -1238671, -977126, -1473837]
9011a473837k66129M75931R34712Q12519N3714j106820j789582j240992k0458
9002c620942O03043M11572K84193N35181N15039L2670j56515K96582O44785K46384
8992b08008m52473o50668j99895N11516J067375J107497M32844o89007j603011
8983f83830j697841o99619R93057K061043J250082p93721j714453m05023J330222
8974c60083J309475J0441n75909j02046J54036k01578l23442L9310L29828N37167
8964H17199R01490O97343o78328j908069j292043L89712R99294N12325N51644
8955I90567R03875j13733j813676j444483J006514K149070N43139j063055n32732
8946F25486L82101j64069o38128O06072J728290N08813j444737j257299L47482
$$ y = [-1473837, -1739966, -1264035, -329323, 483196, 536910, -569910, -2359492, -3600484, -3620942, -3017899, -2606327, -2322134, -1786953, -1271914, -1239244, -1395759, -1099177, -454392, -208008, -660481, -1311149, -1511044, -999528, 67847, 1175344, 1608188, 919181, -683830, -2381671, -3081290, -2088233, -27190, 1222892, 429171, -1285282, -1690305, -360083, 949392, 959833, 383924, 281878, 435914, 234336, -89106, -49796, 280032, 817199, 1718689, 2416032, 1737704, -170365, -1462408, -1072696, -73402, 438923, 990567, 1894442, 1780709, -32967, -1477450, -470936, 1678134, 2221273, 1158218, 625486, 1007587, 843518, 205390, 811462, 2539752, 3048565, 1603828, 346529, 694011]
8937F94011M71990j002994j577384m59803O94285R55022R26466O66625l06294
8928A061924j138009n22274P28897O86983l60643m07327O05181O96828m13424
8919I38136p24404K67678M76157r03763j555480R9978J894522J138684j102086
8910E29422j591117L11505J971981J272015r40269k355790j768108J40031J684960
8901g45370J670442M95452k89759J27744P84995L33507j002125j706285j050870
8892a382269J5902K92760q4344n6232O82379J193886P09243j47858k68276J73991
8882A129182n1086j117041j521889l11930J179805J060163l42110r29224R9613
8873h04517J185191Q00304m12194p69365k5362L98998m03797j382805r06667P87921
$$ y = [694011, 1166001, 163007, -1414377, -1874180, -1179895, -224873, 701593, 1368218, 1061924, -76085, -598359, 130538, 817521, 456878, 49551, 654732, 1351560, 938136, 213732, 481410, 957567, 53804, -1501676, -1401698, 492824, 1631508, 529422, -1061695, -750190, 1221791, 2493806, 1553537, -802253, -2570361, -2430330, -745370, 925072, 1420524, 1130765, 1258509, 2043504, 2377011, 1374886, -331399, -1382269, -1366367, -1073607, -1157951, -1214183, -531804, 662082, 1371325, 1223467, 955191, 1129182, 1078096, -38945, -1560834, -1872764, -692959, 367204, 25094, -904130, -804517, 380674, 1180978, 768784, -581, -25943, 373055, -30742, -1413547, -2320214, -1532293]
8863a532293J581883L71510j068616m46341J460660J631090o16970k269654j000840
8854a889571J339831J613032l8377j079640p96043n99543o95798K74633K005339
8845A33863K128607M6593j667761j137222O4223j62486r91492m66870R13592J042684
8835i6269k60987j095327n46196L28850O16935O47823O90561L18746m20305o80465
8825d96634k40111J6249l60174n41042J35568R08218P00716k30186o95709k09108
8815a012213N90397R08104N26386k76661r93015j163623p97398l95277k78456
8806b891756j70088K21130N97662N73267M13147N91205Q66104O15977j6334k47603
8796E52711j4080j81000j015001j473006p43589L55135N22550n6793q0054P58191
$$ y = [-1532293, 49590, 421100, -647516, -1093857, 366803, 1997893, 1380923, -888731, -1889571, -549740, 1063292, 1024915, -54725, -850768, -1450311, -2146109, -1871476, 133863, 2262470, 2309063, 641302, -495920, -431697, -594183, -1585675, -2052545, -1138953, -96269, -357256, -1452583, -1998779, -1669929, -1052994, -405171, 285390, 604136, 183831, -496634, -736745, -720496, -1080670, -1621712, -1486144, -577926, 122790, -107396, -803105, -1012213, -421816, 486288, 1012674, 736013, -257002, -1420625, -2218023, -2613300, -2891756, -3061844, -2840714, -2243052, -1669785, -1256638, -665433, 200671, 816648, 800314, 552711, 538631, 357631, -657370, -2130376, -2873965, -2518830, -1996280, -2053073, -2133127, -1374936]
8786a374936J263193N74449n34752p18918K13859J153876R56868m23861j848625
8777g38847j984644o86001P21447R61873L71044K28138P65181R35887K65230l20974
8767E18334m4046M70958L15406k04986j89234L29013N07850Q2377k87571m9377
8757A448724M65831L87229p36231k162212k295859m89343J607070J676257r0973
8748a89507j013091K39682J658826J083074m73891p84050j95877o82722j939381
8739b296937j635800M22749J648676R35150M09188J477149K097553K86161k070433
8730A273456j845247M28588J459832K76246p88824k25608N83356K22408m70410
8721I13797l51608j19292p93064j573771j109489J15812N92345L56448P17189
$$ y = [-1374936, -111743, 462706, -72046, -790964, -577105, 576771, 1533639, 1109778, -738847, -2723491, -3409492, -2688045, -1726172, -1355128, -1126990, -361809, 574078, 839308, 518334, 474288, 945246, 1260652, 1055666, 866432, 1195445, 1703295, 1785672, 1498101, 1448724, 1914555, 2301784, 1565553, -596659, -2892518, -3381861, -1774791, -98534, -189507, -1202598, -962916, 695910, 1778984, 1305093, 521043, 325166, -357556, -2296937, -3932737, -3509988, -1861312, -926162, -516974, 960175, 3057728, 3343889, 1273456, -571791, -143203, 1316629, 1592875, 804051, 578443, 1161799, 1384207, 913797, 562189, 442897, -350167, -1923938, -3033427, -2917615, -2325270, -1968822, -1251633]
8712a251633J599082J330408m25970j566472n50921J076794Q51603r21817j633526
8703a492452k58779J247540R44399m22676q07394K42380J369561J472652P36180
8694C031411j83627r01875j156788p64742M2147P21446R50686P33778J56734n28223
8684B100947q30454n75414k70594l40351l64396J64140P22485M24931m38690p13006
8674a20402j75619K21469Q419k24181j61221k76351n50545j41360R51828J353059
8664H85096M22875m90920j45138N78912K71310n56889m53821M03459O31092Q9097
8654A635073j77532j51320p86821j737208j451451M6582P51970j78616j041734
8645c091057m10271P08485Q94729N85956O85842O50274j15594n05627M31014J227822
$$ y = [-1251633, 347449, 1677857, 1251887, -314585, -865506, 211288, 1062891, 141074, -1492452, -1751231, -503691, 440708, 18032, -789362, -546982, 822579, 2295231, 3031411, 2847784, 1945909, 789121, 24379, 66526, 787972, 1738658, 2472436, 2629170, 2100947, 1270493, 695079, 424485, 84134, -280262, -116122, 606363, 1031294, 592604, -120402, -296021, -74552, -66133, -290314, -451535, -727886, -1278431, -1419791, -467963, 885096, 1307971, 817051, 671913, 1250825, 1522135, 965246, 511425, 914884, 1545976, 1635073, 1457541, 1306221, 519400, -1217808, -2669259, -2622677, -1870707, -2049323, -3091057, -3501328, -2792843, -1898114, -1312158, -626316, 23958, -91636, -597263, -166249, 1061573]
8635A061573J45657j475976r75097J077116J396563p23305k047232m20299J960129
8626h71K128494O16642k21334j64243o34159j453141j028205M98834R56088n28574
8616A69531j983833j273927J054428K547381J718339n57945k184674j998315q27635
8607c336650k84632n52218k06588J317430K298327J043928j269882j879633k38621
8598c108539J350600J080488j85757o69987o3690P15714R99539O99963q431o05205
8588B04695n09559J3768j1269p49168j051198j19301J168038J397199M65009n00459
8578C07755o27639m3332N59557O07485J48936j23936K56019O78140K16065p85052
8568A193998r89928j44168M64277J34172r9497O20150J264228M88411j078957
$$ y = [1061573, 1207230, -268746, -1243843, -166727, 1229836, 506531, -1540701, -1961000, -871, 2127623, 2744265, 2522931, 2358688, 1724529, 271388, -756817, -257983, 698105, 169531, -1814302, -3088229, -2033801, 513580, 2231919, 1673974, -510700, -2509015, -3336650, -3621282, -4173500, -4380088, -3062658, -764331, 279597, -990285, -2869918, -3108539, -1757939, -677451, -863208, -1533195, -1596885, -881171, 118368, 818331, 809900, 204695, -304864, -291096, -302365, -1051533, -2102731, -2222032, -1053994, 343205, 808214, 307755, -319884, -363216, 196341, 803826, 952762, 828826, 1084845, 1762985, 1979050, 1193998, 204070, 59902, 524179, 658351, 558854, 1179004, 2443232, 2931643, 1852686]
8559A852686j668595r26631j43698j77527n21217m85903j75143k669L8220L24224
8549a886253J051646J735585J383769k55641j725752j260406O32207J439947J26499
8540A241601j313413q96085M60610P86574K91792N02536J173449O08963j263202
8531A592825k535157k127068q93937K07364J083541J444156P69733k67942k22245
8522i48730Q24901J163213J45189q37631o74676k9349K31610L46990N22829J67938
8512I12284p16697r28578P2417J083414R85858L08697l5968j73654l61137j19127
8502A027509N36496M61320o89642j362930m38228P76538N96914l55738m93318
8493E8921o6444l67447j034574o24688N90989Q82967K3077l96491K00285N23732
$$ y = [1852686, 184091, -742540, -886238, -1063765, -1584982, -2070885, -2246028, -2248697, -2210477, -1886253, -834607, 900978, 2284747, 2029106, 303354, -957052, -324845, 1115102, 1241601, -71812, -967897, -507287, 279287, 571079, 1073615, 2247064, 2856027, 1592825, -942332, -3069400, -3963337, -3755973, -2672432, -1228276, -458543, -726485, -948730, -123829, 1039384, 1184573, 346942, -327734, -357083, -125473, 221517, 744346, 912284, 195587, -732991, -660574, 422840, 1408698, 1717395, 1681427, 1507773, 1146636, 1027509, 1564005, 2025325, 1335683, -27247, -465475, 311063, 907977, 552239, 58921, -7523, -374970, -1409544, -2034232, -1443243, -560276, -537199, -933690, -733405, -209673]
8483b09673q1867m59231J71217P05875k7923j362295j823312j063216J50399J014400
8473b985626J046567K30915n66587k26916R98505J492470N35683n61736m57108
8464d93833K38714J79134m53922m18787L68424P01205J41668k74477K20051Q81741
8454A089918O37522l09123q52767n41294K134J00096j81886m03454m43702m78408
8444a380964m74706j49206M72859Q16019M07249l73946o12033M823P40761P54583
8434B05439J87906j23598P5049O6038o68779j403476j022147K14808P17144k08238
8424a959854j088768k14357J744324K428507J078723l90956j89420Q72956Q47747
8415C128902m00581j222782p75657n2438j52240p64246q81909k21163N86981P62017
$$ y = [-209673, -291540, -750771, -579554, 126321, 98398, -1263897, -3087209, -4150425, -4000026, -2985626, -1939059, -1708144, -2274731, -2501647, -1503142, -10672, 525011, -36725, -493833, -255119, -75985, -529907, -948694, -580270, 120935, 262603, -11874, 208177, 1089918, 1727440, 1418317, 565550, 24256, 26390, 126486, -55400, -458854, -902556, -1380964, -1855670, -2004876, -1532017, -715998, -308749, -682695, -1294728, -1289905, -549144, 205439, 393345, 269747, 344796, 410834, -257945, -1661421, -2683568, -2468760, -1751616, -1959854, -3048622, -3262979, -1518655, 909852, 1988575, 1597619, 1408199, 2281155, 3128902, 2728321, 1505539, 729882, 677444, 525204, -239042, -1120951, -1342114, -755133, 6884]
8405F884N2216r71125j231545k64143R69850J044687n1605p67632r117J439640
8395B18110J992596J138332l26057j406263j569656o89285Q09439J793076J228727
8386C189019n41842j871799j579619l23932L00570j40635m81171J59401R09764
8377c80244M61334o91388p64212M48974R01648n84961k073147j119591J352560
8368b449027K078298J73939j606172r93065O99001J005493j6197n54731k66049
8359a928510l37693p63513o9518J762328K363493L06569k223203j956087R33456
8350a912678K809800J342386j435989j926064K75755K087520J273404p30202j211694
8341E72238j9852P11369J06172l03680N69898J348781L79638j433922j847751
$$ y = [6884, 59100, -912025, -2143570, -2407713, -1437863, -393176, -444781, -1212413, -1221530, 218110, 2210706, 3349038, 3022981, 1616718, 47062, -642223, 167216, 1960292, 3189019, 2647177, 775378, -804241, -1128173, -827603, -968238, -1449409, -1290008, -380244, 81090, -610298, -1374510, -925536, -23888, -608849, -2681996, -3801587, -2449027, -370729, -196790, -1802962, -2796027, -2097026, -1091533, -1107730, -1662461, -1928510, -2266203, -3029716, -3099234, -1336906, 1026587, 1333156, -890047, -2846134, -1912678, 897122, 2239508, 803519, -1122545, -846790, 1240730, 2514134, 1783932, 572238, 552386, 1263755, 1369927, 1066247, 1636145, 2984926, 3364564, 1930642, 82891]
8332H2891o36833K96885R9988J14483J181130J767125K78686k044587k445049
8323a305281m12847J664606J755647M88905l82460m60938n76599j014967j155686
8314a399620o72613j7353L97811O50082P33715L21244n06996r40573m11547N24796
8304a321054Q74118N19002K47276N41780R15596N98948m52662j394535j244145
8295g15676J07691J510870J480541j45049j763548j732216k95503Q47511P20709
8286A5330j9076l63758j76690J92143N93704Q03601L45564o54152j087443k61452
8276f12229Q05554N84661o76429j093524K22069J814670J773552J41241j365212
8267A594353j535239o99612K04190P04713P82374N22138J93454K06141N29114
$$ y = [82891, -553942, -257057, -157069, -42586, 1138544, 2905669, 3184355, 1139768, -1305281, -1718128, -53522, 1702125, 2191030, 1808570, 1347632, 771033, -243934, -1399620, -2072233, -2089586, -1691775, -1041693, -307978, 13266, -493730, -1434303, -1845850, -1321054, -446936, 72066, 319342, 861122, 1776718, 2375666, 1923004, 528469, -715676, -607985, 902885, 2383426, 2238377, 474829, -1257387, -1552890, -705379, 15330, -3746, -367504, -544194, -352051, 241653, 1045254, 1390818, 736666, -350777, -612229, 193325, 777986, 101557, -991967, -769898, 1044772, 2818324, 2959565, 1594353, 59114, -640498, -436308, 268405, 1050779, 1572917, 1766371, 1972512, 2501626]
8258B501626N08862j98616q29827m25485N60886N88249p12935j688508r01503
8249e97251O76363R92406j13842q68213m29868j8211o20871j261778o98784M39083
8239b500966O78796M3571j92610L37571P20789M64597J61656K65954L94150J61851
8229E35359k36931n64731q25558q26757k92459M21140N93026K91806L44519R38741
8219C78155J235718O96556j71036p48947j001222q58245n2442Q62733N58747j105725
8209b05708k268715j367560N96985J395332N77977k36316J48020J035973J040530
8200G16518j63693j565605j851566o85580Q22568J226401M84122o3158K92568
8191g87425O88545L79701O3562L82479L94542p82939j849438r68314J067970J688961
$$ y = [2501626, 3010488, 2811872, 1982045, 1556560, 2117446, 2705695, 1992760, 304252, -597251, 79112, 1071518, 957676, 89463, -340405, -358616, -979487, -2241265, -2940049, -2500966, -1822170, -1778599, -1971209, -1633638, -912849, -448252, -286596, -20642, 373508, 535359, 298428, -266303, -1091861, -1918618, -2211077, -1789937, -1196911, -905105, -560586, 378155, 1613873, 2310429, 2139393, 1390446, 389224, -469021, -521463, 341270, 900017, -205708, -2474423, -3841983, -3244998, -1849666, -1271689, -1508005, -1359985, -324012, 716518, 552825, -1012780, -2864346, -3549926, -2727358, -1500957, -1016835, -1079993, -787425, -98880, 280821, 344383, 726862, 1121404, 338465, -1510973, -2479287, -1411317, 277644]
8181B77644M17447o01720k52114k4915j001915j704894n86257J200420J460386
8172h15918J82223p78983n15253J34682K36926j71815n19371k57298P47628J748762
8162h417J639761N13972k34535n7696j79462j287103j861896n84888R82453N02036
8152e75775j273276j500352K10451J224954K28929q03190q0358J176334J044714
8143c47569j6090l36932K02949N57501N76850P77727Q30793J35663o18573k69711
8133A492608P33824P90087l90466j379351j184156l57606K20173L26028n0238
8124B00903q37763j302460n82924Q81931J669934J377636R69057Q47363K23324
8115C447001r71177j333755k69310O57670J39960o34648n1585R59012M15865j123387
$$ y = [277644, 695091, 93371, -158743, -183658, -1185573, -2890467, -3476724, -2276304, -815918, -633695, -1412678, -1927931, -1793249, -1556323, -1728138, -2247509, -2504807, -1757179, -8417, 1631344, 2145316, 1910781, 1853085, 1673623, 386520, -1475376, -2060264, -1077811, -575775, -1849051, -3349403, -3138952, -1913998, -1685069, -2488259, -2568617, -1392283, -347569, -363659, -700591, -497642, 59859, 636709, 1414436, 2245229, 2380892, 1762319, 1492608, 2226432, 3016519, 2626053, 1246702, 62546, -295060, -74887, 251141, 200903, -636860, -1939320, -2522244, -1640313, 29621, 1407257, 2376314, 3223677, 3447001, 2475824, 1142069, 872759, 1530429, 1670389, 1035741, 984156, 1943168, 2359033, 1235646]
8105A235646j260833J73247P26134n06209j282490o0069J264704M47716j407809
8096f69963j686056l14140O26106M47505L67041Q23422Q50908K49717N5465M61622
8086A211627L97615l12984m40723L29095O18365j88581p26894q0365N04987j52960
8076A159182r95397n85315L60771L58211j52873K30985J101348Q52317l90431
8067A938798r01048l18874o7772n84737n40967N29201J119292L40830m10768J89701
8057A293656J055172M30044j202148j812576q20235L24923L71797l72376r88366
8048a720109j048296n25342M27632J226540J117746J66027n18753q5028Q00421
8039a59162O46257q15495j938879j113832R85945K079177J235189m3458k25993
$$ y = [1235646, -25187, 148060, 874194, 367985, -914505, -974574, 290130, 737846, -669963, -2356019, -2670159, -2044053, -1596548, -1229507, -406085, 444823, 694540, 750005, 1211627, 1609242, 1296258, 855535, 1184630, 1802995, 1614414, 887520, 807155, 1312142, 1159182, 163785, -421530, -60759, 297452, 144579, 375564, 1476912, 2329229, 1938798, 1037750, 718876, 651104, 66367, -474600, 54601, 1173893, 1514723, 1103955, 1293656, 2348828, 2778872, 1576724, -235852, -1056087, -731164, -359367, -731743, -1720109, -2768405, -3293747, -2866115, -1639575, -521829, -355802, -874555, -959583, -159162, 487095, -328400, -2267279, -3381111, -2395166, -315989, 919200, 875742, 649749]
8030F49749Q7069l83124j106128n71565R04250J320676Q6252j055812p77896K7584
8020h18945J13407j53476O1554L56895K0590l70106J85144J303217J691812J002580
8010C392672r181p93186j318812j394370p86190J25116O75606P19105M68233J5672
8000A094665l09535J57358J236031J440364p5066j845408j852917l82434N75729
7991C8787M24795N03765J405648J755753M43348j465265k102400j141743J49152
7982A1840N88441J03097n20634m35373M32287J179878R30572j7183o15726n36307
7972A120892m24464o79524q56579n03258J25512M33608R1698o94689j084019j75660
7962b646483J578675K181413N32948j523845j329440P27040J621758J82054j264512
$$ y = [649749, 736818, 353694, -752434, -1323999, -419749, 900927, 987179, -68633, -846529, -818945, -705538, -859014, -797460, -440565, -419975, -790081, -604937, 698280, 2390092, 3392672, 3383491, 2590305, 1271493, -122877, -909067, -783951, -108345, 610760, 1078993, 1094665, 785130, 942488, 2178519, 3618883, 3543817, 1698409, -154508, -536942, 38787, 463582, 967347, 2372995, 4128748, 4572096, 3106831, 1004431, -137312, 11840, 600281, 703378, 182744, -252629, 179658, 1359536, 2290108, 2272925, 1657199, 1120892, 696428, 16904, -839675, -1342933, -1217421, -783813, -692115, -1386804, -2470823, -2646483, -1067808, 1113605, 1646553, 122708, -1206732, -479692, 1142066, 1324120, 59608]
7953E9608o75330O10458K91027j186224j560456l83979N81062K99955k47335K1572
7943b189642P00863Q30914L75660O1052K18059L41428j91552j140718j433219
7934b427155m97398P34461R10481J77757j00798L83832L57161p72965j667454
7925b902078j085884J91803P50862O73349Q22136J007947N27991k11204k94885
7916e19963L8158k6444j84791L59177J060241P45111j54468j38167O96542P02244
7906B577640m29271j061385l90666L63249L16286L25328R54831J068804j13761
7897C611055j304056j118187l06636k75780o56613k90032L46041j37462j364956
7888a496626j418188J77818J584088J257720m2440n71227J02038Q84576P23661
$$ y = [59608, -615722, -5264, 285763, -900461, -2460917, -2844896, -2263834, -1963879, -2211214, -2189642, -1488779, -657865, -282205, -221153, -3094, 338334, 146782, -993936, -2427155, -2924553, -2190092, -1279611, -1101854, -1202652, -818820, -461659, -1234624, -2902078, -3987962, -3796159, -3045297, -2371948, -1549812, -541865, -13874, -225078, -519963, -481805, -508249, -693040, -333863, 726378, 1471489, 1317021, 1178854, 1875396, 2577640, 2148369, 1086984, 696318, 1059567, 1375853, 1701181, 2656012, 3724816, 3611055, 2306999, 1188812, 882176, 606396, -50217, -340249, 5792, -131670, -1496626, -2914814, -2736996, -1152908, 104812, 62372, -508855, -406817, 477759, 1201420]
7879A201420k45057r98531q00244K2694N96047O49345O19107O10681J58423o38061
7869A175824p95387N636N54773j85645j378821j525161o51012P5769L30097P05208
7859a688719J181087J125906O80354N59464N23264l00022j485526j517783l09395
7850a231370L31250m98308j265596m03567J220021J647456O30658l81853m80866
7841d32175j83589k78254p72974j001930l09624J134463K016826J076164j036947
7832B11960k040352p85661J208203J785423P64829m55524r69641q17736j35848
7823a234347P74218J043038K28337p16506p25106l08000m94399p08345L39534
7814a801576J900830J653928o56191k310470j395590M58182O20657p79214j490987
$$ y = [1201420, 956363, -42168, -842412, -819718, -223671, 425674, 1044781, 1655462, 1813885, 1175824, 380437, 386073, 940846, 755201, -623620, -2148781, -2799793, -2724024, -2393927, -1688719, -507632, 618274, 1298628, 1858092, 2381356, 2081334, 595808, -921975, -1231370, -900120, -1398428, -2664024, -3067591, -1847570, -200114, 430544, 48691, -432175, -615764, -894018, -1666992, -2668922, -2978546, -1844083, 172743, 1248907, 211960, -1828392, -2614053, -1405850, 379573, 1144402, 688878, -280763, -1098499, -1234347, -460129, 582909, 811246, 94740, -630366, -938366, -1432765, -2141110, -1801576, 99254, 1753182, 1096991, -1213479, -2609069, -2150887, -1530230, -2309444, -3800431]
7805c800431n98229O56911J204796J407999J682904J436631J99869j172390j439900
7796d21840p03710k50552o52846q83080J59461J792853K152483O59573j088804
7787G63538j382750m93070J18111m9958l48423m90540q13520j068901m23474J004222
7777c184765J924133J658559R30284M00653k21381r43255q47366K61496R46448
7768I24806K30611o17275m851J301094J312310o4126j117786j180421j193818
7759d09456j431795r26497L45574Q58604J4491o74214j4374R60592Q73225K49663
7749a54187K41182M00888l10780j218981q04545N57415R62948J05310k05056Q25693
7739C99887J474827K67211j545276j851062p63806k7845j05871J49524J067827
$$ y = [-3800431, -4398660, -3741749, -2536953, -1128954, 553950, 1990581, 2190450, 1018060, -421840, -1125550, -1376102, -2028948, -2912028, -2752567, -959714, 1192769, 1852342, 763538, -619212, -1112282, -994171, -1044129, -1392552, -1883092, -2696612, -3765513, -4188987, -3184765, -1260632, 397927, 1328211, 1728864, 1507483, 564228, -283138, -21642, 924806, 1155417, 538142, 533291, 1834385, 3146695, 3082569, 1964783, 784362, -409456, -1841251, -2767748, -2422174, -1563570, -1549079, -2223293, -2237667, -1277075, -403850, -154187, 86995, 487883, 177103, -1041878, -1846423, -1289008, -326060, -220750, -425806, 399887, 1874714, 2141925, 596649, -1254413, -2018219, -2046064, -2151935, -2002411, -934584]
7730i34584J376584L62711p86430p22631J44869N47585L31486L07584O26587O17088
7720A870849J44235j22981j348j83685q71447j097169k18103P65539M84939o83025
7710H7804j024175L2411J081327P92502k59196o14549q5792J68458m49987j055027
7700a326224o21239M85302R89153M19806l67519m65586q8607m7545m21754m30714
7690a874927K92053R34219N16283o30752j075139r1836J319133J649369P54552
7681A792955j22963j30795J61353j33350p44557o66682K00279P63114K65116p03018
$$ y = [-934584, 442000, 804711, 18281, -704350, -559481, -11896, 319590, 627174, 1253761, 1870849, 2015084, 1892103, 1890755, 1707070, 835623, -261546, -479649, 285890, 770829, 87804, -936371, -903960, 177367, 969869, 710673, 96124, 10332, 178790, -271197, -1326224, -1947463, -1462161, -473008, -53202, -420721, -886307, -974914, -1022459, -1444213, -1874927, -1582874, -648655, -132372, -763124, -1838263, -1930099, -610966, 1038403, 1792955, 1669992, 1539197, 1700550, 1567200, 822643, 155961, 356240, 1119354, 1384470, 681452]
$$ [...]
##END NTUPLES=NMR SPECTRUM
##END=
