##TITLE=31Pdec_SR55oil(CDCl3)
 d2o, 124 sc
 29.04.2021
##JCAMPDX= 6.0         $$ Bruker NMR JCAMP-DX V2.0
##DATA TYPE= NMR SPECTRUM
##DATA CLASS= NTUPLES
##ORIGIN= UXNMR, Bruker Analytische Messtechnik GmbH
##OWNER= root
$$ XWIN-NMR		Version 3.5
$$ Thu Apr 29 16:12:20 2021 Russian Standard Time (UT+4h)  she@DPX200
##.OBSERVE FREQUENCY= 81.013821
##.OBSERVE NUCLEUS= ^31P
##.ACQUISITION MODE= SIMULTANEOUS
##.ACQUISITION SCHEME= undefined
##.AVERAGES= 124
##.DIGITISER RES= 16
##SPECTROMETER/DATA SYSTEM= spect
##.PULSE SEQUENCE= zgpg30
##.SOLVENT NAME= CDCl3
##.SHIFT REFERENCE= (INTERNAL, CDCl3, 0, 248.564)
##AUDIT TRAIL= $$ (NUMBER, WHEN, WHO, WHERE, WHAT)
$$ ##TITLE= Audit trail, XWIN-NMR		Version 3.5
$$ ##JCAMPDX= 5.01
$$ ##ORIGIN= Bruker BioSpin GmbH
$$ ##OWNER= she
$$ F:/spectra/data/she/nmr/P31/1/pdata/1/auditp.txt
$$ ##AUDIT TRAIL=  $$ (NUMBER, WHEN, WHO, WHERE, WHAT)
(   1,<2021-04-29 16:11:10.29 +0400>,<she>,<DPX200>,
      <continue with go, POWCHK disabled, PULCHK disabled
       configuration hash MD5:
       00 E9 B6 7A A2 85 ED C7 34 08 36 98 17 FE 4E 26
       data hash MD5: 32K
       3A B9 87 A5 46 C9 09 DD 1A 02 3D 6B AC E4 90 A2>)
(   2,<2021-04-29 16:11:11.95 +0400>,<she>,<DPX200>,
      <Start of raw data processing
       efp BC_mod = 2 LB = 1 FT_mod = 6 PKNL = 1 PHC0 = -6217.499 PHC1 = -17.19908 SI = 64K 
       data hash MD5: 64K
       60 85 6E F5 56 C5 CE 17 8D 83 25 E3 E4 F4 4F C3>)
(   3,<2021-04-29 16:11:31.89 +0400>,<she>,<DPX200>,
      <pk PHC0 = 45.37511 PHC1 = -72.59998 
       data hash MD5: 64K
       1C 20 4A 7D A7 22 45 E9 20 80 63 54 6A 55 B1 4C>)
(   4,<2021-04-29 16:11:35.62 +0400>,<she>,<DPX200>,
      <abs ABSG = 5 
       data hash MD5: 64K
       64 CD C7 FC 20 08 A6 56 22 E1 46 79 CD 68 2F B7>)
$$ ##END=
$$ 
$$ hash MD5
$$ F1 1D DF 58 13 C9 F5 30 4A 14 CD F3 9E 32 A7 C7
##$RELAX= 
##$RELAX= 
##$RELAX= 
##$RELAX= 
##$RELAX= 
##$RELAX= 
##$RELAX= 
##$RELAX= 
$$ Bruker specific parameters
$$ --------------------------
##$DU= <F:/spectra>
##$EXPNO= 1
##$NAME= <P31>
##$PROCNO= 1
##$TYPE= <nmr>
##$USER= <she>
##$AMP= (0..31)
100 100 100 100 100 100 100 100 100 100 100 100 100 100 100 100 100 100 
100 100 100 100 100 100 100 100 100 100 100 100 100 100 
##$AQSEQ= 0
##$AQ_mod= 1
##$AUNM= <au_zg>
##$AUTOPOS= <>
##$BF1= 81.014009
##$BF2= 200.13
##$BF3= 200.13
##$BF4= 200.13
##$BF5= 200.13
##$BF6= 200.13
##$BF7= 200.13
##$BF8= 200.13
##$BYTORDA= 1
##$CFDGTYP= 0
##$CFRGTYP= 5
##$CHEMSTR= <none>
##$CNST= (0..31)
1 1 145 1 1 1 1 1 1 1 1 1 1 1 1 1 1 1 1 1 1 1 1 1 1 1 1 1 1 1 1 1 
##$CPDPRG= <waltz16>
##$CPDPRG1= <>
##$CPDPRG2= <waltz16>
##$CPDPRG3= <>
##$CPDPRG4= <mlev>
##$CPDPRG5= <mlev>
##$CPDPRG6= <mlev>
##$CPDPRG7= <mlev>
##$CPDPRG8= <mlev>
##$CPDPRGB= <>
##$CPDPRGT= <>
##$D= (0..31)
0 1 0 0 0 0 0 0 0 0 0 0.03 2e-05 3e-06 0 0 0 0 0 0 0 0 0 0 0 0 0 0 0 0 
0 0 
##$DATE= 1619698102
##$DBL= (0..7)
120 120 120 11 120 120 24 19 
##$DBP= (0..7)
150 150 150 150 150 150 150 150 
##$DBP07= 0
##$DBPNAM0= <>
##$DBPNAM1= <>
$$ [...]
##$SUBNAM3= <"">
##$SUBNAM4= <"">
##$SUBNAM5= <"">
##$SUBNAM6= <"">
##$SUBNAM7= <"">
##$SUBNAM8= <"">
##$SUBNAM9= <"">
##$SW= 501.771253377433
##$SWIBOX= (0..15)
0 1 3 0 0 0 0 0 0 0 0 0 0 0 0 0 
##$SW_h= 40650.406504065
##$TD= 32768
##$TD0= 1
##$TE= 0
##$TE2= 300
##$TE3= 300
##$TEG= 300
##$TL= (0..7)
0 120 53 12 22 120 120 120 
##$TP= (0..7)
150 150 150 150 150 150 150 150 
##$TP07= 0
##$TPNAME0= <>
##$TPNAME1= <>
##$TPNAME2= <>
##$TPNAME3= <>
##$TPNAME4= <>
##$TPNAME5= <>
##$TPNAME6= <>
##$TPNAME7= <>
##$TPOAL= (0..7)
0.5 0.5 0.5 0.5 0.5 0.5 0.5 0.5 
##$TPOFFS= (0..7)
0 0 0 0 0 0 0 0 
##$TUNHIN= 0
##$TUNHOUT= 0
##$TUNXOUT= 0
##$USERA1= <user>
##$USERA2= <user>
##$USERA3= <user>
##$USERA4= <user>
##$USERA5= <user>
##$V9= 5
##$VALIST= <valist>
##$VCLIST= <CCCCCCCCCCCCCCC>
##$VD= 0
##$VDLIST= <DDDDDDDDDDDDDDD>
##$VPLIST= <PPPPPPPPPPPPPPP>
##$VTLIST= <TTTTTTTTTTTTTTT>
##$WBST= 1024
##$WBSW= 4
##$XGAIN= (0..3)
0 0 0 0 
##$XL= 0
##$YL= 0
##$YMAX_a= 12591
##$YMIN_a= -16140
##$ZGOPTNS= <>
##$ZL1= 120
##$ZL2= 120
##$ZL3= 120
##$ZL4= 120
##$ABSF1= 248.5645
##$ABSF2= -253.2056
##$ABSG= 5
##$ABSL= 3
##$ALPHA= 0
##$AQORDER= 0
##$ASSFAC= 0
##$ASSFACI= 0
##$ASSFACX= 0
##$ASSWID= 0
##$AUNMP= <proc_1d>
##$AZFE= 0.1
##$AZFW= 0.5
##$BCFW= 0
##$BC_mod= 2
##$BYTORDP= 0
##$COROFFS= 0
##$CY= -3
##$DATMOD= 1
##$DC= 0
##$DFILT= <>
##$DTYPP= 0
##$F1P= 0
##$F2P= 0
##$FCOR= 1
##$FTSIZE= 65536
##$FT_mod= 6
##$GAMMA= 0
##$GB= 0
##$INTBC= 1
##$INTSCL= 5.30512e-09
##$ISEN= 30
##$LB= 1
##$LEV0= 0
##$LPBIN= 0
##$MAXI= 10000
##$MC2= 0
##$MEAN= 0
##$ME_mod= 0
##$MI= 50
##$NCOEF= 0
##$NC_proc= -7
##$NLEV= 6
##$NOISF1= 182.463
##$NOISF2= 159.3651
##$NSP= 0
##$NTH_PI= 0
##$NZP= 0
##$OFFSET= 248.5645
##$PC= 4
##$PHC0= -6172.124
##$PHC1= -89.79906
##$PH_mod= 1
##$PKNL= yes
##$PPARMOD= 0
##$PSCAL= 0
##$PSIGN= 0
##$REVERSE= no
##$SF= 81.014009
##$SI= 65536
##$SIGF1= 159.3651
##$SIGF2= -187.1042
##$SINO= 113.3802
##$SIOLD= 16384
##$SREGLST= <1H.CDCl3>
##$SSB= 0
##$STSI= 65536
##$STSR= 0
##$SW_p= 40650.406504065
##$SYMM= 0
##$S_DEV= 0
##$TDeff= 32768
##$TDoff= 0
##$TI= <>
##$TILT= no
##$TM1= 0
##$TM2= 0
##$TOPLEV= 0
##$USERP1= <user>
##$USERP2= <user>
##$USERP3= <user>
##$USERP4= <user>
##$USERP5= <user>
##$WDW= 1
##$XDIM= 65536
##$YMAX_p= 441067078
##$YMIN_p= -227553157
$$ End of Bruker specific parameters
$$ ---------------------------------
##NTUPLES= NMR SPECTRUM
##VAR_NAME=  FREQUENCY,     SPECTRUM/REAL,   SPECTRUM/IMAG
##SYMBOL=    X,             R,               I
##VAR_TYPE=  INDEPENDENT,   DEPENDENT,       DEPENDENT
##VAR_FORM=  AFFN,          ASDF,            ASDF
##VAR_DIM=   65536,         65536,           65536
##UNITS=     HZ,            ARBITRARY UNITS, ARBITRARY UNITS
##FACTOR=    0.620285442955139, 1,           1
##FIRST=     20137.2065510759, 0,            0
##LAST=      -20513.1999529892, 0,           0
##MIN=       -20513.1999529892, -227553157,  0
##MAX=       20137.2065510759, 441067078,    0
$$ Real data points
##PAGE= N=1
##DATA TABLE= (X++(R..R)), XYDATA
$$ [...]
42697B0229922K327217n331028k109011K619776j717985j0632770j2213646m345552
42689a1173077L872514N380859K397474J34444m13061p61734m20002J766669L564711
42680D348797R07702n935818j0822931q301316l55411N534959N010821J498282
42672h114915J084981M379824O319098M011305R24677R29967J733076j133362
42664A0134651o008554p078014m233978l627770o715932o648230M19997Q047802
42656a5710028R430579P390746O911496M854923k746603r265047o047419J664061
42648c517292J829498l573249j485618P780287P819202o555299j7778279j1481921
42640b6962671K371529P394008N407150P261001J0904157P209626k38928m95540
$$ y = [20229922, 22557139, 17226111, 15117100, 17736876, 16018891, 5386121, -6827525, -11173077, -7300563, -1919704, 477770, 612214, 199153, -562581, -982583, 784086, 4348797, 5256499, -679319, -11502250, -19803566, -20158977, -14624018, -9613197, -8114915, -7029934, -2650110, 3668988, 7680293, 8604970, 9534937, 11268013, 10134651, 4126097, -2951917, -7185895, -10813665, -17529597, -24177827, -23757830, -15710028, -6279449, 1111297, 8022793, 12877716, 10131113, 866066, -5181353, -3517292, -1687794, -5261043, -6746661, 1033626, 8852828, 2297529, -15480750, -26962671, -24591142, -17197134, -11789984, -4528983, 6375174, 13584800, 13345872, 12850332]
42632A2850332M152546J851197o862609r564704m098726j357683m135806k295651
42624i461104O473768R843708K193093m701223j971772J603912k898691p365735
42616f284044j830271N874752L236598l649898J80148J0829156R214701p079352
42608A0491790j7089871q221469M276228J662955r306663q553406M848776J1964802
42600i926858M611201k974549P03682N262646k035486j0946472k596945J6604458
42592a298323J9513910K89105j2689762P62163J8930887R642472j8973120k8477704
42584a2300372o997754J4766745J0970967m227635m596228P259326R051298l922290
42576A0004057j3969894r504119J408581P091699O607112M653009L027881J050689
$$ y = [12850332, 17002878, 18854075, 11991466, 2426762, -1671964, -3029647, -7165453, -9461104, -2987336, 6856372, 9049465, 4348242, 2376470, 3980382, 1081691, -6284044, -8114315, -2239563, 997035, -2652863, -2472715, 8356441, 17571142, 10491790, -6598081, -14819550, -10543322, -8880367, -18187030, -26740436, -21891660, -9926858, -5315657, -8290206, -7586524, -2323878, -4359364, -15305836, -17902781, -1298323, 18215587, 18504692, 5814930, 6577093, 25507980, 35150452, 16177332, -12300372, -19298126, -4531381, 6439586, 2211951, -2384277, 4875049, 13926347, 10004057, -3965837, -13469956, -12061375, -4969676, 1637436, 6290445, 9318326, 10369015]
42568A0369015k198833p687209j3491780j3190000l193828R889665J5672448J2149178
42560H318656N269365r22761o216791q796745o487610k263546n56664L71156M164142
42551g120798O944861K378487n394578n715336J461201M963849R94958r24438
42543b411794M701021Q900795K752814q267110j3176289j0167582l825294M251462
42535a7241977J2478353J4051622N515662m480167n675219j344168j829164o279832
42527d804890l882450O766912J2754480N415257o700361r800636k757887L816209
42519H06634K475749l499856o573158m289876o63366P4869j174771q23436J053443
42510a2613768R37734j171425q43734K130831J173520n468922p707309K711810
$$ y = [10369015, 8170182, 482973, -13008807, -26198807, -29392635, -19502970, -3830522, 8318656, 13588021, 12665260, 6448469, -2348276, -8835886, -11099432, -11656096, -11284940, -7120798, -175937, 2202550, -3192028, -8907364, -7446163, -2482314, -1487356, -2411794, 2289227, 11190022, 13942836, 5675726, -7500563, -17668145, -21493439, -17241977, -4763624, 9287998, 14803660, 10323493, 4648274, 3304106, 1474942, -4804890, -8687340, -1920428, 10834052, 16249309, 9548948, -251688, -3009575, 806634, 3282383, -217473, -6790631, -11080507, -11743873, -11669004, -12843775, -13667211, -12613768, -11676034, -12847459, -13691193, -11560362, -10386842, -15855764, -23563073, -20851263]
42502b0851263J6783444J7957904M955278o989050p389138j130861L295661L998199
42494A0630174J249329n248475j0538156p358128N61638N97190p696919q023485
42486b5826832O753240J8873487J0375825q329646j2845619m90522Q399708K864659
42478b25700m843387j525703P418562Q361602j476388j2760252j5544344p423865
42470b8019475N192574J1904306Q453854J438928j505753k213744n084750n309317
42462a5143377L436216J3092285R091909n397413j0245903K004530J3669208P483902
42454A7991357r153072j6247459p534540N872000J1338062N542496n247275r648166
42446g086597j467429J0742543J1915493P88533q329292o946895k180384m52920
$$ y = [-20851263, -4067819, 13890085, 18845363, 11856313, 4467175, 3336314, 6631975, 10630174, 11879503, 6631028, -3907128, -11265256, -10703618, -10106428, -17803347, -25826832, -19073592, -200105, 10175720, 1846074, -10999545, -11490067, -3090359, -225700, -5069087, -6594790, 823772, 9185374, 7708986, -5051266, -20595610, -28019475, -22826901, -10922595, -2468741, -1029813, -2535566, -4749310, -9834060, -15143377, -11707161, 1385124, 10477033, 5079620, -5166283, -3161753, 10507455, 17991357, 8838285, -7409174, -14943714, -9071714, 2266348, 7808844, 2561569, -7086597, -8554026, 2188517, 14104010, 14892543, 6563251, -383644, -2564028, -3016948]
42438c016948K555194P502964M220674q787820j4505239k862261R702972N078525
42430a11939o796299n824008L236211J004305r399910o397126J0262288J5315941
42422A289463p68737j5602926j0799860J706986L852821k57049J895718O558383
42414a2125201K398999p653984j1365623o280259J241935Q836743J5787781J5000765
42406E841156K445245j0601757r773773J366926O902548K500730j220743J460658
42398a079010L737445J129767l29789L581056O466342K234098l945534l655360
42390H139015J886456M891777L003909O15805J53923r38623m443311p987856q356130
42381c035035m582586K298614Q895448R315736O06617j0702434j3303643n067976
$$ y = [-3016948, -461754, 7041210, 11261884, 2474064, -12031175, -14893436, -5190464, -111939, -6908238, -12732246, -9496035, -8491730, -17891640, -24288766, -14026478, 1289463, 520726, -15082200, -25882060, -24175074, -20322253, -20579302, -18683584, -12125201, -9726202, -17380186, -28745809, -35026068, -33784133, -24947390, -9159609, 5841156, 8286401, -2315356, -12089129, -10722203, -3819655, -1318925, -2539668, -1079010, 2658435, 3788202, 3458413, 7039469, 13505811, 15739909, 11794375, 8139015, 10025471, 14917248, 17921157, 18536962, 18690885, 17752262, 13308951, 5321095, -3035035, -7617621, -5319007, 3576441, 12892177, 13498794, 2796360, -10507283, -15575259]
42373a5575259L457228L637083N21742L044698Q152057N465560m528532r441226
42365e266649l857241K797325K014256j175438J229028O009094M523984k934865
42357C339494p571453m014393M582182J0864913Q923494l04405p174293l695606
42349D949933K996068j339175j3865436j4570795K046584J4012636M931631q627754
42341i466308l950261R699602P529687o779701o273102J2259485K0135942K227796
42333B5383140j9477124j9951982m140428Q174560R992115N083445m050012j1646126
42325a0632412p120256Q278686J6782476Q453731l588687m573070P0551j530528
42317F140491o251542m726553J34640K03531j829753M38530K763378j018264m188928
$$ y = [-15575259, -12118031, -8480948, -7959206, -4914508, 3237549, 8703109, 4174577, -5266649, -9123890, -6326565, -4312309, -5487747, -4258719, 1750375, 6274359, 3339494, -4231959, -8246352, -3664170, 7200743, 16124237, 15819832, 8645539, 4949933, 7946001, 6606826, -7258610, -21829405, -19782821, -5770185, -838554, -9466308, -13416569, -3716967, 3812720, -2966981, -9240083, 3019402, 23155344, 25383140, 5906016, -14045966, -18186394, -10011834, -19719, 5063726, 1013714, -10632412, -17752668, -9473982, 7308494, 15762225, 12173538, 7600468, 7671019, 6140491, -111051, -4837604, -4702964, -4499433, -6329186, -5890656, -3127278, -4145542, -8334470]
42308h334470K242683J1171460Q759752l040593r933147p218778k279059J491127
42300g141025P003359J1500788P994755j112539n496124k577751J43647j640879
42292H674231m629117o337607p328855n780097N7591N394993M815114K109961
42284c023786L445144M141779m406251j6525659j6164727p61090J2923909J1397400
42276h973281J178390l168566J104349M334910n92375q706069q852234J897112
42268b1777764J1813573P351875p603957j4288054m426982Q110304Q705622K905161
42260i210222L341996O618864Q40810j0098460r551211N087828J6608375J2182501
42252A5820481j220274r699083q740491k591956K832377K836638k598883o540530
$$ y = [-8334470, -6091787, 5079673, 13839425, 10798832, 865685, -6353093, -8632152, -7141025, -137666, 11363122, 19357877, 18245338, 12749214, 10171463, 10315110, 8674231, 4045114, -2292493, -9621348, -15401445, -15343854, -9948861, -5133747, -3023786, 421358, 4563137, 156886, -16368773, -32533500, -33294590, -20370681, -8973281, -7794891, -10963457, -9859108, -5524198, -6116573, -14822642, -23674876, -21777764, -9964191, -2612316, -10216273, -24504327, -28931309, -20821005, -12115383, -9210222, -5868226, 750638, 1591448, -8507012, -18058223, -12970395, 3637980, 15820481, 14600207, 4901124, -3839367, -6431323, -3598946, -762308, -3361191, -9901721]
42244i901721k934476M124495O362138L836620K193055Q12041m624520j0093183
42236a0225551o978125K407999O035710J05531o048227m601099J901341P530093
42228i872328Q984486M464771l863308p526685j957041L913961J51399o284062
42220a1988807j399822J1196080J3727463K183299q098341p142630j896679J001896
42212b417541N156170J0693834Q588776k724482j0704435p391889o24070J283428
42204A859791J662621M130957L719339j455119l598987K40108R04684n823349
42196A640045r213467j888291N868193L058709l605191k459111L215328L192463
42188a91322j115229j467664J119282K3027k941452j224429L185212L275417R0986
$$ y = [-9901721, -12836197, -8711702, -2349564, 1487056, 3680111, 4492152, -132368, -10225551, -17203676, -14795677, -8759967, -8654436, -14702663, -19303762, -17402421, -9872328, -887842, 3576929, -286379, -7813064, -9770105, -5856144, -5704745, -11988807, -13388629, -2192549, 11534914, 13718213, 5619872, -1522758, -3419437, -2417541, 2738629, 13432463, 22021239, 19296757, 8592322, 1200433, 576363, 1859791, 3522412, 7653369, 11372708, 9917589, 6318602, 6558710, 7463394, 1640045, -7573422, -9461713, -3593520, -534811, -4140002, -6599113, -3383785, -191322, -1306551, -2774215, -1654933, -1631906, -4573358, -5797787, -2612575, 662842, 753828]
42179G53828J54616L044158K961916J2928o71696J171120J467779Q8011L9044
42170I021704O67150o52774k608628k581792k014260k830705k388799J694264
42162a693840N739266N095764J167649j562329j160734K453079P707046Q515139
42154B6261040k1868j0551726r690146J112152N417585j729027m647827N697257
42146A1847440J4028901N629342q374298r767908k460008j186602l820412M16502
42138F312957N095515l583812j6823847j2020123R175658J9935747Q893719n104588
42130A1881226n496676J86810Q67373P89477M654206M047411n955037j3014859
42122b040069o411863L606438J945886o258523m313728Q214804J3674435K177072
$$ y = [753828, 908444, 3952602, 6914518, 6927446, 6255750, 7426870, 8894649, 8982660, 9021704, 9688854, 9036080, 6427452, 3845660, 1831400, -999305, -3388104, -1693840, 4045426, 9141190, 10308839, 8746510, 7585776, 10038855, 17745901, 26261040, 26239172, 15687446, 5997300, 7109452, 12527037, 10798010, 6150183, 11847440, 25876341, 31505683, 23131385, 13363477, 10903469, 9716867, 5896455, 6312957, 11408472, 7824660, -8999187, -21019310, -11843652, 8092095, 16985814, 11881226, 6384550, 6571360, 7438733, 8228210, 12882416, 16929827, 10974790, -2040069, -8451932, -4845494, -2899608, -9158131, -13471859, -5257055, 8417380, 10594452]
42114A0594452j4130983j6396334j425172J5164326J6353167K632170q585251
42107D206375m389653P208350R080146p82627q024886m101255L217874M115229
42099A0529553o73449n780923q680142p038487J42979M793440l660785j8504768
42091b8872582j7715395M835524K5037680J9006154m265031j6781210r028376
42084b7783236M149639R657688R293896P308666K198270n100948p946936m065175
42076a2288136M55872J174702J212388L657713N514355L328364q54714k823620
42068f23076j295142K565781O622548P395233K841504l132637l959234Q8641J178253
42059A1681871m441372r577914n784713L870738Q012699K037271o142134p364716
$$ y = [10594452, -3536531, -19932865, -21358037, -6193711, 10159456, 12791626, 4206375, -183278, 7025072, 16105218, 15322591, 7297705, 3196450, 6414324, 10529553, 9856104, 4075181, -4604961, -11643448, -11500469, -6707029, -10367814, -28872582, -46587977, -41752453, -16714773, 2291381, -1973650, -18754860, -27783236, -23633597, -13975909, -4682013, 2626653, 4824923, -276025, -8222961, -12288136, -11832264, -10657562, -9445174, -5787461, -273106, 3055258, 2200544, -623076, -1918218, 647563, 7270111, 14665344, 17506848, 14374211, 10414977, 10503618, 11681871, 7240499, -2337415, -8122128, -4251390, 3761309, 5798580, -343554, -7708270]
42051g708270l243184k128399n529316n632937J835036R377374Q329055K480853
42043b219788K023830O382424M597986n767122j2442539o717573L369681O608658
42035d164443N224126O469319O375811k735845j3403278r621785O931610J4816692
42027I892207K868106j2776385j1335613M480427J5016223J1033331J716755j898188
42019A8996863J30785J482205r41586n198381p495484n371869j98776L175900
42011D579657J262731l980190p197167m563243L639239J2102779J1780156j757367
42003A5866595j8374054j9428818n44246J8254892J5049002n400262j7367717
41996a1944608p492187J0349948J6268218Q185639k257590p693780r028819p038062
$$ y = [-7708270, -10951454, -13079853, -18609169, -24242106, -22407070, -13029696, -4700641, -2219788, -195958, 6186466, 10784452, 5017330, -7425209, -14142782, -10773101, -4164443, 1059683, 7529002, 13904813, 11168968, -2234310, -11856095, -4924485, 9892207, 12760313, -16072, -11351685, -6871258, 8144965, 19178296, 20895051, 18996863, 19127648, 20609853, 19668267, 14469886, 6974402, 1602533, 1403757, 4579657, 5842388, 1862198, -5334969, -9898212, -6258973, 5843806, 17623962, 15866595, -2507459, -21936277, -22480523, -4225631, 10823371, 5423109, -11944608, -19436795, -9086847, 7181371, 15367010, 13109420, 5415640, -3613179, -10651241]
41988a0651241n83880P499374J0741667O788414K30990l214289k259639L07098
41980H858494Q70970j970879n611991n441841l73491N216838P066874O144157
41972A4759131N155884K651356m411724j3248680j6030837r379341J183995Q144806
41964a1175410R824070Q978866O868969K561269l257933p768727r514253r109003
41956a2592152o070888O97630P267547N150964o622731j4277036m134252J5984072
41948a4596846K2631761Q142356p100611l388131R729750R364753m737090j1011865
41940I034077j229172P514984J561409q843890q782289j840717l1105k898555
41932e515258j922383K676076M155953K401704J681046M29614m161080o430418
$$ y = [-10651241, -11235121, -3735747, 7005920, 13794334, 14025324, 10811035, 8551396, 8858494, 9729464, 7758585, 2146594, -3295247, -3668738, 1548100, 8614974, 14759131, 19915015, 22566371, 18154647, 4905967, -11124870, -20504211, -19320216, -11175410, -1351340, 7627526, 14496495, 17057764, 13799831, 6031104, -3483149, -12592152, -18663040, -17965410, -10697863, -5546899, -12169630, -26446666, -30580918, -14596846, 8034915, 16177271, 9076660, 5688529, 15418279, 24783032, 20045942, 9034077, 7804905, 15319889, 16881298, 8037408, -744881, -2585598, -2616703, -5515258, -7437641, -4761565, -605612, 1796092, 3477138, 3906752, -254328, -6684746]
41924f684746j87278Q043214P298402J48267j848089J830418N48304p514587j0498741
41915h864836j323145J1333129J4834850O403806p392728j6979026j4649187j378508
41907a8015645J0501896Q945961l657329j4395007j5127409o829483N868531J5073224
41899a7635261J1594738j445651n305364Q701686J9902578N821187j9291613k1213604
41891a8871304K061335J6857011O484570o154991l07756J0584446P633026p16618
41883A7569719J176783N687101j609414j2079850q419054L394949M158517m935475
41875D943276o053342K559608M426361m910628j0259183k922588O632823P667350
41867B083677L295334m4913k619272n131783m452720p14212J081121k1372N34924
$$ y = [-6684746, -6872024, 1171190, 8469592, 8617859, 6769770, 8600188, 9148492, 1633905, -8864836, -10187981, 1145148, 15979998, 22383804, 14991076, -1987950, -16637137, -18015645, -7513749, 1432212, -2225117, -16620124, -31747533, -38577016, -32708485, -17635261, -6040523, -7486174, -12791538, -4089852, 15812726, 21633913, 2342300, -18871304, -16809969, 47042, 6531612, 376621, 68865, 10653311, 18286337, 17569719, 18746502, 24433603, 22824189, 10744339, 2325285, 5720234, 9878751, 4943276, -1110066, 1449542, 5875903, 965275, -9293908, -12216496, -5583673, 2083677, 5379011, 5334098, 2714826, -2416957, -6869677, -7583889, -6502768, -6524140, -5989216]
41858e989216L039636J569921n354849j0532524p800428K99720O984332Q493537
41850i289871N598433J583349p60215j674141k162205L80742Q031782J3861541
41842A5569415Q259657l850915o074581L545401O375979o895578j8443496j1291042
41834a2805160K243759J350354q549168p288057M296805Q089816K223327J955050
41826h483274Q862726Q022448k289446o108133O41361L248418k855059l404944
41818b365903N757301Q153512l001067j0117692k028303N195878l365439j4536840
41810a6308553r929871L043849O484810L204214P675099J6570580J3828732m14063
41802B4154797r478252o817206k429129k739613k658972N72210J810098n88536
$$ y = [-5989216, -2949580, -1379659, -6734508, -17267032, -25067460, -24767740, -17783408, -9289871, -3691438, -2108089, -2868304, -4542445, -6704650, -6323908, 1707874, 15569415, 23829072, 19978157, 13903576, 17448977, 23824956, 16929378, -1514118, -12805160, -10561401, -9211047, -17760215, -25048272, -20751467, -12661651, -10438324, -8483274, 379452, 8401900, 6112454, 4321, 645682, 3894100, 1039041, -2365903, 3391398, 11544910, 8543843, -1573849, -3602152, 1593726, -1771713, -16308553, -26238424, -23194575, -16709765, -13505551, -5830452, 10740128, 24568860, 24154797, 14676545, 7859339, 5430210, 2690597, 31625, 603835, 2413933, 1825397]
41794A825397r29950K988308N638262K935662k408310n734080m284773K241294
41786B271810Q744021O397557n052749j2321753n768153M777780L937908n435754
41778b449333q121481k075408M58620l214018j524350Q308636J2521803M349374
41770H253843l104381P28224N155902k739338j4053295j1871566R2050L430775
41762a4107786m665234q280467l21527P592749P532814P728421J3401956J3049341
41754B1930267k214826j9470266k0555528p992161K616296P956186J5225769K0299077
41746A7794814J0756903q372570j5174815l610179N945516o39527q763416r35447
41738b998721J2730829J0767578m845187j3134646p466293j618844l398631l785319
$$ y = [1825397, 895447, 3883755, 9522017, 12457679, 10049369, 4315289, 30516, 2271810, 11015831, 17413388, 12360639, 38886, -5729267, -951487, 2986421, -2449333, -10570814, -12646222, -12187602, -15401620, -16925970, -8617334, 3904469, 8253843, 5149462, 5877686, 11033588, 8294250, -5759045, -17630611, -17538561, -14107786, -18773020, -27053487, -27375014, -19782265, -12249451, -4521030, 8880926, 21930267, 19715441, 245175, -20310353, -28302514, -25686218, -17730032, -2504263, 17794814, 28551717, 20179147, 5004332, 1394153, 7339669, 6700142, -2063274, -2998721, 9732108, 20499686, 15654499, 2519853, -4946440, -6565284, -9963915, -13749234]
41730a3749234L435507R574720O282185n45771n12508O442011J1707302Q773002
41722C1407214j433656j1233495j1449572j445716P502818N822684o70101m91477
41714A8008699M074196J204881q467721j0824662j499729O824864N789573L430829
41706A8540930O524473O731573l580110j4828944j4029283n573533k835717n415091
41698a4465702j154787J1107291J6754179O729297q513004j2924403n322842J681233
41690f108738L54633k514777K501318J1533598J1539194M64850p023273o21799
41682A0125006Q007780J269576j5910577k0011107k334593J7607773J8295268
41675A7049126K509810j1239036j3091071p270213l31493N029639P196772N181708
$$ y = [-13749234, -10313727, -739007, 5543178, 4997407, 4484899, 10926910, 22634212, 31407214, 29973558, 18740063, 7290491, 5844775, 13347593, 19170277, 18500176, 18008699, 22082895, 23287776, 14820055, 3995393, 2495664, 9320528, 15110101, 18540930, 25065403, 31796976, 28216866, 13387922, -641361, -6214894, -9050611, -14465702, -15620489, -4513198, 12240981, 18970278, 10457274, -2467129, -7789971, -6108738, -5754105, -8268882, -5767564, 5766034, 17305228, 17770078, 10746805, 10125006, 18132786, 19402362, 3491785, -16519322, -18853915, -1246142, 17049126, 19558936, 8319900, -4771171, -12041384, -12372877, -7343238, -146466, 5035242]
41667E035242Q01912k928227m506994l362561K71701L662267L882985K381595
41659E237920K134280Q83681n061216j0446723n066993R145108J6067529O056293
41651A8949879j0702046j7944186j2243825j611987O849731J0154039O748656
41644B00261j182240o805654o304890l660034l135619k208838K618533P968079
41636a2510402P704923J707884m313808n367491p07820O144844R275943N928226
41628G862299O60233m87189J055490m36870m556484n896847m151225l262562j989206
41619a1202361L175088P210566K542964n067390k877333O198788O162507m314030
41611A828799q171092m8743L164785p245818j3984339k337106J3894767J4422178
$$ y = [5035242, 5837154, 2908927, -1598067, -4960628, -4688927, -1026660, 2856325, 5237920, 7372200, 8255881, 3194665, -7252058, -12319051, -3173943, 12893586, 18949879, 8247833, -9696353, -21940178, -23552165, -16702434, -6548395, 200261, -981979, -7787633, -14092523, -17752557, -20888176, -23097014, -20478481, -12510402, -4805479, -3097595, -7411403, -12778894, -13486714, -7341870, 1934073, 7862299, 8522532, 8035343, 9090833, 8653963, 4097479, -1799368, -5950593, -9213155, -11202361, -8027273, -816707, 1726257, -3341133, -6218466, -19678, 6142829, 1828799, -6342293, -6391036, -3226251, -10472069, -24456408, -26793514, -12898747, 1523431]
41603A523431L348216k732848k798496n272508o012783L598563J4736233J1036829
41595A7426637m031852j1282750m504713M605004P836001P914294O049667k7735
41587B3984553o017503m955283k24011l28471l623923l043442j459159n517952
41579a185191q964058j333844J0237886Q953595l288294p441605J741782Q572868
41571G293139L980742j427051J648308O717966N951961K095643j522313p080234
41563A7658161j1884660q151515N08925j49464j0497533j2364392J224433J1739866
41555a1916179M780258n226647Q26041J3802057J1353345m110816q811704L451186
41547D147541J1646517K159075r525282m175285J0474997J1557342m203420j5834925
$$ y = [1523431, 4871647, 2138799, -659697, -5932205, -11944988, -8346425, 6389808, 17426637, 13394785, 2112035, -2392678, 2212326, 10048327, 17962621, 24012288, 23984553, 17967050, 13011767, 12787756, 12459285, 8835362, 5791920, 4332761, -1185191, -10149249, -11483093, -1245207, 7708388, 4420094, -3021511, -1279729, 7293139, 11273881, 9846830, 11495138, 18213104, 24165065, 26260708, 24738395, 17658161, 5773501, -2378014, -1869089, -2018553, -12516086, -24880478, -23656045, -11916179, -7135921, -12362568, -11536527, 2265530, 13618875, 9508059, 696355, 4147541, 15794058, 17953133, 8427851, 4252566, 14727563, 26284905, 22081485, 6246560]
41539F246560q918299M823888O372222l550937q856651l915566L25984k961172
41531a0433971n160473J218995P734068L518734n677967o045628K260918O710737
41523e874587L702712K624913P131292P414006l052060j4863026j4928876m042105
41515b1887731N433619N377766p13328m344489j632360L953447O873889O193000
41507g46187M962575L672740l49152n524150n320661J000889N108128L058247
41499E862429K574787P972737Q328883n560242k1083599j8463687q16756R886448
41491a1299000N869768J828299O680802Q154696m344555j8619176j6083585J007685
41483b6805066J3509642J1815335N095790M244894O543573K483257p533541j1513717
$$ y = [6246560, -2671739, 2152149, 8524371, 4973434, -3883217, -7798783, -7472799, -10433971, -15594444, -14375449, -6641381, -3122647, -8800614, -14846242, -12585324, -5874587, -2171875, 453038, 7584330, 14998336, 11946276, -2916750, -17845626, -21887731, -16454112, -11076346, -11789674, -16134163, -17766523, -13813076, -6939187, -746187, 4216388, 7889128, 7539976, 2015826, -3304835, -2303946, 2804182, 5862429, 8437216, 16409953, 24738836, 19178594, -1905005, -20368692, -21185448, -11299000, -5429232, -3600933, 3079869, 11234565, 6890010, -11729166, -27812751, -26805066, -13295424, -1480089, 3615701, 7860595, 14404168, 16887425, 9353884, -2159833]
41475b159833l240013N785036J117214j0977530r344839R353083K1203028R135554
41467B0871700j0259846j1560106J502698N756591k671282o018332J350304M581878
41459C553605k408264n230442M524404J3268959P451605o204307j4046195j4055779
41451a3146414j0447607l534462M621447O759743J928260j082905R63092K50017
41443a3688829n306798n329768L930573J0080032N436955J097121O571540J1376803
41435A4167629L626393p234158n680186L084834K523248o792771r749085l558502
41427i612598n75012m564726m506908M333942J0897105O527786j323977j892713
41419g17101K508781J921338n093002r026500k241223J0601503J6404872P583594
$$ y = [-2159833, -5399846, 385190, 1502404, -9475126, -18819965, -9466882, 11736146, 20871700, 10611854, -948252, 554446, 6311037, 3639755, -2378577, -1028273, 3553605, 1145341, -4085101, 439303, 13708262, 21159867, 14955560, 909365, -13146414, -23594021, -27128483, -22507036, -15747293, -13819033, -14901938, -13938846, -13688829, -18995627, -24325395, -20394822, -10314790, -4877835, -3780714, 2790826, 14167629, 17794022, 10559864, 4879678, 7964512, 10487760, 3694989, -6054096, -9612598, -10187610, -14752336, -19259244, -14925302, -4028197, 2499589, 1175612, -717101, 1791680, 3713018, -1379984, -10406484, -12647707, -2046204, 14358668, 21942262]
41411B1942262q507436j6169415q296539N888761J1707474N010667m770734n733510
41403A071530L632629J1941495P043366p450334j3196937r11191J3750116J0160830
41395B6041504o640885j2720596j690423O728383k85424r293617n997251N33854
41387c324455l465445j0282838m834609O766717O512960m045341n923634N021033
41379a3575612J1444104L667802n953819n494049j818703n180318r694228l267472
41371b9872295J1212658J8451862J1717371J40971n146145l630135j818925l030998
41363a975636m955884m916411l293945j203892K067721O897903J0316950Q582626
41355A1519432K659719k181366l059213k876962n671052j0709545j2708897p242250
$$ y = [21942262, 13434826, -2734589, -11031128, -5142367, 6565107, 11575774, 6805040, 1071530, 4704159, 16645654, 23689020, 16238686, 3041749, 2130558, 15880674, 26041504, 19400619, 6680023, 4989600, 11717983, 11432559, 2138942, -3858309, -3324455, -6789900, -17072738, -21907347, -15140630, -8627670, -12673011, -18596645, -13575612, -2131508, 1536294, -4417525, -9911574, -11730277, -16910595, -26604823, -29872295, -18659637, -207775, 11509596, 11650567, 6504422, 2874287, 1055362, -1975636, -6931520, -11847931, -15141876, -16345768, -14278047, -7380144, 2936806, 11519432, 14179151, 11997785, 8938572, 6061610, 390558, -10318987, -23027884, -30270134]
41347c0270134L974700J2797290J1795662L182395k748508o16521L418496K250995
41339C784375j139769m80892J990564N30538k034054Q94504O104958M949446p69628
41330A3830042j563923K130669Q94872m667699l294409N570722P842632k030483
41322A8712423j1414247j0447483n688462m196650j187791N814445P386607n74252
41314a595410n912937m42526M413772j955579q455276q90701J1369915R226474
41306E757732m246612q335056K769156J2940074R420547k464165j1229971j1818194
41298g206489n193099L481399O539621K461829l37321L536485O538700J462229
41290A1283354m139676l20787O910988N549079j393427k286637J894564J571003
$$ y = [-30270134, -26295434, -13498144, -1702482, 1479913, -1268595, -1885116, 1533380, 3784375, 2644606, 2163714, 4154278, 4684816, 2650762, 3545266, 9650224, 14599670, 13830042, 12266119, 14396788, 15291660, 10623961, 7329552, 12900274, 20742906, 18712423, 7298176, -3149307, -8837769, -13034419, -14222210, -8407765, -1021158, -1595410, -7508347, -7950873, -3537101, -5492680, -13947956, -14838657, -3468742, 5757732, 1511120, -6823936, -4054780, 8885294, 18305841, 15841676, 4611705, -7206489, -12399588, -8918189, -2378568, 83261, -254060, 3282425, 9821125, 11283354, 7143678, 6822891, 13733879, 19282958, 17889531, 15602894, 17497458, 19068461]
41282A9068461j339992K270952P856735K705770q942517r506399J592582N184566
41274A8890158m988169j1053354j911260P487807J949293q225230n232815O577231
41266C493661Q788328j347157q495047m319310J813648k12609o408839o835542
41258a3522867j068221J992479k139773o610592k840679P050413J3188512J1786081
41250G835353Q346256O358931K574168k801028k423466M451205O018085l800026
41242B6559478j2332697p199294K156916m79155j0113976q861971K839740P144729
41234b86230L02179j731250O565868R252294k579108j3600238q802220L347481
41226g531224P245543M027297L049038K624586l283471q858680m637487M384890
$$ y = [19068461, 17728469, 19999421, 27856156, 30561926, 21619409, 12113010, 13705592, 18890158, 13901989, 2848635, 937375, 8425182, 10374475, 2149245, -3083570, 3493661, 12281989, 10934832, 2439785, -1879525, -65877, -278486, -6687325, -13522867, -14591088, -12598609, -14738382, -21348974, -24189653, -17139240, -3950728, 7835353, 16181609, 22540540, 25114708, 22313680, 19890214, 24341419, 30359504, 26559478, 14226781, 7027487, 9184403, 8705248, -1408728, -10270699, -7430959, -286230, 15949, -1715301, 4850567, 14102861, 11523753, -2076485, -10878705, -7531224, -285681, 3741616, 6790654, 9415240, 6131769, -2726911, -7364398, -2979508]
41218b979508N462656j258617m494093j611499j171478n802456p065594j23063
41210a9043652Q297881J0378154O462923N90332n011843p615984l885290L657702
41202f169777O490699J219049m354314j556414O705035R816731L906013l529464
41194A2527558l868484K417315P652588O119807q73436p501252r032367n611932
41186A829797j668651j022766k272048p82909L980795O073284P53295p650849
41178g60052r562483j547530R211320J2204193L958893q104764j1755753k773053
41170i129229Q031927O518534m651729p591551L539179R985962l727681k1377468
41162a8402056j5426056J0304840K3542953J0284626p334598p547420J471026
$$ y = [-2979508, 2483148, 1224531, -3269562, -4881061, -6052539, -11854995, -18920589, -19043652, -10745771, -367617, 6095306, 6685638, 1673795, -5942189, -9827479, -6169777, 320922, 1539971, -2814343, -4370757, 2334278, 12151009, 16057022, 12527558, 8659074, 11076389, 18728977, 24848784, 23975348, 16474096, 7441729, 1829797, 161146, -861620, -3133668, -3916577, 64218, 6137502, 6890797, -760052, -10322535, -11870065, -2658745, 9545448, 13504341, 5399577, -6356176, -9129229, -1097302, 5421232, 769503, -6822048, -3282869, 6703093, 2975412, -18402056, -33828112, -23523272, 19681, 10304307, 2969709, -4577711, -3106685]
41155c106685K314791k656705j421014M069388L628573j946918m427147l239994
41147f785711k733866j770344J574029K951635K51143m54944K769704K099785
41139b098569l155404o56508J0698518J0647251r150861k2439911n218927K2369304
41131I94893K2760326k622456j8262932r424093L364147M042445Q10648J566598
41123C229576N98711k744010P41768Q671378N922301p791030j3368409k788716
41115g528431R137820J0561088O980341L134883n261407j3950653r156421O466921
41107C84141J1428012q53004j0524434m531004M200086L641788K338166O372592
41099A2456343L054373j2619083j9757022l282374J6970528J4268967m537991
$$ y = [-3106685, -791894, -3448599, -4869613, -800225, 2828348, 881430, -3545717, -6785711, -9519577, -11289921, -9715892, -6764257, -6513114, -6968058, -4198354, -2098569, -5253973, -5910481, 4788037, 15435288, 6284427, -16155484, -21374411, 994893, 23755219, 21132763, 2869831, -6554262, -3190115, 852330, 1662978, 3229576, 3828287, 1084277, 1826045, 10497423, 16419724, 8628694, -4739715, -7528431, 1609389, 12170477, 19150818, 22285701, 17024294, 3073641, -6082780, 384141, 11812153, 10959149, 434715, -4096289, 103797, 3745585, 6083751, 12456343, 15510716, 2891633, -16865389, -20147763, -3177235, 11091732, 6553741]
41092F553741j2416029l323635N456580L573158l144962q307991j0159898n601375
41084b7370411M807223J1221543P597433K793295N450901P852665p8981j0935261
41076A338407j0868040j886145L619888K915510J325332j590945p779733r920963
41068b2846689j559975Q536787Q360890K465263L425166R909318J0490802M333321
41060B3114883R39108K567225K570240j321202n604416r355149j1894512p817094
41052f800917L255647R443721K842956n600817k911338L708856n742q750413n954416
41043a0772463O729125J1291287K939763m491346l474538k030024n146925o305345
41035a1260466k058181J602142J726918K316597K629118l268121j1857406j0468583
$$ y = [6553741, -5862288, -9185923, -3729343, -156185, -3301147, -11609138, -21769036, -27370411, -22563188, -11341645, -3744212, -950917, 4499984, 12352649, 12273668, 1338407, -9529633, -11415778, -7795890, -4880380, -3555048, -5145993, -12925726, -22846689, -24406664, -15869877, -7508987, -5043724, -1618558, 8290760, 18781562, 23114883, 24053991, 26621216, 29191456, 27870254, 22265838, 12910689, 1016177, -6800917, -3545270, 5898451, 8741407, 3140590, 229252, 3938108, 3932366, -4818047, -10772463, -4043338, 7247949, 10187712, 5696366, 2221828, 191804, -4955121, -11260466, -13318647, -11716505, -9989587, -7672990, -5043872, -8311993, -20169399, -30637982]
41027c0637982K669829J2550837P804617m293611r225211k959904O348002Q244016
41019i499407q3547r074927n128807J0245962J7343081N082401r008080k870747
41011b994071J4562605J5480566k647023j2579925j117273J0318549J023839j6761903
41003E285364j8919728n720085L288737P22122k168545K800726R241991Q290571
40995B821153J103496m469381m009815k48731J577772M91853M31228L157896L939720
40986D795191j251615p324819n655739L408196J0764367J0508489M852105j632857
40978A8463318n244224k223161O763456J2255157N501228p908353j3622929q152873
40970E831619k729891n880136j2227644j2199375m615408M473476R576458R334903
$$ y = [-30637982, -27968153, -15417316, -7612699, -11906310, -21131521, -24091425, -17743423, -9499407, -9582954, -18657881, -23786688, -13540726, 3802355, 8884756, -123324, -2994071, 11568534, 27049100, 24402077, 11822152, 10704879, 21023428, 22047267, 5285364, -13634364, -19354449, -16065712, -15343590, -17512135, -14711409, -5469418, 2821153, 3924649, -544732, -4554547, -4803278, -3225506, -2733653, -2302425, 855471, 4795191, 3543576, -3781243, -9436982, -6028786, 4735581, 15244070, 20096175, 18463318, 13219094, 10995933, 17759389, 30014546, 35515774, 27607421, 13984492, 5831619, 3101728, -2778408, -15006052, -27205427, -31820835, -27347359, -17770901, -8435998]
40962h435998O393801M687108L981936l24774q030755j0534671l609394L173220
40954a2699527M35729m419193J132798J1731401J0405010l673955j2466710o476618
40946a6031065L031784M340699J275623J543662L415791K669249J304896J358376
40938B909015j33750l361158k646756K881291N443226J326298k700149j772975
40930A945042j164785n010049p109851j571804N968251O646919J306181k713853
40922a703949k236724Q75835M558804O738484M947582l58643n735036q931675
40914a845322q529730j885475Q397980J0238890k619895j4897659p318581J1772179
40906f687613J5062052r75129q975827M425050J5684361M288551j1768457o845996
$$ y = [-8435998, -2042197, 2644911, 6626847, 6302073, -1728682, -12263353, -15872747, -12699527, -12263798, -16682991, -15550193, -3818792, 6586218, 2912263, -9554447, -16031065, -12999281, -8658582, -7382959, -5839297, -2423506, 245743, 1550639, 2909015, 2775265, -585893, -3232649, -351358, 5091868, 6418166, 3718017, 1945042, 780257, -4229792, -11339643, -12911447, -6943196, -296277, 1009904, -1703949, -3940673, -3064838, 1493966, 8232450, 13180032, 12821389, 7086353, -1845322, -10375052, -12260527, -3862547, 6376343, 3756448, -11141211, -18459792, -6687613, 8374439, 7399310, -1576517, 2848533, 18532894, 22821445, 11052988, 4206992]
40898D206992Q185254N575539j0238343j0327695P510026J3403142m382963j9125365
40890e193413q254876J2842877J7387030N231920n598866r025349j1464478j2437077
40882a6512232n083028P759751J4361823J0132064J245266n802514q183327l560206
40874e642403O074589J0193235J327123j0703478r016585N593092J3837956M999427
40866A6662956q763485j1531388m798969k46534j186545k474184k081568j156103
40858a5575820K539587R537239J1179163L85023j2575436r925096P389781J8442025
40850A1396466J0827459m157808j0642860q299324m878034j688343K302361K386868
40842b753215l534138o584643R56457J1890589J4235696Q598121L235405j448563
$$ y = [4206992, 12392246, 17967785, 7729442, -2598253, 4911773, 18314915, 13931952, -5193413, -13448289, -605412, 16781618, 22013538, 16414672, 7389323, -4075155, -16512232, -21595260, -13835509, 526314, 10658378, 11903644, 6101130, -2082197, -5642403, 432186, 10625421, 11952544, 1249066, -7767519, -2174427, 11663529, 16662956, 7899471, -3631917, -8430886, -8677420, -9863965, -12338149, -14419717, -15575820, -13036233, -3498994, 7680169, 8065192, -4510244, -14435340, -7045559, 11396466, 22223925, 18066117, 7423257, -876067, -5754101, -7442444, -5140083, -2753215, -6287353, -12871996, -11915539, -24950, 14210746, 22808867, 26044272, 24595709]
40834B4595709r274154j4660831q824508K785519N241781l606463j0337476o510753
40826b0591176J897644P452954J0103508J0024364M328434m701527q701483m660379
40818d847661J459087M729278N937404N209491R37308l708553l191070P84064
40810G309348K271078K923002Q487703J4231657Q862070n567344j3378230q140610
40802A6998674m15549J155724M46004P93962j766119n997124l330343M490330
40794A2375559L690026o869539q985416M890050J5207937N398092j0293868r514350
40786E898491L399159Q782043N550936P622674J3789902Q601837p899027j7020639
40778B8725376j1264453m464441o076853o221183L911973J3915311R157516p085586
$$ y = [24595709, 15321555, 660724, -8163784, -5378265, -136484, -3742947, -14080423, -20591176, -18693532, -11240578, -1137070, 8887294, 13215728, 8514201, -187282, -4847661, -3388574, 1340704, 7278108, 12487599, 13424907, 9716354, 6525284, 7309348, 9580426, 12503428, 20991131, 35222788, 44084858, 38517514, 25139284, 16998674, 16583125, 17738849, 18184853, 18978815, 17212696, 11215572, 7885229, 12375559, 16065585, 9196046, 210630, 5100680, 20308617, 25706709, 15412841, 5898491, 9297650, 18079693, 23630629, 31253303, 45043205, 53645042, 45746015, 28725376, 17460923, 12996482, 6919629, 698446, 4610419, 18525730, 27683246, 20597660]
40770B0597660j8298524j5204322k862417P998521R983240K973099n735014p631139
40762h178896k044272L779686M427896J747877j7292R95275N151347J0585671
40754A6447292J0447912j117632j7071788k0313345m971802J2359726J1902185
40747G682548l494842j3078929p169670K060665K495455O79057P430377J5411183
40739A2015844Q519436r571728j6107269k903112R647746L035979j1362845j1039988
40731a7765937L148313J1307507O381820K32073j01171r03095m465617l214575
40723e380682L724143N981350N70536j363711N955978J2048878P565172j175473
40715B7926191m126087j797727P60205K694067K753720k213259q092815o068734
$$ y = [20597660, 2299136, -12905186, -15767603, -7769082, 2214158, 5187257, -547757, -8178896, -10223168, -6443482, -2015586, -267709, -285001, 710274, 5861621, 16447292, 26895204, 25777572, 8705784, -11607561, -16579363, -4219637, 7682548, 4187706, -8891223, -16060893, -14000228, -11504773, -10825716, -3395339, 12015844, 20535280, 10963552, -5143717, -8046829, 1600917, 4636896, -6725949, -17765937, -14617624, -3310117, 3071703, 3303776, 3202605, 2299510, -2166107, -5380682, -1656539, 4324811, 4895347, 3531636, 9487614, 21536492, 29101664, 27926191, 23800104, 22002377, 22762582, 25456649, 28210369, 25997110, 17904295, 11835561]
40707A1835561N84059j292999r967999o933011J0542251J8419816L205656j2957318
40699A3436016o345431R810682Q107175p528728j0382561L722606J1564041J597353
40691B3981153j0915357j1391006m522311J65740J959304K514390R58918p90845
40683A959986K8840l08204n549792r012669l380633M166622K752610k274642R56421
40674a0661461P489092M193442l294960J839410J5196834J4795276j051996r171483
40666A9334154q92162M109974n955912j4242417o505446L528103o8452o982102
40658g674260q17575J0316625P853804n268689j0795594n278075j494240m100620
40650a7258624m376121J624541O943279O913437M986177L902376J692409k148474
$$ y = [11835561, 12419620, 11126621, 1158622, -5774389, 4767862, 23187678, 26393334, 13436016, 7090585, 16901267, 25008442, 17479714, 7097153, 10819759, 22383800, 23981153, 13065796, 1674790, -2847521, -2681781, -722477, 1791913, 2750831, 1959986, 1988826, 1680622, -3869170, -12881839, -16262472, -12095850, -9343240, -11617882, -10661461, -3172369, 1021073, -2273887, -434477, 14762357, 29557633, 28505637, 19334154, 18441992, 22551966, 16596054, 2353637, -4151809, -623706, -692158, -7674260, -8491835, 1824790, 9678594, 4409905, -6385689, -11663764, -13158004, -17258624, -21634745, -20010204, -13066925, -6153488, -1167311, 2735065, 4427474, 2279000]
40642B279000m669516m604056l754613l357175k901267j297581K650617P857527
40634g797064Q973695K740653m312512l499027J414226k49640n721773r15137
40626i366579J3294984J6927167K292440j0825814n759727M621643J486802o890824
40618E780092l88250J5990253J7971329P77244j4089853j1859065j230630N392084
40610A8343204P472352O473468p23574j0719985j1803544j918257M848950j408472
40602A0564142j0951376q667872M875615J5846726J4913770N154025m137453o518201
40594B1079376l733577l607899r398373j3015013n620348P299966J1760082N512990
40586A0277204J3373P42827j4824n831935o569029M297118J5227463J1878367
$$ y = [2279000, -2390516, -6994572, -10749185, -14106360, -17007627, -18305208, -15654591, -7797064, 1176631, 3917284, -395228, -3894255, -2480029, -2729669, -8451442, -9366579, 3928405, 20855572, 23148012, 12322198, 6562471, 11184114, 12670916, 5780092, 5391842, 21382095, 39353424, 40130668, 26040815, 14181750, 12951120, 18343204, 25815556, 32289024, 31565450, 20845465, 9041921, 7123664, 11972614, 10564142, -387234, -9055106, -4179491, 11667235, 26581005, 31735030, 27597577, 21079376, 17345799, 13737900, 4339527, -8675486, -14295834, -6995868, 4764214, 10277204, 10290577, 11033404, 11018580, 5186645, -1382384, 2914734, 18142197, 30020564]
40578C0020564j812253j0250626p642435p50722M768481Q253806P452379N89560
40570C0628754o172340m957507N28448p02127r052478j2815319o619857P20348
40562h442078J242611n83268J999139N859044M338327j042970l524938r74486
40554a128619L990385Q812790R706386J889058j1122187j5288010l391331J1293218
40546D761690J1039275j251762p660010l113924k0461l974954m393348L915487
40538f98007Q602025R93820o682655r41599Q846014M675631j0082430j5280983
40530a0568184n318927M267186K810048j428495J549954P662863P985764K798268
40522I758477j286037q33974L076222O862230N067156l845319j0970596n553711
$$ y = [30020564, 28208311, 17957685, 10315250, 9564528, 14333009, 22586815, 30039194, 30628754, 24456414, 19498907, 20027355, 19325228, 10272750, -2542569, -9162426, -8442078, -7199467, -7782735, -5783596, 75448, 4413775, 3370805, -154133, -1128619, 2861766, 11674556, 21380942, 23270000, 12147813, -3140197, -6531528, 4761690, 15800965, 14549203, 6889193, 3775269, 3754808, -220146, -4613494, -698007, 7904018, 8897838, 2215183, 1273584, 10119598, 14795229, 4712799, -10568184, -15887111, -11619925, -8809877, -10238372, -8688418, -1025555, 6960209, 9758477, 8472440, 7638466, 10714688, 17576918, 22644074, 18798755, 7828159, 2274448]
40514B274448P952209J2447073J656605j0427378r455594R34149Q232418Q338007
40506B1951937M521485k233977j1336049j7028286j4603637p940356k880900J868325
40498b7681458R151019J4248293J0859054K107393l678425m777222m867869l786273
40490h425488P28832M995597L488177p51672k36087L382304R88067p844955j1711282
40481a5386507m171129N821158O139895k242030p397846j753055R539950J4850544
40473E400980Q586626k628824p008486j362867N384925M909659P66794R95155
40465A5043962L766423j12032j1183880j7945311j2205947L87122R299300J1768110
40457a182253J1407846R691639N362069l39854l887373m430868m161959l692443
$$ y = [2274448, 10226657, 22673730, 24330335, 13902957, 4447363, 5381512, 13613930, 21951937, 26473422, 24239445, 12903396, -4124890, -18728527, -26668883, -29549783, -27681458, -18530439, -4282146, 6576908, 8684301, 5005876, 228654, -4639215, -8425488, -7696656, -2701059, 787118, 35446, -200641, 3181663, 4169730, -3675225, -15386507, -19557636, -13736478, -7596583, -9838613, -17236459, -18989514, -9449564, 5400980, 13987606, 11358782, 4350296, 2987429, 8372354, 13282013, 14048807, 15043962, 18810385, 18698353, 7514473, -10430838, -22636785, -22249663, -12950363, -1182253, 10225593, 19917232, 25279301, 24939447, 21052074, 16621206, 12459247, 8766804]
40449H766804j024241L645921N386834J638q725288j0978237k409262Q581254
40441C245423R286297j546709j1143378q231215L017080Q936413L905515l554951
40433C914475k747974N703173J1424666P745330k23497k961987L99077J512062
40425B4765325l854071q683365o044781j195104l107420q157866m824006O227276
40417d874012J1295731N757821J481706N202223N369721p144872j8906109j1558968
40409a3376759Q961062J9427217J1684136k6355l548227l029974n300975p343618
40401G446507l963247K654050P134019P382180L384239l617587q810041p577323
40393D032797k282467J742512N333677J1006170J1887853q53127j9146429k2738083
$$ y = [8766804, 7742563, 11388484, 16775318, 16776956, 8051668, -2926569, -5335831, 3245423, 12531720, 10985011, -158367, -8389582, -5372502, 3563911, 7469426, 3914475, 1166501, 6869674, 18294340, 26039670, 25816173, 22854186, 23253263, 24765325, 20911254, 12227889, 6183108, 4988004, 1880584, -6277282, -11101288, -4874012, 6421719, 12179540, 13661246, 18863469, 24233190, 17088318, -1817791, -13376759, -4415697, 15011520, 26695656, 26669301, 23121074, 20091100, 14790125, 7446507, 3483260, 6137310, 13271329, 20653509, 24037748, 20420161, 11610120, 4032797, 1750330, 3492842, 8826519, 19832689, 31720542, 30867415, 11720986, -11017097]
40385a1017097p263504P913037O977263k036247l623789K422787O781319P545265
40377G699034P693659M617756l692195r033623l808763M189811K342768o038081
40369C970366p104217K55276L525550q13821j269082P708476J4748604R536904
40361C0558056j106679m981932k516983k118319m458902l194913J833670L284063
40353A7298061j498930n901331m036543J014824K264515j655998n219376k846374
40345e81152M722470J0576094Q249676j015029q646035p958365j578280K777011
40337F546390K162355J6750q24658q21531J041092P361080J4420524J2089823
40329D1991825j533459j2351071p570699L934292K553869j1479702j5302521K826001
$$ y = [-11017097, -18280601, -10367564, -3390301, -5426548, -9050337, -6627550, 153769, 7699034, 15392693, 20010449, 16318254, 7284631, 3475868, 7665679, 10008447, 3970366, -3133851, -2878575, 646975, -166846, -1435928, 6272548, 21021152, 30558056, 29451377, 24469445, 21952462, 19834143, 15375241, 12180328, 14013998, 17298061, 15799131, 9897800, 5861257, 6876081, 9140596, 7484598, 2265222, -581152, 4141318, 14717412, 22967088, 21952059, 13306024, 5347659, 3769379, 6546390, 8708745, 8725495, 7900837, 7079306, 8120398, 15481478, 29902002, 41991825, 40458366, 28107295, 20536596, 24470888, 27024757, 15545055, 242534, 3068535]
40321C068535K3283208K1419684K117249r082998k913852M875785J670338m220117
40313D0217832r46193O455373M488981p850903j7632715j4744125j998681J0729825
40305A8719394J6448697J4401168P523245q98060q076115j0884536p216056P34947
40297C0752684P849101J2462522J6871746J9450811J4085247K870760k24093J1493900
40289A15612678K3722974K0975468J2545960J9829546M1627403N3915199M4711387
40282C32940615K6116658P656280j6838816m5515936n7106684m1019598j8740248
40275A87492271j4717248k1825701j7539067j248113Q558049N760826J520905
40268A48001922K439591N452344J1339348K3206138L4321759L6749646L8156039
$$ y = [3068535, 26351743, 47771427, 49888676, 40805678, 37891826, 42767611, 44437949, 40217832, 39271639, 45727012, 50215993, 42365090, 24732375, 9988250, 7989569, 18719394, 35168091, 49569259, 57092504, 56194444, 48118329, 37233793, 30017737, 30752684, 38601785, 51064307, 67936053, 87386864, 101472111, 104342871, 104118778, 115612678, 139335652, 160311120, 172857080, 192686626, 234314029, 288229228, 332940615, 359057273, 366713553, 349874737, 304358801, 247252117, 206232519, 187492271, 172775023, 150949322, 133410255, 132162142, 140720191, 146481017, 148001922, 150441513, 155893857, 167233205, 190439343, 224761102, 261510748, 299666787]
40261B99666787M8906014N6233768L6260509p607082m3510197n2571898m7438721
40254B89939180m3551560l7202675k3291082j1910648j1704188j4087316r141478
40247A39050233k677737l241849n601885j930313K261013j635233q587194p631143
40239A10005892J193785R716588J3881182J2600457L676012p976066q598288M775896
40231A39275458J3738547L278804j2846060j0708117O681614J2954291j882515
40224A50492022j7130937j2365165N084120J3576105O549429k971119k762334
40217A40472121L298631K364934q925593j8427547j4122278j444573L783580j655690
40209A05343585n096370k01784K789515l439659r122253m897329Q62524k161496
$$ y = [299666787, 348572801, 404806569, 441067078, 433459996, 389949799, 337377901, 289939180, 246387620, 209184945, 185893863, 173983215, 162279027, 148191711, 139050233, 136372496, 133130647, 127528762, 125598449, 127859462, 126224229, 117637035, 110005892, 111199677, 120916265, 134797447, 147397904, 151073916, 143097850, 134499562, 139275458, 153014005, 156292809, 143446749, 132738632, 139420246, 152374537, 150492022, 133361085, 120995920, 126080040, 139656145, 146205574, 143234455, 140472121, 143770752, 146135686, 137210093, 118782546, 104660268, 103215695, 106999275, 105343585, 100247215, 100045431, 102834946, 99395287, 90273034, 85375705, 86238229, 84076733]
40201H4076733o055454N92501Q594816J612286j3236802j3451734K137166J0456349
40193G4725861R34838r383872m714915P287783J2140402Q770072K539478n428911
40185H6870736j0983382m544853J1916268J9645022P863958r006844j2548402
40178H9212503o434843n470053r297238o136080L339806N722856k355390q912511
40170E9669050o612465k738932m201909n672821l42289P163293P969122L408051
40162E8641100K568176P129348Q045770p0093q814353o752393L602019Q314087
40154G2663661J802606n232406j928771P124736R870559L913090l410612p191009
40146G7611854p291022k828852M499881N432548n314792j5302805p886289J0952187
$$ y = [84076733, 78021279, 78613780, 87208596, 88820882, 75584080, 62132346, 64269512, 74725861, 75660699, 66276827, 61561912, 68849695, 80990097, 89760169, 92299647, 86870736, 75887354, 71342501, 83258769, 102903791, 110767749, 101760905, 89212503, 82777660, 77307607, 68010369, 61874289, 65214095, 70936951, 68581561, 59669050, 53056585, 50317653, 46115744, 40442923, 40100634, 47263927, 55233049, 58641100, 61209276, 68338624, 76384394, 76314301, 67499948, 60747555, 64349574, 72663661, 74466267, 69233861, 67305090, 74429826, 84300385, 88213475, 84802863, 77611854, 70320832, 67491980, 71991861, 77424409, 72109617, 56806812, 48920523, 59872710]
40138E9872710J7025360K301390j3524203j2515192j490052M772956O380653J0028290
40130G2851912J1497240L416684q175132j1216790o000009j925907p74268K849014
40122F2522744Q044217Q332061L935561J093384N30396k070230n486290m137730
40114G2764113O48563J222478m031904q127231n936289L52326N993711P204797
40106G0090564J580308q061431j2704411p333945R19782K417995j364562k700212
40098D2844088j248068j838641k769534R10986N080702J415614o282032n249050
40090C2864065N390062J1544455N697981k147608j119075M643555M459486l070967
40082E8261954j0192550j0396746l502018N029348O977185r87119j0756288j0493550
$$ y = [59872710, 76898070, 79199460, 65675257, 53160065, 51670013, 56442969, 62823622, 72851912, 84349152, 87765836, 79590704, 68373914, 62373905, 60447998, 59673730, 62522744, 70566961, 78899022, 82834583, 83927967, 84458363, 82388133, 76901843, 72764113, 73412676, 74635154, 70603250, 62476019, 56539730, 56892056, 62885767, 70090564, 71670872, 63609441, 50905030, 43571085, 44490867, 46908862, 45544300, 42844088, 41596020, 39757379, 36987845, 37898831, 42979533, 44395147, 38113115, 32864065, 38254127, 49798582, 55496563, 53348955, 52229880, 56873435, 61332921, 58261954, 48069404, 37672658, 34170640, 39199988, 46177173, 45190054, 34433766, 23940216]
40074B3940216m13393O974057M464034r99594r07574K401135K103397j255029
40066C6307249j584603K620560N913592K780741n597011j0998601n900966N925829
40058B9466790J0417192O92309j1139850r332978K193947N451652l638420r141476
40050A4969166r46313R450708P622936k712545q364606o154934j731559L627137
40042A5759990J2556184K1904331K4228578J7287135M628094j0269852k3400769
40035F2693691k7599121j8958507m291593M831255M723113J269646P80444L936458
40027B7385386P164954O026341j058090r713881j2831464q729267k408717K177954
40019H013216N124747M834981j930168j0909737j0951238M76362J1448287J1837687
$$ y = [23940216, 23526823, 30500880, 34964914, 33965320, 33057746, 35458881, 37562278, 36307249, 34722646, 37343206, 43256798, 46037539, 40440528, 29441927, 23540961, 29466790, 39883982, 40576291, 29436441, 20103463, 22297410, 27749062, 24110642, 14969166, 14022853, 23473561, 31096497, 28383952, 20019346, 13864412, 12132853, 15759990, 28316174, 50220505, 74449083, 91736218, 96364312, 86094460, 62693691, 35094570, 16136063, 11844470, 16675725, 21398838, 22668484, 23448928, 27385386, 34550340, 40576681, 39518591, 29804710, 16973246, 8243979, 5835262, 8013216, 13137963, 17972944, 16042776, 5133039, -5818199, -5341837, 6106450, 17944137]
40011A7944137O105589K393726p46869o641368r499305l831815L164999K203427
40003A1092521k015949L81110O031227M800851o43917K77936M951602J026958
39995B5902339r630144j1207888p50125O253785K673436J219214J0118817J7523387
39987D2102821J2976987O233101Q761292J2152759L497139j0221137j3467387
39980F2035575q698962j0026915j6384768j3886399k959500K55347p828687j1045246
39972h539555j248514P451932K854501m921894j144009R436767J1856126M431937
39964B0177291k600668m971121n760120m070155K375077O586085k6493j0455924
39956A253972q655790N234460J2479691L332479q505075p388257J841571M732529
$$ y = [17944137, 24049726, 26443452, 25696583, 19055215, 9555910, 5724095, 8889094, 11092521, 9076572, 9457682, 15488909, 20289760, 19645843, 19923779, 24875381, 25902339, 16272195, 5064307, 4314182, 10567967, 13241403, 14460617, 24579434, 42102821, 55079808, 61312909, 70074201, 82226960, 85724099, 75502962, 62035575, 53336613, 43309698, 26924930, 13038531, 10079031, 10334378, 2505691, -8539555, -9788069, -2336137, 518364, -4403530, -5547539, 3889228, 15745354, 20177291, 17576623, 12605502, 6845382, 2775227, 5150304, 11736389, 11709896, 1253972, -7401818, -2167358, 10312333, 13644812, 5139737, -2248520, -406949, 4325580]
39948D325580M01500n63659L729659L292806o240267j5158123j3033093k571477
39940b5817074N158698M813868R68676M5449K742801N589514O835167P197093
39932G534192N401868j741904j1986256j5719568p716062L113296M509218q58222
39924a7463438Q44157J2126299J8589467J0366432l542979j0023344r376772q138460
39916f618638m942912L554967J0671994Q145127J482366K078332P123395K990197
39908B4484828j1386197j9755536j0829605O531754J4939311P074064r651953
39901A406666j9832790j1626439J0080585K3504246J3182468q345028j4546559
39894f176851L67760J5607044J3917382R37319j0119295j6188989j8192843j2129186
$$ y = [4325580, 4727080, 4163421, 7893080, 11185886, 4945619, -10212504, -23245597, -25817074, -20658376, -15844508, -14875832, -14830383, -12087582, -6498068, 337099, 7534192, 12936060, 11194156, -792100, -16511668, -24227730, -21114434, -16605216, -17463438, -16619281, -4492982, 14096485, 24462917, 20919938, 10896594, 1519822, -6618638, -11561550, -8006583, 2665411, 10810538, 12292904, 14371236, 21494631, 24484828, 13098631, -6656905, -17486510, -10954756, 3984555, 11058619, 1406666, -18426124, -30052563, -19971978, 3532268, 16714736, 8369708, -6176851, -5809091, 9797953, 23715335, 24652654, 14533359, -1655630, -19848473, -31977659]
39886c1977659K026063J3324362J2893243N894253J811951J628934K720099O232745
39878A4553991J0274048O525817n485626j1658662l541377N618548M61232j0798990
39870E948981r135792L825846Q614378k67231p540644m303936l78844l059738
39862f296980l574243M497170J0330875L438653o973659o189253J824485J955878
39854i87074n449666m442628R278319J8779151J0308169o415435j2489179n304941
39846C276716J877626R73435k387253r52944M009937P292855O623412J737393
39838B2451177o835003j4420421j3761202m539545L772598L550392j060936j259819
39830a2102759L582405O631361M412892N62183j94683K805572O020452M214621
$$ y = [-31977659, -29951596, -16627234, -3733991, 2160262, 3972213, 5601147, 8321246, 14553991, 24828039, 31353856, 25868230, 14209568, 10668191, 16286739, 16747971, 5948981, -3186811, 639035, 9253413, 8986182, 1445538, -2858398, -3237242, -6296980, -9871223, -5374053, 4956822, 8395475, 1421816, -4767437, -2942952, -987074, -6436740, -10879368, -1601049, 17178102, 27486271, 21070836, 8581657, 3276716, 5154342, 6127777, 3740524, 2787580, 6797517, 14090372, 20713784, 22451177, 15616174, 1195753, -12565449, -17104994, -13332396, -9782004, -10842940, -12102759, -8520354, -1888993, 2523899, 3086082, 2891399, 5696971, 11717423, 15932044]
39822A5932044l864109j0612110o413102N711102J0810494K747992n854532k888834
39814E568945M813580M522001j043667j230018J693640k289250r991999r026705
39806f983473l59580L149824n5958P53999N648143K129196j0277234j5477176
39798b1472259o802338L225118N627872O455401Q312850K831395q699988r789962
39790b0311911L938517J3637539P000108k538723j431200J358363m812184j0406640
39782a3566131n116513J098463j683338j876989J0512099J8938930O450881j0891105
39774C866297q105684N982226M597471r428461r451490O887252J3794107K792714
39766A0934432m582895L868197J2137022O559353l702197q089040j0774719j3591256
$$ y = [15932044, 12067935, 1455825, -4957277, 753825, 11564319, 14312311, 8457779, 5568945, 10382525, 14904526, 13860859, 12630841, 14324481, 12035231, 2043232, -6983473, -7343053, -4193229, -4249187, -3495188, 2152955, 4282151, -5995083, -21472259, -28274597, -25049479, -19421607, -12966206, -4653356, -1821961, -10521949, -20311911, -16373394, -2735855, 4264253, 1725530, 294330, 1652693, -3159491, -13566131, -18682644, -17584181, -19267519, -21144508, -10632409, 8306521, 14757402, 3866297, -4239387, 1742839, 6340310, -3088151, -12539641, -5652389, 8141718, 10934432, 6351537, 10219734, 22356756, 28916109, 25213912, 17124872, 6350153, -7241103]
39758g241103o857643R475412J6997513N656938q604102p306175M677336J0442400
39750A7240576N742431o93575k393098l8891K564630J136241m548019o996464
39742A2013831p3444R108829Q562760n6916n092515m909243p550827j1626968
39734C75507o938007M565781Q430444J393666l979871j605939R84063R49366M336250
39725H511260Q187527J376691j1465899j1227117L376534J0265933Q4074q777716
39717C31287l407883K697417k049611m881464N194432J3219287L831092r697869
39709E236688p077015N406741Q139878P36603l596355m081311q035869j0542885
39701a3813525k553124Q635373R469480L396771K794023N447905P71541p790705
$$ y = [-7241103, -14098746, -4623334, 12374179, 18031117, 9427015, 2120840, 6798176, 17240576, 22983007, 22289432, 19896334, 19857443, 22422073, 23558314, 19010295, 12013831, 11940387, 21049216, 29611976, 29555060, 24462545, 19553302, 12002475, 375507, -6562500, -1996719, 6433725, 7827391, 3847520, 2241581, 3225644, 4175010, 8511260, 16698787, 18075478, 6609579, -4617538, -1241004, 9024929, 9109003, 331287, -3076596, -379179, -2428790, -7310254, -2115822, 11103465, 14934557, 5236688, -1840327, 3566414, 11706292, 12442895, 8846540, 4765229, -3270640, -13813525, -16366649, -7731276, 1738204, 5134975, 7928998, 13376903, 14148444, 6357739]
39693F357739q659224m006468l820166m468306L830585J3738135R591733l837810
39685H726218o475956L963726Q919977P92647o307400k200600M910147N913492
39677A8242251L426467M33048o186128j4094212j3462320l168366N270088N505510
39669d033662L918515M382815Q42698p981069j1252584k557061Q333128R686365
39661A339145L865183N1053m76774k144081m205718j502231O236929J2321129
39653A5484635R874218j734693j5573532k1588774j5207282k023209Q172864J0800885
39645a1794888P860987L464827J735316M969819R257313O600357l694851j1658068
39637F740812j0193013m415845p02516L862069J1226715J2222807P77794j0665606
$$ y = [6357739, -2301485, -6307953, -10128119, -14596425, -10765840, 2972295, 12564028, 8726218, 2250262, 6213988, 15133965, 15926612, 9619212, 7418612, 12328759, 18242251, 21668718, 22101766, 15915638, 1821426, -11640894, -14809260, -9539172, -4033662, -115147, 4267668, 5110366, -2870703, -14123287, -16680348, -8347220, 1339145, 5204328, 5255381, 4778607, 2634526, -1571192, -3073423, 3163506, 15484635, 25358853, 23624160, 8050628, -13538146, -28745428, -30768637, -22595773, -11794888, -3933901, -469074, 1266242, 6236061, 15493374, 22093731, 18398880, 6740812, -3452201, -7868046, -8570562, -4708493, 6518222, 18741029, 19518823, 8853217]
39629H853217o892826N381709P106908l000548q085732j956263K514439k846713
39621A074191q152365k541450R807384J7189185J3073431j927510j9804680k5659677
39613a6941491j1268319J0339502J7170934O441371l825949k362242L010285L746828
39605F310919L143861M023482R90690o219318p140221J581248O716443j873627
39597G533477j4166251j4629457m135677M810392O997683O864886P210923O141561
39589F627537K658224k032694o571722q633888n761916K22617M360334N469158
39581c662350N857986M316628j750815p199366l618158N505650O970486j561423
39573D858638o937371j556610N175046L781368n55258M02295L725428L250261
$$ y = [8853217, 1960391, 7342100, 14449008, 11448460, 3362728, 1406465, 3920904, 1074191, -7078174, -9619624, 187760, 17376945, 30450376, 28522866, 8718186, -16941491, -28209810, -17870308, -699374, 5741997, 1916048, -446194, 2564091, 6310919, 9454780, 13478262, 14468952, 8249634, 1109413, 2690661, 9407104, 7533477, -6632774, -21262231, -25397908, -20587516, -13589833, -6724947, 485976, 6627537, 9285761, 7253067, 681345, -7952543, -13714459, -13491842, -9131508, -3662350, 2195636, 6512264, 4761449, -2437917, -6056075, -550425, 6420061, 4858638, -2078733, -3635343, 1539703, 5321071, 4765813, 5168108, 8893536, 12143797]
39565A2143797J547544L294752N100448J874682l789704o916224p583239o204324
39557e32268j3083Q841463J1263010M538880k373957l877475o059886j1739611
39549D7073j1056020J327250J2726426J0260865Q89454j384050K000486Q60404
39541A5671888l405729j944645L370452L391450r25283r30453L418789M983669
39533B3630138L391141K388860k064389j4090426k2352778j1664372J0763496
39526i998330K0314247Q406564p251514r682119k695351J860320J379091o79839
39518A653069l105635m730676l113230l00987j239925l857417r15421O204246
39510i405976P567683J621991r13924N106231J0514359P496981J738804P85551
$$ y = [12143797, 13691341, 16986093, 22086541, 23961223, 20171519, 13255295, 5672056, -532268, -545351, 8296112, 19559122, 24098002, 21724045, 17846570, 11786684, 47073, -11008947, -9681697, 3044729, 13305594, 14195048, 12810998, 14811484, 15671888, 12266159, 10321514, 13691966, 17083416, 16158133, 15227680, 18646469, 23630138, 27021279, 29410139, 27345750, 13255324, -9097454, -20761826, -9998330, 10315917, 18722481, 11470967, 1788848, -906503, 953817, 2332908, 1653069, -1452566, -6183242, -9296472, -9597459, -10837384, -14694801, -15610222, -9405976, -1838293, -216302, -1130226, 3976005, 14490364, 21987345, 23726149, 24511700]
39502B4511700J236844l008591q492597p777904r62860O213687R989840Q134965
39494B9845084j083254j2896795j6288464p493972L454596O464495M098610L067504
39486I167804J650821m125216q947429m969677M296654Q573333O371995M706877
39478A6725162N519560M040101k40117k675846l803969q627118j3928531r086098
39470a2076856N693341J4024408M486892j2036531j6238299n584387N236282N999910
39462a0495240J575114R917O32298r47368l297439j765594K714250M298693J232754
39453f042615j589337k49785K693322K720980j45121k461240k636724j729787
39445i440307l31570J940983M088659L531340j352997r359331j5849194j3566577
$$ y = [24511700, 25748544, 22739953, 14247356, 6469452, 5506592, 11720279, 21710119, 29845084, 28761830, 15865035, -423429, -7917401, -4462805, 2001690, 6100300, 9167804, 10818625, 6693409, -2254020, -7223697, -2927043, 5646290, 12018285, 16725162, 22244722, 26284823, 26044706, 23368860, 19564891, 10937773, -2990758, -12076856, -6383515, 7640893, 12127785, 91254, -16147045, -21731432, -16495150, -10495240, -8920126, -8910209, -8277911, -9225279, -12522718, -14288312, -11574062, -7275369, -6042615, -7631952, -7881737, -5188415, -2467435, -2612556, -5073796, -7710520, -9440307, -9771877, -7830894, -3742235, -210895, -1563892, -10923223, -26772417, -40338994]
39437d0338994J492130K1306575K7960927J2587798r914544j5127306N76385J4572373
39429A3115344P819054j0102566j5353265k233691J1501054J0183925j298430
39422A3631425p912820m027707L298494N274405Q288p540712j0618909o910985
39414a4798521j088568R35005K50240L043643R683934J2065331N332614l797929
39406A1625749o034879j995128J040298Q89249Q43801R13098j784884m497084
39398A000220j062376N713095M786434n701210j2537130o388642L160064K207097
39390h822448n456007m788750N673773J1015272L549652n414858l526536M697743
39382c072159O746203N13475o039719q171840p247364l502228L866337J0071547
$$ y = [-40338994, -38846864, -17540289, 10420638, 23008436, 13093892, -2033414, -1457029, 13115344, 20934398, 10831832, -4521433, -6755124, 4745930, 14929855, 13631425, 5718605, 1690898, 4989392, 10263797, 10272085, 2731373, -7887536, -14798521, -15887089, -14952084, -14701844, -11658201, -1974267, 10091064, 15423678, 11625749, 5590870, 3595742, 4636040, 5525289, 6369090, 7282188, 5497304, 1000220, -62156, 5650939, 10437373, 4736163, -7800967, -14189609, -11029545, -8822448, -14278455, -19067205, -13393432, -2378160, 1171492, -4243366, -7769902, -3072159, 3674044, 4187519, -1852200, -10024040, -17271404, -20773632, -16907295, -6835748]
39374f835748P961080m66840m339095J059588P180485N133822q90311o44800N634563
39365A3792744P010772j505652j0845084j0549935l034773J409806l6012q20046
39357d578180J993000K091692m713320j0981557o934050M538433J0435591M876351
39349c272040l555117l696732M503012J1485110J0046741K538125l063266k663661
39341A2322172r52390n101801j3215931j3775219q17326J4899818J7520291O565048
39333A7444662l246835k385674L215550M332773Q28256k705385m892510n414029
39325G176808k417602K059719J451898m293979m964751M754170J4146604J0552533
39317B8465400j678525p695061l202662K812536L482851N2827n832947j3225080
$$ y = [-6835748, 1125332, 658492, -3680603, -2621015, 4559470, 9693292, 8802981, 8158181, 13792744, 20803516, 19297864, 8452780, -2097155, -5131928, -3722122, -3758134, -4578180, -2585180, -493488, -5206808, -16188365, -23122415, -18583982, -8148391, -3272040, -6827157, -10523889, -6020877, 5464233, 15510974, 18049099, 14985833, 12322172, 11369782, 6267981, -6947950, -20723169, -21540495, -6640677, 10879614, 17444662, 14197827, 11812153, 15027703, 19360476, 20188732, 17483347, 12590837, 7176808, 4759206, 6818925, 8270823, 3976844, -987907, 3766263, 17912867, 28465400, 26786875, 19091814, 15889152, 18701688, 22184539, 22237366, 16404419, 3179339]
39309C179339j5417227n415666J0159953J5042717M790990p056870q559821l721069
39301f997654j339483n76915L587006Q786861Q969183M699062J228721l02821
39293A8053960k298704l986458k303424J604362K434711k477312r407877j1212647
39285i593389l762355Q362718J3583349N653862o413207p811919K570227J1029251
39277A3618537Q623846J101980l772425o396203p179239j540168Q198702R069621
39269B1724651k889117j1898228n355759N002812K346019o500376l651434P109872
39261E888440O497307m995967o817123M364202O932562p324660j6109405l322601
39253a4887245J2753367Q857720o240377q351263L461798J0285161N725312j17796
$$ y = [3179339, -12237888, -17653554, -7493601, 7549116, 12340106, 5283236, -3276585, -6997654, -8337137, -8914052, -5327046, 3459815, 12428998, 17128060, 18356781, 18053960, 15755256, 11768798, 9465374, 11069736, 13504447, 11027135, 1619258, -9593389, -13355744, -4993026, 8590323, 14244185, 7830978, 19059, 2589286, 13618537, 22242383, 23344363, 19571938, 13175735, 5996496, 4456328, 12655030, 21724651, 18835534, 6937306, 1581547, 6584359, 8930378, 2430002, -1221432, 5888440, 12385747, 7389780, 572657, 4936859, 11869421, 4544761, -11564644, -14887245, -2133878, 6723842, 483465, -7867798, -4406000, 5879161, 11604473, 11486677]
39245A1486677l238737q219342j1037213k669908J0343010J1056309n51229o634783
39237E34784o64392M024853j64091k880109K458153N774614O84274j678192O440001
39228A4529895J2115028K732426j0188061q014241M661221P814075k266637j0248705
39220A1135001q162472l891958k486202J283914P487246O176096m735421j1993363
39212e187159o409628L010146M235686L20511R10116M822620M210695o8770q72768
39203D971449R89763j398974o463373n448348Q95001J694127m324733m011359
39195a3096447P463691J4308099L824581j0216904o239776J0876355J5862865
39188B2782464J722840j0638788o210735K939002J165552n604216m153282J788235
$$ y = [11486677, 8247940, 28598, -11008615, -13678523, -3335513, 7720796, 7169567, 534784, -129608, 3895245, 3731154, 851045, 3309198, 9083812, 9768086, 8089894, 14529895, 26644923, 29377349, 19189288, 11175047, 15836268, 23650343, 21383706, 11135001, 2972529, -919429, -3405631, -2121717, 5365529, 11541625, 6806204, -5187159, -11596787, -8586641, -4350955, -4030444, -3120328, 1702292, 5912987, 5844217, 4971449, 5961212, 4562238, -1901135, -7349483, -6454482, -4760355, -9085088, -13096447, -5632756, 8675343, 12499924, 2283020, -3956756, 6919599, 22782464, 24505304, 13866516, 7655781, 10594783, 11760335, 6156119, 2002837, 3791072]
39180C791072N04843m925104k656559N466045O872668J30533m561376m438254
39172A83868n544216o620714o21932P856758O395463k674227l842360M849962
39164a7398Q206790J270023k951944o0574l385194j5203958j4785688P473188
39156a9454755K7431688K0563698j489214j1495110p022917m214025m972430Q42096
39148A89031R203484O857657j966350j179709P248367O051294n114092p791415
39140A3498267K170204O944212j358987o979606J103032J0066467N584802n538579
39132B5489812r031543m685082r46597L90435K106697L058378J386089q83598
39124A6884591k541227m772954m766373J929390R835122P100225n239145j1390190
$$ y = [3791072, 4295915, -629189, -3285748, 2180297, 9052965, 9183498, 4622122, 183868, -5360348, -11981062, -12602994, -4746236, 1649227, -1025000, -4867360, -17398, 8189392, 9459415, 6507471, 6446897, 3061703, -12142255, -26927943, -19454755, 7976933, 28540631, 27051417, 15556307, 8533390, 4319365, -653065, 189031, 9392515, 16250172, 14283822, 13104113, 20352480, 26403774, 21289682, 13498267, 15668471, 22612683, 21253696, 14274090, 15377122, 25443589, 31028391, 25489812, 16458269, 11773187, 10826590, 11217025, 13323722, 16382100, 17768189, 16884591, 14343364, 9570410, 4804037, 6733427, 16568549, 23668774, 18429629, 7039439]
39116G039439l982719M761108K483363n567685o912739N65938R186865J1151308
39108A8724878L171717r382948j1860597L289982J9675263J4418629o260477j2032481
39100A9743966N217810J6980023L414883j3636391m620880K1831812L2900811
39093H1832034J7676028n863124k0623252k3743089j6803886m374396K039096
39086C0139411l067311p715313n84242Q027040K884400p757341m187560J0399779
39078B8138863J3631328M28109j0085485o407665Q15043J073003j342996j788625
39070B4461575m378498q680116n251965O864749J4095359Q300626j599267n680051
39062B8132412o179842o518446k145168P320015J0344327J27j2496607j2832019
$$ y = [7039439, 3056720, 7817828, 10301191, 4733506, -2179233, -1613295, 7573570, 18724878, 21896595, 12513647, 653050, 3943032, 23618295, 38036924, 31776447, 19743966, 24961776, 41941799, 45356682, 31720291, 27099411, 48931223, 81832034, 99508062, 93644938, 73021686, 49278597, 32474711, 28100315, 30139411, 27072100, 19356787, 18772545, 26799585, 29683985, 21926644, 17739084, 28138863, 41770191, 42198300, 32112815, 25705150, 26520193, 27593196, 26250200, 24461575, 20083077, 11402961, 6150996, 13015745, 27111104, 35411730, 33812463, 28132412, 21952570, 15434124, 13288956, 20608971, 30953298, 30953425, 18456818, 5624799]
39054E624799l444740L277615L917933L848111L835306k29989o287307o238500
39046D303228J696171Q832131O815644j799129o220844J29913J0673044J1332885
39038C5763043k327315j6683319j4918214J415037J4184425J2339952L747828
39031C3521437J77198J022366o47216m009829k931862J033468j137352j1153724
39023A5874486j7085081p291507J2716415K3803852J4989847l386528j2648712
39016B6972772p936790J72352L797006N816037P732890L284391p813487j2258042
39008A9767129j734493J0665035P642090n718069r528374O01799Q852234M613296
39000C5160647m532232p922733m966289M23832N699205P050405K524671j292138
$$ y = [5624799, 2180059, 5457674, 9375607, 13223718, 17059024, 16829035, 10541728, 4303228, 5999399, 14831530, 21647174, 19848045, 13627201, 13757114, 24430158, 35763043, 33435728, 16752409, 1834195, 3249232, 17433657, 29773609, 33521437, 33698635, 34721001, 34073785, 30063956, 27132094, 28165562, 27028210, 15874486, -1210595, -8502102, 4214313, 28018165, 43008012, 39621484, 26972772, 19035982, 19208334, 23005340, 28821377, 36554267, 39838658, 32025171, 19767129, 18032636, 28697671, 36339761, 30621692, 21093318, 21695117, 30547351, 35160647, 30628415, 22705682, 17739393, 18163225, 23862430, 30912835, 33437506, 32145368]
38992C2145368K002294M664473m529163j7173634j3514579M418840J1981538P74131
38984B0769268p401614K221418J2093054L618165r250453l327959J3787520J5978738
38976D8488137Q59890r549393o083761j959654m530641m267663L140833P424266
38968C3522014L885415J971976N292744L119690p636362j1318137J554517J5211101
38960D5602958J1636416j055149k920173N289358O355072j603918j842796J0382615
38952G1844383J7067649O191290q150035p764495K425322N676150J139585Q51245
38944H9281094M535147j064989j6165242k1647228o624306J3903217J9638746
38937H1856439J0594386L57531n350231r336914r986319l106687O812050J0836619
$$ y = [32145368, 34147662, 38812135, 34282972, 17109338, 3594759, 8013599, 19995137, 20769268, 13367654, 15589072, 27682126, 31300291, 22049838, 18721879, 32509399, 48488137, 49348027, 39798634, 33714873, 31755219, 27224578, 22956915, 26097748, 33522014, 37407429, 39379405, 44672149, 47791839, 40155477, 28837340, 30391857, 45602958, 57239374, 56184225, 53264052, 58553410, 64908482, 63304564, 61461768, 71844383, 88912032, 95103322, 86953287, 79188792, 81614114, 87290264, 88429849, 89281094, 93816241, 92751252, 76586010, 54938782, 48314476, 62217693, 81856439, 92450825, 92808356, 87458125, 78121211, 68134892, 65028205, 71840255, 82676874]
38929H2676874R012766P724739O874058K664970q3904O414788J6497569J6750908
38921A48532768Q664320Q305256K0593313L1516083L0886306K5010468J9760141
38914B93268655R554834o561439j5776926j1929021r104561j9436275l1924833
38907B08090434l0951667k2506813k1352885k3094130j3052257L560769O145083
38900A06838534p596353j7345122j2682133o308512q113123q699104k36636N928325
38892E1785876j717385j2587110q316780R178185K0654822J6320416M841348l020419
38884G7138953o426475q355740q065339l797230L038320R405676J2779757J1075870
38876H6793792M690372p92417J281368R864434J5317815R841097l695354j5587177
$$ y = [82676874, 91689640, 99414379, 106288437, 108953407, 108869503, 115284291, 131781860, 148532768, 157197088, 165502344, 186095657, 217611740, 248498046, 273508514, 293268655, 302823489, 296262050, 280485124, 268556103, 259451542, 240015267, 208090434, 177138767, 154631954, 133279069, 110184939, 97132682, 100693451, 106838534, 99242181, 81897059, 69214926, 62906414, 54793291, 46094187, 45857551, 51785876, 50068491, 37481381, 29164601, 38342786, 58997608, 75318024, 80159372, 77138953, 70712478, 62356738, 54291399, 50494169, 53532489, 62938165, 75717922, 86793792, 91484164, 90691747, 91973115, 101837549, 117155364, 126996461, 123301107, 107713930]
38868A07713930j9573243j6328942q809610Q65921R184027J1054655N662933n76282
38860H9193389j547642J31678k298272q247662j0287397o445904l188524l386276
38852E3923390r95299O442438R648712J380127r500787r708094j776387J107218
38844E0521318k690227j811247O960594J2152432O269694l543321r295351j2519319
38836D6044573j3498536n004784J1936085J9612118O101083j4034608j8344014
38829C2811917p970794j748027m192889j630327R359884J2900114P70458j1685815
38821B8614521q866216J644675L696611j278342J82285Q626601R983056j686948
38813D0916243j4190752j3396729k12145J2109035J2412637J851099p372875m520893
$$ y = [107713930, 88140687, 71811745, 63002135, 63868056, 73052083, 84106738, 89769671, 89193389, 87645747, 87777425, 85479153, 77231491, 66944094, 60498190, 57309666, 53923390, 52928091, 59370529, 69019241, 70399368, 60898581, 51190487, 49414100, 50521318, 47831091, 46019844, 52980438, 65132870, 71402564, 67859243, 58563892, 46044573, 32546037, 27541253, 39477338, 59089456, 65190539, 51155931, 32811917, 24841123, 23093096, 18900207, 17269880, 26629764, 39529878, 40300336, 28614521, 19748305, 21392980, 25089591, 23811249, 23993534, 32620135, 42603191, 40916243, 26725491, 13328762, 13116617, 25225652, 37638289, 39489388, 32116513, 27595620]
38805B7595620O485495J0880865K910535o080518n531372j794901n477013j1807485
38797A7181226r229656j493698k468533j0772690r644410N102738J6295812J0960817
38789A5931606k442497j0110599j0129191m814772P752085K2816280K4654217
38782D3657129P506704j1444385j4562989p838452o872889r970654m496381P229928
38774C208011R387210j646496j1498193r232438M8415N900594M140219l049498
38766b742176q848065m946075P680627J4837688O664250o043949o160052M300355
38758D742603Q527071R01446q194823j1195450r644637l352544Q352488J5231135
38750E367289N674971j1386715j4367501r48725R069825O089686K581080O383320
$$ y = [27595620, 34081115, 44961980, 47872515, 41791997, 36260625, 34465724, 28988711, 17181226, 7951570, 6457872, 3989339, -6783351, -16427761, -11325023, 4970789, 15931606, 13489109, 3378510, -6750681, -11565453, -3813368, 19002912, 43657129, 51163833, 39719448, 25156459, 17318007, 10445118, 474464, -4021917, 3208011, 12595221, 10948725, -549468, -9781906, -9733491, -3832897, 307322, -2742176, -11590241, -16536316, -8855689, 5981999, 12646249, 6602300, 442248, 4742603, 13269674, 14171120, 5976297, -5219153, -14863790, -18216334, -9863846, 5367289, 11042260, -344455, -14711956, -15660681, -6590856, -501170, 2079910, 8463230]
38742H463230O707507k521945q726783l817581N08498l667340l037468J1512265
38734E420383K1874028Q965113j3158800j5539539K885323J6251834J0264417
38727C6962759m138820j3213166j4291703p350200O842602J8215796J5060771
38720C8088039K838537o35632R040236J7544742J4806006P390313L610961J305497
38712I3988699l199353o789237p319494q988145j3134921j3195787n825226J383298
38704C6919834P34023l970229m358538o99003k24178n243678j0191200r863165
38696C103866n185896l15061K251322K516434J217867r70651k753233k270234
38688b405586Q28916L931511L906840R96803j520814j260181J633513N463641
$$ y = [8463230, 15170737, 12648792, 3922009, 104428, 612926, -3054414, -6091882, 5420383, 27294411, 36259524, 23100724, 7561185, 10446508, 26698342, 36962759, 32823939, 19610773, 5319070, -2031130, 4811472, 23027268, 38088039, 40926576, 40290944, 49331180, 66875922, 81681928, 89072241, 92683202, 93988699, 90789346, 84000109, 76680615, 67692470, 54557549, 41361762, 35536536, 36919834, 37653857, 33683628, 29325090, 28626087, 28401909, 23158231, 12967031, 3103866, -2082030, -2397091, -145769, 2370665, 3588532, 2617881, -135352, -2405586, -1576670, 2354841, 6261681, 7258484, 5737670, 4477489, 6111002, 11574643]
38680A1574643O603366O81280j0290732j4527353l117474J4270518J7416283K299017
38672B4909548j1776596q293593M019166M962812q472707j9179910j2879163N961138
38664b0749305K0959377J9990197N014929r632497j0124378K401967J2894247
38657B0754537J0532643J343714j235227O054074J3170117Q947401o790132k1875280
38649C0901847k2737516r663003J887189J003941l372386K065546J0807863O298788
38641A7192269o996214o529485J0473973J8611041M584844j0408757n849666N026166
38633B6104171O95492j0802242q107001L992075K762998j2117009j7193031l270628
38625a7935175J2363509J4245669O116006l317348j1305055j3640706m685175
$$ y = [11574643, 18178009, 18859289, 8568557, -5958796, -9076270, 5194248, 22610531, 24909548, 13132952, 4839359, 8858525, 13821337, 5348630, -13831280, -26710443, -20749305, 210072, 20200269, 25215198, 15582701, 5458323, 7860290, 20754537, 31287180, 32630894, 31395667, 37449741, 50619858, 59567259, 52777127, 30901847, 8164331, -1498672, 388517, 1392458, -1979928, 85618, 10893481, 17192269, 10196055, 3666570, 14140543, 32751584, 37336428, 26927671, 21078005, 26104171, 26799663, 15997421, 7890420, 11882495, 14645493, 2528484, -14664547, -17935175, -5571666, 8674003, 14790009, 11472661, 167606, -13473100, -18158275]
38618a8158275J0225611J7019735J0777230n48900r525947j3410748q193170N735937
38610f078527J4744245N983054j1391955j6072888l995125R222130J2758228R193073
38602A4362235J296705r697174j4236805l803312J0492349R687896l326296p859371
38594c083773J490697R519432Q408925N771920L321305n658189j4643693q205396
38586c078772P189569P028773r201278j2386615P694287K1502972N960827j8540826
38578F168937k0565026k607045J0514374Q753722j66924q338198q801813M422451
38570a0619522K0601951J5941695r778948k3022561m051089J9485450J3292316
38563B1849292j1471705j8925114m025881P605906M558212l63922J59832j08731
$$ y = [-18158275, -7932664, 9087071, 19864301, 19315401, 9789454, -3621294, -11814464, -6078527, 8665718, 14648772, 3256817, -12816071, -16811196, -7589066, 5169162, 14362235, 15658940, 5961766, -8275039, -12078351, -1586002, 8101894, 4775598, -3083773, -1593076, 7926356, 16335281, 22107201, 25428506, 19770317, 5126624, -3078772, 4110797, 11139570, 1938292, -10448323, -2754036, 18748936, 24709763, 6168937, -14396089, -17003134, -6488760, 2264962, 2098038, -6240160, -15041973, -10619522, 9982429, 25924124, 16145176, -6877385, -10928474, 8556976, 21849292, 10377587, -8547527, -12573408, -4967502, -409290, -773212, -613380, -722111]
38555g22111j281148K744098O514054M51691p187728j287383J0985753R063562
38547A9280788n614175j1403332l130726K042948k574112l677355L785125P003104
38539E712265J418164k33216N800213M693402q713266j6275353n370516R786041
38531c182266J1153029L118837n7837K400410K866767J075085j01077m046503
38523A3226445j2169989j5873035q989397Q13638M136230L757500N478539N500155
38515d119914m38452n073241j015227L973624j368714j0729618p576936Q441967
38507a7906511J8805828J2049635j335505n213122J085132N282536N00244o437195
38499F831042n263828L625221R130136L836693n824116q209333k222071K889414
$$ y = [-722111, -2003259, 740839, 7254893, 7706584, 518856, -768527, 10217226, 19280788, 13666613, 2263281, -867445, 1175503, -1398609, -5075964, -1290839, 5712265, 7130429, 6897213, 12697426, 17390828, 8677562, -7597791, -12968307, -3182266, 7970763, 11089600, 11031763, 13432173, 16298940, 17374025, 17272948, 13226445, 1056456, -14816579, -23805976, -22992338, -18856108, -15098608, -9620069, -4119914, -4558366, -9631607, -10646834, -6673210, -8041924, -18771542, -26348478, -17906511, 899317, 12948952, 11613447, 6400325, 7485457, 12767993, 13268237, 6831042, 1567214, 5192435, 14322571, 18159264, 12335148, 4125815, 1903744, 4793158]
38491D793158K440963J458983K951427J523098n617787j0534017n821025K807387
38483e997813M594390k79063k555709J145719N221084N890976N269237L915764
38475A7204585r60941p058632o002423L722902J0539526M395422p503853r407421
38467D929165K91703O205524j324770j1288220p906417N769643J1904798L528471
38459A2109897o379966m648866M114328O538157Q6297n495919l156065L324169
38451F492032N849870P80826r026074j6710582j6075357p118309L435437R227200
38443b3144957J0105975Q918804O111450J403299k473533k693398q01798L14795
38435b259363J542403M633555O560471K861901m265174p125432k368027M762197
$$ y = [4793158, 7234121, 8693104, 11644531, 13167629, 7549842, -2984175, -8805200, -5997813, -1403423, -1682486, -4238195, -3092476, 2128608, 8019584, 13288821, 17204585, 16243644, 9185012, 3182589, 6905491, 17445017, 21840439, 14336586, 4929165, 5220868, 11426392, 10101622, -1186598, -9093015, -3323372, 8581426, 12109897, 5729931, 1081065, 5195393, 11733550, 11819847, 6323928, 3167863, 6492032, 12341902, 13122728, 4096654, -12613928, -28689285, -35807594, -32372157, -23144957, -13038982, -4120178, 1991272, 3394571, 921038, -1772360, -2574158, -2259363, -716960, 3916595, 10477066, 13338967, 9073793, 1948361, -419666, 4342531]
38427D342531O857751J969818n559529r579934p315973j298255M178036P920798
38419A515243J0752960J0823155N246455l381769q337769p723192n482934k862666
38411E49483K468026P414703M601305m041909p028462j870510k80537p327915
38403e515816j0649957j892418O433244J264076p432345k573506J1253579J6147368
38395G034225J0125711N523296L669100m836552j6637434j6663795m087238N179580
38387a0693107M379727K734778M024865J218314l763417P89244J1326627Q479524
38379A8496555r337511j7846278n512046N768522l380755j7310156j1987036N630064
38371c5478641J1596699M342076K051919Q935855J1400745M913556p7036N55627
$$ y = [4342531, 11200282, 13170100, 7610571, -1969363, -9285336, -10583591, -6405555, 1515243, 12268203, 23091358, 28337813, 24956044, 16618275, 8895083, 3412149, 549483, 3017509, 10432212, 15033517, 10991608, 3963146, 2092636, 1812099, -5515816, -16165773, -18058191, -11624947, -10360871, -17793216, -20366722, -9113143, 7034225, 17159936, 22683232, 26352332, 21515780, 4878346, -11785449, -15872687, -10693107, -6313380, -3578602, 446263, 1664577, -2098840, -1309596, 10017031, 18496555, 9159044, -8687234, -14199280, -8430758, -11811513, -29121669, -41108705, -35478641, -23881942, -19539866, -17487947, -8552092, 2848653, 7762209, 7685173, 8240800]
38363H240800p21938m924336k902425N916127Q685092q95175j2024729j2703062
38355a1329646m928946J846487L299029J100345j581980j495127K232334N217529
38347e639975K735880k625947m551937l134923l527262n188497j782229P021387
38339a6693503J2520573Q528319r44834p908893q471352l257492M364549Q995792
38331b866841P403107L057651J867697L615524K981728j468634n457216o104295
38323C028721m953563l921768l713758n457520q160431o330071K860670J2091528
38315a4556192J2076099N491553K665320M393682J432634p394170j0327674j385099
38307g603847Q504413P409628o22470m163235j851736l99288j057003K53759K500370
$$ y = [8240800, 7518862, 2594526, -307899, 5608228, 14293320, 13398145, 1373416, -11329646, -16258592, -14412105, -11113076, -10012731, -11594711, -13089838, -10857504, -5639975, -2904095, -5530042, -10081979, -13216902, -16744164, -21932661, -23714890, -16693503, -4172930, 4355389, 3410555, -4498338, -12969690, -16227182, -11862633, -2866841, 4536266, 7593917, 9461614, 13077138, 16058866, 14590232, 9133016, 3028721, -1924842, -5846610, -9560368, -15017888, -23178319, -29508390, -26647720, -14556192, -2480093, 3011460, 5676780, 10070462, 11503096, 4108926, -6218748, -7603847, 900566, 8310194, 7687724, 3524489, 1672753, 1273465, 216462, 470221, 2970591]
38298B970591O99613l410731k683136K596027L553437k613642o496408o82225
38290f066474P556339N874927n021178j1766436o431461L863477Q173111O158842
38282B341147N702591R295409R858380J469657j0879631j6107300r813344J090674
38274g042417O390938K921315l589746n538245j288839L925932M497401Q35444
38266A111783j842903n13253J983516Q37846m818238j0584435j0273769j274384
38258b5373837J1179336J5965689O886714p702160j1728335r07378J0224488O217549
38250D762066q878000j6677860q099406O711211J3261939R710626M905267M796712
38242A0492555O486656M267068k714981r538084j0746243o150108j229150q55376
$$ y = [2970591, 3670204, 259473, -2423663, 172364, 3725801, 1112159, -5384249, -6066474, 1489865, 7364792, 2343614, -9422822, -15854283, -11990806, -3817695, 2341147, 8043738, 17339147, 27197527, 28667184, 17787553, 1680253, -8133091, -7042417, -651479, 2269836, -1319910, -6858155, -8146994, -4221062, 276339, 1111783, -731120, -1244373, 739143, 1576989, -3241249, -13825684, -24099453, -25373837, -14194501, 1771188, 8657902, 955742, -10772593, -11679971, -1455483, 4762066, -4115934, -20793794, -28893200, -22181989, -8920050, 790576, 5695843, 10492555, 16979211, 21246279, 18531298, 8993214, -1753029, -7903137, -9132287, -9987663]
38234i987663l259283k539933K794231P036605M799287j307659l730552R2976
38226f101991M395067L097647j494529j658356M262285P964237K128175q112875
38218D479660j0769437l476458K916102k04843p206269p148758P07152P806387
38210a2896464R419614Q360027O674826K587515k902043m807992k814727l508147
38202A12609r138764j1255881k862780Q254701P980495l730514j0862243k477319
38194b3979696J2385697J6804981P598690k946835n086433k612058l328305o067334
38186g231293l884356L400505P797956M533857j973509n554675n698410m344085
38178a2954010j079008L589771N214231K028302N13718O457532J3274474R076061
$$ y = [-9987663, -13246946, -15786879, -12992648, -5956043, -1156756, -2464415, -6194967, -6101991, -1706924, 1390723, -103806, -1762162, 2500123, 10464360, 12592535, 4479660, -6289777, -9766235, -6850133, -7054976, -14261245, -21410003, -20702851, -12896464, -3476850, 4883177, 11558003, 14145518, 11243475, 6435483, 3620756, 112609, -9026155, -20282036, -23144816, -14890115, -6909620, -10640134, -21502377, -23979696, -11593999, 5210982, 12809672, 9862837, 4776404, 2164346, -1163959, -7231293, -11115649, -7715144, 82812, 4616669, 2643160, -2911515, -8609925, -12954010, -14033018, -10443247, -5229016, -3200714, -2686996, 3770536, 17045010, 26121071]
38170B6121071m781846j2968607p162141K387032K427239m815343p561654k806667
38162i160916J948050K663709L371275N813075M548908l280340j0658653r196540
38154a3951432r21977M183227Q80726n751827p473928k312916M236531N882633
38146a5228963K026070k714285m552332l941196k293068J208346O218696P926235
38138a1350497L041701k606525k15528P772522Q656517j826649j1142860p441333
38130a5112652K488091L176010o198699j0602429j091433J3088827J7292080Q072245
38122A1112040o364724j5571075j3519302j975962R274200J0462495K636929m247896
38114h193295m886353l293079k574266L87846N623304N524843k568366p930032
$$ y = [26121071, 21339225, 8370618, 1208477, 3595509, 6022748, 1207405, -6354249, -9160916, -7212866, -4549157, -1177882, 4635193, 9184101, 5903761, -4754892, -13951432, -14873409, -10690182, -9809456, -15561283, -23035211, -25348127, -21111596, -15228963, -13202893, -15917178, -20469510, -24410706, -26703774, -25495428, -19276732, -11350497, -8308796, -10915321, -11130849, -3358327, 5298190, 3471541, -7671319, -15112652, -12624561, -9448551, -15647250, -26249679, -27341112, -14252285, 3039795, 11112040, 4747316, -10823759, -24343061, -26319023, -17044823, -6582328, -3945399, -8193295, -13079648, -16372727, -18946993, -18559147, -12935843, -7411000, -9979366, -17909398]
38106a7909398j012697R925854R001994l708975j1549870m546312Q276711J2810844
38098A288151O762135j753717n674117m240307q98192L60178j290858k201072
38090g647799J049828O138851P811693N370990K663866J072882k082970p629930
38082F747411j1953758j1284330m957243N042700J3808023J4710901O589195k074902
38074A6627997k935234J45456k816847j1212732j3807433o163290L300745P555438
38066i305900R680918J2389575J0406716J050337p494467p787396m934182o814959
38058b809358r541243m092741P249411J2919869Q366716j10770o228361q323046
38050b569523m509815N563405J3641716Q940747n851706j4921071r827200l3782
$$ y = [-17909398, -18922095, -8996241, 5753, -3703222, -15253092, -19799404, -11522693, 1288151, 8050286, 6296569, 622452, -3617855, -4516047, -4155869, -5446727, -7647799, -6597971, -459120, 7352573, 12723563, 15387429, 16460311, 14377341, 6747411, -5206347, -16490677, -21447920, -16405220, -2597197, 12113704, 18702899, 16627997, 13692763, 13838219, 11021372, -191360, -13998793, -20162083, -16861338, -9305900, 375018, 12764593, 23171309, 24221646, 16727179, 8939783, 4005601, -2809358, -12350601, -16443342, -9193931, 3725938, 12092654, 11981884, 5753523, -2569523, -7079338, -1515933, 12125783, 21066530, 15214824, 293753, -9533447, -9567229]
38042i567229K700750J023933M153392J0239774Q411832l097939j2074867q646555
38034f856909J566312N823847Q48218n024953m336315O82504K741690r17206n759401
38025a1232213n455929J052742P854628Q117324K405157j527278M07233J783861
38017C405525m446765j2276274q732498N711716J4585682Q330148j973778k861878
38009A741878N78709m041183j2313031q508617O856075J4116144L335744j0522045
38001h756326r512579K963945R750078L292040p989525j1435063j536590J5653756
37993g570264K4905281J4650288q021501k1757631j4886747J968110J1544882
37986H32418R715333L433222k533116p897828j1061925r197509k140179P411718
$$ y = [-9567229, -6866479, -5842546, -1689154, 8550620, 16962452, 13864513, 1789646, -6856909, -5290597, 533250, 1381468, -3643485, -7979800, -7297296, -4555606, -5472812, -11232213, -16688142, -15635400, -7780772, 336552, 2741709, 1214431, 1621664, 3405525, -1041240, -13317514, -22050012, -16338296, -1752614, 6577534, 4603756, 1741878, 2320587, -1720596, -14033627, -22542244, -15686169, -1570025, 1765719, -8756326, -18268905, -15304960, -5554882, -2262842, -10252367, -21687430, -23224020, -7570264, 17335017, 31985305, 23963804, 2206173, -12680574, -10712464, 832418, 10547751, 13980973, 11447857, 3550029, -7511896, -16709405, -18849584, -11437866]
37978a1437866J4268204J1348219k247375j3889318r907845L426150O617878k487060
37970d309013m632426P048786J2742556J69082j1142501k621055Q338883k928057
37962B666255k1468427j2810288J7750674K8063936M620484j6095997n171701
37955b445064J6714132J6515734j641568j1051719n624465m40317k020275l887894
37947F118564m386740o784877o769686R37536Q448748N405371j397114J669708
37939C241510R398279M081480j2870585j8246652j322084J9087143K1226555Q163905
37931C2759551k424867m000293l640117o178794q534310p300535k778813L316949
37923A218771P657425M957548n532119j4923505j3159600k253125N844631N420444
$$ y = [-11437866, 2830338, 14178557, 11931182, -1958136, -11865981, -8439831, -1821953, -4309013, -8941439, -1892653, 10849903, 11018985, -123516, -2744571, 5594312, 2666255, -18802172, -31612460, -13861786, 14202150, 18822634, 2726637, -2445064, 14269068, 30784802, 29143234, 18091515, 12467050, 12026733, 10006458, 6118564, 1731824, -5053053, -11822739, -10885203, -2436455, 2968916, 1571802, 3241510, 12639789, 16721269, 3850684, -14395968, -15718052, 3369091, 24595646, 32759551, 30334684, 26334391, 22694274, 16515480, 7981170, 680635, -2098178, 1218771, 8876196, 13833744, 8301625, -6621880, -19781480, -22034605, -16189974, -10769530]
37915a0769530L654357P749779J2376965P213901o235390j4179963q350937K985432
37907e555386O127015r04792q037226p337801j238357L344740L760897K783093
37899g057817M026776P469785Q413753K343067p048057q280668L760460J6787445
37891B0414744J3108286o547268k0861167j4166062L584362J0821817K452985
$$ y = [-10769530, -7115173, 634606, 13011571, 20225472, 13990082, -189881, -8540818, -5555386, 571629, -333163, -8370389, -15708190, -16946547, -13601807, -9840910, -7057817, -3031041, 4438744, 12852497, 15195564, 8147507, -133161, 3627299, 20414744, 33523030, 26975762, 6114595, -8051467, -4467105, 6354712, 8807697]
$$ [...]
##END NTUPLES=NMR SPECTRUM
##END=
