##TITLE=31Pdec_SR55_rm3
 , 48 sc
 28.04.2021
##JCAMPDX= 6.0         $$ Bruker NMR JCAMP-DX V2.0
##DATA TYPE= NMR SPECTRUM
##DATA CLASS= NTUPLES
##ORIGIN= UXNMR, Bruker Analytische Messtechnik GmbH
##OWNER= root
$$ XWIN-NMR		Version 3.5
$$ Wed Apr 28 13:01:34 2021 Russian Standard Time (UT+4h)  she@DPX200
##.OBSERVE FREQUENCY= 81.013821
##.OBSERVE NUCLEUS= ^31P
##.ACQUISITION MODE= SIMULTANEOUS
##.ACQUISITION SCHEME= undefined
##.AVERAGES= 48
##.DIGITISER RES= 16
##SPECTROMETER/DATA SYSTEM= spect
##.PULSE SEQUENCE= zgpg30
##.SOLVENT NAME= CDCl3
##.SHIFT REFERENCE= (INTERNAL, CDCl3, 0, 248.564)
##AUDIT TRAIL= $$ (NUMBER, WHEN, WHO, WHERE, WHAT)
$$ ##TITLE= Audit trail, XWIN-NMR		Version 3.5
$$ ##JCAMPDX= 5.01
$$ ##ORIGIN= Bruker BioSpin GmbH
$$ ##OWNER= she
$$ F:/spectra/data/she/nmr/P31/1/pdata/1/auditp.txt
$$ ##AUDIT TRAIL=  $$ (NUMBER, WHEN, WHO, WHERE, WHAT)
(   1,<2021-04-28 13:00:39.32 +0400>,<she>,<DPX200>,
      <continue with go, POWCHK disabled, PULCHK disabled
       configuration hash MD5:
       00 E9 B6 7A A2 85 ED C7 34 08 36 98 17 FE 4E 26
       data hash MD5: 32K
       4C DC 06 3B 83 C4 56 E6 AE 61 13 15 4D EB 46 D7>)
(   2,<2021-04-28 13:00:46.17 +0400>,<she>,<DPX200>,
      <Start of raw data processing
       efp BC_mod = 2 LB = 1 FT_mod = 6 PKNL = 1 PHC0 = -6283.848 PHC1 = 235.8009 SI = 64K 
       data hash MD5: 64K
       D6 23 48 BA 0D 39 8D B3 07 D0 2D 56 AD 4B 96 53>)
(   3,<2021-04-28 13:01:05.14 +0400>,<she>,<DPX200>,
      <pk PHC0 = 1.309917 PHC1 = -18 
       data hash MD5: 64K
       20 54 86 5D 11 D0 E9 8A 00 C7 1B AE 97 85 6C B0>)
(   4,<2021-04-28 13:01:08.71 +0400>,<she>,<DPX200>,
      <abs ABSG = 5 
       data hash MD5: 64K
       92 41 91 B3 40 0B 15 C3 17 9D 7E C0 A8 1A 2F F6>)
$$ ##END=
$$ 
$$ hash MD5
$$ 08 0F 7C 19 68 12 A5 76 61 5A 63 2E E3 BE 31 F8
##$RELAX= 
##$RELAX= 
##$RELAX= 
##$RELAX= 
##$RELAX= 
##$RELAX= 
##$RELAX= 
##$RELAX= 
$$ Bruker specific parameters
$$ --------------------------
##$DU= <F:/spectra>
##$EXPNO= 1
##$NAME= <P31>
##$PROCNO= 1
##$TYPE= <nmr>
##$USER= <she>
##$AMP= (0..31)
100 100 100 100 100 100 100 100 100 100 100 100 100 100 100 100 100 100 
100 100 100 100 100 100 100 100 100 100 100 100 100 100 
##$AQSEQ= 0
##$AQ_mod= 1
##$AUNM= <au_zg>
##$AUTOPOS= <>
##$BF1= 81.014009
##$BF2= 200.13
##$BF3= 200.13
##$BF4= 200.13
##$BF5= 200.13
##$BF6= 200.13
##$BF7= 200.13
##$BF8= 200.13
##$BYTORDA= 1
##$CFDGTYP= 0
##$CFRGTYP= 5
##$CHEMSTR= <none>
##$CNST= (0..31)
1 1 145 1 1 1 1 1 1 1 1 1 1 1 1 1 1 1 1 1 1 1 1 1 1 1 1 1 1 1 1 1 
##$CPDPRG= <waltz16>
##$CPDPRG1= <>
##$CPDPRG2= <waltz16>
##$CPDPRG3= <>
##$CPDPRG4= <mlev>
##$CPDPRG5= <mlev>
##$CPDPRG6= <mlev>
##$CPDPRG7= <mlev>
##$CPDPRG8= <mlev>
##$CPDPRGB= <>
##$CPDPRGT= <>
##$D= (0..31)
0 1 0 0 0 0 0 0 0 0 0 0.03 2e-05 3e-06 0 0 0 0 0 0 0 0 0 0 0 0 0 0 0 0 
0 0 
##$DATE= 1619600313
##$DBL= (0..7)
120 120 120 11 120 120 24 19 
##$DBP= (0..7)
150 150 150 150 150 150 150 150 
##$DBP07= 0
##$DBPNAM0= <>
##$DBPNAM1= <>
##$DBPNAM2= <>
$$ [...]
##$SUBNAM3= <"">
##$SUBNAM4= <"">
##$SUBNAM5= <"">
##$SUBNAM6= <"">
##$SUBNAM7= <"">
##$SUBNAM8= <"">
##$SUBNAM9= <"">
##$SW= 501.771253377433
##$SWIBOX= (0..15)
0 1 3 0 0 0 0 0 0 0 0 0 0 0 0 0 
##$SW_h= 40650.406504065
##$TD= 32768
##$TD0= 1
##$TE= 0
##$TE2= 300
##$TE3= 300
##$TEG= 300
##$TL= (0..7)
0 120 53 12 22 120 120 120 
##$TP= (0..7)
150 150 150 150 150 150 150 150 
##$TP07= 0
##$TPNAME0= <>
##$TPNAME1= <>
##$TPNAME2= <>
##$TPNAME3= <>
##$TPNAME4= <>
##$TPNAME5= <>
##$TPNAME6= <>
##$TPNAME7= <>
##$TPOAL= (0..7)
0.5 0.5 0.5 0.5 0.5 0.5 0.5 0.5 
##$TPOFFS= (0..7)
0 0 0 0 0 0 0 0 
##$TUNHIN= 0
##$TUNHOUT= 0
##$TUNXOUT= 0
##$USERA1= <user>
##$USERA2= <user>
##$USERA3= <user>
##$USERA4= <user>
##$USERA5= <user>
##$V9= 5
##$VALIST= <valist>
##$VCLIST= <CCCCCCCCCCCCCCC>
##$VD= 0
##$VDLIST= <DDDDDDDDDDDDDDD>
##$VPLIST= <PPPPPPPPPPPPPPP>
##$VTLIST= <TTTTTTTTTTTTTTT>
##$WBST= 1024
##$WBSW= 4
##$XGAIN= (0..3)
0 0 0 0 
##$XL= 0
##$YL= 0
##$YMAX_a= 22360
##$YMIN_a= -29398
##$ZGOPTNS= <>
##$ZL1= 120
##$ZL2= 120
##$ZL3= 120
##$ZL4= 120
##$ABSF1= 248.5645
##$ABSF2= -253.2056
##$ABSG= 5
##$ABSL= 3
##$ALPHA= 0
##$AQORDER= 0
##$ASSFAC= 0
##$ASSFACI= 0
##$ASSFACX= 0
##$ASSWID= 0
##$AUNMP= <proc_1d>
##$AZFE= 0.1
##$AZFW= 0.5
##$BCFW= 0
##$BC_mod= 2
##$BYTORDP= 0
##$COROFFS= 0
##$CY= -3
##$DATMOD= 1
##$DC= 0
##$DFILT= <>
##$DTYPP= 0
##$F1P= 0
##$F2P= 0
##$FCOR= 1
##$FTSIZE= 65536
##$FT_mod= 6
##$GAMMA= 0
##$GB= 0
##$INTBC= 1
##$INTSCL= 5.30512e-09
##$ISEN= 30
##$LB= 1
##$LEV0= 0
##$LPBIN= 0
##$MAXI= 10000
##$MC2= 0
##$MEAN= 0
##$ME_mod= 0
##$MI= 50
##$NCOEF= 0
##$NC_proc= -8
##$NLEV= 6
##$NOISF1= 182.463
##$NOISF2= 159.3651
##$NSP= 0
##$NTH_PI= 0
##$NZP= 0
##$OFFSET= 248.5645
##$PC= 4
##$PHC0= -6282.538
##$PHC1= 217.8009
##$PH_mod= 1
##$PKNL= yes
##$PPARMOD= 0
##$PSCAL= 0
##$PSIGN= 0
##$REVERSE= no
##$SF= 81.014009
##$SI= 65536
##$SIGF1= 159.3651
##$SIGF2= -187.1042
##$SINO= 113.3802
##$SIOLD= 16384
##$SREGLST= <1H.CDCl3>
##$SSB= 0
##$STSI= 65536
##$STSR= 0
##$SW_p= 40650.406504065
##$SYMM= 0
##$S_DEV= 0
##$TDeff= 32768
##$TDoff= 0
##$TI= <>
##$TILT= no
##$TM1= 0
##$TM2= 0
##$TOPLEV= 0
##$USERP1= <user>
##$USERP2= <user>
##$USERP3= <user>
##$USERP4= <user>
##$USERP5= <user>
##$WDW= 1
##$XDIM= 65536
##$YMAX_p= 294976800
##$YMIN_p= -126248539
$$ End of Bruker specific parameters
$$ ---------------------------------
##NTUPLES= NMR SPECTRUM
##VAR_NAME=  FREQUENCY,     SPECTRUM/REAL,   SPECTRUM/IMAG
##SYMBOL=    X,             R,               I
##VAR_TYPE=  INDEPENDENT,   DEPENDENT,       DEPENDENT
##VAR_FORM=  AFFN,          ASDF,            ASDF
##VAR_DIM=   65536,         65536,           65536
##UNITS=     HZ,            ARBITRARY UNITS, ARBITRARY UNITS
##FACTOR=    0.620285442955139, 1,           1
##FIRST=     20137.2065510759, 0,            0
##LAST=      -20513.1999529892, 0,           0
##MIN=       -20513.1999529892, -126248539,  0
##MAX=       20137.2065510759, 294976800,    0
$$ Real data points
##PAGE= N=1
##DATA TABLE= (X++(R..R)), XYDATA
$$ [...]
38738E5425552J8935050k142904j4808699j0470905m423353q284263j4360770
38731A9869708j2746460o891868l763615j113281N743356J2804488J2710208O541213
38723C3153749J798531R72548l3212k364309r42282O062227J0753718N268837
38715E4669807m876904o156578L123236Q510267Q58875p916395k148929J1604597
38707E7667976J2371651k883316j3269168n531661N833185J216686j4721471k1178472
38699A9505410j1147233J835204M460108j470493n731189k321266O291708J2447519
38691B3869768J0341360K309354l668421l620724j22188M869828J1078649J2552293
38683E7609919J919055j3190300j3127191M860119J6597414M488180j4108687
$$ plain form
38738 55425552 74360602 72217698 57408999 46938094 42514741 34230478 19869708
38731 19869708 7123248 231380 -3532235 -4645516 1097840 13902328 26612536 33153749
38723 33153749 34952280 35924828 35891616 33527307 32585025 38647252 49400970 54669807
38715 54669807 49792903 43636325 46759561 55269828 56128703 48212308 46063379 57667976
38707 57667976 70039627 67156311 53887143 48355482 54188667 55405353 40683882 19505410
38699 19505410 8358177 10193381 14653489 13182996 7451807 5130541 11422249 23869768
38691 23869768 34211128 36520482 32852061 29231337 29109149 33978977 45057626 57609919
38683 57609919 59528974 46338674 33211483 38071602 54669016 59157196 45048509
38676D5048509j2218927N177852J0344813k721319j1159885j790368J0303798
38669D2984473R289057J438844q10888R68709l45820l054989k713407j533792
38661D6222187j893123n53989K590447O94224p528183j2668572r474228m877801
38653A2510962l628602L36933Q552628Q858941m936443j7018559r214188J2345581
38645G807253K5763224K1789118R414762q41585n380374m200198j424613m113339
38637D8814248j0573425q407282M694524J0522737l215523j8710854j2050026
38630A1074399Q456166J3988827j03990j0066631m129019K690731p7966j427225
38622B0405292N360940O973008l745962r590171K746408J5836403O766387j4943496
$$ plain form
38676 45048509 32829582 38007434 48352247 45630928 34471043 32680675 42984473
38669 42984473 52273530 53712374 52901486 53870195 53524375 50469386 47755979 46222187
38661 46222187 44329064 43775075 46365522 47059746 39531563 26862991 17388763 12510962
38653 12510962 8882360 9219293 17771921 26630862 21694419 4675860 -4538328 7807253
38645 7807253 33570477 55359595 64774357 63932772 58552398 54352200 52927587 48814248
38637 48814248 38240823 29833541 34528065 45050802 41835279 23124425 11074399
38630 11074399 19530565 33519392 33415402 23348771 19219752 21910483 21832517 20405292
38622 20405292 25766232 32739240 28993278 19403107 22149515 37985918 44752305 29808809
38614B9808809k0578808n536531O809076L240921k225518M544746J3965193Q615348
38606C8643236q364707j5126265k70644K0004368K0102328k287113k0964434j4147736
38598A7589033O438977J2933634J999715l114748P063408J1729079l683818j9039773
38590C1915507j0135874J0459866J1699621p157539j6724350l844740J1999722
38583B8212213J2343980L101034l201149n241071l917518L529204J0895497M606470
38575E0328660j1927058j6097031l30771J2660888M563496r173096m828703J2311206
38567C7507591J9619857J2596164L958770k432534j0910287j4520899l264921
38560D2553741J1804689R971152m430760o643081O936339J1585695l471641j5377010
$$ plain form
38614 29808809 9230001 3693470 10502546 13743467 11517949 16062695 30027888 38643236
38606 38643236 30278529 15152264 14881620 34885988 54988316 52701203 31736769 17589033
38598 17589033 24028010 36961644 38961359 35846611 42910019 54639098 50955280 31915507
38590 31915507 21779633 32239499 43939120 36781581 20057231 16212491 28212213
38583 28212213 40556193 43657227 40456078 35215007 31297489 34826693 45722190 50328660
38575 50328660 38401602 22304571 21973800 34634688 39198184 30025088 25196385 37507591
38567 37507591 57127448 69723612 73682382 71249848 60339561 45818662 42553741
38560 42553741 54358430 64329582 59898822 53255741 60192080 71777775 68306134 52929124
38552E2929124n150646J1187403R387931n498113j1557587n483787j375783k882521
38544D1556021l38297P512132J0118219M080495j870029k673571k917451m742279
38536E0725240l153535L253555Q220102P910811N293825J609119o518740j7174370
38528E0166007j9536893o981013J1298045J8093879O613767j1855584j9112205
38521B8686003r087675N222918P497544l80098j597542Q509714J2665355r52467
38513E0563752j5636918q892829J1135354J5784525k80400j1659622l222106P905563
38505D5697319L413031o803557m774385M545584M810730j884842r33556O288753
38497E0359077M821675m902569n378841O793079J1271559m688666k4156287k3540501
$$ plain form
38552 52929124 47778478 58965881 68353812 62855699 51298112 45814325 44438542 41556021
38544 41556021 41217724 48729856 58848075 62928570 61058541 58384970 55467519 50725240
38536 50725240 47571705 50825260 59045362 66956173 72249998 73859117 67340377 50166007
38528 50166007 30629114 23648101 34946146 53040025 59653792 47798208 28686003
38521 28686003 19598328 24821246 32318790 31938692 30341150 38850864 51516219 50563752
38513 50563752 34926834 26034005 37169359 52953884 52673484 41013862 37791756 45697319
38505 45697319 49110350 42306793 37532408 42077992 46888722 45003880 44070324 50359077
38497 50359077 55180752 50278183 44899342 51692421 62963980 58275314 34119027 10578526
38489A0578526m575121J1380956J2567258N773293M60350k063904l301766k293608
38481B8525984J153719M284670N063382M575474M827441O434472P882653N335842
38473F8083637m007887j5357295j7505654o528727N424401L736688p792075j0419739
38465A5633349L004437J6324302J1896661m917670j3705193o504845M605741O622030
38457C2958812O30733n035186o435263l587929L128072R344963O674309n204528
38449C2473983j2317176k956849J3204813J5444426J158378r746180m195722M852728
38441C7918401o16388j4676965j5608000J134211J5407475J0799228m040814r925109
38433B0392039k223667Q183856J1723180P233922l295156j5695382k0695061j1380925
$$ plain form
38489 10578526 6003405 17384361 29951619 35724912 36185262 34121358 30819592 28525984
38481 28525984 29679703 33964373 39027755 43603229 48430670 54865142 62747795 68083637
38473 68083637 64075750 48718455 31212801 24684074 30108475 33845163 26053088 15633349
38465 15633349 18637786 34962088 46858749 41941079 28235886 21731041 26336782 32958812
38457 32958812 33589545 28554359 22119096 18531167 21659239 31004202 37678511 32473983
38449 32473983 20156807 17199958 30404771 45849197 47007575 37261395 33065673 37918401
38441 37918401 37302013 22625048 7017048 8151259 23558734 34357962 30317148 20392039
38433 20392039 18168372 26352228 38075408 45309330 42014174 26318792 5623731 -5757194
38425e757194M842208J1970246O146125N50427M590431R196929K496101q917289
38417B5117984q801690K336826O111670n581890j6390996q286018J2346837K3478982
38409C0331705J6529854L671665k723803m788348r076312j2437115p053817N104975
38401A9558804J2400488Q298366j264259p236807p688756n017577N09006P294816
38393B6854081P473077l796428j5490328j0469443Q635534J7725753M150761j2843221
38385B2239786r466756O603967Q818759o062345j4374254n473192K436305l959791
38377G62479j0108469j867147O439046l039786j5984686n585550K0887223K8007597
38369A9510707N347664j6527800j1868709N783403R971224N38723l408433L701735
$$ plain form
38425 -5757194 -914986 11055260 17201385 17751812 22342243 31539172 34035273 25117984
38417 25117984 16316294 18653120 24764790 19182900 2791904 -5494114 6852723 30331705
38409 30331705 46861559 50533224 47809421 43021073 33944761 21507646 14453829 19558804
38401 19558804 31959292 40257658 38993399 31756592 24067836 19050259 19559265 26854081
38393 26854081 34327158 30530730 15040402 4570959 13206493 30932246 35083007 22239786
38385 22239786 12773030 19376997 28195756 22133411 7759157 2285965 4722270 762479
38377 762479 -9345990 -11213137 -4774091 -7813877 -23798563 -29384113 -8496890 19510707
38369 19510707 24858371 8330571 -3538138 2245265 12216489 12755212 9346779 13048514
38361A3048514Q954635L784368n283071q841550n964428j730520k82216j488456
38353B197276j576645J692711L985309k52630o327928j994657J3631236K3036166
38345C4390838J0966244j3904955k7690442j8850562J329670J4206928J2024550
38338A2472271Q37112q117692q039488j066103N058192N186258J087550j895799
38330E522301j40321N673596J0108653O783431k705264o764968J496988J0977397
38322C0951813O179768p370017q143643P330169J4832978j989709k4085797k2772850
38314e067288p39256J3865616Q030324l497892n751952k510456k236966k561645
38306d69515J634169O533126N893249J890142P19027K198560J398083k283584
$$ plain form
38361 13048514 22003149 25787517 20504446 11662896 5698468 3967948 3685732 2197276
38353 2197276 620631 2313342 6298651 6046021 -281907 -2276564 11354672 34390838
38345 34390838 45357082 31452127 3761685 -15088877 -13759207 447721 12472271
38338 12472271 13309383 5191691 -2847797 -3913900 1144292 6330550 7418100 5522301
38330 5522301 5381980 11055576 21164229 27947660 25242396 18477428 19974416 30951813
38322 30951813 37131581 29761564 21617921 28948090 43781068 41791359 17705562 -5067288
38314 -5067288 -5806544 8059072 16089396 12591504 6839552 4329096 2092130 -469515
38306 -469515 1164654 7697780 13591029 15481171 16200198 18398758 19796841 17513257
38298A7513257m482445l470621k841354n359673p668451m028542N273174J2424557
38290G359902J1058473M265346j38513j82707K99967P25149M149470Q035163N048452
38281D0620702l569696o541396k79909L509056l319492j0313324m478703Q049013
38273B3676251J1090973K726817m902188n986994n648147o129811l649226R88899
38265A2166574K409359J547687L604798N655526J49214r399853j1114616l989952
38257A028737R92070M96977K877520R395558R272838l21242o577851j722735M662411
38248B0104283L558948J105198L967918N226906j444568p050024k464442L061293
38240B6065512l818567j6095194j4851145K041001J6884706J6508140N073284
$$ plain form
38298 17513257 13030812 9560191 6718837 1359164 -6309287 -10337829 -5064655 7359902
38290 7359902 18418375 22683721 22545208 22362501 22662468 23387617 27537087 35572250 40620702
38281 40620702 37051006 30509610 30229701 33738757 30419265 20105941 15627238 23676251
38273 23676251 34767224 37494041 32591853 26604859 20956712 14826901 11177675 12166574
38265 12166574 14575933 16123620 19728418 25383944 25533158 16133305 5018689 1028737
38257 1028737 2020807 2517784 5395304 14790862 24063700 23742458 17164607 15441872 20104283
38248 20104283 23663231 24768429 28736347 33963253 32518685 25468661 23004219 26065512
38240 26065512 22246945 6151751 -8699394 -6658393 10226313 26734453 31807737
38233C1807737o741551j2301116r100314o2877N467944K044558k622153J041438
38225I533666Q009537O584682r86707k055352L580310K675383p223026j1460549
38217H657944k712382O234812M254485k6513M219034Q412135j227849j6718803
38209A1092863j6397104J806818J5139958Q613700m163847k627226J0410953J4173199
38201C8049314J125448j1897088p561842P432528J1183397l463901j8795592j5939906
38193A32358K8498Q199641J174547o369141j170672Q843580P609461l999914r075026
38184E373332N09353J2327162J0722411k487079j1653522q148720m25809j552978
38176D664150j0747206j2922688R04283J7846930J6944048j224584j1704465N53379
$$ plain form
38233 31807737 25066186 12765070 3664756 3601879 9069823 11114381 8492228 9533666
38225 9533666 17543203 24127885 23141178 21085826 24666136 27341519 20118493 8657944
38217 8657944 5945562 12180374 16434859 16408346 20627380 29039515 27811666 11092863
38209 11092863 -5304241 -3497423 11642535 20256235 16092388 13465162 23876115 38049314
38201 38049314 39174762 27277674 19715832 27148360 38331757 34867856 16072264 132358
38193 132358 160856 8360497 9535044 3165903 1995231 10838811 18448272 14448358 5373332
38184 5373332 5882685 18209847 28932258 26445179 14791657 6642937 6217128 4664150
38176 4664150 -6083056 -19005744 -18101461 -254531 16689517 15464933 3760468 4313847
38168D313847J6858853J1074876r713831j4175312M786709J7521122L041123j8148522
38160A5558865j5213991Q048748K3044632J8601316P359668k940587j6363037
38153C8095614k7216682j9749015L411676J6541326N616069j1747207j3052789
38146h101008j72133J1287477J5804667J5677101Q241008p288611j9053163j5007846
38138A387492o90600Q552385P357360Q99240o761795j2200166q208420N983179
38130c681325J6627854J1855895k65784m630374k550641n082643r891033n749069
38122c367120L453776K167685q547539r190561O712985K0865954J8415253Q510451
38114C9020884N288525N149430k469596j3774206j5777728o534067L019648M806941
$$ plain form
38168 4313847 21172700 32247576 22533745 8358433 13145142 30666264 33707387 15558865
38160 15558865 344874 8393622 31438254 50039570 57399238 54458651 38095614
38153 38095614 10878932 -8870083 -5458407 11082919 16698988 4951781 -8101008
38146 -8101008 -8273141 3014336 18819003 34496104 42737112 35448501 16395338 1387492
38138 1387492 696892 9249277 16606637 17505877 10744082 -1456084 -9664504 -3681325
38130 -3681325 12946529 24802424 24536640 19906266 17355625 12272982 2381949 -3367120
38122 -3367120 86656 2254341 -6293198 -15483759 -8770774 12095180 30510433 39020884
38114 39020884 44309409 49458839 46989243 33215037 17437309 10903242 13922890 18729831
38106A8729831J428340o92024Q17393L347028L226339Q24358P57581M102617L886583
38097C6428046m692522j3008455q539043N712085J3476831P550568k725155q056054
38089B6146301r690883r665505m531827M820076R369717N318239Q05059K695150
38081B5266327O806210P486109O310294M658259j446099j1570425j6336244j0546162
38073A0628269j458970K874096L525587K882726j032151n327894r58455J0211489
38065B1344697J1520175l669681j7751865j3791636p85077L094817k90264K672013
38057B343179R557915O208817n485779q083255K211577Q675409J020460r563871
38049F884452r272715k80379P205134Q999766N440452l453717j3095597j3075445
$$ plain form
38106 18729831 20158171 19466147 20283540 23630568 26856907 27681265 28438846 32541463 36428046
38097 36428046 31735524 18727069 10188026 15900111 29376942 36927510 34202355 26146301
38089 26146301 16455418 6789913 2258086 7078162 16447879 21766118 22571177 25266327
38081 25266327 32072537 39558646 45868940 50527199 49081100 37510675 21174431 10628269
38073 10628269 9169299 12043395 15568982 18451708 17419557 12091663 11133208 21344697
38065 21344697 32864872 29195191 11443326 -2348310 -3133387 -38570 -328834 2343179
38057 2343179 11901094 18109911 12624132 4540877 6752454 15427863 16448323 6884452
38049 6884452 -2388263 -2668642 4536492 13536258 18976710 15522993 2427396 -10648049
38041a0648049M03219J5880572J7941033M696896j1143850j6797228j0717413
38034a0384820j63153Q377638J3498592J4463588P875915n850350j6039575j1443100
38026C34735K988572R958782L764782j873983L692659J1075002P208391l372117
38018C3776823p961258o719161p711707q237988K01345J2183821J3029724K674652
38010C1236251l883837j475745j030445o772285o638369N559086J5461358Q568495
38002D1024509p107064j3056063o795893j826798n035983q248293l279089N737850
37994A413176R264180M571523l777183j1099007j4505275j0068561M129949K0038396
37986c2802K2393143O305898j2729090j5427002k729134P047380L682811m787416
$$ plain form
38041 -10648049 -10244830 5635742 23576775 28273671 17129821 332593 -10384820
38034 -10384820 -10547973 -2170335 11328257 25791845 33667760 27817410 11777835 334735
38026 334735 3323307 13282089 17046871 15172888 18865547 29940549 37148940 33776823
38018 33776823 25815565 19096404 11384697 3146709 3348054 15531875 28561599 31236251
38010 31236251 27352414 25876669 24846224 18073939 11435570 16994656 32456014 41024509
38002 41024509 33917445 20861382 14065489 12238691 7202708 -1045585 -4324674 1413176
37994 1413176 10677356 15248879 11471696 372689 -14132586 -24201147 -20071198 -32802
37986 -32802 22360341 28666239 15937149 510147 -2218987 4828393 8511204 3723788
37978C723788q138512o033406p38719P328886J1720304L717821r368839p942739
37970e731416Q649784J5685815J407271j1703271m059258O895896j855469j5249187
37962e959835n231062J6135450J2862011j2192061j8629298L870251J7882143
37955H737599J908321j4960801n564508J0092340M170002r133463j467053J7435051
37947A1217488J7021034o22976o447934M158168O439844p045834j3183620l0099
37939A1506071J1459398K416992j2937710j0204777Q231785J8600458R583698
37932C8655915o004795j1289907m691813L022431L841707l5067k477262k511625
37924A8509584l370951m941303m055221k282902m756386r335780p179297K097865
$$ plain form
37978 3723788 -4414724 -10448130 -11186849 -3857963 7862341 11580162 2211323 -5731416
37970 -5731416 2918368 18604183 20011454 8308183 4248925 11144821 9289352 -5959835
37962 -5959835 -11190897 4944553 17806564 5614503 -13014795 -9144544 8737599
37955 8737599 10645920 -4314881 -9879389 212951 4382953 -4750510 -6217563 11217488
37947 11217488 28238522 27615546 21167612 25325780 31765624 24719790 11536170 11506071
37939 11506071 22965469 25382461 12444751 2239974 10471759 29072217 38655915
37932 38655915 32651120 21361213 16669400 19691831 23533538 23498471 21021209 18509584
37924 18509584 15138633 10197330 6142109 3859207 -897179 -10232959 -17412256 -15314391
37916a5314391P619182N545344O602306J5868375J9499369N907170j2498014j6441430
37908A6787911q473331m520520m915275K689625J5131876J3811300m290243j8542100
37900G679243j4105670r8548Q836441J1119595R937579L157210p914554j3312858
37892E298438q223627q31113J627365K749578N570540M857443m31626j075355
37884I541643N739518P968062j306625j0268170q595571n544320j0222712r807406
37876b2495581Q793787K8149434K0497628p029915j8693013k699906J3816262
37869B0338696R560900j847237j713596K577519l069709j1106858p873938j108560
37861E757217n445312j1996176j164228J9878938K2692951K064270j3903448o273752
$$ plain form
37916 -15314391 -7695209 -2149865 4452441 20320816 39820185 45727355 33229341 16787911
37908 16787911 8314580 3794060 -1121215 1568410 16700286 30511586 26221343 7679243
37900 7679243 -6426427 -6524975 2311466 13431061 23368640 26525850 18611296 5298438
37892 5298438 -2925189 -3756302 -2128937 620641 6191181 11048624 10616998 9541643
37884 9541643 15281161 23249223 21942598 11674428 3078857 -2465463 -12688175 -22495581
37876 -22495581 -13701794 14447640 34945268 27915353 9222340 6522434 20338696
37869 20338696 29899596 28052359 26338763 28916282 25846573 14739715 6865777 5757217
37861 5757217 311905 -11684271 -12848499 7030439 29723390 31787660 17884212 11610460
37853A1610460Q154607O534751n582647q226844J33314M946861K052660P85344
37845B0408506L658290K317431m661377o846280R0790N429498J60488p952630
37837A2604716n761897N566996J2552017Q092980j507699p968654j0248508r584909
37829C745042l621182P973320J6979251J4010297J330326r050538j0271650o264537
37821A4830329j907473K962971O352180J735308r603408j3842880l221420Q996881
37813F302488O106840n905914p079316M676717J0452611J456947o941927l74048
37805H694398J2555614J4868040M741242p173434j3476949j2195475k809440R090429
37797A4294425J1844295K834563m735230j08257Q850279Q389524q94132p808483
$$ plain form
37853 11610460 19765067 26299818 20717171 12490327 12623641 17570502 19623162 20408506
37845 20408506 24066796 26384227 21722850 14876570 14967360 20396858 20557346 12604716
37837 12604716 6842819 12409815 24961832 33054812 31547113 23578459 13329951 3745042
37829 3745042 123860 8097180 25076431 39086728 40417054 31366516 21094866 14830329
37821 14830329 12922856 15885827 22238007 23973315 14369907 527027 -2694393 6302488
37813 6302488 12409328 6503414 -575902 4100815 14553426 16010373 9068446 8694398
37805 8694398 21250012 36118052 40859294 33685860 20208911 8013436 5203996 14294425
37797 14294425 26138720 28973283 24238053 24129796 32980075 41369599 40475467 32666984
37789C2666984o830784l92839O887926P436975m736079j9371745j4817222R548737
37781A0391953K3306470N764018k1121547k4723777r954268m631488r389300L0125
37773c0327814K4168018L3158260J4683154o894374j0224173m173795k222698
37766A8166578N49179Q275264Q567704n065237j7053312j4182866o119212m452386
37758a1314288k151792P190973J0648204j147575j1231119j581926J4371846J1596877
37750A6381200n879049j2443554k103946N876388P60893o056973l908990K182060
37742e191971M441470L929132M309634N708313P335915P704323L498845l900225
37734B7835436n843654K94986L021844n852278j4554816p983194O765695J0227836
$$ plain form
37789 32666984 25836200 25443361 32331287 39768262 35032183 15660438 843216 10391953
37781 10391953 33698423 39462441 18340894 -6382883 -16337151 -20968639 -30357939 -30327814
37773 -30327814 -6159796 26998464 41681618 34787244 24563071 20389276 18166578
37766 18166578 18715757 26991021 35558725 30493488 13440176 -742690 -6861902 -11314288
37758 -11314288 -13466080 -6275107 4373097 3225522 -8005597 -9587523 4784323 16381200
37750 16381200 10502151 -1941403 -4045349 1831039 2591932 -3465041 -7374031 -5191971
37742 -5191971 -750501 3178631 7488265 13196578 20532493 28236816 31735661 27835436
37734 27835436 21991782 22286768 25308612 19456334 4901518 -3081676 3684019 13911855
37726A3911855P66587n090031k59228M822388K088298m395106r776174j3012597
37718a0944008r900566J777702J0901048N365410m883206J209035K0224864K4217656
37710C7967935K901626j8920751j8160555m881538m35971l908399j368309N600497
37702a205465M006672n077311p016567K340705J1511376J2394173Q255941J665915
37694B6875439r375378j9323494j4732812N497367K1637782J6302362j677130
37687B5204136r275012j094068N411848j979546j1821455p418439P085400J2612359
37679A8725223K548940j0214584j3647730r741411l775186N401452J6430692J8849018
37671B4576414O869048q079262j0213365Q8156Q915827P902819R16041n008417
$$ plain form
37726 13911855 14678442 9588411 9329183 14151571 16239869 11844763 2068589 -10944008
37718 -10944008 -20844574 -19066872 -8165824 -2800414 -7683620 -6474585 13750279 37967935
37710 37967935 40869561 21948810 3788255 -1093283 -1529254 -5437653 -6805962 -1205465
37702 -1205465 2801207 -2276104 -9292671 -6951966 4559410 16953583 25209524 26875439
37694 26875439 17500061 -1823433 -16556245 -11058878 10578904 26881266 25204136
37687 25204136 15929124 14835056 20246904 18267358 6445903 -972536 6112864 18725223
37679 18725223 21274163 11059579 -2588151 -12329562 -16104748 -10703296 5727396 24576414
37671 24576414 31445462 23366200 13152835 13240991 22156818 30059637 30975678 25967261
37663B5967261o385032l588332j501595n619282j1635512p074442Q440027J5643314
37655A4246407J783098j6355273j4027018M511808J2564023J299094j0028608
37648f006469o030234N246812J0487838Q756263L510654m911542j0924391n141752
37640e012821P511782Q654592n324058j4270285n073468P519052O318703j75819
37632A47678M674802J4401326R865109p058856j4766803n192442O059353N248427
37624A3378594k150576m556670m29396M499434N906463K144399n595584j1573522
37616A623142j0040254k385140N340482J0054812J0755945M423640q138000j6604373
37608d969746j2440788k638458J2417l039212n46586O309517M251420p699553
$$ plain form
37663 25967261 19582229 15993897 14492302 8873020 -2762492 -9836934 -1396907 14246407
37655 14246407 16029505 -325768 -14352786 -9840978 2723045 4022139 -6006469
37648 -6006469 -12036703 -6789891 3697947 12454210 15964864 11053322 128931 -5012821
37640 -5012821 2498961 11153553 5829495 -8440790 -13514258 -5995206 323497 147678
37632 147678 4822480 19223806 29088915 22030059 7263256 2070814 8130167 13378594
37624 13378594 11228018 6671348 6241952 10741386 16647849 18792248 13196664 1623142
37616 1623142 -8417112 -10802252 -5461770 4593042 15348987 19772627 11634627 -4969746
37608 -4969746 -17410534 -20048992 -20036575 -23075787 -23622373 -17312856 -13061436 -20760989
37600b0760989j3108148l530207Q476790J0166781N841021L064268j594266r517598
37592b0962348q704976O834025J9362156R725699j1785886j8762968o697867N316931
37584b5675234P301551P641328R076662K091629j1279765j2385212M012072J6876088
37576b340881R780875n283824r997871o289642l525414J815450J2519252J4163394
37568A0841339k589671j7857315r185174R362528P133429j1695252j3475367Q499699
37560a8965784K1804521P560959j1648208j2264523m974193q025076j3487640
37553c9999944n769671P784604J1039973P151332P628923Q258303J125785l151110
37545e931805P389801J7938962N826589j9400838k5782615o911226J0353636Q805288
$$ plain form
37600 -20760989 -33869137 -37399344 -28922554 -18755773 -12914752 -9850484 -11444750 -20962348
37592 -20962348 -29667324 -22833299 -3471143 6254556 -5531330 -24294298 -30992165 -25675234
37584 -25675234 -18373683 -10732355 -1655693 435936 -10843829 -23229041 -19216969 -2340881
37576 -2340881 7439994 2156170 -7841701 -14131343 -17656757 -15841307 -3322055 10841339
37568 10841339 8251668 -9605647 -18790821 -9428293 -2294864 -13990116 -27465483 -18965784
37560 -18965784 2838737 10399696 -1248512 -13513035 -18487228 -26512304 -39999944
37553 -39999944 -45769615 -37985011 -26945038 -19793706 -12164783 -3906480 -2780695 -5931805
37545 -5931805 1457996 19396958 25223547 5822709 -19959906 -26871132 -16517496 -7712208
37537g712208K138833N546248J1784723R417485L635143L645454M708094j997472
37529C1166300j1877675j3226133n211665J737108J163503j850284J125260R663191
37521A2689605J2833036K546772j2377203j4167436j606390M841137p011059j9589782
37513b1841320j0692089J0945841J7398510L114136r712114o905621J013817K274441
37505a4404399J200818L857645N533333K413288M43798L572719O047865L534752
37497A2199819j53858k488472n723908p390365j466065P803919Q994382L371450
37489A5146902L818234J0404496P826535o606969j4928472q083668r45570n003229
37481A628259q272974J161776J1819360Q163578l596259q438108o481490n158075
$$ plain form
37537 -7712208 -5573375 -27127 11757596 21175081 24810224 28455678 33163772 31166300
37529 31166300 19288625 6062492 850827 2587935 3751438 1901154 3026414 12689605
37521 12689605 25522641 28069413 15692210 1524774 -81616 4759521 -2251538 -21841320
37513 -21841320 -32533409 -21587568 -4189058 -1074922 -10787036 -17692657 -16678840 -14404399
37505 -14404399 -13203581 -9345936 -3812603 -1399315 -955517 2617202 8665067 12199819
37497 12199819 12045961 9557489 3833581 -3556784 -5022849 2781070 11775452 15146902
37489 15146902 18965136 29369632 37196167 30589198 15660726 7577058 6631488 1628259
37481 1628259 -6644715 -5482939 6336421 14499999 10903740 2465632 -4015858 -9173933
37473i173933j898932N842008P404406l512198j1721797l186418Q515458L197563
37465d533843j0415283q512576O855989J1523811O72560m805949M284812J1355769
37457F425290M265837o759825j0918548j2897642j5808829r727303Q361495K1165790
37449a5893735J4093271j447004m042614P628905J6311125J1978178J322964o490950
37441B3460140j0305690j1271362o989338K943449J0813934P658243l389866p703526
37433E215984J600052J1268179N623358p383910n496866J0621083J2797435j0150071
37425B4095244k7911293j2106531J6196146J5757793j0199133j8982890K969326
37418a0181338J9808195O280328j3128104q362054P546347N864494p609033o747777
$$ plain form
37473 -9173933 -11072865 -5230857 2173549 -1338649 -13060446 -16246864 -7731406 -4533843
37465 -4533843 -14949126 -23461702 -16605713 -5081902 -4409342 -9215291 -4930479 6425290
37457 6425290 10691127 3931302 -6987246 -19884888 -35693717 -45421020 -37059525 -15893735
37449 -15893735 -1800464 -3247468 -7290082 338823 16649948 28628126 29951090 23460140
37441 23460140 13154450 1883088 -5106250 -2162801 8651133 16309376 12919510 5215984
37433 5215984 6816036 18084215 23707573 16323663 10826797 21447880 34245315 24095244
37425 24095244 -3816049 -15922580 273566 16031359 5832226 -13150664 -10181338
37418 -10181338 9626857 15907185 2779081 -5582973 1963374 7827868 218835 -6528942
37410f528942O478587O617333q827138j5231697m141534M550773P16072J215819
37402a5150727J5681765K4563529J0929987r168531j1163191M06917L295644n365076
37394A4030317r217109l729189j270647n458412m439914N637374J1359257M079246
37386A0990923o049620p164927k153089J497195M754697R025229P154984m803324
37378A3252068j6106241j4464931l603466M110662N646681N804019M531274p23651
37370a553585n126665k471729L018022L773001K809026O557702R401684K294269
37362A8701725p549892n228371N365507N205122q058941j4445340l516061R854759
37354C28508J0680373M645809K152334L00496n098140o040020K944846J0040888
$$ plain form
37410 -6528942 -50355 6566978 -2260160 -17491857 -21633391 -17082618 -16366546 -15150727
37402 -15150727 531038 25094567 36024554 26856023 15692832 16099749 19395393 14030317
37394 14030317 4813208 1084019 -186628 -5645040 -10084954 -4447580 6911677 10990923
37386 10990923 4941303 -2223624 -4376713 -2879518 1875179 10900408 18055392 13252068
37378 13252068 -2854173 -17319104 -20922570 -16811908 -11165227 -5361208 -829934 -1553585
37370 -1553585 -6680250 -9151979 -6133957 -2360956 448070 7005772 16407456 18701725
37362 18701725 11151833 5923462 11288969 16494091 8435150 -6010190 -9526251 328508
37354 328508 11008881 15654690 17807024 18107520 13009380 6969360 9914206 19955094
37346A9955094K951691j0310924j3906728q074868l884234k336832L236810R475546
37338b894445O441617k807312l442647Q311774J7732314J1324253n707580j6298622
37330A2659352j0666586M093572J1826253M910029o902193r468831l495245q76470
37322B079881l375544o85783P534490P060644n155916j1067641j002294P122926
37314B510763k912638j5707107q253076J0601405J3483036j442828j0114374l249428
37306a5084247K807292j890374o518455l639305k010751n850875m181229P592354
37298b8775590J5474152R309183K72684J840048P804726M801940m166726n166258
37290A394159L614277R309191L838927n564669p566814j686764K001657k947586
$$ plain form
37346 19955094 22906785 12595861 -1310867 -9385735 -13269969 -15606801 -12369991 -2894445
37338 -2894445 3547172 739860 -2702787 5608987 23341301 34665554 28957974 12659352
37330 12659352 1992766 6086338 17912591 22822620 15920427 6451596 2956351 2079881
37322 2079881 -1295663 -1981446 5553044 12613688 7457772 -3609869 -4612163 2510763
37314 2510763 -401875 -16108982 -24362058 -13760653 -277617 -1720445 -11834819 -15084247
37306 -15084247 -12276955 -14167329 -20685784 -24325089 -26335840 -32186715 -36367944 -28775590
37298 -28775590 -13301438 -3992255 -3719571 -1879523 5925203 10727143 6560417 1394159
37290 1394159 5008436 14317627 18156554 12591885 5025071 3338307 5339964 2392378
37282B392378r137874m434749Q707110J2687883k97739j3601687q957908N121325
37274g521261N866848p683108j2981007J18950J3997860J1910653K552064K729647
37266H990646R611081O458800j0569898k5917291k4492643q637655O749336J1414092
37258b6393532R129092R547627J3285030J1462811J627320n628052k885010J189026
37250A1334312l826586j2043413j1737160n610433l383314j359042R727447K1135374
37242D237185J4634307n639803j5107225o212329J557444l630506p348765K311211
37234a5198481J1449199L815461j1279925j4415433n664293R18705K315280O428488
37226b1630999J2649429J0733517j638595j3577618j4399856m319228P865755
$$ plain form
37282 2392378 -6745496 -11180245 -2473135 10214748 9917009 -3684678 -12642586 -7521261
37274 -7521261 -1654413 -9337521 -22318528 -22199578 -8201718 3708935 6260999 8990646
37266 8990646 18601727 25060527 14490629 -11426662 -35919305 -44556960 -37807624 -26393532
37258 -26393532 -17264440 -7716813 5568217 17031028 18658348 13030296 10145286 11334312
37250 11334312 7507726 -4535687 -16272847 -21883280 -25266594 -26625636 -16898189 4237185
37242 4237185 18871492 13231689 -1875536 -8087865 -6530421 -10160927 -17509692 -15198481
37234 -15198481 -3749282 66179 -11213746 -25629179 -31293472 -30374767 -28059487 -21630999
37226 -21630999 -8981570 1751947 113352 -13464266 -27864122 -32183350 -24317595
37219b4317595J2562562O743037k983460p127322l962913Q43687L589091M148902
37211a0504011R58103n286666o210031K579267Q423053j915682j6024828r624341
37203c7605136J2931901K0052461J674059j3342131k735323J5139201J3939415
37196A0054447R26554o91363P865392P615035k782424p021826j207302J542902
37188A6301415m695275j0863431r942052n216658q74588L100349O986269J0701016
37180E497045J3676597J0314178m901632k1990459k0230595J855945J8584279
37173B805358J2580757o81952j104602L495088l676922j5071921j2569120r75126
37165a5198440J810060k215286J924006J0611781Q178158j121498K37745Q529585
$$ plain form
37219 -24317595 -11755033 -5011996 -7995456 -15122778 -19085691 -18242004 -14652913 -10504011
37211 -10504011 -9545908 -14832574 -21042605 -18463338 -10040285 -11955967 -27980795 -37605136
37203 -37605136 -24673235 -4620774 -2946715 -16288846 -19024169 -3884968 10054447
37196 10054447 10981001 10289638 18155030 25770065 22987641 15965815 14758513 16301415
37188 16301415 11606140 742709 -9199343 -14416001 -15290589 -12190240 -5203971 5497045
37180 5497045 19173642 29487820 24586188 2595729 -17634866 -15778921 2805358
37173 2805358 15386115 14704163 13599561 17094649 13417727 -1654194 -14223314 -15198440
37165 -15198440 -13388380 -15603666 -13679660 -3067879 5110279 3988781 4226526 12756111
37157A2756111M249039r679989j0045933M752299J0610384N93400m167992M671317
37149A3738636P255646n280235j1442348J738605J2660398J541908j4935720j2106318
37141f829428K247135M529633m689661o292906L096170R609562Q168509N906773
37133A5745787L736630m008354j3620553j4324994n652987K688500O390116Q190765
37125h55090P139008O99802m763983k45151R845256J1416206R99366r782668j1059534
37116C393212n036651J890898O892876P962641K665017o163167j0038391m686272
37108c119837L543045M942275j493261o346916j102346J0141207J3807326L810454
37100B4181947q930884r731451N06199P825871N485282Q31288P64793K008405
$$ plain form
37157 12756111 17005150 7325161 -2720772 2031527 12641911 13235311 9067319 13738636
37149 13738636 20994282 15714047 4271699 6010304 18670702 20212610 5276890 -6829428
37141 -6829428 -4582293 -52660 -4742321 -11035227 -7939057 1670505 9839014 15745787
37133 15745787 19482417 15474063 1853510 -12471484 -18124471 -15435971 -9045855 -855090
37125 -855090 6283918 6983720 2219737 1974586 11819842 23236048 24235414 14452746 3393212
37116 3393212 -1643439 247459 7140335 15102976 17767993 11604826 1566435 -3119837
37108 -3119837 423208 5365483 3872222 -2474694 -3577040 6564167 20371493 24181947
37100 24181947 15251063 5519612 6025811 13851682 19336964 20168252 20933045 22941450
37092B2941450J75254j937064j143888k57449j457896r42993L642366P271755
37084B8291535M901504j167099n958859p844471o455624j605966K781558J649884
37076A4592462j972090j80529N582710N520009q99922l171862J42029k648687
37068A6964120j2515724j1885819N825437J8492352O635316j3675668j3105108
37061c265094O976013J8852357J0864102j238714m812424o439161j2450678j5274209
37053f787808p844256M405534J3185749J5780288R715925n828631j8528279j0179824
37045f081302J5612364K9170910J0947623k0681502l2590717j8680141j934983
37038b4237748N83160l239503O53665R840036J1297552K470153n183521l797700
$$ plain form
37092 22941450 23116704 21179640 20035752 19778303 18320407 17377414 21019780 28291535
37084 28291535 33193039 32025940 26067081 18222610 11766986 10161020 12942578 14592462
37076 14592462 12620372 12439843 18022553 23542562 22642640 19470778 19612807 16964120
37068 16964120 4448396 -7437423 -1611986 16880366 23515682 9840014 -3265094
37061 -3265094 3710919 22563276 33427378 32188664 27376240 20937079 8486401 -6787808
37053 -6787808 -14632064 -10226530 2959219 18739507 28455432 22626801 4098522 -6081302
37045 -6081302 9531062 38701972 49649595 28968093 -3622624 -22302765 -24237748
37038 -24237748 -23654588 -26894091 -26240426 -16400390 -5102838 -2632685 -7816206 -11613906
37030a1613906j50283l094771p070833M03808J6126870K0235197L763556j5379048
37022C220590j5218988N82574R998256M060316m965957n364526J70645M761819
37014b755271P014382O149056J81893o004890k800399Q057923J1360453k24339
37006B0978808j3797700j4248924m643981J957520K521103L464043N812473M092739
36998F136081k023388o367367o214471m258906j287598L961135P863653M387771
36990B196910m222174q120604l479759K702386M095012L086729L408796K851425
36982B518721p49386l269173j500248q78304o848990j2451339n870466R795837
36974a9253348J6266526M143852j2383398j2698315M177671J9143737J6202308
$$ plain form
37030 -11613906 -11764189 -14858960 -21929793 -21525985 -5399115 14836082 18599638 3220590
37022 3220590 -11998398 -11415824 -1417568 2642748 -2323209 -7687735 -7517090 -2755271
37014 -2755271 4259111 10408167 10590060 4585170 1784771 9842694 21203147 20978808
37006 20978808 7181108 -7067816 -11711797 -9754277 -7233174 -3769131 2043342 6136081
36998 6136081 4112693 -2254674 -8469145 -12728051 -14015649 -10054514 -2190861 2196910
36990 2196910 -2025264 -10145868 -13625627 -10923241 -6828229 -3741500 -332704 2518721
36982 2518721 1769335 -1499838 -3000086 -3878390 -10727380 -23178719 -29049185 -19253348
36974 -19253348 -2986822 1157030 -11226368 -23924683 -19747012 -603275 15599033
36967A5599033j251674j6678160j7162384m082938Q744509Q494458j969016o384205
36959a4690377L310567J3808717Q170893q593154j5731553p052942J792078o9210
36951a9054981k480133N705984J5626597J2064203j940205r913891o096707m66448
36943f555581k236213j0194952j7428949j6066998j358770J9106174K6206894
36936h528395J1427585q088569j0838324n76322L093537k374694j965650O206073
36928a1644759O153435n121466q612814L767019J1959807j88146j6967264j5213457
36920c5867645L86068R069472P932400R294737J2741532O178803p639448j0809788
36912h713869P02829R591268M402193m647852m651874J318743L881708K875965
$$ plain form
36967 15599033 14347359 -2330801 -19493185 -23576123 -14831614 -6337156 -8306172 -14690377
36959 -14690377 -11379810 2428907 10599800 2006646 -13724907 -20777849 -18985771 -19054981
36951 -19054981 -21535114 -15829130 -202533 11861670 9921465 7574 -6089133 -6555581
36943 -6555581 -8791794 -18986746 -36415695 -52482693 -53841463 -34735289 -8528395
36936 -8528395 2899190 -5189379 -16027703 -16604025 -13510488 -15885182 -17850832 -11644759
36928 -11644759 -5491324 -10612790 -19225604 -15458585 -3498778 -3686924 -20654188 -35867645
36920 -35867645 -35481577 -26412105 -18479705 -9184968 3556564 9735367 2095919 -8713869
36912 -8713869 -8011040 1580228 5982421 1334569 -3317305 -1998562 1883146 4759111
36904D759111K970059K751750j980569r110364j1662034n920284M845372J1935074
36896a411885P349222n969522j2585167k402264J2589764J2259115k180257r362787
36888a713781r53829O001487j500781j0252625l403823J0649348J1871545P84891
36880A1482432m605236J036536N109522J374295j621484J1740k653029j2586627
36872b451851j7154190p946502L730910L890236k433693p69227Q803324J2607018
36864a723975N463804k798653m035138k349522l878436n883556k259212O153547
36856a1311141J2803956J3658017R526114K739891l949485o664940l339418K210492
36848A5673486K915175l102941r250588q124626q35555M843908N175234M201731
$$ plain form
36904 4759111 7729170 10480920 8500351 -610013 -12272047 -18192331 -13346959 -1411885
36896 -1411885 5937337 -32185 -12617352 -15019616 -2429852 9829263 7649006 -1713781
36888 -1713781 -2667610 3333877 1833096 -8419529 -11823352 -1174004 10697541 11482432
36880 11482432 6877196 7913732 13023254 14397549 12776065 12787805 10134776 -2451851
36872 -2451851 -19606041 -27552543 -23821633 -19931397 -22365090 -23134317 -14330993 -1723975
36864 -1723975 3739829 941176 -3093962 -5443484 -9321920 -15205476 -17464688 -11311141
36856 -11311141 1492815 15150832 24676946 27416837 23467352 16802412 13462994 15673486
36848 15673486 18588661 15485720 6235132 -1889494 -2725049 2118859 7294093 11495824
36840A1495824M775131K088486p361306j5054943r303760N716400J2111683L273077
36832G740592n917702j994032O201643K726055q916031j1939183l945274J370447
36824a4673485l66255J656671R572641R070445m428047j2574782k526892R615020
36816d654684L948423r471764o853730Q937288J2608282j344458r811598N43636
36808f098605J3073984J0164725p16376m541787l067392m757761n846488K11445
36800a578255O210202K711527l250224O1211O152808l71751j5998505k1266395
36792b7329382j1056734r65166n71423p84438N389757Q446065j5930j0225902
36784c7113153q407313K307694Q936079R410873J1739894J5779193J0944243n243042
$$ plain form
36840 11495824 16270955 18359441 10998135 -4056808 -13360568 -7644168 4467515 7740592
36832 7740592 1822890 -171142 6030501 8756556 -159475 -12098658 -16043932 -14673485
36824 -14673485 -15039740 -13383069 -3810428 5260017 831970 -11742812 -14269704 -4654684
36816 -4654684 -706261 -10178025 -17031755 -8094467 4513815 3169357 -6642241 -6098605
36808 -6098605 6975379 17140104 16423728 11881941 8814549 4056788 -1789700 -1578255
36800 -1578255 4631947 7343474 4093250 4154461 10307269 9935518 -6062987 -27329382
36792 -27329382 -38386116 -39351282 -39922705 -40707143 -35317386 -26871321 -26887251 -37113153
36784 -37113153 -45520466 -43212772 -34276693 -24865820 -13125926 2653267 13597510 8354468
36776H354468j8318985j3914787K477806J1235748L455920p615724m430616J0710687
36768h045483J8295333Q466012n413738o146611L377767O281467l486303j4761405
36760a432961j6144039p797273L847853J2146291J0450999k094333j3558449j0258973
36752b4840885L197862Q591537J680650j685156O377779J0857989K35360j0409557
36744e994421l018884J0363868M187869j7171104k1667255J572626K3741112J8844438
36736A0858249R70244q14711J1683988J0969537j0404678k5928207j3861611J0675224
36728e851965J7048658Q05097j3736591r338815L664640P783546M172430N538426
36720A0085426J1732548Q863240o956280j9856865j4862776J949206J2880527
$$ plain form
36776 8354468 -9964517 -23879304 -21401498 -10165750 -6709830 -14325554 -18756170 -8045483
36768 -8045483 10249850 18715862 13302124 7155513 10533280 16814747 13328444 -1432961
36760 -1432961 -17577000 -25374273 -21526420 -9380129 1070870 -1023463 -14581912 -24840885
36752 -24840885 -21643023 -13051486 -11370836 -13055992 -6678213 4179776 4415136 -5994421
36744 -5994421 -9013305 1350563 5538432 -11632672 -33299927 -31727301 -7986189 10858249
36736 10858249 11828493 11013782 22697770 33667307 23262629 -2665578 -16527189 -5851965
36728 -5851965 11196693 12001790 -1734801 -11073616 -7408976 374570 4547000 10085426
36720 10085426 21817974 30681214 23724934 3868069 -10994707 -9045501 3835026
36713C835026J1513812N950793K584254j821474r984591j5512548j0564530K163077
36705a1836181J1229889R779700K737664o31953J713570L469127p99062r134554
36697F528200j5567238j6248770j0576155m50505Q631696J0398993O129017N136577
36689f018185J0861080J2312050q75911j9184228k2076340n887492J0358398R913549
36681a0597079k723810j1990371r670665J597052J3302275J5046722L407195r349544
36673a0978225o529956R253053J7050051P456182m346182l814561J780387M8811
36665I919560m972229m307652k710692o910103p772377M105009J5200241O249802
36657H801559j3377824j4902000O955122K5650068K0871929J886650j2911501
$$ plain form
36713 3835026 15348838 21299631 23883885 22062411 12077820 -3434728 -13999258 -11836181
36705 -11836181 -606292 9173408 11911072 11279119 12992689 16461816 15662754 6528200
36697 6528200 -9039038 -25287808 -35863963 -36314468 -27682772 -17283779 -11154762 -6018185
36689 -6018185 4842895 17154945 16279034 -2905194 -24981534 -30869026 -20510628 -10597079
36681 -10597079 -13320889 -25311260 -34981925 -33384873 -20082598 -5035876 -1628681 -10978225
36673 -10978225 -17508181 -8255128 8794923 16251105 11904923 8090362 9870749 9919560
36665 9919560 4947331 639679 -2071013 -8981116 -16753493 -12648484 2551757 8801559
36657 8801559 -4576265 -19478265 -12523143 13126925 33998854 35885504 22974003
36650B2974003j8400609j6443525o375331P275790J2160545L754809p030114r206603
36642a1291035m315290J652913P277429J0906801Q318523J148176k815927k359956
36634H521634m729544j1018319j2535394o435235j290284j336803N95680P388684
36626b0839581R534584J858318n380080k726675L271278K268777l317669n332500
36618b0663548l871169l052302j397679K858617M887665J786795j93153L099092
36610a6545682M084847l629987j1094572o002479O851024J0574164n19480j3681401
36602b9963566j3744519Q38174J7521185K1202782Q370180q389467j3951563q155894
36594b6272688k255811K43913O208132J5526598J7350756Q614545K18503k060778
$$ plain form
36650 22974003 4573394 -11870131 -18245462 -10969672 1190873 4945682 -2084432 -11291035
36642 -11291035 -15606325 -13953412 -6675983 4230818 12549341 13697517 10881590 8521634
36634 8521634 3792090 -7226229 -19761623 -26196858 -27487142 -28823945 -28228265 -20839581
36626 -20839581 -11304997 -9446679 -14826759 -17553434 -14282156 -12013379 -15331048 -20663548
36618 -20663548 -24534717 -27587019 -28984698 -26126081 -21238416 -19451621 -19644774 -16545682
36610 -16545682 -12460835 -16090822 -27185394 -33187873 -26336849 -15762685 -16282165 -29963566
36602 -29963566 -43708085 -42869911 -25348726 -4145944 4224236 -4165231 -18116794 -26272688
36594 -26272688 -28528499 -28284586 -22076454 -6549856 10800900 19415445 19633948 17573170
36586A7573170o211930j5078482j6528203m186043Q706506R613428N319046O115609
36578E323101P065294Q94159n316742l419534l47835l786333n740159J637734
36570c690315Q415357M396265r38050K843171M653634p120834j7022553n150342
36562a3613667J5521997J6578173m67892r834674n931847o529945j4055697j0617399
36554b8950951N450913J3326187O489761L049776J0979094J4252671M047804n269526
36546B3375729k887209K072863J534362O05117r9104p815316j5409897n321786
36538c945241J5155132J5611713p727464j9776380k345628J4818254M166789j3786733
36530B170442p752311J1122913J1634947m330731j0981018n188151m314940p934111
$$ plain form
36586 17573170 11361240 -3717242 -20245445 -24431488 -15724982 -6111554 -792508 5323101
36578 5323101 12388395 13282554 7965812 4546278 4198443 412110 -5328049 -3690315
36570 -3690315 4725042 9121307 8183257 11026428 15680062 8559228 -8463325 -13613667
36562 -13613667 1908330 18486503 18018611 8183937 2252090 -4277855 -18333552 -28950951
36554 -28950951 -23500038 -10173851 -3684090 -634314 10344780 24597451 28645255 23375729
36546 23375729 20488520 22561383 24095745 24700862 24601758 16786442 1376545 -3945241
36538 -3945241 11209891 26821604 19094140 -682240 -3027868 11790386 15957175 2170442
36530 2170442 -5581869 5541044 17175991 12845260 1864242 -3323909 -7638849 -15572960
36522a5572960m02316J3791470J3858192L22648m767836M329930J0215785M743988
36514B6518901j489719m062508r792866j4161763l783070J3750373J3414368n774564
36506A4619152j3997860K211499J6472657M453378j7521856j9186831j530611
36499a4480472J0157996N439237l607451o857305o395343m486972J045131Q657453
36491a0527726J2509650J0510771N095777j675231p207503p191805k070270J173012
36483F16675K18392K206805R282388R892898l214027j6381388j2754183J113973
36475i018467N773379J027298M368343J7010925J7492245k190118j8428252j0064384
36467E970969R011756J2207238O31452l664387L585978M693609n847112j0688064
$$ plain form
36522 -15572960 -15975276 -2183806 11674386 11997034 7229198 11559128 21774913 26518901
36514 26518901 25029182 20966674 11173808 -2987955 -6771025 6979348 20393716 14619152
36506 14619152 621292 2832791 19305448 23758826 6236970 -12949861 -14480472
36499 -14480472 -4322476 1116761 -2490690 -9347995 -15743338 -20230310 -19185179 -10527726
36491 -10527726 1981924 12492695 17588472 15913241 8705738 1513933 -556337 616675
36483 616675 835067 3041872 12324260 22217158 19003131 2621743 -10132440 -9018467
36475 -9018467 -3245088 -2217790 2150553 19161478 36653723 34463605 16035353 5970969
36467 5970969 14982725 27189963 27821415 24157028 27743006 32436615 26589503 15901439
36459A5901439n54996Q560318K401409p270264k573142J1155703J5145753O490062
36451D9256282j711167l353797l322514j744250O425488J5760149J2721830k455394
36443G1576627j2004371m487949J0361799J6483252J0339287m50895p729329p051072
36435G7037349M25957O598207M415860j743006k844245j344521p054418j6414699
36427E9076484j3456692L286001J3116973K684187j3068761j3076673o2880P468548
36419D5967187L531458j732635j417770N93266k53368l407467o721171p220685
36411B9338815q72424J0843661J7857915J2705649R59904o540457p117305m876741
36403E2299017j703479K225752M187814L187585L407136O340880O143334M20497
$$ plain form
36459 15901439 15346443 23906761 26308170 19037906 16464764 27620467 42766220 49256282
36451 49256282 47545115 44191318 40868804 39124554 45550042 61310191 74032021 71576627
36443 71576627 59572256 55084307 65446106 81929358 92268645 91817750 84088421 77037349
36435 77037349 77463306 84061513 88477373 86734367 83890122 82545601 75491183 59076484
36427 59076484 45619792 48905793 62022766 64706953 51638192 38561519 38498639 45967187
36419 45967187 49498645 47766010 46348240 46941506 46688138 43280671 36559500 29338815
36411 29338815 28466391 39310052 57167967 69873616 70833520 64293063 57175758 52299017
36403 52299017 50595538 52821290 57009104 60196689 63603825 69944705 76088039 76508536
36395G6508536k620292K531618O900909Q09273p922744l949479J1817282K2643141
36387A06718244J8324925M783580p181924j1398309n963604N793840J4563687
36380A25640439J4047604R111596P711618R153446Q904690R031577J3027844J6089735
36372B12718549J2799921R038513J2721501J7800048J2868178J954600l28733
36365B79572577O831693Q572530j167035r949904o792104J814071K629437o953184
36357B74558081j8146027k1680619j6388450j0192810j1567778j7402477j5426508
36350A63753412l499527L735117l314757j2649398r991808k808761o394718j6062358
36342A12767202j5689470o842949m486118p945019l079255P591412N379248j0792604
$$ plain form
36395 76508536 73888244 76419862 83320771 84130044 76207300 72257821 84075103 106718244
36387 106718244 125043169 129826749 122644825 111246516 105282912 111076752 125640439
36380 125640439 139688043 148799639 156511257 165664703 174569393 183600970 196628814 212718549
36372 212718549 225518470 234556983 247278484 265078532 277946710 279901310 279572577
36365 279572577 286404270 294976800 293809765 283859861 277067757 278881828 281511265 274558081
36357 274558081 256412054 234731435 218342985 208150175 196582397 179179920 163753412
36350 163753412 160253885 163989002 160674245 148024847 138033039 135224278 128829560 112767202
36342 112767202 97077732 90234783 85748665 77803646 74724391 82315803 87695051 76902447
36334G6902447j9200092j0401974n29364r68622j553413M642001N764605n032808
36326D9622780j3720341r047727p90586J025027L597404J1521637J1661045k667389
36318E1201850j3549997o629687K443126n276979j6962626q823227J1450566J4845411
36310B8698437k907635j5904945p824878R432591J8537377J5337010K453412j5124455
36302C2696914k5110122j6755813K402718J3855109J2355823P312378K199293
36295B8956300p860577j7763084j3344488M315524J5173430Q537230k020781j194090
36287A4799464N889412N469646k494851o534901j994330L822431L063444l087673
36279A8932642o811517l342054K662002K808202k365942k854638M734840R431421
$$ plain form
36334 76902447 57702355 47300381 46771017 45802395 44248982 48890983 54655588 49622780
36326 49622780 35902439 26854712 26064126 27089153 30686557 42208194 53869239 51201850
36318 51201850 37651853 31022166 33465292 28188313 11225687 2402460 13853026 28698437
36310 28698437 25790802 9885857 2060979 11493570 30030947 45367957 47821369 32696914
36302 32696914 7586792 -9169021 -6766303 7088806 19444629 26757007 28956300
36295 28956300 21095723 3332639 -10011849 -5696325 9477105 18014335 15993554 14799464
36287 14799464 20688876 26158522 23663671 17128770 15134440 18956871 22020315 18932642
36279 18932642 12121125 8779071 11441073 14249275 11883333 9028695 13763535 23194956
36271B3194956K526494p134026o531985R07512K935584j41820O74844K827445
36263A9259004l822987j4469685j2600016K085695J0356468L014051o666433o868397
36255i712300l501320l442224r00702P725943J2696850P621723J809586K770921
36247A5068477J757940q463694j6326798r337144L506862O067253J147509J897620
36239d681975N771062l31087j3284120j5107396j458839J1970847J4280591J1592002
36231H751085J0169518N729074k939991n780641L027806J3445445J3378612M579064
36223E0359972m250273j1070032j7029392j7206334p128048N390477O978694k990289
36215C054775j0821110o803711L310168Q300114N872875J846492k17015j544585
$$ plain form
36271 23194956 25721450 18587424 12055439 12962951 15898535 15756715 16431559 19259004
36263 19259004 15436017 966332 -11633684 -9547989 808479 3822530 -2843903 -9712300
36255 -9712300 -13213620 -16655844 -17556546 -9830603 2866247 10487970 12297556 15068477
36247 15068477 16826417 8362723 -7964075 -17301219 -13794357 -7727104 -6579595 -4681975
36239 -4681975 1089087 758000 -12526120 -27633516 -29092355 -17121508 -2840917 8751085
36231 8751085 18920603 24649677 21709686 15929045 18956851 32402296 45780908 50359972
36223 50359972 46109699 35039667 18010275 803941 -6324107 -933630 6045064 3054775
36215 3054775 -7766335 -14570046 -11259878 -2959764 2913111 4759603 4542588 2998003
36207B998003j783931K368546R824625J2598738N804963l888400o434601k704628
36199A8783315k541480q823168j2785040p865797Q83057O015417P749617Q372055
36191I787976M960521l535400r084632m957469K157596J698559l810635m030905
36183f814389P59593J370197j914916L96907O866512L630929j0935561j8124950
36175b4765678o262745R534046R503469j272641l043777O959183J2328414M488881
36167G469152o480502j0163625q915696p487146l251459N061354R087322J427165
36159a3253435j0878459j2948097n97201J4801318K0080293J3576592L599981
36152A4380992k085730k388974n11044Q39828R12093J72809L12324L182192O898706
$$ plain form
36207 2998003 1214072 3582618 13407243 26005981 31810944 27922544 21487943 18783315
36199 18783315 16241835 7418667 -5366373 -13232170 -12349113 -6333696 1415921 9787976
36191 9787976 14748497 11213097 2128465 -2829004 -671408 1027151 -2783484 -6814389
36183 -6814389 -6054796 -4684599 -6599515 -6202608 663904 4294833 -6640728 -24765678
36175 -24765678 -31028423 -21494377 -11990908 -13263549 -16307326 -9348143 2980271 7469152
36167 7469152 988650 -9174975 -18090671 -25577817 -28829276 -23767922 -14680600 -13253435
36159 -13253435 -24131894 -37079991 -37677192 -22875874 -2795581 10781011 14380992
36152 14380992 12295262 9906288 9395244 10235072 11147165 11319974 11632298 14814490 21713196
36143B1713196N060065n425079j6813976j7031777m432101R906163J5459796J1190330
36135A9626617R79019j0170041j3300423j366291J5928795J6179183o549431k8411606
36127g084178k4944773l089502J1914628J2275653J0269921J1101162O556626
36120A6999537l993960q764071m114448j46977p66391K073349Q287137N303821
36112A4877997o995700r162460O228300J6929885L402294j9145342k2949273p890941
36104b4705240M422877O511806Q975111J3745064R959035k364067q259529k350062
36096E934995K588633k056391p511752m433059K442264N294888N685667O223117
36088A4168362J006266j3811638k6995581k2085915Q81392K2067661K2270688
$$ plain form
36143 21713196 26773261 21348182 4534206 -12497571 -16929672 -7023509 8436287 19626617
36135 19626617 20605636 10435595 -2864828 -4231119 11697676 27876859 21327428 -7084178
36127 -7084178 -32028951 -35118453 -23203825 -10928172 -658251 10442911 16999537
36120 16999537 13005577 4241506 127058 -19919 -786310 1287039 9574176 14877997
36112 14877997 7882297 -1280163 4948137 21878022 25280316 6134974 -16814299 -24705240
36104 -24705240 -20282363 -13770557 -4795446 8949618 18908653 16544586 8285057 5934995
36096 5934995 8523628 6467237 -1044515 -5477574 -3035310 2259578 7945245 14168362
36088 14168362 15174628 1362990 -25632591 -47718506 -46837114 -24769453 -2498765
36081b498765L240210j4329178j3095004K164738J1543703N395938m927345n424877
36073a7930580J107812L070543o34696k145248m79089j466961l902056l38806
36065b2719081P781319R592465J730850o295400o400868r63706M392281O873751
36057f008389M418774j964949l921161M386142J3154211Q112233n664844q606960
36049C905057K643810R054976k34879j1141979q663776O16728L402197J241406
36041H23540J782170J527092n728838j2806278q429730L721682J0561333R243516
36033F94487P025455N756251R36332n800915o642514l11938N462680M624293j480886
36024A0263245p753632q569445p55592J0248139J2162503J333705r401628p598422
$$ plain form
36081 -2498765 741445 -13587733 -26682737 -24517999 -12974296 -7578358 -12505703 -17930580
36073 -17930580 -16822768 -13752225 -14386921 -16532169 -17011258 -18478219 -22380275 -22719081
36065 -22719081 -14937762 -5345297 -3614447 -9909847 -16310715 -17274421 -12882140 -6008389
36057 -6008389 -1589615 -3554564 -7475725 -3089583 10064628 18176861 12512017 3905057
36049 3905057 6548867 15603843 15368964 4226985 -4436791 -3820063 -417866 823540
36041 823540 2605710 4132802 -1596036 -14402314 -22832044 -19110362 -8549029 694487
36033 694487 7719942 13476193 14412525 8611610 1969096 1657158 7119838 11744131 10263245
36024 10263245 2509613 -6059832 -6815424 3432715 15595218 16928923 7527295 -71127
36016g1127p3575k932852j6215117k2006421r047635J1859574K1111461J2363603
36008e012089k537468p835917p17527O761390L562062n446901o615431K417378
36000a5424503R936902Q306834K960952L4661k006031l337110N44883O269919
35992G286507K103004j0853522j3780025R52246J3387981N400640r858713r056149
35984a4418031M490442R556496K771644o51867L497020M274917p91826k452916
35976F275879o562j768393n335750p33601O568623R03074j3424220j4078426K070580
35967a9528796J1306990J696195p937791j069011R824824P155547k611871l737224
35959d901137J439276L24438o622416q976685m205588K572572Q564312J0978919
$$ plain form
36016 -71127 -144702 -3077554 -19292671 -41299092 -50346727 -38487153 -17375692 -5012089
36008 -5012089 -7549557 -15385474 -16103001 -9341611 -5779549 -11226450 -17841881 -15424503
36000 -15424503 -5487601 2819233 5780185 5814846 3808815 471705 1016588 7286507
35992 7286507 9389511 -1464011 -15244036 -14291790 -903809 4496831 -5361882 -14418031
35984 -14418031 -9927589 -371093 2400551 1748684 5245704 9520621 8728795 6275879
35976 6275879 6269317 4500924 -834826 -1568427 5000196 5903270 -7520950 -21599376 -19528796
35967 -19528796 -8221806 -6525611 -14463402 -15532413 -5707589 1447958 -1163913 -4901137
35959 -4901137 -3461861 -3137423 -9759839 -18736524 -22942112 -20369540 -11805228 -826309
35951h26309M774299n830553n772986Q215380J6974718O124024r954345r851357
35943C852871J637450L910666m999787q537868j742022K844560n41227k820937
35935f396294O48152K469201l37964J4478N948487Q037752J818461l323622k95013
35926H583638L650013N87502l617501O4886P159633O210608k770689q782705p350996
35917C734389n800569r010293j0516299l861812M857521M908143k334904n447172
35909b3470996k040688l184770j2875902j5773455J542277K5565107K9773609
35902d64818J1159455n813296m148182N556304O765810Q87095j950211j319546
35894A0672611k073627k635061r17099k111180p799651p600432M289322J4699393
$$ plain form
35951 -826309 3947990 -1882563 -7655549 559831 17534549 23658573 13704228 3852871
35943 3852871 5490321 9400987 4401200 -4136668 -5878690 -3034130 -3575357 -6396294
35935 -6396294 -5748142 -3278941 -3616905 -3602427 2346060 10383812 12202273 8878651 8583638
35926 8583638 12233651 12821153 9203652 9268538 16428171 22638779 19868090 11085385 3734389
35917 3734389 -2066180 -11076473 -21592772 -25454584 -20597063 -15688920 -18023824 -23470996
35909 -23470996 -25511684 -28696454 -41572356 -57345811 -55803534 -30238427 -464818
35902 -464818 10694637 4881341 733159 6289463 13055273 13942368 11992157 10672611
35894 10672611 8598984 5963923 5046824 2935644 -4864007 -12464439 -8175117 6524276
35886F524276R920873j199253j363706O175116M283390p420583j1867545l594762
35878A457806M318619M459626M189765O278367K219362p976923j0113609Q7997
35870D921010O088356m033332j7651684j6787302l534670P695928J1565472J1121549
35862f14673O036949l216721p313135M34673R843142N697323r527691j8300765
35854a6960898j1698865J669268R860519J0048194O269771L341010L881000N683197
35846A2093196L251146l474430o192511k38316O234045L869195k494302j301944
35838A1746079O463372Q383282K01580q491305r912242p663110p223421p455562
35830a3951327o429446o496106p648485l792640P068332J4958287Q912816o680093
$$ plain form
35886 6524276 16445149 15245896 13882190 20057306 24340696 16920113 5052568 1457806
35878 1457806 5776425 10236051 14425816 20704183 22923545 14946622 4833013 4921010
35870 4921010 11009366 6976034 -10675650 -27462952 -30997622 -23301694 -11736222 -614673
35862 -614673 5422276 2205555 -5107580 -4672907 5170235 10867558 1339867 -16960898
35854 -16960898 -28659763 -26990495 -17129976 -7081782 -812011 2528999 6409999 12093196
35846 12093196 15344342 11869912 5677401 5439085 11673130 15542325 13048023 11746079
35838 11746079 18209451 26592733 26794313 18303008 8390766 727656 -6495765 -13951327
35830 -13951327 -20380773 -26876879 -34525364 -38318004 -31249672 -16291385 -7378569 -14058662
35822a4058662j4899327o308855R842384J7328663J2125012N018719N319419Q107887
35814B2475240L192441o852077p898656L872897J2263527K390254j5693406j8010150
35806d259930M98007J8073265J4753791k859191j2954480o590581N121409Q462574
35798B0244864K436359m368355n783059l409924k339454m494352o566190l702381
35790g982492M934855J3640547J3309423m61472j9970619k8402948j5696838Q260897
35782c2368647K2320824J7650579N735070r4598j754580p546090j5006467j4888368
35774b5952277p414042q91319L792402J2329005K0035068J2870566q267459k0368155
35766a3866211p443831J5047765K0123670O298704k923071M687742J2754672K336295
$$ plain form
35822 -14058662 -28957989 -35266844 -25424460 -8095797 4029215 9047934 14367353 22475240
35814 22475240 25667681 18815604 10916948 14789845 27053372 29443626 13750220 -4259930
35806 -4259930 -3761923 14311342 29065133 26205942 13251462 6660881 11782290 20244864
35798 20244864 22681223 18312868 12529809 9119885 6780431 2286079 -4280111 -7982492
35790 -7982492 -3047637 10592910 23902333 23440861 3470242 -24932706 -40629544 -32368647
35782 -32368647 -10047823 7602756 13337826 13243228 11488648 3942558 -11063909 -25952277
35774 -25952277 -33366319 -34257638 -30465236 -18136231 1898837 14769403 6501944 -13866211
35766 -13866211 -21310042 -6262277 13861393 20160097 17237026 21924768 34679440 37015735
35758C7015735j8756968k6082060j2074263N192630Q158823J308302j365223Q0358
35750f522666m865427j3851400j0496638Q139474K0304242Q844064j1214432j2316655
35742b1979438O082850J8466861J1732598O24786M35422N219118L314235k550092
35734B1346340m021790l329945o532237r610747n154848L414404P052317N629851
35726H793345N423213O292988L213998k275172l606110q11387m50607m482899
35718A2097369p946133p248787l314150K431661Q231686R725172M330247l493606
35710A4813459p112455n617542j933129K877690P638258Q248061L417550j755331
35702B0576561m207447q306384j5484147j6616761m906042J0645277J5587895
$$ plain form
35758 37015735 18258767 -7823293 -19897556 -14704926 -6546103 -5237801 -6603024 -6522666
35750 -6522666 -11388093 -25239493 -35736131 -27596657 -7292415 1551649 -9662783 -21979438
35742 -21979438 -15896588 2570273 14302871 14927657 15363079 20582197 23896432 21346340
35734 21346340 17324550 13994605 7462368 -2148379 -7303227 -3888823 3163494 8793345
35726 8793345 14216558 20509546 23723544 21448372 17842262 17030875 16580268 12097369
35718 12097369 4151236 -3097551 -6411701 -3980040 4251646 13976818 18307065 14813459
35710 14813459 7701004 2083462 150333 3028023 10666281 18914342 22331892 20576561
35702 20576561 16369114 8062730 -7421417 -24038178 -28944220 -18298943 -2711048
35695b711048P812326m792696j6174499k0547182r815768J2200527K3382040R751674
35687h94626j0710126j1614532K942679P777561j474666m950507M212470R943748
35679d767999M616440O27857L281887R82526p940383p671479L733774N176174
35671a961203r663283j5578166K543494K0680029J4072663k187388j703052P398037
35663A3601131Q47518j5143085j4598433J332387P361864p32598k351902O437640
35655c245478N754987q310967j3307044n49237P982988k064642j2548416n179140
35647c1466949P526719N975349k969633o71378J0246784J2235162K850547m151772
35639d25171k513294J387283L786608O401989O241084j103317r050119o570550
$$ plain form
35695 -2711048 5101278 308582 -15865917 -36413099 -46228867 -34028340 -10646300 -894626
35687 -894626 -11604752 -23219284 -20276605 -12499044 -13973710 -18924217 -14711747 -4767999
35679 -4767999 -151559 476298 3758185 4740711 -3199672 -10871151 -7137377 -1961203
35671 -1961203 -11624486 -27202652 -24659158 -3979129 10093534 7906146 6203094 13601131
35663 13601131 14448649 -694436 -15292869 -13960482 -6598618 -7331216 -9683118 -3245478
35655 -3245478 2509509 -5801458 -19108502 -19657739 -11674751 -13739393 -26287809 -31466949
35647 -31466949 -23940230 -17964881 -20934514 -21605892 -11359108 876054 3726601 -425171
35639 -425171 -2938465 -1551182 2235426 8637415 14878499 13775182 4725063 -1845487
35631a845487K784519M021083n128755r098202Q19561J1454471P572991m407685
35623F172496o218975M111197R121905j242287j3100869p899962R393817J4600122
35615A4937444k213163k0238735j4237754R870335K0485580L022585j8226046
35608f599754j2482106J3300828K1951288j566361k6557452j8380993J2290298
35601a8044252K4616699N600271j4551508j0134831M719841N091361l576479K63628
35593f015270J3283846J2048418n670895j5913800p992673R04709j089740j331248
35585a1776653R526162J6543519O008713r525451j2228225o808062o006109n066246
35577a9332352N475715J5539776R911125l301577m554469M317027M986574n057402
$$ plain form
35631 -1845487 939032 4960115 -168640 -9266842 -8447281 3007190 10580181 6172496
35623 6172496 -46479 4064718 13186623 11944336 -1156533 -9056495 337322 14937444
35615 14937444 12724281 -7514454 -21752208 -11881873 8603707 11626292 -6599754
35608 -6599754 -19081860 -5781032 16170256 14603895 -11953557 -30334550 -18044252
35601 -18044252 6572447 12172718 -2378790 -12513621 -7793780 -2702419 -6278898 -6015270
35593 -6015270 7268576 19316994 13646099 -2267701 -10260374 -9355665 -10445405 -11776653
35585 -11776653 -2250491 14293028 20301741 10776290 -1451935 -8259997 -14266106 -19332352
35577 -19332352 -13856637 1683139 11594264 8292687 3738218 8055245 13041819 7984417
35569G984417j0759950o679904j180097L633859J1256285J3150036j131948j7794588
35561a521890j2314638R487869J5275222l500421j7689778p637924P717883N888895
35553d294782l570116n15602J1135992J3906173N807315k935054r522256j5245296
35545e233626j3816616j862769Q725961O690559N47060M542622J4301090J4857434
35537B8751715O084680J017834K500502j49856j1093669j9867935j6063234k143353
35529a0963316J0266104J1284540J304700p760607m485005N991964O705992o096088
35521F248284j5117272p318686O345262Q631563J257380k555776p34871p10125
35513c954241k442782m24156K295715j034070n646478j936047N053245Q96763
$$ plain form
35569 7984417 -2775533 -9455437 -10635534 -7001675 4254610 17404646 16272698 -1521890
35561 -1521890 -13836528 -4348659 10926563 7426142 -10263636 -17901560 -10183677 -4294782
35553 -4294782 -7864898 -8380500 2755492 16661665 22468980 19533926 10011670 -5233626
35545 -5233626 -19050242 -20913011 -12187050 -5496491 -4949431 -406809 13894281 28751715
35537 28751715 34836395 35854229 38354731 38204875 27111206 7243271 -8819963 -10963316
35529 -10963316 -697212 10587328 11892028 4131421 -353584 5638380 12344372 6248284
35521 6248284 -8868988 -16187674 -9842412 -1210849 46531 -2509245 -3244116 -3954241
35513 -3954241 -6397023 -6821179 -4525464 -5559534 -11206012 -13142059 -8088814 -7192051
35505g192051j2932869j7119181k424841J5888807J8893044P592286k531685k395414
35497b221904L813551Q335244Q609831O364613K829074k173432p091211q305211
35489A0160555n593681m244174o356434m331217P470065J7948146J0485886j0335758
35481A5203388j9811736o356714J2334935J4781218K393441r474580j2887352
35474c817400q261127K430344J1196539O364740q167913j1133340M614775J6165377
35466I391995M265029j4881414j4815676J29003O636662K410185L088082P828947
35458D052813J844696j0231864q147824N864874P450977o574634j0337477O071437
35450a0007002J8179306Q722464m615505k761722K577230n616693j6650793j1938025
$$ plain form
35505 -7192051 -20124920 -37244101 -39668942 -23780135 -4887091 2705195 173510 -2221904
35497 -2221904 1591647 9926891 18536722 24901335 27730409 25556977 18465766 10160555
35489 10160555 4566874 322700 -6033734 -10364951 -2894886 15053260 25539146 15203388
35481 15203388 -4608348 -10965062 1369873 16151091 18544532 9069952 -3817400
35474 -3817400 -12078527 -9648183 1548356 7913096 -254817 -11388157 -6773382 9391995
35466 9391995 13657024 -1224390 -16040066 -15911063 -9274401 -6864216 -3776134 4052813
35458 4052813 5897509 -4334355 -12482179 -6617305 833672 -5740962 -16078439 -10007002
35450 -10007002 8172304 16894768 12279263 9517541 12094771 6478078 -10172715 -22110740
35442b2110740R61569K360333n200313m482853M292267O385979J912874N389409
35434a0491475J7069521J9316013M511681j3516784j9823137j3769320j823546
35427a8527047R379303J0790060k248966j7746829j6890713J1611J2422495Q886113
35419a3923973J535613M167545J1398406J0501237J472237o983683j1758614j3339672
35411a6930904q140229L723812J0323234K893660o363338R51970J8941680K1771898
35403B7171783K128109j5164325q418126R663286J2318945k064391j1289387m598807
35395I747087M304179J486992p741352j0396897m203266L440182O491192L908123
35387G036240j412496l166703K509062R222606O452629m091196q498783j289943
$$ plain form
35442 -22110740 -21149171 -18788838 -23989151 -28472004 -24179737 -17793758 -15880884 -10491475
35434 -10491475 6578046 25894059 30405740 16888956 -2934181 -16703501 -18527047
35427 -18527047 -9147744 1642316 -606650 -18353479 -35244192 -35232581 -22810086 -13923973
35419 -13923973 -12388360 -8220815 3177591 13678828 15151065 8167382 -3591232 -16930904
35411 -16930904 -25071133 -21347321 -11024087 -8130427 -14493765 -13541795 5399885 27171783
35403 27171783 29299892 14135567 5717441 15380727 27699672 25635281 14345894 9747087
35395 9747087 14051266 15538258 7796906 -2599991 -6803257 -3363075 3128117 7036240
35387 7036240 5623744 2457041 4966103 14188709 20641338 16550142 8051359 6761416
35379F761416N332024j76369j1753899j6080022j0700835k148012N683943J0745589
35371a2336165Q061922k464702r470296l390623Q335433J1143101M315154l47794
35363C846030K046997M421564J664429k295236k930968j311826j06368l02992
35355E031630k497374n974796p389152m971820j589567L43496K340986M181122
35347a0525475J893394l396524l764760J622039K108212n869377q870102K038990
35339b4763603J3248409Q857062l222043n206295J196022J961953j528952K564424
35331f893023R657472M213485r940929j2455549l77158Q206715O763770Q051978
35323G226761J4483744J0574172o027416j5057028p613232j940402j0127183j5727764
$$ plain form
35379 6761416 12093440 11917071 163172 -15916850 -26617685 -28765697 -23081754 -12336165
35371 -12336165 -4274243 -6738945 -16209241 -19599864 -11264431 -121330 4193824 3846030
35363 3846030 5893027 10314591 11979020 9683784 6752816 5440990 5334622 5031630
35355 5031630 2534256 -3440540 -10829692 -15801512 -17391079 -17047583 -14706597 -10525475
35347 -10525475 -8632081 -12028605 -15793365 -14171326 -12063114 -17932491 -26802593 -24763603
35339 -24763603 -11515194 -2658132 -5880175 -11086470 -9890448 -7928495 -9457447 -6893023
35331 -6893023 2764449 6977934 -2962995 -15418544 -15795702 -7588987 -825217 7226761
35323 7226761 21710505 32284677 26257261 11200233 3587001 1646599 -8480584 -24208348
35315b4208348l564490J2013536J0612792j911353p002968l203773m75569J548032
35307a6192141P693204J0497322M66586j4613814j8893387j0581534j12456O167712
35299c5568508P663543M260665R52766O037217J4186648P651062j2985126k0149374
35291b7951107O6872K0748311J2913773r079176j2398956Q90982K944268p540405
35283a9405438l864001J8077586K8439928J1329514j1127683j5591923q178801
35276c20818l265901J297197R499079J0136923m703784k0003071j6654411M80681
35268b3534105J0600847N677073l773602o734374k725754L168687O946147P218289
35260c156792M508497q18266q877961j5684753j2947346O2562J0020476O313160
$$ plain form
35315 -24208348 -27772838 -15759302 -5146510 -7057863 -14060831 -17264604 -17740173 -16192141
35307 -16192141 -8498937 1998385 2464971 -12148843 -31042230 -41623764 -41736220 -35568508
35299 -35568508 -27904965 -23644300 -22691534 -16654317 -2467669 5183393 -7801733 -27951107
35291 -27951107 -27884235 -7135924 5777849 -3301327 -15700283 -14809301 -11865033 -19405438
35283 -19405438 -23269439 -5191853 23248075 34577589 23449906 7857983 -320818
35276 -320818 -3586719 -2289522 7209557 17346480 12642696 -7360375 -24014786 -23534105
35268 -23534105 -12933258 -7256185 -11029787 -17764161 -20489915 -17321228 -10375081 -3156792
35260 -3156792 1351705 533439 -8344522 -24029275 -36976621 -36914059 -26893583 -20580423
35252b0580423j342959K703379J3031806J0542947m879853j2391729l930120M105051
35244a2741901Q0994n730010l862353k287932o303126l988684J0598629J9854782
35236d379601Q994744p233251o952794M229305N660975k733470l722391N328549
35228h07934J0028784N288826k69376m537193j2754359j8536693q480985J1870831
35220a8198099K0309156J0666726N97860J198524K310631l546873o279529K40787
35212G299183L416096n558580j3252635n937981O186118O433718j45323K130370
35204E70966R897688N847170j0388851j8983889r077335P107839J3077997P158675
35196E210260p23367r95619Q284630J7838304J3134790o682044k1239929j3487791
$$ plain form
35252 -20580423 -21923382 -19220003 -6188197 4354750 -525103 -12916832 -16846952 -12741901
35244 -12741901 -12660907 -18390917 -22253270 -24541202 -30844328 -34833012 -24234383 -4379601
35236 -4379601 4615143 -2618108 -9570902 -5341597 319378 -2414092 -6136483 -807934
35228 -807934 9220850 14509676 14240300 9703107 -3051252 -21587945 -30068930 -18198099
35220 -18198099 2111057 12777783 13375643 14574167 16884798 13337925 7058396 7299183
35212 7299183 10715279 5156699 -8095936 -14033917 -7847799 -1414081 -1559404 570966
35204 570966 10468654 16315824 5926973 -13056916 -22134251 -15026412 -1948415 5210260
35196 5210260 4486893 3491274 11775904 29614208 42748998 36066954 14827025 1339234
35188A339234M232685O506034o962887j2016693L57167J0266412K478341j0148647
35180c948354j0380429l481378l066339o113050j688949O555774O462242q77090
35172a6537573l601065Q57569M257501K974657O07565j633066l673424K30745
35164a6517091J2768325K1944731J3709564o189999j8285260j5272679o354415
35157a4196824J661855R587988J2981813M082073j0360296j2403626N51934J0422531
35149B327448N873632k697828l292061M88203K208397N171786J0126052O895372
35141B7101001p312840j6339926q257443L553412J211897q009319n160554O071858
35133g141914M582036j0879848j6556238j075841J6212699J5371315M209997J012909
$$ plain form
35188 1339234 5571919 12077953 5115066 -6901627 -6544460 3721952 6200293 -3948354
35180 -3948354 -14328783 -17810161 -20876500 -26989550 -28678499 -22122725 -15660483 -16537573
35172 -16537573 -20138638 -19281069 -15023568 -12048911 -11441346 -13074412 -16747836 -16517091
35164 -16517091 -3748766 18195965 31905529 25715530 7430270 -7842409 -14196824
35157 -14196824 -12534969 -2946981 10034832 14116905 3756609 -8647017 -8095083 2327448
35149 2327448 8201080 5503252 2211191 2699394 4907791 10079577 20205629 27101001
35141 27101001 19788161 3448235 -4809208 -1255796 -43899 -8053218 -13213772 -7141914
35133 -7141914 -2559878 -13439726 -29995964 -31071805 -14859106 512209 4722206 5735115
35125E735115M400220R2853j0879263j2354130p19675P743560K921674l192037
35117f251683K321287J0398885M648850j0221840j4822348o677935k870592q384244
35109c1859620o445978R132612J6637783N90922j7835909j0626918J2402577J9530777
35101h473754P676115K087621R075862P386571q309751j4151150n62565P752454
35093B481403m559563j3839752J725414K1109628J3416763j0673939j6875673
35086g215719j585243Q986994N178813K352326N658512J823950j0566214j4350908
35078i717489m431160K276576l855795r926036m093912O546862J1538924J2437427
35070G75397J3217644J0781616L264673m983059j1412833j5628012j1533292L928594
$$ plain form
35125 5735115 10135335 10228188 -651075 -13005205 -13724880 -5981320 -3059646 -6251683
35117 -6251683 -3930396 6468489 11117339 895499 -13926849 -20604784 -23475376 -31859620
35109 -31859620 -38305598 -29172986 -12535203 -11944281 -29780190 -40407108 -28004531 -8473754
35101 -8473754 -797639 1289982 10365844 17752415 9442664 -4708486 -5271051 2481403
35093 2481403 -2078160 -15917912 -14192498 6917130 20333893 9659954 -7215719
35086 -7215719 -8800962 186032 5364845 7717171 13375683 15199633 4633419 -9717489
35078 -9717489 -14148649 -11872073 -15727868 -25653904 -29747816 -23200954 -11662030 775397
35070 775397 13993041 24774657 28039330 23056271 11643438 -3984574 -15517866 -11589272
35062a1589272J5101884L163436k0727438k4038463q63533J7312185J0427662
35055a1213539q13195O351045J7536355Q779829r119984p975678R104864J2215981
35047B4865678n838429j8629651r205049N773398N937764k630081k570497N786397
35039C489530P702630j796638j1723671j1213697j942810O389688P488523L397156
35031A790711m19957k633046n650379p854562k966735Q398414J3744679M133152
35023H542277j0404154j2191482k34111R369908P405633K171333K592327M517017
35015A1768748J723552q94179L797356J0666438Q564342k787835j2763972j4329128
35007E745322r009884J7294Q980340R419140l915555j9818144j9112357r20194
$$ plain form
35062 -11589272 3512612 6676048 -14051390 -38089853 -38953386 -21641201 -11213539
35055 -11213539 -12026734 -5675689 11860666 20640495 11520511 3544833 12649697 24865678
35047 24865678 19027249 397598 -8807451 -3034053 2903711 273630 -2296867 3489530
35039 3489530 11192160 9395522 -2328149 -13541846 -15484656 -9094968 -1606445 1790711
35031 1790711 1370754 -1262292 -6912671 -14767233 -17733968 -9335554 4409125 8542277
35023 8542277 -1861877 -14053359 -14287470 -4917562 2488071 4659404 7251731 11768748
35015 11768748 13492300 12598121 16395477 27061915 35626257 32838422 20074450 5745322
35007 5745322 -3264562 -3247268 5733072 15152212 11236657 -8581487 -27693844 -28614038
34999b8614038J3212586Q858658j548920j33376Q380803P276853k515773m670336
34991B46457L567442O993177l69493n625441j854656j283493j0949569j4497848
34983b3773424L040927K6134772K6463556K964312j7108773j5249255m12757J0449299
34975A2508657J2299883P633214k134547j2772810j5552946p678134K199907M701616
34967A204840P46167k230901k78897M209824N865901P58675r006093j4914247
34959a3644731j0487060N54504R132346J1751403J0676512O412430j132467n983467
34951G279470j418589P649748Q570812o49811p674128m239963K434693K668523
34943A4620755n67074K041993J0522522J4898342Q168215n986504j7797555j9924330
$$ plain form
34999 -28614038 -15401452 -6542794 -8091714 -8225090 155713 7432566 4916793 246457
34991 246457 3813899 10807076 10437583 4812142 2957486 1673993 -9275576 -23773424
34983 -23773424 -20732497 5402275 31865831 34830143 17721370 2472115 2059358 12508657
34975 12508657 24808540 32441754 30307207 17534397 1981451 -5696683 -3496776 1204840
34967 1204840 1951007 -279894 -558791 3651033 9516934 10275609 1269516 -13644731
34959 -13644731 -24131791 -23577287 -14444941 -2693538 7982974 14395404 13262937 7279470
34951 7279470 5860881 13510629 22081441 21431630 13757502 9517539 11952232 14620755
34943 14620755 14053681 16095674 26618196 41516538 49684753 43698249 25900694 5976364
34935E976364j2020287M0997Q502847Q339149m2213r796256j0733995M48510J2290978
34926C006094R326186o278022j4585767n553975O224954N497978R15309P648861
34918F201618J7304892R954478r370028j4334064R29914J1962967L585194p814144
34910A8420827n021246J794378l293232j2249139p886202N612595J0655227N613059
34902A3646267K887888L276193l689769j4723621j2062509P002869K0636864J2415303
34894B9389485n357126j0935057l957102j622625r896049j5122190o223515Q480755
34886a5243424J4040445R384381M897041M519455K457648k992310n390840l181966
34878H490430l907836r139400q263872L081476J1424896N710148l165508m27167
$$ plain form
34935 5976364 -6043923 -6002926 2499921 10839070 10796857 1000601 -9733394 -9284884 3006094
34926 3006094 12332280 6054258 -8531509 -14085484 -7860530 -2362552 -1447243 6201618
34918 6201618 23506510 33460988 24090960 9756896 10686810 22649777 26234971 18420827
34910 18420827 13399581 15193959 11900727 -348412 -8234614 -2622019 8033208 13646267
34902 13646267 16534155 19810348 16120579 1396958 -10665551 -3662682 16974182 29389485
34894 29389485 24032359 13097302 9140200 7517575 -2378474 -17500664 -23724179 -15243424
34886 -15243424 -1202979 8181402 13078443 17597898 20055546 17063236 11672396 8490430
34878 8490430 4582594 -4556806 -12820678 -9739202 1685694 7395842 4230334 3803167
34870C803167N921227j349281j5967959j5136310K590041J3578790O541598k886371
34862b905098j998547M20254l880422o246381n28053K878275k481972m687614
34854a9429558M448684J2152936P042208M4715L640845Q098088M34470q959897
34846G472491l370278R305527Q725727l740493q943710k294601K821926Q19553
34838A0796142m64042J268838j64636l637582j809151K337154r35519q466894
34830a075690p084791L594872R653234N144652j315205l106904k517920r46002
34822B346246K035151Q31669q777362j6602453r964300M095928P974681K088228
34814a5972212K177945R521810Q820536k206043p056869J26355M610363j210540
$$ plain form
34870 3803167 9724394 8375113 -7592846 -22729156 -20139115 -6560325 -18727 -2905098
34862 -2905098 -4903645 -4483391 -8363813 -14610194 -15138247 -12259972 -14741944 -19429558
34854 -19429558 -14980874 -2827938 4214270 4258985 7899830 15997918 16432388 7472491
34846 7472491 4102213 13407740 22133467 18392974 9449264 7154663 9976589 10796142
34838 10796142 10332100 11600938 11436302 7798720 5989569 8326723 7391204 -1075690
34830 -1075690 -8160481 -4565609 5087625 10232277 8917072 5810168 3292248 2346246
34822 2346246 4381397 5213066 -3564296 -20166749 -30131049 -26035121 -18060440 -15972212
34814 -15972212 -13794267 -4272457 4548079 2342036 -4714833 -4588478 21885 -1188655
34806a188655m493901K866129Q566182K361149o279742o696045m430254o121710
34798a5416847n053877L203540P760255J321104l393401O282432J9768550J8409264
34790C2881020L389449r115925j2346459j1916461j1007049p980901m144114j445973
34782b1686413K782135Q999257J0332855L735328k201122m37191K813060j61154
34774D176755n166406n422207l975965n638370p310518p167081j0637932j5640604
34766e6782328p921415J3582400K4537716R196338r972197k668170K2133029K9272649
34758B1378022R972612r889178j1910977n258977k228157j399519m39417j902141
34750a677732j659178O561036J3011447K208593j7008911j8904745j877293P983134
$$ plain form
34806 -1188655 -5682556 -2816427 5749755 8110904 1831162 -4864883 -9295137 -15416847
34798 -15416847 -20470724 -17267184 -9506929 -8185825 -11579226 -5296794 14471756 32881020
34790 32881020 36270469 27154544 14808085 2891624 -8115425 -16096326 -20240440 -21686413
34782 -21686413 -18904278 -9905021 427834 4163162 1962040 1524849 4337909 4176755
34774 4176755 -989651 -6411858 -10387823 -16026193 -23336711 -30503792 -41141724 -56782328
34766 -56782328 -64703743 -51121343 -26583627 -17387289 -27359486 -30027656 -7894627 21378022
34758 21378022 31350634 21461456 9550479 4291502 2063345 663826 224409 -1677732
34750 -1677732 -3336910 3224126 16235573 18444166 1435255 -17469490 -19346783 -11363649
34742a1363649R73582j749067J0167301J5067021m03475j2779839n94241J6542090
34734A5859723R703754j1094432j5801199m824371k850052j2149915j0742555
34727c1899047N284648J4299232P302089L39576K042646p7677j0363112j1044308
34719b4115953O863390K2742009J5329626n108815j2737367k156102R554075R245485
34711A9616348K27413q073295j0440398o698610k96220M114013N109665M415390
34703G974306J906642l841498r559883r270782l658400J01300r18294k501453
34695a9768062j532362J026184M636292P702349M317489o193677j0942829j09430
34687b0864046J2800951P847209p198821n698106J3284260J9699151N65357j8057575
$$ plain form
34742 -11363649 -10390067 -12139134 -1971833 13095188 12691713 -88126 -682367 15859723
34734 15859723 25563477 14469045 -1332154 -6156525 -9006577 -21156492 -31899047
34727 -31899047 -26614399 -12315167 -5013078 -4673502 -2630856 -2708533 -13071645 -24115953
34719 -24115953 -17252563 5489446 20819072 15710257 2972890 816788 10370863 19616348
34711 19616348 19843761 11770466 1330068 -5368542 -5664762 -1550749 3558916 7974306
34703 7974306 9880948 6039450 -3520433 -12791215 -16449615 -16348315 -17266609 -19768062
34695 -19768062 -21300424 -20274240 -15637948 -7935599 -3618110 -9811787 -20754616 -20864046
34687 -20864046 -8063095 -215886 -7414707 -13112813 171447 19870598 20435955 2378380
34679B378380j2869733K651296O988165N386186R857339R763818o242463j9611667
34671a698679q166195J2413132R977049j1800854j9928883m849219J0497590J1946085
34663a609974P808090J195749j4191007k7192905j5537456J3614092K5759104
34656a0154307J1342358n36346O912152J1806677k978084j7045525r052901N694982
34648d010994M045532m850894j37018J1061633P841328n898729r692770k667148
34640d309060n63767m210130q00072P766201O447986m026024o181181M271727
34632a604320J0739602K179783j1804059j6958870j0812245k12933N947199J753171
34624b0772672p613972o715843R599047K3375928J6291007k127864p718807K396993
$$ plain form
34679 2378380 -10491353 -7840057 -851892 4534294 14391633 24155451 17912988 -1698679
34671 -1698679 -9864874 2548258 12525307 724453 -19204430 -24053649 -13556059 -1609974
34663 -1609974 6198116 7393865 -6797142 -33990047 -49527503 -35913411 -10154307
34656 -10154307 1188051 651705 7563857 19370534 16392450 -653075 -9705976 -4010994
34648 -4010994 34538 -4816356 -4953374 6108259 13949587 8050858 -1641912 -4309060
34640 -4309060 -4872827 -9082957 -9883029 -2116828 4331158 305134 -5876047 -1604320
34632 -1604320 9135282 11315065 -488994 -17447864 -28260109 -28473042 -22525843 -20772672
34624 -20772672 -28386644 -35102487 -25503440 -2127512 14163495 12035631 4316824 6713817
34616F713817Q582565J306865p480813p692443m596477l670180p23154N534164
34608b025656O823200p20423q488069q541601m204374j523349k2817K212247K828977
34599a3661865K48894k002283k00628M854895R356862Q565495p57169j4120244
34591g716043j9020854q878379O254283J1612854O154320l90985l177516l179455
34583a8341775J373091J0043171J2244890J093708r535714j574893J6423741J8003516
34575B9729735o89690j4383072r010564k481567j1569874k1624839j0467546J3572922
34567b6924495K2067614P767104p902360q390727k173808l171759p650734k851993
34559b9231158J0213742J6736819R773505n60165l602747k977733o190521q258740
$$ plain form
34616 6713817 15296382 16603247 9122434 1429991 -3166486 -6836666 -7559820 -2025656
34608 -2025656 4797544 4077121 -4410948 -12952549 -17156923 -18680272 -18703089 -16490842 -13661865
34599 -13661865 -13412971 -15415254 -15615882 -10760987 -1404125 7161370 6404201 -7716043
34591 -7716043 -26736897 -35615276 -29360993 -17748139 -11593819 -11984804 -15162320 -18341775
34583 -18341775 -16968684 -6925513 5319377 6413085 -3122629 -4697522 11726219 29729735
34575 29729735 29040045 14656973 5646409 3164842 -8405032 -30029871 -40497417 -26924495
34567 -26924495 -4856881 2910223 -4992137 -13382864 -15556672 -18728431 -26379165 -29231158
34559 -29231158 -19017416 -2280597 7492908 6932743 3329996 352263 -5838258 -14096998
34551a4096998M16000J4224159J6973861O567323j876149k19664L309609L255114
34543B8553255N051664O987642k679688j9508668j9675909O80222J1037826n470848
34535D975496j9243989j952141K1200335J0748782j7210327j4118717J8365794
34528B765233K7865497k804736k7879503j3779906J1166677R284795q648349j1316273
34520a3346565J685364J0246958R867925O752933j459444j2876101j0758121Q065978
34512a821073J6675660k148889k2415735j3073065J1090350J3173506o768851
34505e288097j5677359k088455J2084073J2557598R273222Q651608J809407j1937676
34497I384321j7209038p730938K634947K727780j014251k80689J978157K323548
$$ plain form
34551 -14096998 -13680998 543161 17517022 24084345 22208196 21988532 25298141 28553255
34543 28553255 33604919 40592561 37912873 18404205 -1271704 -591482 10446344 4975496
34535 4975496 -14268493 -16220634 4979701 15728483 -1481844 -15600561 2765233
34528 2765233 30630730 27825994 -53509 -13833415 -2666738 6618057 -2030292 -13346565
34520 -13346565 -11661201 -1414243 8453682 15206615 13747171 871070 -9887051 -1821073
34512 -1821073 14854587 12705698 -9710037 -22783102 -11692752 1480754 -5288097
34505 -5288097 -20965456 -23053911 -10969838 1587760 10860982 19512590 21321997 9384321
34497 9384321 -7824717 -15555655 -12920708 -10192928 -11207179 -11487868 -9509711 -7186163
34489g186163N054691J0661611R277346m372121j8887828j8683999l609635J0933459
34481a6812639J1661147J410466n081571M05996P918792K617743j1288325j2682963
34473b1851354N427316K1607841J3976398r707541k4249150j9667669n904939
34466d0369098P147797J6475236J7244097N562822r934540j4132922m564420O660327
34458a5910701R865486O544890K154542K3533J496757L942639R30720q346775
34450G01091j4267833r144961J336634P272964P994451P197902L265494m212721
34442A43021o900196K04963P039630K607932o921272q848643m569751l105058
34434b0349374j730376P708418J8208795J4030239l215251j3926094p727837M670061
$$ plain form
34489 -7186163 -2131472 8530139 17807485 13435364 -5452464 -24136463 -27746098 -16812639
34481 -16812639 -5151492 -3741026 -8822597 -8416601 -497809 2119934 -9168391 -21851354
34473 -21851354 -16424038 5183803 19160201 9452660 -14796490 -34464159 -40369098
34466 -40369098 -33221301 -16746065 498032 6060854 -3873686 -18006608 -22571028 -15910701
34458 -15910701 -6045215 499675 2654217 2677750 4174507 8117146 9047866 701091
34450 701091 -13566742 -22711703 -21375069 -14102105 -6107654 1090248 4355742 143021
34442 143021 -6757175 -6552212 487418 3095350 -3825922 -12674565 -17244316 -20349374
34434 -20349374 -22079750 -14371332 3837463 17867702 14652451 726357 -7001480 -2331419
34426b331419R098964L887047l939342p472739l831752K778663L920874r67792
34418A142504k272594K750706K538573p814338j2935406j552479J0344719L265177
34410d533138j1490855q414090R859302J6622262M218175o894865l614416L242291
34402a005334K385057k611715o617655r840430p766709M832322J7882705J5614447
34394A2872688K873470j374717L554849Q44382r905643r858396L361932Q628540
34386A0997105j745049r199768l824968n56733o746873n437442J0716204J9174925
34378A3377401L779514j5439445j3695406M27420M570232K62039K993655J0276371
34370F551781P973590j779910m806125j64164J001622l480227n747194l131259
$$ plain form
34426 -2331419 6767545 10654592 6715250 -757489 -4589241 -1810578 2110296 1142504
34418 1142504 -1130090 1620616 4159189 -3655149 -16590555 -18143034 -7798315 -4533138
34410 -4533138 -16023993 -24438083 -14578781 2043481 6261656 -633209 -4247625 -1005334
34402 -1005334 1379723 -1231992 -7849647 -17690077 -25456786 -20624464 -2741759 12872688
34394 12872688 15746158 14371441 17926290 18770672 8865029 -993367 2368565 10997105
34386 10997105 9252056 52288 -3772680 -4329413 -11076286 -16513728 -5797524 13377401
34378 13377401 17156915 1717470 -11977936 -11550516 -6980284 -6718245 -3724590 6551781
34370 6551781 14525371 12745461 7939336 7775172 8776794 5296567 -450627 -3581886
34362c581886N79456L172545J846751p459235j8346413j5297251J855510J1855964
34354b5374559M101533l266570N047686J3906141N329721p378305k538482J0039616
34346a33219N452883j1925713j5413814q23385R969041P549669M018841L740685
34338B434988k349138j0668086n328251R911413J1218775n243904j2992169K707207
34330a0309165K0280918J5629282k844030j1221379m140497N750690Q779279L384285
34322B5309383q338013j7326392j0853151Q825140J9856040P143241j5841706
34315H774542k3542924r496078R450351J4570698K784933j2564610j3712187K892380
34307b0842895J8581386J2967587p173220j4687252o05148J3552611J0170884
$$ plain form
34362 -3581886 -3002430 170115 2016866 -5442369 -23788782 -39086033 -37230523 -25374559
34354 -25374559 -21273026 -24539596 -19491910 -5585769 -256048 -7634353 -10172835 -133219
34346 -133219 5319664 -6606049 -22019863 -22843248 -12874207 -5324538 -1305697 2434988
34338 2434988 85850 -10582236 -15910487 -5999074 5219701 -24203 -13016372 -10309165
34330 -10309165 9971753 25601035 22757005 11535626 7395129 13145819 21925098 25309383
34322 25309383 16971370 -355022 -11208173 -2383033 17473007 24616248 8774542
34315 8774542 -14768382 -24264460 -14814109 -243411 2541522 -10023088 -23735275 -20842895
34307 -20842895 -2261509 10706078 3532858 -11154394 -11759542 1793069 11963953
34300A1963953P36834J444848L759787q004351k4065945k1235853j225099J0193977
34292b6431849K393566p127791m014291K234632o74901n691352k77293J1220646
34284b8368633J5298203J0999879Q005137P617959J591799j0161086j5287871
34277a0304613o735900O211515J0685108N950113j79908m103753p624412j0418495
34269a6520345r754889o337856l162399N70509P028221J1854558P682458k874499
34261a1514242p331723p73347N919170K205824n760487m689413N394730J1980495
34253d568993R472747N535308O040899N072422l819831j4357445j4251661k279606
34245a3156160R171675R356894J387620l530889o17299M265154M534513J719461
$$ plain form
34300 11963953 12700787 14145635 17905422 9901071 -14164874 -35400727 -36625826 -26431849
34292 -26431849 -24038283 -31166074 -35180365 -32945733 -33620634 -39311986 -39589279 -28368633
34284 -28368633 -13070430 -2070551 5934586 13552545 15144344 4983258 -10304613
34277 -10304613 -17040513 -10828998 -143890 5806223 5626315 1522562 -6101850 -16520345
34269 -16520345 -26275234 -32613090 -35775489 -35204980 -28176759 -16322201 -8639743 -11514242
34261 -11514242 -18845965 -19619312 -13700142 -11494318 -17254805 -21944218 -16549488 -4568993
34253 -4568993 4903754 10439062 16479961 21552383 17732552 3375107 -10876554 -13156160
34245 -13156160 -3984485 5372409 6760029 3229140 2611841 6876995 11411508 13130969
34237A3130969P33388L34886m333778j0106069o119773R175532J9285703P926673
34229C0027531j6747113k7423647j0239690J6687173K4316602P389312j1280752
34222A2729416j1361615M77081L805586n078520r617553l09469J0171583Q005373
34214H821882R02654M086692J2338671O645953j3063046k3895643j3536608K752701
34206a4946744P831174O088522P761071P284103m279372j7516774j5522536M71000
34198b2829556J4252544J7622930J3178880R43286j7605769k6836846j1484850
34191c2759381J5785921K4138453N976261j3008228j1808490n42187K046569k288211
34183a2459293p54108O179609P862749K831784q38113k37347L45652q04304j731023
$$ plain form
34237 13130969 13864357 14199243 9865465 -240604 -6360377 2815155 22100858 30027531
34229 30027531 13280418 -14143229 -24382919 -7695746 16620856 24010168 12729416
34222 12729416 1367801 1844882 5650468 571948 -9045605 -9355074 816509 8821882
34214 8821882 9724536 13811228 26149899 32795852 19732806 -4162837 -17699445 -14946744
34206 -14946744 -7115570 -1027048 6734023 14018126 9738754 -7778020 -23300556 -22829556
34198 -22829556 -8577012 9045918 22224798 23168084 5562315 -21274531 -32759381
34191 -32759381 -16973460 7164993 13141254 133026 -11675464 -12217651 -10171082 -12459293
34183 -12459293 -13213401 -7033792 828957 3660741 2822628 2585281 2930933 2126629 395606
34174C95606k749614m282192k285244M755123Q214043m1362j1656087r255822
34166a6905549Q376908K0605394J0397430j2849569k4125684j2791302O383061
34159b0909311J2821001M202269l876653L23383J0129558J0675099r31069j1775275
34151F59002r156063M503191J4345230Q266065j0964998k6890009k3759532k571925
34143d5569039J8554231K3036549J2672885K035535m69766P48610j271587p230529
34135B506889j3398562j5298508r010916M477699J5780073J5022814M159295n250592
34127a011808o668809l508569K18868M682106Q285421O711701P81935l286788
34119F204057l703666m508429o038573m391337j424986k740844m191099M037572
$$ plain form
34174 395606 -2354008 -6636200 -8921444 -4166321 4047722 4006360 -7649727 -16905549
34166 -16905549 -8528641 12076753 22474183 9624614 -14501070 -27292372 -20909311
34159 -20909311 -8088310 -3886041 -7762694 -7439311 2690247 13365346 12434277 659002
34151 659002 -8497061 -3993870 10351360 18617425 7652427 -19237582 -42997114 -45569039
34143 -45569039 -27014808 -3978259 8694626 10730161 10260395 11009005 9737418 2506889
34135 2506889 -10891673 -26190181 -35201097 -30723398 -14943325 79489 4238784 -1011808
34127 -1011808 -7680617 -11189186 -10970318 -6288212 1997209 8708910 9490845 6204057
34119 6204057 2500391 -2008038 -8046611 -12437948 -13862934 -16603778 -20794877 -16757305
34111a6757305J6505394J4679025k340403j0202156M184811J9248824J1229941
34104C6548131q462990j3318256m481345l456324j0927207o714568R909986J4305735
34096A3403162j723423j3929272n035238P793602L293699r530490r472413K350400
34088a2849973R560005R069349Q914930O939451m413915j7555961j7183330n568693
34080b3088137J513086K199739Q439463J8104556J3431476o207490j5828128j972019
34072c407454J4364347R464583p372911j1506998k161541J379703m928478n669220
34064i837969K946464M292564q532457j6592282l518799J6454025J7063575k387177
34056a12056j6931953j1348139K055009N499704R87798K599988J1393021J2452716
$$ plain form
34111 -16757305 -251911 14427114 12086711 1884555 6069366 25318190 36548131
34104 36548131 28085141 14766885 10285540 6829216 -4097991 -10812559 -902573 13403162
34096 13403162 11679739 -2249533 -7284771 508831 3802530 -5727960 -15200373 -12849973
34088 -12849973 -3289968 5779381 14694311 21633762 17219847 -336114 -17519444 -23088137
34080 -23088137 -21575051 -19375312 -10935849 7168707 20600183 14392693 -1435435 -3407454
34072 -3407454 10956893 20421476 13048565 1541567 -619974 759729 -4168749 -9837969
34064 -9837969 -6891505 -2598941 -11131398 -27723680 -31242479 -14788454 2275121 -112056
34056 -112056 -17044009 -28392148 -26337139 -20837435 -19849637 -17249649 -5856628 6596088
34048F596088j390076j5345946j1503933M784233J1047048N17045o797604N396957
34040f696188K1802501J5398233j1256509k6152324j2168704R406681J0590392
34033I24082m729656j1011516K9030J0864472P162355l041372m730478K619450
34025a913633P581047L596257m855776r857604p807471o53065O406623Q301784
34017G98162L669075l954603q728414o699203J178990Q869027R289098R95610
34009E417742q904682j0396461n31198J2136036J4365608K018132j2676406j2435856
34001a1007085L085422J3022184J386230j8425219j9578756k75355J3064563N790613
33993a2937403l757964L512772J4911578Q433189p467939o271930J0880381J4508455
$$ plain form
34048 6596088 5206012 -10139934 -21643867 -16859634 -5812586 -5295541 -12093145 -6696188
34040 -6696188 15106313 30504546 19248037 -6904287 -19072991 -9666310 924082
34033 924082 -3805574 -14817090 -14788060 -3923588 3238767 197395 -4533083 -1913633
34025 -1913633 5667414 9263671 4407895 -5449709 -13257180 -13910245 -7503622 798162
34017 798162 4467237 512634 -8215780 -14914983 -13735993 -4866966 4422132 5417742
34009 5417742 -3486940 -13883401 -14414599 -2278563 12087045 14105177 1428771 -11007085
34001 -11007085 -7921663 5100521 6486751 -11938468 -31517224 -31792579 -18728016 -12937403
33993 -12937403 -16695367 -13182595 1728983 10162172 2694233 -3577697 7302684 21811139
33985B1811139n087080k0891587j1933942N445031P302485o98420M48209P288038
$$ plain form
33985 21811139 16724059 -4167528 -16101470 -10656439 -3353954 -4052374 -3604165 3683873
$$ [...]
##END NTUPLES=NMR SPECTRUM
##END=
