##TITLE=31Pdec_SR55_rm2
 , 124 sc
 27.04.2021
##JCAMPDX= 6.0         $$ Bruker NMR JCAMP-DX V2.0
##DATA TYPE= NMR SPECTRUM
##DATA CLASS= NTUPLES
##ORIGIN= UXNMR, Bruker Analytische Messtechnik GmbH
##OWNER= root
$$ XWIN-NMR		Version 3.5
$$ Tue Apr 27 13:53:32 2021 Russian Standard Time (UT+4h)  she@DPX200
##.OBSERVE FREQUENCY= 81.013821
##.OBSERVE NUCLEUS= ^31P
##.ACQUISITION MODE= SIMULTANEOUS
##.ACQUISITION SCHEME= undefined
##.AVERAGES= 124
##.DIGITISER RES= 16
##SPECTROMETER/DATA SYSTEM= spect
##.PULSE SEQUENCE= zgpg30
##.SOLVENT NAME= D2O
##.SHIFT REFERENCE= (INTERNAL, D2O, 0, 248.564)
##AUDIT TRAIL= $$ (NUMBER, WHEN, WHO, WHERE, WHAT)
$$ ##TITLE= Audit trail, XWIN-NMR		Version 3.5
$$ ##JCAMPDX= 5.01
$$ ##ORIGIN= Bruker BioSpin GmbH
$$ ##OWNER= she
$$ F:/spectra/data/she/nmr/P31/1/pdata/1/auditp.txt
$$ ##AUDIT TRAIL=  $$ (NUMBER, WHEN, WHO, WHERE, WHAT)
(   1,<2021-04-27 13:52:34.34 +0400>,<she>,<DPX200>,
      <continue with go, POWCHK disabled, PULCHK disabled
       configuration hash MD5:
       00 E9 B6 7A A2 85 ED C7 34 08 36 98 17 FE 4E 26
       data hash MD5: 32K
       75 42 20 99 D4 30 EF 6C F7 46 CE BC 6A 6F 79 7B>)
(   2,<2021-04-27 13:52:36.31 +0400>,<she>,<DPX200>,
      <Start of raw data processing
       efp BC_mod = 2 LB = 1 FT_mod = 6 PKNL = 1 PHC0 = -5545.376 PHC1 = 194.0015 SI = 64K 
       data hash MD5: 64K
       85 C1 8E 2C 7F C8 42 C8 96 54 FE E7 85 11 D2 51>)
(   3,<2021-04-27 13:52:56.67 +0400>,<she>,<DPX200>,
      <pk PHC0 = 2.984909 PHC1 = -40.60001 
       data hash MD5: 64K
       1B E7 DF A4 90 D7 15 7C 3B FD 7E 6E 68 35 7C FB>)
(   4,<2021-04-27 13:52:59.67 +0400>,<she>,<DPX200>,
      <abs ABSG = 5 
       data hash MD5: 64K
       67 7C DD 30 E0 B4 76 4C DB AC 71 63 CC D5 8D 22>)
$$ ##END=
$$ 
$$ hash MD5
$$ 60 51 AD 66 90 AB 5C B8 EE 9E FE 8D 42 DF 62 D6
##$RELAX= 
##$RELAX= 
##$RELAX= 
##$RELAX= 
##$RELAX= 
##$RELAX= 
##$RELAX= 
##$RELAX= 
$$ Bruker specific parameters
$$ --------------------------
##$DU= <F:/spectra>
##$EXPNO= 1
##$NAME= <P31>
##$PROCNO= 1
##$TYPE= <nmr>
##$USER= <she>
##$AMP= (0..31)
100 100 100 100 100 100 100 100 100 100 100 100 100 100 100 100 100 100 
100 100 100 100 100 100 100 100 100 100 100 100 100 100 
##$AQSEQ= 0
##$AQ_mod= 1
##$AUNM= <au_zg>
##$AUTOPOS= <>
##$BF1= 81.014009
##$BF2= 200.13
##$BF3= 200.13
##$BF4= 200.13
##$BF5= 200.13
##$BF6= 200.13
##$BF7= 200.13
##$BF8= 200.13
##$BYTORDA= 1
##$CFDGTYP= 0
##$CFRGTYP= 5
##$CHEMSTR= <none>
##$CNST= (0..31)
1 1 145 1 1 1 1 1 1 1 1 1 1 1 1 1 1 1 1 1 1 1 1 1 1 1 1 1 1 1 1 1 
##$CPDPRG= <waltz16>
##$CPDPRG1= <>
##$CPDPRG2= <waltz16>
##$CPDPRG3= <>
##$CPDPRG4= <mlev>
##$CPDPRG5= <mlev>
##$CPDPRG6= <mlev>
##$CPDPRG7= <mlev>
##$CPDPRG8= <mlev>
##$CPDPRGB= <>
##$CPDPRGT= <>
##$D= (0..31)
0 1 0 0 0 0 0 0 0 0 0 0.03 2e-05 3e-06 0 0 0 0 0 0 0 0 0 0 0 0 0 0 0 0 
0 0 
##$DATE= 1619516983
##$DBL= (0..7)
120 120 120 11 120 120 24 19 
##$DBP= (0..7)
150 150 150 150 150 150 150 150 
##$DBP07= 0
##$DBPNAM0= <>
##$DBPNAM1= <>
##$DBPNAM2= <>
$$ [...]
##$SUBNAM3= <"">
##$SUBNAM4= <"">
##$SUBNAM5= <"">
##$SUBNAM6= <"">
##$SUBNAM7= <"">
##$SUBNAM8= <"">
##$SUBNAM9= <"">
##$SW= 501.771253377433
##$SWIBOX= (0..15)
0 1 3 0 0 0 0 0 0 0 0 0 0 0 0 0 
##$SW_h= 40650.406504065
##$TD= 32768
##$TD0= 1
##$TE= 0
##$TE2= 300
##$TE3= 300
##$TEG= 300
##$TL= (0..7)
0 120 53 12 22 120 120 120 
##$TP= (0..7)
150 150 150 150 150 150 150 150 
##$TP07= 0
##$TPNAME0= <>
##$TPNAME1= <>
##$TPNAME2= <>
##$TPNAME3= <>
##$TPNAME4= <>
##$TPNAME5= <>
##$TPNAME6= <>
##$TPNAME7= <>
##$TPOAL= (0..7)
0.5 0.5 0.5 0.5 0.5 0.5 0.5 0.5 
##$TPOFFS= (0..7)
0 0 0 0 0 0 0 0 
##$TUNHIN= 0
##$TUNHOUT= 0
##$TUNXOUT= 0
##$USERA1= <user>
##$USERA2= <user>
##$USERA3= <user>
##$USERA4= <user>
##$USERA5= <user>
##$V9= 5
##$VALIST= <valist>
##$VCLIST= <CCCCCCCCCCCCCCC>
##$VD= 0
##$VDLIST= <DDDDDDDDDDDDDDD>
##$VPLIST= <PPPPPPPPPPPPPPP>
##$VTLIST= <TTTTTTTTTTTTTTT>
##$WBST= 1024
##$WBSW= 4
##$XGAIN= (0..3)
0 0 0 0 
##$XL= 0
##$YL= 0
##$YMAX_a= 58715
##$YMIN_a= -73145
##$ZGOPTNS= <>
##$ZL1= 120
##$ZL2= 120
##$ZL3= 120
##$ZL4= 120
##$ABSF1= 248.5645
##$ABSF2= -253.2056
##$ABSG= 5
##$ABSL= 3
##$ALPHA= 0
##$AQORDER= 0
##$ASSFAC= 0
##$ASSFACI= 0
##$ASSFACX= 0
##$ASSWID= 0
##$AUNMP= <proc_1d>
##$AZFE= 0.1
##$AZFW= 0.5
##$BCFW= 0
##$BC_mod= 2
##$BYTORDP= 0
##$COROFFS= 0
##$CY= -3
##$DATMOD= 1
##$DC= 0
##$DFILT= <>
##$DTYPP= 0
##$F1P= 0
##$F2P= 0
##$FCOR= 1
##$FTSIZE= 65536
##$FT_mod= 6
##$GAMMA= 0
##$GB= 0
##$INTBC= 1
##$INTSCL= 5.30512e-09
##$ISEN= 30
##$LB= 1
##$LEV0= 0
##$LPBIN= 0
##$MAXI= 10000
##$MC2= 0
##$MEAN= 0
##$ME_mod= 0
##$MI= 50
##$NCOEF= 0
##$NC_proc= -5
##$NLEV= 6
##$NOISF1= 182.463
##$NOISF2= 159.3651
##$NSP= 0
##$NTH_PI= 0
##$NZP= 0
##$OFFSET= 248.5645
##$PC= 4
##$PHC0= -5542.391
##$PHC1= 153.4015
##$PH_mod= 1
##$PKNL= yes
##$PPARMOD= 0
##$PSCAL= 0
##$PSIGN= 0
##$REVERSE= no
##$SF= 81.014009
##$SI= 65536
##$SIGF1= 159.3651
##$SIGF2= -187.1042
##$SINO= 113.3802
##$SIOLD= 16384
##$SREGLST= <1H.CDCl3>
##$SSB= 0
##$STSI= 65536
##$STSR= 0
##$SW_p= 40650.406504065
##$SYMM= 0
##$S_DEV= 0
##$TDeff= 32768
##$TDoff= 0
##$TI= <>
##$TILT= no
##$TM1= 0
##$TM2= 0
##$TOPLEV= 0
##$USERP1= <user>
##$USERP2= <user>
##$USERP3= <user>
##$USERP4= <user>
##$USERP5= <user>
##$WDW= 1
##$XDIM= 65536
##$YMAX_p= 493364364
##$YMIN_p= -30105703
$$ End of Bruker specific parameters
$$ ---------------------------------
##NTUPLES= NMR SPECTRUM
##VAR_NAME=  FREQUENCY,     SPECTRUM/REAL,   SPECTRUM/IMAG
##SYMBOL=    X,             R,               I
##VAR_TYPE=  INDEPENDENT,   DEPENDENT,       DEPENDENT
##VAR_FORM=  AFFN,          ASDF,            ASDF
##VAR_DIM=   65536,         65536,           65536
##UNITS=     HZ,            ARBITRARY UNITS, ARBITRARY UNITS
##FACTOR=    0.620285442955139, 1,           1
##FIRST=     20137.2065510759, 0,            0
##LAST=      -20513.1999529892, 0,           0
##MIN=       -20513.1999529892, -30105703,   0
##MAX=       20137.2065510759, 493364364,    0
$$ Real data points
##PAGE= N=1
##DATA TABLE= (X++(R..R)), XYDATA
$$ [...]
$$ plain form
13109 621385 -1459778 -3133466 -3351398 -1457959 1080923 1744989 618635 437419 1943154
13100 1943154 2133037 -996439 -4701463 -5138378 -2710279 -783624 -527664 -376723 31884
13091 31884 -1013438 -3664112 -5072147 -3081766 625062 2651131 1905124 133464 -650086
13082 -650086 39211 1342234 1892568 887955 -710143 -597775 2089934 4963210 4920172
13073 4920172 2277283 401523 883542 1338046 -697169 -3722389 -4365533 -2263118 -254000
13064 -254000 -152142 -927371 -1228842 -1227751 -1355315 -1438183 -1819060 -3165422 -4402781 -3315659
13054 -3315659 -350951 935203 -921895 -2414708 -118451 3710527 4110360 491706
13046 491706 -3114369 -4186139 -4038825 -3842074 -2412864 606665 2719726 1851360 -589352
$$ packed form
13109F21385k081163j673688k17932J893439K538882O64066j126354j81216J505735
13100A943154J89883l129476l705024m36915K428099J926655K55960J50941M08607
13091C1884j045322k650674j408035J990381L706828K026069p46007j771660p83550
13082f50086O89297J303023N50334j004613j598098J12368K687709K873276m3038
13073D920172k642889j875760M82019M54504k035215l025220o43144K102415K009118
13064b54000J01858p75229l01471J091j27564q2868l80877j346362j237359J087122
13054c315659K964708J286154j857098j492813K296257L828978L99833l618654
13046D91706l606075j071770J47314J96751J429210L019529K113061q68366k440712
$$ plain form
13037 -589352 -1922865 -1782375 -1619066 -2018017 -2450727 -2806453 -3332298 -3484015 -2429555
13028 -2429555 -665186 40929 -1468962 -4448243 -6770125 -6492180 -3381458 623722
13020 623722 2875942 2479689 1070591 828992 2073279 3197977 2701787 861091 -583072
13011 -583072 -300427 1060374 1470715 -782 -1804532 -1823481 -371090 -31742 -2198314
13002 -2198314 -4963147 -5396014 -3257333 -1205560 -1242333 -2161291 -1491693 662939 1410073
12993 1410073 -849816 -3910578 -4896736 -4420704 -4973303 -6021421 -4484325 -667767 539100
12984 539100 -3237946 -7313009 -6218310 -1705944 182867 -1743380 -3101036 -2015436
12976 -2015436 -2026447 -5264415 -7929721 -5799140 -572433 2884484 3103893 2207863 1383853
$$ packed form
13037e89352j333513J40490J63309l98951m32710l55726n25845j51717J054460
13028b429555J764369P06115j509891k979281k321882K77945L110722M005180
13020F23722K252220l96253j409098k41599J244287J124698m96190j840696j444163
13011e83072K82645J360801M10341j471497j803750j8949J452391L39348k166572
13002b198314k764833m32867K138681K051773l6773r18958O69598K154632P47134
12993A410073k259889l060762r86158M76032n52599j048118J537096L816558J206867
12984E39100l777046m075063J094699M512366J888811j926247j357656J085600
12976b015436j1011l237968k665306K130581N226707L456917K19409q96030q24010
$$ plain form
12967 1383853 101756 -925838 88199 2434337 2772992 -184436 -3326705 -3148137
12959 -3148137 -340881 1640302 1556027 1493066 2939145 4181836 3001370 282521 -1253992
12950 -1253992 -1257381 -2157819 -5000899 -7281879 -6261233 -2736111 46676 103296 -1944577
12941 -1944577 -4100120 -4355202 -2066444 828054 1375171 -466232 -1378745 408475 2315461
12932 2315461 1785564 653202 1717333 3424921 2423025 -237272 -485469 1895370
12924 1895370 3007723 1582292 754717 2143987 3112458 1605945 -624914 -1552181 -1827695
12915 -1827695 -2449977 -2986887 -3570248 -5090588 -6316385 -4892396 -2205669 -2406742 -5241466
12906 -5241466 -5517436 -1833827 473101 -1623988 -3510536 -1357616 663468 -2086347
$$ packed form
12967A383853j282097j027594J014037K346138L38655k957428l142269J78568
12959c148137K807256J981183q4275o2961J446079J242691j180466k718849j536513
12950a253992l389r00438k843080k280980J020646L525122K782787N6620k047873
12941a944577k155543k55082K288758K894498N47117j841403r12513J787220J906986
12932B315461n29897j132362J064131J707588j001896k660297k48197K380839
12924A895370J112353j425431q27575J389270R68471j506513k230859r27267k75514
12915a827695o22282n36910n83361j520340j225797J423989K686727k01073k834724
12906e241466k75970L683609K306928k097089j886548K152920K021084k749815
$$ plain form
12898 -2086347 -5781876 -4456782 -634427 -871570 -3882329 -2730182 2417747 3589849
12890 3589849 -2001391 -7220051 -5820038 -614002 2299686 1404939 -1281207 -3943932
12882 -3943932 -4637983 -1703151 2803640 4156773 1558672 -610889 4995 386657 -1416729
12873 -1416729 -1912685 1839787 6527598 7516453 5809190 5259713 5785874 4421608 1200932
12864 1200932 -868553 -706088 88073 634690 1299818 1476915 217037 -1392229 -1454827
12855 -1454827 -374940 -75608 -843905 -1586424 -2289771 -3383626 -3618674 -1735231 501717
12846 501717 296429 -1605544 -1843803 161412 1376342 143474 -1540416 -1686256 -1017924
12837 -1017924 -728142 -444585 30355 -427673 -1901663 -2204647 18722 2815482 3548934
$$ packed form
12898b086347l695529J325094L822355k37143l010759J152147N147929J172102
12890C589849n591240n218660J400013N206036K913688q94747k686146k662725
12882c943932o94051K934832M506791J353133k598101k169561O15884L81662j803386
12873a416729m95956L752472M687811R88855j707263n49477N26161j364266l220676
12864A200932k069485J62465P94161N46617O65128J77097j259878j609266o2598
12855a454827J079887K99332p68297p42519p03347j093855k35048J883443K236948
12846E01717k05288j901973k38259K005215J214930j232868j683890j45840O68332
12837a017924K89782K83557M74940m58028j473990l02984K223369K796760P33452
$$ plain form
12828 3548934 2497841 1836240 2192564 2206918 778786 -1890943 -4846232 -6574945 -5485814
12819 -5485814 -1687053 2398491 4533558 4926000 4702343 3587535 1277928 -206298
12811 -206298 1272062 3765274 2746136 -2522327 -7458595 -8374014 -6996514 -6644620 -6937431
12802 -6937431 -5581561 -3202448 -2354916 -2772049 -1831618 311947 360920 -2404414 -4149866
12793 -4149866 -2238892 578242 492304 -1703825 -2618607 -1831524 -1673827 -2573072 -2517438
12784 -2517438 -1041235 -157498 -733863 -1074874 -115840 756160 446134 280783 1606821
12775 1606821 3146196 2787413 809000 -633081 -500190 439521 1475923 2678397 3618230
12766 3618230 3022283 593604 -1690386 -1268382 1941358 5029183 5290824 3426725 2418208
$$ packed form
12828C548934j051093o61601L56324J4354j428132k669729k955289j728713J089131
12819e485814L798761M085544K135067L92442k23657j114808k309607j484226
12811b06298J478360K493212j019138n268463m936268r15419J377500L51894k92811
12802f937431J355870K379113Q47532m17133R40431K143565M8973k765334j745452
12793d149866J910974K817134q5938k196129r14782P87083J57697q99245N5634
12784b517438J476203Q83737n76365l41011R59034Q72000l10026j65351J326038
12775A606821J539375l58783j978413j442081J32891R39711J036402J202474R39833
12766C618230n95947k428679k283990M22004L209740L087825K61641j864099j008517
$$ plain form
12757 2418208 3273219 3570758 1146576 -2405976 -3762673 -2380679 -696783 -192025 215237
12748 215237 1484016 2628142 2687362 2523071 3095484 3339811 1513684 -1953949 -4432178
12739 -4432178 -3893184 -1004483 1557756 1663038 -163863 -1318772 -304642 1220396
12731 1220396 743376 -1385654 -2507964 -1740216 -950421 -1100680 -457049 2004016 3975297
12722 3975297 2986790 347002 -777726 -1081 409550 -342547 -538359 804050 2215392
12713 2215392 2068894 710174 -444910 -470363 960438 3602370 6174458 7116499 6328414
12704 6328414 4993105 3439059 870286 -2161268 -3072671 -605250 2725688 3641662
12696 3641662 2551851 2503832 4043296 4080535 809168 -2913719 -3218029 -572530 1158131
$$ packed form
12757B418208Q55011K97539k424182l552552j356697J381994J683896N04758M07262
12748B15237J268779J144126N9220j64291N72413K44327j826127l467633k478229
12739d432178N38994K888701K562239J05282j826901j154909J014130J525038
12731A220396m77020k129030j122310P67748P89795j50259O43631K461065J971281
12722C975297r88507k639788j124728P76645M10631p52097j95812J342409J411342
12713B215392j46498j358720j155084k5453J430801K641932K572088R42041p88085
12704F328414j335309j554046k568773l031554r11403K467421L330938R15974
12696C641662j089811m8019J539464L7239l271367l722887l04310K645499J730661
$$ plain form
12687 1158131 338515 -588136 740098 3189135 4170130 3159925 1458574 -250272 -2147936
12678 -2147936 -3755866 -4063804 -3158480 -2309208 -2278136 -2504577 -1988912 -319547 1902379
12669 1902379 3111645 1946486 -913400 -3039160 -3259355 -3021297 -3506235 -3237243 -770325
12660 -770325 1981906 2284188 1289036 2414794 5365819 5951248 2529327 -1410023 -2484597
12651 -2484597 -1475007 -272986 1555077 4473620 6308806 5095229 2511020 1474767
12643 1474767 1919324 1671714 79260 -1867736 -3711191 -5271211 -5410269 -3526297 -1273190
12634 -1273190 -642566 -1483368 -2751448 -4365728 -5632242 -4271637 -169948 2288593
12626 2288593 -291439 -4390324 -3881454 989747 4280399 3599850 2802100 4502465 5792800
$$ packed form
12687A158131q19616r26651J328234K449037R80995j010205j701351j708846j897664
12678b147936j607930l07938R05324Q49272L1072k26441N15665J669365K221926
12669A902379J209266j165159k859886k125760k20195K38058m84938K68992K466918
12660g70325K752231L02282r95152J125758K951025N85429l421921l939350j074574
12651b484597J009590J202021J828063K918543J835186j213577k584209j036253
12643A474767M44557k47610j592454j946996j843455j560020j39058J883972K253107
12634a273190O30624q40802j268080j614280j266514J360605M101689K458541
12626B288593k580032m098885N08870M871201L290652o80549p97750J700365J290335
$$ plain form
12617 5792800 3922552 1256440 1066709 2126379 1292445 -1189226 -2697378 -2733886 -2888302
12608 -2888302 -3401975 -2951168 -1424512 -339410 -551997 -1364344 -1746099 -1183336 161615
12599 161615 1122356 310201 -1765830 -2728125 -1703625 -871788 -1828627 -2421839 -78957
12590 -78957 3174940 2762863 -1608215 -4987848 -4062216 -1604137 -2013351 -4995003 -6549899
12581 -6549899 -4968987 -2764277 -2559949 -3689556 -3982469 -3112442 -2455933 -2494789 -2268868
12572 -2268868 -1465126 -1342545 -2803656 -4767434 -5557473 -5093763 -4452005 -3770964 -2079734
12563 -2079734 792420 3474593 4566962 3901152 2022765 -527709 -2925526 -4007381
12555 -4007381 -3313415 -1759777 -726700 -776010 -1624994 -2991229 -4864030 -6868632 -7790408
$$ packed form
12617E792800j870248k666112j89731J059670q33934k481671j508152l6508j54416
12608b888302n13673M50807J526656J085102k12587q12347l81755N62763J344951
12599A61615R60741q12155k076031r62295J024500Q31837r56839n93212K342882
12590g8957L253897m12077m371078l379633R25632K458079m09214k981652j554896
12581f549899J580912K204710K04328j129607k92913Q70027O56509l8856K25921
12572b268868Q03742J22581j461111j963778p90039M63710O41758O81041J691230
12563b079734K872154K682173J092369o65810j878387k550474k397817j081855
12555d007381O93966J553638J033077m9310q48984j366235j872801k004602r21776
$$ plain form
12546 -7790408 -6407266 -3242533 -902097 -1429555 -3407746 -3425505 -924073 643539 -1060090
12537 -1060090 -3362791 -2557403 65167 35710 -3031114 -4376022 -1286311 2596739 2370074
12528 2370074 -1591737 -4778748 -4320934 -1114614 2514830 4801741 4781000 2670632 151919
12519 151919 -845441 332678 2964689 5499892 5955245 3311942 -652628 -2445028 -881797
12510 -881797 1308639 1007373 -1579518 -3940715 -4579359 -3949249 -3334348 -4032418 -6305999
12501 -6305999 -8059121 -6404166 -2003174 330768 -2447852 -7084116 -8128841 -4928314
12493 -4928314 -1345864 273863 1149901 2339745 2677191 1299704 -521319 -1150554 -303191
12484 -303191 1532856 3503039 3887009 1306177 -2945457 -5663328 -5469438 -4077120 -3337232
$$ packed form
12546g790408J383142L164733K340436n27458j978191j7759K501432J567612j703629
12537a060090k302701Q05388K622570k9457l066824j344908L089711L883050k26665
12528B370074l961811l187011M57814L206320L629444K286911k0741k110368k518713
12519A51919r97360J178119K632011K535203M55353k643303l964570j792400J563231
12510h81797K190436l01266k586891k361197o38644O30110O14901o98070k273581
12501f305999j753122J654955M400992K333942k778620m636264j044725L200527
12493d928314L582450J619727Q76038J189844L37446j377487j821023o29235Q47363
12484c03191J836047J970183L83970k580832m251634k717871J93890J392318P39888
$$ plain form
12475 -3337232 -2939378 -1858176 -329187 695741 831800 228536 -631224 -651480 1008645
12466 1008645 3305370 4031929 2800864 1785333 2634746 4106490 3936628 1995306 338295
12457 338295 678104 2691465 4458409 4065948 1239688 -2219723 -3984252 -3290152 -1190027
12448 -1190027 791779 1448692 69396 -2624801 -4081774 -2342444 1036954 2360181
12440 2360181 427944 -2064706 -2241500 -155364 2559630 4954432 6267202 5058140
12432 5058140 923371 -3814046 -5922424 -4493136 -1291527 1555572 3114762 3380206
12424 3380206 2693488 1536387 322097 -688260 -1293422 -1582991 -2071800 -2805270 -2586157
12415 -2586157 -373918 2594063 3710237 2334879 458022 -560230 -1853850 -4360345
$$ packed form
12475c337232L97854J081202J528989J024928J36059o03264q59760k0256J660125
12466A008645K296725P26559j231065j015531Q49413J471744j69862j941322j657011
12457C38295L39809K013361J766944l92461k826260l459411j764529O94100K100125
12448a190027J981806O56913j379296k694197j456973J739330L379398J323227
12440B360181j932237k492650j76794K086136K714994K394802J312770j209062
12432E058140m134769m737417k108378J429288L201609K847099J559190K65444
12424C380206o86718j157101j214290j010357o05162k89569m88809p33470K19113
12415b586157K212239K967981J116174j375358j876857j018252j293620k506495
$$ plain form
12407 -4360345 -6175682 -4783704 -1069085 1104919 -470404 -3568640 -3999671 -359708
12399 -359708 4202949 5298632 2353477 -608418 -55345 2482307 2949475 909555 -36788
12390 -36788 1833054 3654012 2724340 671480 283615 760809 -532951 -3055363 -3345207
12381 -3345207 -67751 4030454 5561643 3936537 1158955 -238599 1030217 3938845
12373 3938845 5803884 4987888 2644820 922472 277982 -113213 -211070 724737 2149690
12364 2149690 2262939 321593 -2206628 -3066830 -1361483 1380900 2097276 -739456 -4543237
12355 -4543237 -4861657 -1146527 1870249 291783 -3620136 -4764807 -2081522 981837
12347 981837 1751511 779617 -508899 -1437141 -1331394 22897 1046820 14275 -2033416
$$ packed form
12407d360345j815337J391978L714619K174004j575323l098236m31031L639963
12399c59708M562657J095683k945155k961895N53073K537652M67168k039920r46343
12390c6788J869842J820958r29672k052860l87865M77194j293760k522412k89844
12381c345207L277456M098205J531189j625106k777582j397554J268816K908628
12373C938845J865039q15996k343068j722348o44490l91195r7857R35807J424953
12364B149690J13249j941346k528221q60202J705347K742383P16376k836732l803781
12355d543237l18420L715130L016776j578466l911919j144671K683285L063359
12347I81837P69674r71894j288516r28242J05747J354291J023923j032545k047691
$$ plain form
12338 -2033416 -2624814 -1884564 -2153222 -3507022 -3150096 -179718 2328079 1604801 -996909
12329 -996909 -2217016 -1037622 880983 1537121 395736 -966428 126136 4116078
12321 4116078 7223642 5411911 248528 -2580950 -1110395 539068 -926191 -2963849
12313 -2963849 -1947801 766127 1496646 485038 1103162 3977803 6079560 5597558 4180030
12304 4180030 3737959 3856719 3372669 2454211 1970640 2029874 2076733 1845659 1673166 2010805
12294 2010805 2678831 2753009 1756927 784741 1278319 2667675 2861788 1449241 433339
12285 433339 983196 1633606 1009104 105801 89047 25996 -895280 -979478 1176847 3099579
12275 3099579 1158289 -3822233 -7103963 -6128225 -2911995 -156485 1804012 3338288
$$ packed form
12338b033416n91398P40250k68658j353800L56926K970378K507797p23278k601710
12329i96909j220107J179394J918605O56138j141385j362164J092564L989942
12321D116078L107564j811731n163383k829478J470555J649463j465259k037658
12313b963849J016048K713928P30519j011608O18124K874641K101757m82002j417528
12304D180030m42071J18760m84050r18458m83571N9234M6859k31074j72493L37639
12294B010805O68026P4178r96082r72186M93578J389356J94113j412547j015902
12285D33339N49857O50410o24502r03303j6754o3051r21276q4198K156325J922732
12275C099579j941290m980522l281730R75738L216230K755510J960497J534276
$$ plain form
12267 3338288 3844233 3319994 3346387 4745551 5866566 4858615 2439738 828524 830289
12258 830289 1512258 2084698 2415735 1899994 -344693 -3495742 -4694300 -2172613 1810224
12249 1810224 2904338 -67259 -3428683 -3311607 -430464 1655298 1714892 1474523 1703927
12240 1703927 1270428 663279 2620282 7309471 10239082 7885979 2958137 815904
12232 815904 2430197 4276496 3964260 2392983 864911 -492378 -1331212 -1069116 -579545
12223 -579545 -1418317 -3161780 -3776814 -2660895 -1077109 251659 1523574 2061082 935187
12214 935187 -567706 -39359 2164297 3097822 1814883 714284 1478376 2818525 3502184
12205 3502184 4457416 6034043 6049790 2995383 -908059 -2296763 -892132 888782 1340553
$$ packed form
12267C338288N05945n24239K6393J399164J121015j007951k418877j611214J765
12258H30289O81969N72440L31037n15741k244687l151049j198558K521687L982837
12249A810224J094114k971597l361424J17076K881143K085762N9594k40369K29404
12240A703927m33499o07149J957003M689189K929611k353103m927842k142233
12232H15904J614293J846299l12236j571277j528072j357289q38834K62096M89571
12223e79545q38772j743463o15034J115919J583786J328768J271915N37508j125895
12214I35187j502893N28347K203656R33525j282939j100599P64092J340149O83659
12205C502184R55232J576627J5747l054407l903442j388704J404631J780914M51771
$$ plain form
12196 1340553 746593 365021 1561661 4703219 7705307 7363897 3590152 355506 432471
12187 432471 1216628 -1362837 -6198489 -7849431 -4008340 1107437 1964365 -1815294 -5616951
12178 -5616951 -5335962 -1433056 2184794 2473509 118977 -1836034 -1730886 -779827 -771458
12169 -771458 -1574435 -1851564 -1329115 -1037414 -1598233 -2420037 -2612127 -1818665 -45607
12160 -45607 2494539 4876018 5316543 2546166 -2119352 -4731591 -2214367 3671037 7335963
12151 7335963 5426046 577547 -2296949 -1965655 -889309 -648357 -646636 -918790 -2438273
12142 -2438273 -3986759 -2449166 2211540 5590692 4550653 1406445 25041 495475
12134 495475 680724 729761 2281203 4415327 4228663 1353907 -1203652 -1066528 1141780
$$ packed form
12196A340553n93960l81572J196640L141558L002088l41410l773745l234646P6965
12187D32471P84157k579465m835652j650942L841091N115777Q56928l779659l801657
12178e616951K80989L902906L617850K88715k354532j955011J05148R51059Q369
12169g71458q02977k77129N22449K91701n60819q21804j92090P93462J773058
12160d5607K540146K381479M40525k770377m665518k612239K517224N885404L664926
12151G335963j909917m848499k874496L31294J076346K40952J721k72154j519483
12142b438273j548486J537593M660706L379152j040039l144208j381404M70434
12134D95475J85249M9037J551442K134124j86664k874756k557559J37124K208308
$$ plain form
12125 1141780 3718832 5884646 7240719 7068802 5066625 1884613 -1336605 -3317857
12117 -3317857 -2968540 -476571 2250087 3333868 2865828 2282986 2424443 3076462 3582000
12108 3582000 2929879 407249 -2597229 -2871137 772310 5184828 6415904 4360994
12100 4360994 1726887 -213391 -1886120 -2450923 -220740 3788114 6001160 4743397
12092 4743397 1907408 -466534 -2565845 -4799093 -5986005 -4997981 -2373349 804085
12084 804085 3940926 6041534 5745314 3317563 851519 -427546 -1205240 -1635752 -265028
12075 -265028 3115224 5798277 5397104 3043770 1307773 470012 -837916 -2535630 -3212418
12066 -3212418 -2700724 -2112906 -1603957 -381421 1089401 1139222 -462014 -1881594 -1868694
$$ packed form
12125A141780K577052K165814J356073j71917k002177l182012l221218j981252
12117c317857L49317K491969K726658J083781m68040n82842J41457O52019N05538
12108C582000o52121k522630l004478k73908L643447M412518J231076k054910
12100D360994k634107j940278j672729n64803K230183M008854K213046j257763
12092D743397k835989k373942k099311k233248j186912R88024K624632L177434
12084H04085L136841K100608k96220k427751k466044j279065p77694m30512J370724
12075b65028L380252K683053m01173k353334j735997q37761j307928j697714o76788
12066c212418N11694N87818N08949J222536J470822M9821j601236j419580J2900
$$ plain form
12057 -1868694 -1327609 -1477698 -1970573 -1887714 -1414159 -1267804 -1207997 -383722 1113268 2109214
12047 2109214 1767538 378739 -1260944 -2480977 -2613752 -1115036 1573277 3765167
12039 3765167 3898764 2097426 -164596 -1779105 -2625784 -2576272 -1160072 1072936 1999472
12030 1999472 195664 -2648544 -3219295 -737059 1868081 1677209 -621379 -2097494
12022 -2097494 -1620722 -800106 -1044773 -1556840 -1033269 50045 233694 -557169 -965146
12013 -965146 -413206 41407 -691269 -2543714 -5043952 -7803354 -9552997 -8352391 -4209941
12004 -4209941 -194582 913002 143365 491571 2406843 3704734 3573028 3583235 4287175
11995 4287175 3936618 1766942 -325907 -995010 -1563818 -2865539 -2682804 754251 4824898
$$ packed form
12057a868694N41085j50089m92875Q2859M73555J46355N9807Q24275J496990R95946
12047B109214l41676j388799j639683j220033j32775J498716K688313K191890
12039C765167J33597j801338k262022j614509q46679M9512J416200K233008R26536
12030A999472j803808k844208n70751K482236K605140j90872k298588j476115
12022b097494M76772Q20616k44667n12067N23571J083314J83649p90863m07977
12013i65146N51940M54613p32676j852445k500238k759402j749643J200606M142450
12004d209941M015359J107584p69637L48206J915272J297891j31706J0207P03940
11995D287175l50557k169676k092849o69103n68808j301721J82735L437055M070647
$$ plain form
11986 4824898 5471628 2809673 418134 -107069 -376729 -1332986 -1811930 -1437674 -1616976
11977 -1616976 -2641114 -2651981 -731467 1480935 2577482 3379115 4480358 4042752 405424
11968 405424 -4460059 -6634977 -5083811 -2769537 -2673489 -4263990 -4807283 -3406254 -2373690
11959 -2373690 -3994052 -6818737 -6903614 -3055117 1092374 1641193 -577283 -1774369 -798868
11950 -798868 -56751 -1094324 -2359596 -2147931 -1175915 -909079 -1286235 -1507104 -1613219
11941 -1613219 -1989801 -2420102 -2714677 -3333703 -4497136 -5466758 -5316557 -3720341 -893467
11932 -893467 2146896 3380179 1532200 -1731891 -3146277 -1795701 60168 480395
11924 480395 30000 -189758 -375727 -751663 -617831 -7142 -234529 -1328975 -1043303
$$ packed form
11986D824898O46730k661955k391539n25203k69660r56257m78944L74256j79302
11977a616976j024138j0867J920514K212402J096547Q01633J101243m37606l637328
11968D05424m865483k174918J551166K314274R6048j590501n43293J401029J032564
11959b373690j620362k824685q4877L848497M147491N48819k218476j197086R75501
11950g98868P42117j037573j265272K11665R72016K66836l77156k20869j06115
11941a613219l76582m30301k94575o19026j163433r69622J50201J596216K826874
11932h93467L040363J233283j847979l264091j414386J350576J855869M20227
11924D80395m50395k19758j85969l75936J33832O10689k27387j094446K85672
$$ plain form
11915 -1043303 1720203 4440845 4137118 1474314 -509070 -509638 474078 1633495 3007384
11906 3007384 4185293 4461268 4042415 3574590 3024076 2399807 2544518 3460730 3056874
11897 3056874 -58445 -3356631 -2776071 1689786 5426382 4825490 1343056 -949824
11889 -949824 -197053 1969154 2969832 2036506 646539 634232 2044124 3327283 3697144
11880 3697144 4114736 5283382 6115415 5552418 4593317 4616824 4711913 3047115 412647
11871 412647 -266933 1689271 3252687 1684783 -1707932 -3175742 -990598 2840962
11863 2840962 5016935 4293450 2242810 973275 740293 508114 284198 1036161 1997665
11854 1997665 551401 -3616257 -6558251 -4903237 -969589 267429 -1618658 -2195192
$$ packed form
11915a043303K763506K720642l03727k662804j983384n68R83716J159417J373889
11906C007384J177909K75975m18853m67825n50514o24269J44711R16212m03856
11897C056874l115319l298186N80560M465857L736596o00892l482434k292880
11889i49824P52771K166207J000678r33326j389967j2307J409892J283159L69861
11880C697144M17592J168646Q32033n62997r59101K3507R5089j664798k634468
11871D12647o79580J956204J563416j567904l392715j467810K185144L831560
11863B840962K175973p23485k050640j269535k32982k32179k23916P51963R61504
11854A997665j446264m167658k941994J655014L933648J237018j886087n76534
$$ plain form
11846 -2195192 791259 4076661 4061579 1921773 1016919 1508408 687789 -2105169 -3786094
11837 -3786094 -1490046 3351373 6168816 4339703 199586 -1778066 -401570 1142981
11829 1142981 16981 -2438056 -3172782 -1963552 -944682 -739029 -103680 974284 1058233
11820 1058233 330301 659183 2005412 2059646 483032 9331 1607248 2062680 -975249
11811 -975249 -4605454 -4727925 -2172126 -930710 -1789618 -1922662 -355942 429777 -866427
11802 -866427 -1785937 86218 3302064 4616727 3365124 1779825 1564094 1845571 792418
11793 792418 -1662592 -3436466 -2752733 -461950 970235 737093 549427 1602237 2349239
11784 2349239 863121 -1844528 -2960936 -1707470 61873 780219 574591 -93390 -903309
$$ packed form
11846b195192K986451L285402j5082k139806r04854M91489q20619k792958j680925
11837c786094K296048M841419K817443j829113m140117j977652J376496J544551
11829A142981j126000k455037p34726J209230J018870K05653O35349J077964Q3949
11820A058233p27932L28882J346229N4234j576614m73701J597917M55432l037929
11811i75249l630205j22471K555799J241416q58908j33044J566720P85719j296204
11802h66427r19510J872155L215846J314663j251603j585299k15731K81477j053153
11793G92418k455010j773874O83733K290783J432185k33142j87666J052810P47002
11784B349239j486118k707649j116408J253466J769343P18346k05628o67981q09919
$$ plain form
11775 -903309 -633172 1921862 5352243 6317269 3902720 1207206 1280224 3375371 4751781
11766 4751781 4465898 3571929 2910737 2560019 2494284 2171931 483692 -2343678 -4024384
11757 -4024384 -3166341 -1615340 -1742155 -2804134 -2693640 -1989235 -2723296 -3799507 -1916568
11748 -1916568 2431972 4283840 1293694 -2417850 -2111618 1178818 3312073 3330417 3190339
11739 3190339 3116823 1635700 -431584 -255621 2403278 4510201 4301647 3205344 2448029
11730 2448029 1207002 -468065 -290461 2477649 4735756 3860073 2103936 3377424
11722 3377424 6990471 8284240 5355210 1668801 966942 2393429 2616513 998001
11714 998001 79612 1253090 2436586 1240299 -1159880 -1473646 726127 2040980 269011
$$ packed form
11775i03309K70137K555034L430381R65026k414549k695514P3018K095147J376410
11766D751781k85883q93969o61192l50718o5735l22353j688239k827370j680706
11757d024384Q58043J551001j26815j061979J10494P04405p34061j076211J882939
11748a916568M348540J851868k990146l711544L06232L290436K133255J8344j40078
11739C190339p3516j481123k067284J75963K658899K106923k08554j096303p57315
11730B448029j241027j675067J77604K768110K258107q75683j756137J273488
11722C377424L613047J293769k929030l686409p01859J426487K23084j618512
11714I98001r18389J173478J183496j196287k400179l13766K199773J314853j771969
$$ plain form
11705 269011 -2063348 -1501866 848381 1034942 -1329126 -2412516 -434152 1586789 1111001
11696 1111001 196135 1373481 2620260 406849 -4206565 -6723462 -5609297 -3613650
11688 -3613650 -2888845 -2485843 -1207319 196475 532533 -469737 -2659778 -5119800 -5551109
11679 -5551109 -2856038 -92795 -1226221 -4670813 -4398326 1251883 6486636 6260636
11671 6260636 3088277 1887359 1998692 -344726 -4155855 -4636409 -1519065 -258575
11663 -258575 -3511354 -6862269 -5812297 -2630463 -2372531 -5086215 -6540632 -5350331
11655 -5350331 -4687485 -6514469 -8159961 -6435618 -2385240 410018 578167 -443657
11647 -443657 -1575663 -3098740 -4443231 -3702382 -567861 2243162 2219481 364809 -636624
$$ packed form
11705B69011k332359N61482K350247J86561k364068j083390J978364K020941m75788
11696A111001r14866J177346J246779k213411m613414k516897J114165J995647
11688c613650P24805M03002J278524J403794L36058j002270k190041k460022m31309
11679e551109K695071K763243j133426l444592K72487N650209N234753k26000
11671F260636l172359j200918J11333k343418l811129m80554L117344J260490
11663b58575l252779l350915J049972L181834K57932k713684j454417J190301
11655e350331O62846j826984j645492J724343M050378K795258J68149j021824
11647d43657j132006j523077j344491P40849L134521K811023k3681j854672j001433
$$ plain form
11638 -636624 -503329 -1164679 -2893941 -3509364 -2149072 -1224351 -2989893 -6068952 -7354513
11629 -7354513 -6078806 -3951938 -2135029 -225152 2127831 4584654 6973539 8979061
11621 8979061 9151087 6304202 2089979 5049 1188377 3173566 3600887 3065967 3064550
11612 3064550 3278705 2912688 3055995 5162578 8016578 8794827 6986937 4909137 4116800
11603 4116800 3555608 1919944 -188224 -1525225 -2040980 -2267906 -2148802 -1689926 -1680546
11594 -1680546 -2402556 -2498053 -671719 1938638 2658091 591312 -2170491 -2909776 -1010193
11585 -1010193 1837618 3412444 2734479 677823 -861956 -663488 840685 2302888
11577 2302888 2843097 2438991 1434905 271366 -535564 -708024 -406751 168302 1030805
$$ packed form
11638f36624J33295o61350j729262o15423J360292R24721j765542l079059j285561
11629g354513J275707K126868J816909J909877K352983K456823K388885K005522
11621H979061J72026k846885m214223k084930J183328J985189M27321n34920j417
11612C064550K14155l66017J43307K106583K854000P78249j807890k077800p92337
11603D116800n61192j635664k108168j337001n15755k26926J19104M58876R380
11594a680546p22010r5497J826334K610357P19453k066779k761803p39285J899583
11585a010193K847811J574826o77965k056656j539779J98468J504173J462203
11577B302888N40209m04106j004086j163539q06930j72460L01273N75053Q62503
$$ plain form
11568 1030805 1942525 2254785 1764489 1208402 1257275 1472331 913759 -614018 -2424498
11559 -2424498 -3490883 -2769148 -55198 2771565 2747650 -581248 -3763349 -3342748 -193359
11550 -193359 1934104 1318090 -481110 -1594106 -1519049 -83153 2569666 4701853 4226317
11541 4226317 1744308 66326 285204 718082 202881 -241112 174079 694249 1196008
11532 1196008 2834708 5072295 4913981 1132887 -3184148 -4515265 -3222660 -1788464
11524 -1788464 -740277 1166856 4145965 6986476 8382069 7222002 3291077 -973632
11516 -973632 -1895447 423638 1315643 -1847982 -5424091 -5088153 -2453041 -1851064 -3255942
11507 -3255942 -3527155 -2700644 -3268063 -4219687 -1927645 2939164 5388195 3972922 2963874
$$ packed form
11568A030805R11720L12260m90296n56087M8873K15056n58572j527777j810480
11559b424498j066385P21735K713950K826763k3915l328898l182101M20601L149389
11550a93359K127463o16014j799200j112996P5057J435896K652819K132187m75536
11541D226317k482009j677982K18878M32878n15201m43993M15191N20170N01759
11532A196008J638700K237587j58314l781094m317035j331117J292605J434196
11524a788464J048187J907133K979109K840511J395593j160067l930925m264709
11516i73632r21815K319085Q92005l163625l576109L35938K635112O01977j404878
11507c255942k71213Q26511n67419r51624K292042M866809K449031j415273j009048
$$ plain form
11498 2963874 4950862 6752401 5244234 2330418 908548 138425 -1591404 -2478328
11490 -2478328 -140921 3784375 5717042 5191494 4551140 4907465 5412080 5545930 5425158
11481 5425158 4548907 2512397 338673 -707764 -868490 -1016858 -1173917 -1265558 -1896105
11472 -1896105 -2887082 -2747353 -1267138 -713357 -2415833 -4178803 -3596278 -2057433 -2441593
11463 -2441593 -4321214 -4865862 -3675423 -3217003 -4577796 -5999438 -6038012 -5431899 -5126991
11454 -5126991 -4643326 -3182550 -808349 1860862 3879632 4087748 2492577 1131686
11446 1131686 1751383 3003519 1979389 -1719861 -5574627 -7586519 -7795904 -6526057
11438 -6526057 -3931859 -1734930 -2444219 -5592140 -7264534 -5058899 -1491532 -580795
$$ packed form
11498B963874J986988J801539j508167k913816j421870p70123j729829q86924
11490b478328K337407L925296J932667n25548o40354L56325N04615J33850j20772
11481E425158q76251k036510k173724j046437j60726j48368j57059r1641o30547
11472a896105r90977J39729J480215N53781j702476j762970N82525J538845l84160
11463b441593j879621n44648J190439M58420j360793j421642l8574O06113L04908
11454e126991M83665J460776K374201K669211K018770K08116j595171j360891
11446A131686O19697J252136j024130l699250l854766k011892k09385J269847
11438f526057K594198K196929p09289l147921j672394K205635L567367R10737
$$ plain form
11430 -580795 -2635546 -4567488 -4387538 -3184717 -2842669 -3618861 -4362982 -3985244 -2220582
11421 -2220582 435239 3088593 4904614 5451594 4775222 3314345 1728239 650765
11413 650765 552558 1596405 3120536 3459073 1434750 -1632324 -2855190 -1588413 -644000
11404 -644000 -2190420 -4307517 -4235289 -3507386 -5951816 -10837478 -12496173 -8200556 -2356237
11395 -2356237 -224718 -874046 -14753 2607312 3198027 467165 -2269236 -2155274 -328964
11386 -328964 843106 1055593 939297 109650 -1625392 -2816569 -2111754 -244088 1381879
11377 1381879 2808170 4377243 4769627 2646593 -424789 -1329520 356040 1994031
11369 1994031 1998431 1609237 1719957 793133 -2177847 -4935404 -4764694 -2557902 -1296533
$$ packed form
11430e80795k054751j931942J79950J202821L42048p76192p44121L77738J764662
11421b220582K655821K653354J816021N46980o76372j460877j586106j077474
11413F50765r8207J043847J524131L38537k024323l067074j222866J266777R44413
11404f44000j546420k117097P2228P27903k444430m885662j658695M295617N844319
11395b356237K131519o49328Q59293K622065N90715k730862k736401J13962J826310
11386c28964J172070K12487j16296q29647j735042j191177P04815J867666J625967
11377A381879J426291J569073L92384k123034l071382r04731J685560J637991
11369A994031M400l89194J10720r26824k970980k757557J70710K206792J261369
$$ plain form
11360 -1296533 -1384291 -573378 1620934 2715759 1344653 -376535 -236701 649505 8547
11351 8547 -1667273 -1931994 -305186 1138229 919390 -393589 -2048490 -4141798 -6108808
11342 -6108808 -6317610 -4444682 -2584649 -2451678 -2818309 -1551530 858002 2047155 1594644
11333 1594644 1573547 2949312 3856570 2619524 530642 -31321 1096115 2197172 2360886
11324 2360886 2000592 1346559 367211 -48041 1251796 3642022 4924293 3867501 1346773
11315 1346773 -997265 -1915442 -707031 1955520 3520111 2017960 -872774 -1588589
11307 -1588589 235470 1261174 -214465 -1640128 -645251 971436 323140 -1854142
11299 -1854142 -2640234 -1550773 -707716 -1282113 -2410341 -3080342 -2935173 -1851189 -508096
$$ packed form
11360a296533q7758Q10913K194312J094825j371106j721188J39834Q86206o40958
11351H547j675820k64721J626808J443415k18839j312979j654901k093308j967010
11342f108808k08802J872928J860033J32971l66631J266779K409532J189153m52511
11333A594644k1097J375765R07258j237046k088882n61963J127436J101057J63714
11324B360886l60294o54033r79348m15252J299837K390226J282271j056792k520728
11315A346773k344038r18177J208411K662551J564591j502151k890734p15815
11307a588589J824059J025704j475639j425663R94877J616687o48296k177282
11299a854142p86092J089461Q43057n74397j128228o70001J45169J083984J343093
$$ plain form
11290 -508096 -340805 -1240898 -940291 1288590 2466386 255815 -2729637 -2657191 -696188
11281 -696188 -1131529 -4402799 -6763814 -6496581 -5721734 -5843387 -5781206 -5202731 -5005644
11272 -5005644 -4067751 -378278 3712885 2711620 -3725977 -8876913 -7902888 -3960522
11264 -3960522 -2347574 -3093903 -3143710 -2046124 -1232496 -470357 978982 1878486 1104969
11255 1104969 66301 30606 -462278 -2453350 -3609343 -1865424 719420 1448895 1514551
11246 1514551 2887117 3530351 707219 -3179963 -3555191 -1031059 -189710 -1841047 -2321983
11237 -2321983 -515072 271607 -1578649 -3385332 -3413699 -3931229 -6669465 -9224848 -8756785
11228 -8756785 -6304153 -4712220 -4405780 -3722776 -2116063 -961515 -1659245 -3909556 -5593288
$$ packed form
11290e08096J67291r00093L00607K228881J177796k210571k985452P2446J961003
11281f96188m35341l271270k361015K67233P74847j21653O2181N78475J97087
11272e005644R37893L689473M091163j001265o437597n150936R74025L942366
11264c960522J612948p46329m9807J097586Q13628P62139J449339Q99504p73517
11255A104969j038668l5695m92884j991072j155993J743919K584844P29475O5656
11246A514551J372566O43234k823132l887182l75228K524132Q41349j651337m80936
11237b321983J806911P86679j850256j806683k8367n17530k738236k555383M68063
11228h756785K452632J591933L06440O83004J606713J154548o97730k250311j683732
$$ plain form
11219 -5593288 -4571377 -1434793 431415 -920941 -2993543 -2483198 -544451 -871844
11211 -871844 -3336735 -3934717 -1373517 874253 434027 -430607 640158 1964579 1277952
11202 1277952 153082 1293857 3500876 3182181 -22618 -2612479 -2215405 -368672
11194 -368672 255769 -790539 -2160808 -3024471 -3558549 -3606338 -2263031 543397 2915743
11185 2915743 2871345 1308334 1243738 3345042 4325344 1531538 -2787953 -4405172 -2924263
11176 -2924263 -1548748 -1838771 -2199624 -1532748 -840419 -587357 238893 1493909 1421577
11167 1421577 8955 -214578 1831153 3846170 3813466 2782357 2199013 1382779 -26837
11158 -26837 39136 2679996 4776237 2681420 -2234027 -5266608 -4795921 -3433815 -2974179
$$ packed form
11219e593288J021911L136584J866208j352356k072602N10345J938747l27393
11211h71844k464891n97982K561200K247770m40226q64634J070765J324421o86627
11202A277952j124870J140775K207019l18695l204799k589861L97074J846733
11194c68672O24441j046308j370269q63663n34078m7789J343307K806428K372346
11185B915743m4398j563011o4596K101304R80302k793806m319491j617219J480909
11176b924263J375515k90023l60853O66876O92329K53062Q26250J255016p2332
11167A421577j412622k23533K045731K015017l2704j031109n83344q16234j409616
11158b6837O5973K640860K096241k094817m915447l032581M70687J362106M59636
$$ plain form
11149 -2974179 -2002739 464008 2294607 1333230 -944658 -1363871 388554 1683729 1345186
11140 1345186 1465801 3589315 5299702 3301785 -1009763 -2499826 489255 3314287
11132 3314287 1615988 -2224658 -2744625 369459 2120387 -119426 -3278033 -3933539
11124 -3933539 -2996177 -3010614 -3869208 -3812903 -2756758 -2120434 -2364431 -2623345 -2253070 -1496731
11114 -1496731 -1006794 -1222410 -1626221 -823188 1350274 2358233 -80787 -3814899 -4170114
11105 -4170114 -581739 2174884 794099 -2006028 -2009224 526444 2345705 2177984 1030517
11096 1030517 -647375 -2833957 -4300048 -4216686 -4365471 -6774036 -10046500 -11016854 -9283691
11087 -9283691 -7058420 -5167492 -2550873 478434 1950641 1601075 1267921 1208058 -747182
$$ packed form
11149b974179R71440K466747J830599r61377k277888m19213J752425J295175l38543
11140A345186J20615K123514J710387j997917m311548j490063K989081K825032
11132C314287j698299l840646n19967L114084J750928k239813l158607o55506
11124c933539R37362j4437q58594N6305J056145O36324k43997k58914L70275P56339
11114a496731M89937k15616m03811Q03033K173462J007959k439020l734112l55215
11105d170114L588375K756623j380785k800127l196K535668J819261j67721j147467
11096A030517j677892k186582j466091Q3362j48785k408565l272464r70354J733163
11087i283691K225271J890928K616619L029307J472207l49566l33154n9863j955240
$$ plain form
11078 -747182 -4968555 -7864487 -6128285 -1363872 1645666 395007 -3145899 -5165134
11070 -5165134 -3684624 3837 2864600 3313702 2831763 3645753 5334773 5555531 4065038
11061 4065038 3438372 4818620 5622539 3538821 636995 583126 3044297 4179039 2366865
11052 2366865 61179 -602332 -733167 -1783372 -2668595 -2061108 -1293800 -2220144 -3744258
11043 -3744258 -3481197 -1885034 -1520799 -2618219 -2656245 -589748 1724844 2906255 3607355
11034 3607355 3787917 1928797 -1417121 -2758101 -647547 1702683 1545421 1013324 2718572
11025 2718572 4005046 604519 -5732990 -8740516 -6391009 -2984717 -2079310 -2360275
11017 -2360275 -1811782 -1234859 -1366591 -455268 2518330 5224948 5366178 4248787 4258582
$$ packed form
11078g47182m221373k895932J736202M764413L009538j250659l540906k019235
11070e165134J480510L688461K860763M49102m81939Q13990J689020K20758j490493
11061D065038o26666J380248Q03919k083718k901826n3869K461171J134742j812174
11052B366865k305686o63511j30835j050205q85223O07487P67308r26344j524114
11043c744258K63061J596163L64235j097420l8026K066497K314592J181411P01100
11034C607355J80562j859120l345918j340980K110554K350230j57262n32097J705248
11025B718572J286474l400527o337509l007526K349507L406292R05407k80965
11017b360275N48493N76923j31732R11323K973598K706618J41230j117391R795
$$ plain form
11008 4258582 4799609 3680779 1221877 63980 1295562 3091631 3377153 2312822
11000 2312822 1727245 2747783 4314280 4254451 2043869 -284796 -884065 -658197 -1429693
10991 -1429693 -2719246 -2898158 -2642687 -3867381 -5488052 -4215302 -252670 1863384
10983 1863384 -293395 -3476396 -3770606 -1783597 -321987 41544 145434 -386617 -1710525
10974 -1710525 -1750450 1061810 4507053 5178065 3254583 1742276 1856587 2123690 1614746
10965 1614746 1267193 1822239 2543842 2339052 946813 -875532 -1602305 -111019 2675253
10956 2675253 4432673 4362588 3852522 3538333 2088918 -725660 -2417957 -1366091 453433
10947 453433 884382 1361144 4069013 7314048 7487669 4552553 1936680 1537012 2172742
$$ packed form
11008D258582N41027j118830k458902j157897J231582J796069K85522j064331
11000B312822n85577J020538J566497n9829k210582k328665n99269K25868p71496
10991a429693j289553j78912K55471j224694j620671J272750L962632K116054
10983A863384k156779l183001k94210J987009J461610L63531J03890n32051j323908
10974a710525l9925K812260L445243O71012j923482j512307J14311K67103n08944
10965A614746l47553N55046P21603k04790j392239j822345p26773J491286K786272
10956B675253J757420p0085n10066l14189j449415k814578j692297J051866J819524
10947D53433M30949M76762K707869L245035J73621k935116k615873l99668O35730
$$ plain form
10938 2172742 2557331 2444284 1059044 -2095204 -4656887 -3158241 1812963 5412315
10930 5412315 4761609 2477571 2246218 3413390 2534126 -1123650 -4490097 -5144151 -4489069
10921 -4489069 -5184540 -6716759 -5733441 -1139435 3319472 3442853 223843 -1536748 223002
10912 223002 2756899 3299562 2563712 2210912 1995302 1314694 854072 661899 -676779
10903 -676779 -2761964 -2358978 1395237 3793932 475836 -5776576 -8516077 -6317268
10895 -6317268 -3426224 -2711490 -2812020 -2314749 -2087065 -2404331 -1595184 992429 3553174
10886 3553174 4521330 4262368 3254853 1053699 -2017207 -4359165 -5202117 -5393305 -5569084
10877 -5569084 -5401647 -4977249 -4920887 -4883501 -3990616 -2959658 -3393972 -4649500 -4057320
$$ packed form
10938B172742L84589j13047j385240l154248k561683J498646M971204L599352
10930E412315o50706k284038k31353J167172q79264l657776l366447o54054O55082
10921d489069o95471j532219R83318M594006M458907J23381l219010j760591J759750
10912B23002K533897N42663p35850l52800k15610o80608m60622j92173j338678
10903f76779k085185M02986L754215K398695l318096o252412k739501K198809
10895f317268K891044P14734j00530M97271K27684l17266Q09147K587613K560745
10886C553174R68156k58962j007515k201154l070906k341958q42952j91188j75779
10877e569084J67437M24398N6362L7386Q92885J030958m34314j255528N92180
$$ plain form
10868 -4057320 -1054515 1503712 1388232 32448 -50215 1044695 1424851 665280 260515
10859 260515 1109672 2037922 1248887 -1264777 -3303803 -2879178 -838604 18327 -1254828
10850 -1254828 -2426791 -1565146 -6376 2738 -984113 -806863 488700 945672 304274
10841 304274 303470 1316298 1599112 458594 -456505 64881 920804 634869 -577370 -1629055
10831 -1629055 -2061098 -1998110 -1745324 -1807897 -2260341 -2171294 -952273 99540 -608101 -2157165
10821 -2157165 -2136748 -454210 398592 -621548 -1404324 -103292 2070904 3018936 2804938
10812 2804938 2676795 2450989 1042678 -1018082 -1722086 -449597 947189 664182 -659064
10803 -659064 -1293357 -1437751 -2924123 -5561786 -6096706 -2689871 1331577 1170984 -2811626
$$ packed form
10868d057320L002805K558227j15480j355784q2663J094910L80156p59571m04765
10859B60515Q49157R28250p89035k513664k039026M24625K040574Q56931j273155
10850a254828j171963Q61645J558770R114r86851J77250J295563M56972o41398
10841C04274q04J012828K82814j140518r15099N21386Q55923k85935j212239j051685
10831a629055m32043O2988K52786o2573m52444Q9047J219021J051813p07641j549064
10821b157165K0417J682538Q52802j020140p82776J301032K174196R48032k13998
10812B804938j28143k25806j408311k060760p04004J272489J396786k83007j323246
10803f59064o34293j44394j486372k637663n34920L406835M021448j60593l982610
$$ plain form
10794 -2811626 -5682130 -5111591 -3946243 -4639874 -5472992 -4609846 -3918762 -5434241 -7274393
10785 -7274393 -6856909 -5493818 -5748319 -6556236 -5429379 -3662893 -4495688 -7206484 -7983775
10776 -7983775 -6238373 -5219622 -6219484 -6805009 -5495639 -3962911 -3566421 -3442795 -3065783
10767 -3065783 -3244917 -3555049 -2062681 1269799 3839224 3978490 2568015 603156 -1819486
10758 -1819486 -3657800 -3404441 -2046663 -2155749 -3397952 -2697249 256177 1853445 486729
10749 486729 -668556 775759 2068772 -108939 -3870631 -4801524 -2417813 -134927
10741 -134927 196250 212154 1605540 3650525 4800009 4881594 4764633 4644854 3494147
10732 3494147 493989 -3127801 -4592178 -2710341 311692 1582605 1312504 2020524
$$ packed form
10794b811626k870504N70539J165348o93631q33118Q63146O91084j515479j840152
10785g274393M17484J363091k54501q07917J126857J766486q32795k710796p77291
10776g983775J745402J018751r99862n85525J309370J532728L96490J23626L77012
10767c065783j79134l10132J492368L332480K569425J39266j410475j964859k422642
10758a819486j838314K53359J357778j09086j242203P00703K953426J597268j366716
10749D86729j155285J444315J293013k177711l761692r30893K383711K282886
10741a34927L31177J5904J393386K044985J149484Q1585j16961j19779j150707
10732C494147l000158l621790j464377J881837L022033J270913k70101P08020
$$ plain form
10724 2020524 4379903 6098175 5182159 2409155 127935 31172 2127948 4486965 4349533
10715 4349533 1186734 -1901395 -1783014 518230 1687241 1233327 1407306 2431597 1872696
10706 1872696 -502153 -1252937 1511721 4686360 4325372 930078 -1834540 -2117221 -1258022
10697 -1258022 -1048113 -1620899 -2009800 -1617099 -857862 -581260 -939842 -1288817 -1484762
10688 -1484762 -2317394 -3840647 -4455659 -2997444 -684839 519522 461908 164118 -119303
10679 -119303 -411794 96249 1603201 2379391 1025851 -1173292 -2170691 -1890694 -995506
10670 -995506 956542 3498552 3833564 891660 -1390539 1068254 6038481 7666965
10662 7666965 4333726 -387485 -3328188 -3830269 -1477250 3310772 6939655 5697323
$$ packed form
10724B020524K359379J718272r16016k773004k281220r6763K096776K359017j37432
10715D349533l162799l088129J18381K301244J169011m53914J73979J024291n58901
10706A872696k374849p50784K764658L174639l60988l395294k764618k82681Q59199
10697a258022K09909n72786l88901L92701P59237K76602l58582l48975j95945
10688a484762q32632j523253o15012J458215K312605J204361n7614k97790k83421
10679a19303k92491N08043J506952P76190j353540k199143r97399K79997Q95188
10670i95506J952048K542010L35012k941904k282199K458793M970227J628484
10662G666965l333239m721211k940703n02081K353019M788022L628883j242332
$$ plain form
10654 5697323 1084093 -2066906 -2306974 -2207380 -3096518 -3794961 -3980291 -4162446 -3014208
10645 -3014208 496182 3257039 1538676 -2530887 -3631103 -1517073 -473153 -1216518
10637 -1216518 -282560 2455481 2972003 802201 407413 3086821 4329810 1580496 -1549499
10628 -1549499 -1405201 873297 2973469 4738342 5870348 5294730 4427297 6017933 8582033
10619 8582033 7586712 3291333 1157494 2890422 3628903 247786 -3936694 -5301385
10611 -5301385 -4706365 -3658310 -1653707 209651 -985086 -4107308 -3999726 217046
10603 217046 3239781 2466172 1867077 3864307 4490282 846094 -3082659 -2788939 3106
10594 3106 1355597 1023227 371800 -1022677 -3070862 -3685327 -2548445 -2242721 -3542735
$$ packed form
10654E697323m613230l150999k40068R9594q89138o98443j85330j82155J148238
10645c014208L510390K760857j718363m069563j100216K114030J043920p43365
10637a216518R33958K738041N16522k169802l94788K679408J242989k749314l129995
10628a549499J44298K278498K100172J764873J132006n75618q67433J590636K564100
10619H582033r95321m295379k133839J732928P38481l381117m184480j364691
10611e301385N95020J048055K004603J863358j194737l122222J07582M216772
10603B17046L022735p73609n99095J997230O25975l644188l928753K93720K792045
10594C106J352491l32370o51427j394477k048185o14465J136882L05724j300014
$$ plain form
10585 -3542735 -4114816 -3335941 -3210635 -3454058 -1591815 1231701 1213095 -759099 -292439
10576 -292439 1537243 -669010 -5640262 -5892966 -1175719 -203569 -5445953 -7820795 -1820616
10567 -1820616 5262170 5800288 3244012 3740051 5570177 4625427 2419879 1460836 -89214
10558 -89214 -2883276 -2937282 705018 2687290 835368 379074 3716595 5405931 2668972
10549 2668972 822646 2569975 2520215 -1532587 -3098943 640342 2692530 -396003
10541 -396003 -1374066 3663184 6937560 3583594 1423894 6140573 9749265 5009673
10533 5009673 -1097959 70668 4543544 5365928 4784685 5777970 3687308 -2633462 -4182583
10524 -4182583 2616849 7373796 3668911 361100 3658549 4967775 -750464 -3075014
$$ packed form
10585c542735n72081P78875J25306k43423J862243K823516j8606j972194M66660
10576b92439J829682k206253m971252k52704M717247R72150n242384k374842O000179
10567a820616P082786N38118k556276M96039J830126r44750k205548r59043j550050
10558h9214k794062n4006L642300J982272j851922m56294L337521J689336k736959
10549B668972j846326J747329m9760m052802j566356L739285K052188l088533
10541c96003r78063N037250L274376l353966k159700M716679L608692m739592
10533E009673o107632J168627M472876Q22384n81243R93285k090662o320770j549121
10524d182583O799432M756947l704885l307811L297449J309226n718239k324550
$$ plain form
10516 -3075014 3306798 5966122 -1761705 -5966926 1841924 6956983 -814172 -6387861
10508 -6387861 1504742 6948194 -2204062 -8309137 2281142 9762785 -1482161 -8431477
10500 -8431477 8233553 22035680 7411296 -7887861 7520534 24689495 7551723
10493 7551723 -8934039 21417574 55186003 29892629 13743087 141364346 377253021
10486 377253021 493364364 356449825 113519533 -8254923 15527445 43556969
10480 43556969 9622780 -20538827 -3447587 14384036 -1410811 -15701077 -1057491
10473 -1057491 13200870 3466167 -5367120 7017747 17865191 7929304 -2588737 4698704
10465 4698704 12008905 1876461 -9495307 -4062222 5365619 1498217 -6618017 -4533492
$$ packed form
10516c075014O381812K659324p727827m205221P808850N115059p771155n573689
10508f387861P892603N443452r152256o105075J0590279P481643j1244946o949316
10500h431477J6665030J3802127j4624384j5299157J5408395J7168961j7137772
10493G551723j6485762L0351613L3768429k5293374j6149542J27621259K35888675
10486C77253021J16111343j36914539k42930292j21774456K3782368K8029524
10480D3556969l3934189l0161607J7091240J7831623j5794847j4290266J4643586
10473a057491J4258361r734703q833287J2384867J0847444r935887j0518041P287441
10465D698704P310201j0132444j1371768N433085R427841l867402q116234K084525
$$ plain form
10457 -4533492 873686 -911866 -2297334 4549309 8945278 1536616 -6313584 -2521844
10449 -2521844 4357359 2459757 -1857014 1635572 6847737 3832331 -2305707 -2115419
10441 -2115419 971254 -121493 -1457387 2469983 5943149 2778500 -997958 1386417
10433 1386417 4129329 185882 -4614726 -2055529 3591898 4067104 1413232 1437795 1696853
10424 1696853 -1862605 -4593785 -1319240 2983467 1875623 -895950 675408 3149986
10416 3149986 941026 -2251476 -548654 2602123 1190551 -1715072 -226244 2679311
10408 2679311 969963 -2515208 -1202304 2906728 3040737 -198899 -1047436 377279
10400 377279 -688638 -3901310 -4556088 -2189250 -413664 -112987 228609 -99393 -1853681
$$ packed form
10457d533492N407178j785552j385468O846643M395969p408662p850200L791740
10449b521844O879203j897602m316771L492586N212165l015406o138038J90288
10441b115419L086673j092747j335894L927370L473166l164649l776458K384375
10433A386417K742912l943447m800608K559197N647427M75206k653872K4563K59058
10424A696853l559458k731180L274545M302707j107844k771573J571358K474578
10416C149986k208960l192502J702822L150777j411572k905623J488828K905555
10408B679311j709348l485171J312904M109032J34009l239636q48537J424715
10400C77279j065917l212672o54778K366838J775586L00677L41596l28002j754288
$$ plain form
10391 -1853681 -2071700 1169961 3629206 936955 -3760187 -4682647 -2441876 -1633178 -2780831
10382 -2780831 -3299538 -3457948 -4912631 -5954654 -4251733 -1800765 -1612308 -2163265 -478856
10373 -478856 2020045 1901914 -654440 -3151591 -4760162 -5057794 -2600007 1126503 838965
10364 838965 -4717934 -8810569 -5886183 22709 1901819 75775 -710708 -326174 -1850765
10355 -1850765 -4022198 -2692239 1494528 3549172 1807754 -292509 81716 1979172
10347 1979172 2987635 1667634 -1625296 -4316805 -3655310 -610499 941271 21558
10339 21558 -375210 725167 335253 -2354644 -3593255 -1732985 -451374 -1910571 -2714730
10330 -2714730 -604819 971713 -578422 -2028065 -743379 182256 -1591187 -2504688
$$ packed form
10391a853681k18019L241661K459245k692251m697142r22460K240771Q08698j147653
10382b780831n18707j58410j454683j042023J702921K450968J88457n50957J684409
10373d78856K498901j18131k556354k497151j608571k97632K457787L726510k87538
10364H38965n556899m092635K924386N908892J879110j826044p86483L84534j524591
10355a850765k171433J329959M186767K054644j741418k100263L74225J897456
10347A979172J008463j320001l292930k691509O61495L044811J551770r19713
10339B1558l96768J100377l89914k689897j238611J860270J281611j459197q04159
10330b714730K109911J576532j550135j449643J284686R25635j773443r13501
$$ plain form
10322 -2504688 -224680 780830 -2495543 -4400737 423138 6847158 6826682 2245965
10314 2245965 929865 3682321 4816167 2952935 1939741 2505094 1700859 -151986
10306 -151986 46667 1222298 -863552 -5707829 -7954737 -5415594 -1341264 1320927
10298 1320927 2687041 3214190 2924699 2789106 2981151 1390518 -2314874 -4017486 -1132814
10289 -1132814 2217975 1525882 -413758 1175237 3652745 995040 -5193819 -7439711
10281 -7439711 -4220868 -1517028 -2433782 -3399522 -1803059 -33176 -60823 -264416 375144
10272 375144 200196 -1293957 -2093665 -1349578 -342944 790308 3145923 5596914 5553232
10263 5553232 3448256 2270288 2490843 1742640 -269160 -901427 803976 2502788 2206229
$$ packed form
10322b504688K280008J005510l276373j905194M823875O424020k0476m580717
10314B245965j316100K752456J133846j863232j013194N65353q04235j852845
10306a51986J98653J175631k085850m844277k246908K539143M074330K662191
10298A320927J366114N27149k89491j35593J92045j590633l705392j702612K884672
10289a132814L350789o92093j939640J588995K477508k657705o188859k245892
10281g439711L218843K703840r16754r65740J596463J769883k7647k03593O39560
10272C75144j74948j494153p99708P44087J006634J133252K355615K450991m3682
10263E553232k104976j177968K20555p48203k011800o32267J705403J698812k96559
$$ plain form
10254 2206229 400722 -1660179 -2994632 -2611244 -776514 430243 225477 770921 2934057
10245 2934057 3449771 281100 -2506218 -462564 3536973 3415103 -439932 -2275412
10237 -2275412 -477435 802346 -788324 -2953494 -3725013 -3659574 -2834584 -796015 612615
10228 612615 -583656 -2015451 17806 3769790 4099042 750361 -1635203 -1538536 -1942863
10219 -1942863 -3367540 -2465609 1102038 2966718 1253873 -355485 1025839 3352842
10211 3352842 4067924 3801466 3464452 2103814 -207151 -1297707 -458795 593088 1330968
10202 1330968 2892794 4167320 2227522 -1997113 -3444606 -263655 3195808 2945189
10194 2945189 542533 -750972 -911354 -1390902 -1858611 -1657917 -1846965 -3134425 -3970574
$$ packed form
10254B206229j805507k060901j334453L83388J834730J206757k04766N45444K163136
10245B934057N15714l168671k787318K043654L999537j21870l855035j835480
10237b275412J797977J279781j590670k165170p71519O5439Q24990K038569J408630
10228F12615j196271j431795K033257L751984L29252l348681k385564R6667m04327
10219a942863j424677R01931L567647J864680j712845j609358J381324K327003
10211C352842P15082k66458l37014j360638k310965j090556Q38912J051883P37880
10202A330968J561826J274526j939798m224635j447493L180951L459463k50619
10194B945189k402656j293505j60382m79548m67709K00694j89048j287460q36149
$$ plain form
10185 -3970574 -3050840 -1947859 -3114819 -6353633 -8757040 -7635848 -3105958 1645216
10177 1645216 3135460 1453319 161617 1332990 2880768 2562875 1665103 1895771 1882967
10168 1882967 572473 761682 4414701 7622106 5986817 2224694 1837345 3661357
10160 3661357 2311847 -1577949 -2012688 1724217 3646399 1271411 -916136 3061
10152 3061 1126790 389445 202214 1627498 1674926 -609752 -1757630 -548141 -671039
10143 -671039 -3483854 -4519120 -1049503 2882618 3209125 2051863 2736866 3718544 2288332
10134 2288332 9694 -302084 526050 344428 -388021 -676287 -1654262 -3723972 -4391381
10125 -4391381 -2206767 563173 2151883 4249830 7537506 8532239 4857882 -119823
$$ packed form
10185c970574R19734J102981j166960l238814k403407J121192M529890M751174
10177A645216J490244j682141j291702J171373J547778l17893q97772K30668j2804
10168A882967j310494J89209L653019L207405j635289l762123l87349J824012
10160C661357j349510l889796m34739L736905J922182k374988k187547R19197
10152C061J123729p37345j87231J425284M7428k284678j147878J209489j22898
10143f71039k812815j035266L469617L932121L26507j157262O85003R81678j430212
10134B288332k278638l11778Q28134j81622p32449k88266r77975k069710o67409
10125d391381K184614K769940J588710K097947L287676R94733l674357m977705
$$ plain form
10117 -119823 -2046489 -1584506 -1643748 -1925826 -542031 1687791 2716952 2801722 3042938
10108 3042938 2808055 1756778 1621096 2781537 2249453 -1423544 -4545965 -3527014 -478220
10099 -478220 685154 533201 1679479 2983510 1796443 -15165 1746227 6187781
10091 6187781 7787323 4594457 979088 1064789 3514615 4617838 3670660 3204080 5118700
10082 5118700 8056625 8683197 5537634 1260117 -196933 1446767 2547206 740648
10074 740648 -1989796 -2577954 -876267 1122439 2034860 1546165 -31545 -1330328 -890058
10065 -890058 373228 -304703 -3581829 -6811571 -7647004 -6388980 -4076461 -1242123 533756
10056 533756 -782304 -4149493 -5747752 -4153534 -1933364 -940106 54793 1490659 1099742
$$ packed form
10117a19823j926666M61983n9242k82078J383795K229822J029161Q4770K41216
10108C042938k34883j051277j35682J160441n32084l672997l122421J018951L048794
10099d78220J163374j51953J146278J304031j187067j811608J761392M441554
10091F187781J599542l192866l615369Q5701K449826J103223r47178m66580J914620
10082E118700K937925O26572l145563m277517j457050J643700J100439j806558
10074G40648k730444n88158J701687J998706R12421m88695j577710j298783M40270
10065h90058J263286o77931l277126l229742q35433J258024K312519K834338J775879
10056E33756j316060l367189j598259J594218K220170R93258R94899J435866l90917
$$ plain form
10047 1099742 -1830911 -4273569 -4062720 -2960260 -2772882 -2413572 -1384073 -1890329 -4393888
10038 -4393888 -5250267 -2280308 1213556 1580573 141917 -282594 -251656 -1147428 -1602041
10029 -1602041 -679346 -792072 -2993467 -3356988 838736 5160101 4126891 -26640 -1178869
10020 -1178869 649521 202557 -3308787 -4598104 -857068 4183478 6105132 5002189
10012 5002189 3377742 2501132 2272753 2217649 1740741 895148 606785 861073 89704
10003 89704 -1944044 -2729231 -738657 1752973 2266241 2001258 2965398 3869774 2738301
9994 2738301 1275001 2275679 4391447 3903832 617961 -2161120 -2761577 -2486008 -2485736
9985 -2485736 -2733142 -3519182 -4968745 -5793740 -5091269 -4200285 -4391465 -4482484 -3318923
$$ packed form
10047A099742k930653k442658K10849J102460J87378L59310J029499n06256k503559
10038d393888q56379K969959L493864L67017j438656m24511L0938q95772m54613
10029a602041R22695j12726k201395l63521M195724M321365j033210m153531j152229
10020a178869J828390m46964l511344j289317L741036N040546J921654j102943
10012E002189j624447q76610k28379n5104m76908q45593k88363K54288p71369
10003H9704k033748p85187J990574K491630N13268k64983R64140R04376j131473
9994B738301j463300J000678K115768m87615l285871k779081o00457K75569K72
9985b485736k47406p86040j449563q24995P02471Q90984j91180r1019J163561
$$ plain form
9976 -3318923 -2418968 -3159395 -3677352 -2004384 -95008 -1035398 -4035617 -5697783 -4633965
9967 -4633965 -1793129 1793119 4680574 4833706 2658109 1433649 2024666 908319 -3289753
9958 -3289753 -5912862 -3401670 321478 104260 -2058689 -1153596 2110492 3482377 2919103
9949 2919103 3086884 2825539 -533745 -4445236 -4147942 -777133 707682 152823 1397017
9940 1397017 4118178 4139551 1287788 -373081 146904 145975 -471763 865395 3502873
9931 3502873 4229329 3281708 3164028 2587725 -1285484 -5681422 -5030240 -297713 2228138
9922 2228138 905804 -330159 -318457 -1633074 -3525945 -2324374 1179013 2854519 3151709
9913 3151709 5395000 7389354 4427004 -341158 681548 6129459 7117189 2275974
$$ packed form
9976c318923Q99955p40427n17957J672968J909376r40390l000219j662166J063818
9967d633965K840836L586248K887455J53132k175597j224460N91017j116347m198072
9958c289753k623109K511192L723148k17218k162949R05093L264088J371885n63274
9949B919103J67781k61345l359284l911491K97294L370809J484815n54859J244194
9940A397017K721161K1373k851763j660869N19985r29o17738J337158K637478
9931C502873P26456r47621j17680n76303l873209m395938O51182M732527K525851
9922B228138j322334j235963J1702j314617j892871J201571L503387J675506K97190
9913C151709K243291J994354k962350m768162J022706N447911R87730m841215
$$ plain form
9905 2275974 -701901 732628 1004164 -932752 649485 5570329 6565451 3560067 4744413
9896 4744413 10234239 10271591 3851188 2196759 8078152 9785012 2979972 -807889 3337105
9887 3337105 3756177 -3520700 -3647672 8113643 11864153 328270 4333498 46900287
9879 46900287 91770203 81352360 19190291 -30105703 -27199924 -1577106 4019988
9872 4019988 -7819498 -10499661 -1864225 483153 -5680953 -7190734 -2242774 -1631637
9864 -1631637 -6864199 -8187655 -3268497 -129418 -1504403 -1554977 1167087 1108780 -2535204
9855 -2535204 -3546367 -167270 1799074 -248466 -1411153 1401158 4277864 3599862
9847 3599862 1290313 -361160 -2606330 -5641766 -5950932 -2034584 1878349 1528303 -1761700
$$ packed form
9905B275974k977875J434529K71536j936916J582237M920844R95122l005384J184346
9896D744413N489826L7352o420403j654429N881393J706860o805040l787861M144994
9887C337105M19072p276877j26972J1761315L750510j1535883M005228M2566789
9879D6900287M4869916j0417843o2162069m9295994K905779K5622818N597094
9872D019988j1839486k680163Q635436K347378o164106j509781M947960O11137
9864a631637n232562j323456M919158L139079j374985n0574K722064n8307l643984
9855b535204j011163L379097J966344k047540j162687K812311K876706o78002
9847C599862k309549j651473k245170l035436l09166L916348L912933l50046l290003
$$ plain form
9838 -1761700 -4475210 -6296055 -8395692 -9277897 -6671363 -2197018 -229071 -2250699
9830 -2250699 -5287842 -6170375 -4855940 -2882900 -780802 1467821 2811160 2003720 -256211
9821 -256211 -1989050 -2941572 -4908708 -8255158 -10375292 -9392645 -7340481 -7038159 -7489718
9812 -7489718 -5849941 -2895350 -2280396 -4341829 -5187855 -3082990 -1350640 -2844297 -5472418
9803 -5472418 -5966725 -4690049 -3516837 -1883547 1413832 4752411 5761513 5183356 5054850
9794 5054850 4600616 1874373 -1642149 -2379944 -297177 1036684 239893 -104819 1582212
9785 1582212 3026269 1960285 -398011 -1876976 -2714222 -3952580 -4549587 -2864101 142505
9776 142505 1797357 1293456 147960 -659262 -1832165 -3797090 -5490911 -5820916 -5022965
$$ packed form
9838a761700k713510j820845k099637q82205K606534M474345J967947k021628
9830b250699l037143q82533J314435J973040K102098K248623J343339q07440k259931
9821b56211j732839r52522j967136l346450k120134R82647K052164L02322m51559
9812g489718J639777K954591O14954k061433q46026K104865J732350j493657k628121
9803e472418m94307J276676J173212J633290L297379L338579J009102n78157j28506
9794E054850m54234k726243l516522p37795K082767J333861p96791l44712J687031
9785A582212J444057j065984k358296j478965q37246j238358n97007J685486L006606
9776A42505J654852n03901j145496q07222j172903j964925j693821l30005P97951
$$ plain form
9767 -5022965 -3898293 -2804318 -2080435 -2383691 -3649929 -4581523 -4264031 -3595429 -3807991
9758 -3807991 -4112395 -2542810 833431 3449371 3726184 3358013 4774037 7518414 8876611
9749 8876611 7533323 4847577 2585718 1176810 702056 1887826 4666391 6550001
9741 6550001 4322307 -1979452 -7837135 -8324510 -3392653 2062456 3772759 2395089
9733 2395089 1267680 1450717 1242428 -136871 -1294202 -1444568 -1671709 -2454962 -2559787
9724 -2559787 -1766156 -2107144 -4491051 -6477173 -5718662 -3530712 -2585291 -3120943 -4159738
9715 -4159738 -6281964 -9733709 -11611566 -8955630 -3526534 408281 1943588 2981341
9707 2981341 3084399 276609 -3356171 -2977658 1034074 2541579 -716688 -2949453 627504
$$ packed form
9767e022965J124672J093975P23883l03256j266238r31594L17492O68602k12562
9758c807991l04404J569585L376241K615940K76813l68171J416024K744377J358197
9749H876611j343288k685746k261859j408908m74754J185770K778565J883610
9741F550001k227694o301759n857683m87375M931857N455109J710303j377670
9733B395089j127409J83037k08289j379299j157331j50366k27141p83253j04825
9724b559787P93631l40988k383907j986122P58511K187950R45421n35652j038795
9715d159738k122226l451745j877857K655936N429096L934815J535307J037753
9707B981341J03058k807790l632780L78513M011732J507505l258267k232765L576957
$$ plain form
9698 627504 5951434 6326929 2442107 406664 2168865 3746351 2282928 -353472 -1523305
9689 -1523305 -1257295 -669809 101664 1189183 2128720 2523011 2464005 2209413 2295356 3378511
9679 3378511 4989683 5460633 4216555 2724986 1812572 2562 -3386216 -5588832 -3895286
9670 -3895286 -274925 1004675 -539524 -1631711 -952126 -790044 -2448442 -3851677 -3172964
9661 -3172964 -1668126 -1031606 -469862 1447368 3834043 4601387 3545020 2452024 2494519
9652 2494519 2846808 1924601 -615825 -3171098 -3559345 -1404511 1263135 2424239 2385992
9643 2385992 2600488 3040644 2522392 1126572 188049 -65723 -731109 -1907167 -2372032
9634 -2372032 -2061932 -2624558 -4567353 -5820439 -4318895 -520622 3555752 6298796 6786429
$$ packed form
9698F27504N323930L75495l884822k035443J762201J577486j463423k636400j169833
9689a523305K66010N87486P71473J087519R39537L94291n9006k54592Q5943J083155
9679C378511J611172M70950j244078j491569r12414j810010l388778k202616J693546
9670c895286L620361J279600j544199j092187O79585J62082j658398j403235O78713
9661c172964J504838O36520N61744J917230K386675P67344j056367j092996M2495
9652B494519L52289r22207k540426k555273l88247K154834K667646J161104l8247
9643B385992K14496M40156n18252j395820r38523k53772o65386j176058m64865
9634b372032L10100n62626j942795j253086J501544L798273M076374K743044M87633
$$ plain form
9625 6786429 4965880 2621556 2285313 3801608 3814925 448974 -3215793 -2753671 1505641
9616 1505641 4662442 3543064 453786 -248059 2240803 4493572 3519827 788464 524226
9607 524226 4195619 8314324 8857178 6465272 4979652 5557702 5423293 2944176 553455
9598 553455 800777 2270040 1936665 -470970 -3163427 -5596652 -7978598 -8736855 -6064081
9589 -6064081 -1658870 541119 -338657 -1288091 -461437 375297 -227011 -456857 1296184
9580 1296184 2811054 1321945 -1191009 -83059 4623329 7052369 3326403 -2573502
9572 -2573502 -3841843 -1476 2780569 512957 -3431044 -3830305 -1080567 368710
9564 368710 -745853 -1256499 459796 1827169 1058613 719521 3230203 5910511 4574200
$$ packed form
9625F786429j820549k344324l36243J516295J3317l365951l664767M62122M259312
9616A505641L156801j119378l089278p01845K488862K252769r73745k731363k64238
9607E24226L671393M118705N42854k391906j485620N78050j34409k479117k390721
9598E53455K47322J469263l33375k407635k692457k433225k381946p58257K672774
9589f064081M405211K199989q79776r49434Q26654Q36734o02308k29846J753041
9580A296184J514870j489109k512954J107950M706388K429040l725966n899905
9572b573502j268341L840367K782045k267612l944001l99261K749738J449277
9564C68710j114563n10646J716295J367373p68556l39092K510682K680308j336311
$$ plain form
9555 4574200 294109 -1796182 97650 2450638 2192263 543358 -13115 849845 2471554
9546 2471554 4787335 6889568 6637300 3791412 1255335 996177 919786 -1610910 -5103472
9537 -5103472 -5934267 -3771642 -1671681 -1297160 -1341867 -821993 -741626 -1626097 -2078232 -1047627
9527 -1047627 570399 1859841 3434422 5506666 6171370 3749761 -139293 -2059948
9519 -2059948 -1021285 769148 1549133 2289812 4332022 6443353 6137849 3324000 629529
9510 629529 -174836 -223346 -1107356 -2101253 -1616740 -296398 -273914 -1644566 -2234535 -1299999
9500 -1299999 -806399 -1839886 -2312234 -326687 2186705 1905887 -1001305 -3241294 -3081464
9491 -3081464 -1920561 -1277317 -901826 -261909 520316 1789837 4120023 6273439 5806818
$$ packed form
9555D574200m280091k090291J893832K352988k58375j648905n56473Q62960J621709
9546B471554K315781K102233k52268k845888k536077k59158p6391k530696l492562
9537e103472q30795K162625K099961L74521m4707N19874Q0367q84471m52135J030605
9527a047627J618026J289442J574581K072244O64704k421609l889054j920655
9519b059948J038663J790433P79985P40679K042210K111331l05504k813849k694471
9510F29529q04365m8510q84010r93897M84513J320342K2484j370652n89969R34536
9500a299999M93600j033487m72348J985547K513392k80818k907192k239989J59830
9491c081464J160903O43244L75491O39917P82225J269521K330186K153416m66621
$$ plain form
9482 5806818 2786546 548130 1224511 2678032 1879373 -499326 -1414536 -280541 286408
9473 286408 -1560966 -4513466 -6168232 -5777424 -4275938 -2798532 -1974207 -2026819 -2800138
9464 -2800138 -3650361 -3572696 -1867400 753556 1965189 -57118 -3970010 -6079473 -4674295
9455 -4674295 -2159001 -1563391 -2333947 -1665530 864285 2627126 2035938 822885 1242721
9446 1242721 2842687 3398251 1979853 -204879 -1456708 -1064891 517797 2179754 2945294
9437 2945294 2741271 2319603 2317750 2682096 3027094 3089960 2768647 2189559 1738253 1535786
9427 1535786 1078038 65797 -776895 -757275 -675617 -1634231 -2517390 -842890 3228244
9418 3228244 6017752 4886245 1660490 -375199 -1020752 -2096324 -3323162 -2655838 -218301
$$ packed form
9482E806818l020272k238416O76381J453521p98659k378699r15210J133995N66949
9473B86408j847374k952500j654766L90808J501486J477406Q24325n2612p73319
9464b800138q50223P7665J705296K620956J211633k022307l912892k109463J405178
9455d674295K515294N95610p70556O68417K529815J762841n91188j213053M19836
9446A242721J599966N55564j418398k184732j251829L91817J582688J661957P65540
9437B945294k04023m21668j853L64346L44998O2866l21313n79088m51306k02467
9427A535786m57748j012241q42692J9620Q1658r58614q83159J674500M071134
9418C228244K789508j131507l225755k035689o45553j075572j226838O67324K437537
$$ plain form
9409 -218301 1681490 2731673 5034859 8233459 8229593 3307097 -1946085 -2551629 -435286
9400 -435286 -1193550 -4945656 -5841664 -1176650 4329064 5570293 3890116 3480805 4494903
9391 4494903 4207995 2891382 3449379 5710366 6045058 3555887 2118984 4170723 6278388
9382 6278388 4070188 -1079499 -4016511 -3027157 -1236587 -1089412 -1232307 109322 1794415
9373 1794415 1758263 309698 -714750 -875732 -1068094 -1175817 -7385 2315526 3885582
9364 3885582 3687162 3290574 4771468 7789539 9810249 8808122 4970685 210084 -3174069
9355 -3174069 -3857619 -2623944 -1901904 -3122695 -4777755 -4326203 -1812678 45004 -453742
9346 -453742 -2044582 -2868100 -2870078 -2659202 -1827087 -262452 257929 -1906289 -5301094
$$ packed form
9409b18301J899791J050183K303186L198600l866m922496n253182o05544K116343
9400d35286p58264l752106q96008M665014N505714J241229j680177m09311J014098
9391D494903k86908j316613N57997K260987L34692k489171j436903K051739K107665
9382F278388k208200n149687k937012R89354J790570J47175j42895J341629J685093
9373A794415l6152j448565j024448j60982j92362j07723J168432K322911J570056
9364C885582j98420l96588J480894L018071K020710j002127l837437m760601l384153
9355c174069o83550J233675P22040j220791j655060M51552K513525J857682m98746
9346d53742j590840q23518j978K10876Q32115J564635N20381k164218l394805
$$ plain form
9337 -5301094 -6619253 -4672854 -1299377 1366509 2595860 2351061 1058303 125191 616773
9328 616773 1406595 777975 -385770 147391 1456779 -146199 -5110477 -8783195 -7766902
9319 -7766902 -4748885 -3962799 -4799783 -3878369 -1358707 -524786 -1841094 -2107100 -12768
9310 -12768 1654194 715292 -981796 -817078 607812 991925 30199 -642791 -126701
9301 -126701 1046832 2283491 3413441 4071357 3752823 2430106 523930 -1392101 -2449494
9292 -2449494 -1779096 264821 1679593 549866 -2768465 -5677017 -5619310 -2286219 2176321
9283 2176321 4943609 4633758 1874192 -1883573 -5486317 -7985685 -8529502 -7164532 -4983918
9274 -4983918 -2637256 395315 4016458 6277018 5742644 4122599 4238441 5916234 6457612
$$ packed form
9337e301094j318159J946399L373477K665886J229351k44799j292758r33112M91582
9328F16773P89822o28620j163745N33161J309388j602978m964278l672718J016293
9319g766902L018017P86086q36984R21414K519662Q33921j316308k66006K094332
9310a2768J666962r38902j697088J64718J424890L84113r61726o72990N16090
9301a26701J173533J236659J129950O57916l18534j322717j906176j916031j057393
9292b449494O70398K043917J414772j129727l318331k908552N7707L333091M462540
9283B176321K767288l09851k759566l757765l602744k499368n43817J364970K180614
9274d983918K346662L032571L621143K260560n34374j620045J15842J677793N41378
$$ plain form
9265 6457612 4970113 3303071 2387521 874820 -1507534 -2446275 -812816 756546 -506870
9256 -506870 -3339893 -4495174 -3397738 -2163808 -2146507 -3025753 -4482479 -6279771 -7219842
9247 -7219842 -6269849 -4265520 -2572178 -949157 1061076 1865830 -20769 -2439700 -1898379
9238 -1898379 727714 849587 -2712482 -5347950 -3219371 1369829 3690993 2770810 983272
9229 983272 -199748 -867080 -720384 355446 897580 48233 136405 3836872 9353310
9220 9353310 11876206 9822625 6265712 3860143 1935109 -369134 -1675621 -1043506
9212 -1043506 -141093 -423672 -568043 715228 1458985 -856994 -4799196 -6517605 -5196690
9203 -5196690 -3774876 -4201878 -4982677 -4093749 -1803845 429183 1917864 2609489 2590608
$$ packed form
9265F457612j487499j667042r15550j512701k382354r38741J633459J569362j263416
9256e06870k833023j155281J097436J233930J7301q79246j456726j797292r40071
9247g219842R49993K004329J693342J623021K010233Q04754j886599k418931N41321
9238a898379K626093J21873l562069k635468K128579M589200K321164r20183j787538
9229I83272j183020o67332J46696J075830N42134q49347Q8172L700467N516438
9220I353310K522896k053581l556913k405569j925034k304243j306487O32115
9212a043506R02413k82579j44371J283271P43757k315979l942202j718409J320915
9203e196690J421814m27002p80799Q88928K289904K233028J488681O91625j8881
$$ plain form
9194 2590608 2555351 3252209 3719673 1732777 -2958681 -7354750 -8453486 -6638053 -4622781
9185 -4622781 -4064562 -4540819 -5107389 -5446028 -5671946 -5923884 -6066267 -5491606 -3738499
9176 -3738499 -1508984 -218514 -255434 -676888 -815880 -819706 -291379 1772110 4836579
9167 4836579 6415680 4981425 1740676 -1490090 -4216142 -5797637 -4532599 -486767
9159 -486767 2820776 2318486 -548707 -2294590 -2232615 -1751816 -573563 2173164 4284910
9150 4284910 2660921 -990788 -1564735 1598389 3338901 868770 -1704744 -92918
9142 -92918 3309427 3498717 751426 -301650 2069657 4899251 5616063 4979923 4447967
9133 4447967 3803964 2524292 1391918 1592697 3258593 5414151 6708459 6344441 4981164
$$ packed form
9194B590608l5257O96858M67464j986896m691458m396069j098736J815433K015272
9185d622781N58219m76257n66570l38639k25918k51938j42383N74661J753107
9176c738499K229515J290470l6920m21454j38992l826N28327K063489L064469
9167D836579J579101j434255l240749l230766k726052j581495J265038M045832
9159d86767L307543n02290k867193j745883O1975M80799J178253K746727K111746
9150D284910j623989l651709n73947L163124J740512k470131k573514J611826
9142i2918L402345J89290k747291j053076K371307K829594P16812o36140n31956
9133D447967o44003j279672j132374K00779J665896K155558J294308l64018j363277
$$ plain form
9124 4981164 4160217 4048210 2810082 -442126 -3250207 -2405345 1653630 5192369 5792651
9115 5792651 4583069 3766797 3946676 4432752 4493686 3554171 1457855 -783866 -1603784
9106 -1603784 -820844 58165 14694 -100648 874508 2428071 2977388 1964027 391511
9097 391511 -544853 -545237 106803 1159979 2241466 2532356 1372845 -619024 -1617608 -315448
9087 -315448 2636893 5327517 6448823 6049982 4932423 4064241 4161325 4878718 4807976
9078 4807976 3393612 2298176 3227460 4825743 4040378 849293 -879976 1648159 6429855
9069 6429855 9321528 8745914 6302220 4188260 3546970 4194112 4695075 3783008 2440588
9060 2440588 2857113 4593399 4382444 1217400 -1381240 -635150 950567 -210663 -2638231
$$ packed form
9124D981164q20947j12007j238128l252208k808081Q44862M058975L538739O00282
9115E792651j209582q16272J79879M86076O0934r39515k096316k241721q19918
9106a603784P82940Q79009m3471j15342R75156J553563N49317j013361j572516
9097C91511r36364l84O52040J053176J081487K90890j159511j991869r98584J302160
9087c15448K952341K690624J121306l98841j117559q68182R7084P17393p0742
9078D807976j414364j095436R29284J598283p85365l191085j729269K528135M781696
9069F429855K891673n75614k443694k113960o41290O47142N00963r12067j342420
9060B440588M16525J736286k10955l165044k598640P46090J585717j161230k427568
$$ plain form
9051 -2638231 -2320245 282291 897300 -1336810 -2507382 -501322 1871086 1894053 807764
9042 807764 460758 -189451 -2473162 -4798558 -5014861 -3898903 -3417172 -3061906 -797269
9033 -797269 3162030 6076093 6024095 3748915 1309215 201984 593005 1388237 1304616
9024 1304616 416854 -14071 355650 245189 -1083649 -2341662 -2111633 -985060 -281647
9015 -281647 316781 1964734 4040351 4417050 2584939 767242 1124681 2990257 3919703
9006 3919703 2865759 1061957 -253998 -1574921 -3585616 -4952259 -3622358 -296273
8998 -296273 1633093 471714 -1569225 -1938154 -1219151 -810512 586667 4636594 8865151
8989 8865151 8712477 4064857 -274984 -1328528 -1313123 -3027701 -5617774 -6995832 -7307501
$$ packed form
9051b638231L17986K602536O15009k234110j170572K006060K372408K2967j086289
9042H07764l47006o50209k283711k325396k16303J115958M81731L55266K264637
9033g97269L959299K914063n1998k275180k439700j107231L91021P95232q3621
9024A304616q87762m30925L69721j10461j328838j258013K30029J126573P03413
9015b81647N98428J647953K075617L76699j832111j817697L57439J865576R29446
9006C919703j053944j803802j315955j320923k010695j366643J329901L326085
8998b96273J929366j161379k040939l68929P19003M08639J397179M049927M228557
8989H865151j52674m647620m339841j053544J5405j714578k590073j378058l11669
$$ plain form
8980 -7307501 -7495506 -6910207 -4881396 -2652924 -1363513 76995 2764905 5239555 5667675
8971 5667675 5064259 5657174 7152115 7242411 5102201 2039279 -667948 -2382296 -2213432
8962 -2213432 193501 3252667 4759613 4390737 3351035 2190929 760749 -312171
8954 -312171 -136994 727789 878160 173732 -358604 -438197 -766848 -1590412 -2469363 -3218451
8944 -3218451 -3774978 -3536703 -2120616 -341126 727888 1057577 988591 249400 -1085349
8935 -1085349 -1831574 -1377920 -843348 -906717 -76813 2670449 5132491 4639151 2424413
8926 2424413 1993437 3716033 4454917 2611796 235666 -513249 -111086 21436 -404288
8917 -404288 -1001257 -1290957 -385396 1925889 3629684 2407593 -667421 -2058534 -898015
$$ packed form
8980g307501j88005N85299K028811K228472J289411J440508K687910K474650M28120
8971E667675o03416N92915J494941R0296k140210l062922k707227j714348J68864
8962b213432K406933L059166J506946l68876j039702j160106j430180j072920
8954c12171J75177Q64783J50371p04428n32336p9593l28651q23564q78951p49088
8944c218451n56527K38275J416087J779490J069014L29689o8986p39191j334749
8935a085349p46225M53654N34572o3369Q29904K747262K462042m93340k214738
8926B424413m30976J722596P38884j843121k376130p48915M02163J32522m25724
8917d04288n96969k89700R05561K311285J703795j222091l075014j391113J160519
$$ plain form
8908 -898015 -181379 -1760473 -3268627 -2002693 728397 1698536 488817 -542655 -132326
8899 -132326 499257 -12464 -1414876 -2809364 -4042513 -5370362 -6291077 -5621723 -3193206
8890 -3193206 -958126 -1164903 -3188443 -3797342 -1540529 1007975 1223596 727467 2679495
8881 2679495 5990877 6120249 1719570 -3298163 -5246171 -4742634 -3854347 -2472391 176291
8872 176291 2909669 4080466 4102288 4245587 4166385 2748609 508281 -813108 -621159
8863 -621159 43147 63156 -789587 -2128166 -3381743 -4148220 -4381921 -3945252 -2437342
8854 -2437342 -401801 164005 -1588206 -2917197 -366847 5000280 8367737 7662705 5900507
8845 5900507 5939136 6542387 5701968 4426051 4286531 3973200 1713048 -854519 -723369
$$ packed form
8908h98015P16636j579094j508154J265934K731090R70139j209719j031472M10329
8899a32326O31583n11721j402412j394488j233149j327849r20715O69354K428517
8890c193206K235080k06777k023540o08899K256813K548504K15621m96129J952028
8881B679495L311382J29372m400679n017733j948008N03537Q88287J381956K648682
8872A76291K733378J170797K1822J43299p9202j417776k240328j321389J91949
8863f21159O64306K0009q52743j338579j253577p66477k33701M36669J507910
8854b437342K035541N65806j752211j328991K550350N367127L367457p05032j762198
8845E900507L8629O03251q40419j275917j39520l13331k260152k567567J31150
$$ plain form
8836 -723369 1843823 3997961 4671195 5076735 5485599 4715102 2755066 1048441 -39467
8827 -39467 -1515593 -3263075 -3670470 -2318516 -893115 -589679 -393847 961693 2591447
8818 2591447 2292725 -613283 -4198465 -5886489 -5109108 -3459872 -2161056 -533247 1946689
8809 1946689 3376965 1673928 -1392802 -1594400 1729681 4336418 3206585 741833
8801 741833 535883 1877349 1605026 -589125 -2042899 -1170677 1231035 3886654 5846266
8792 5846266 6245897 5299801 4434080 3747262 1229656 -3418432 -6689697 -5964817 -3845374
8783 -3845374 -4086915 -5472651 -4239687 -827721 1016453 912824 1989118 4357547 4262723
8774 4262723 885627 -1489969 -203240 1740524 1062578 -549921 116607 2361317 3047244
$$ packed form
8836g23369K567192K154138O73234M05540M08864p70497j960036j706625j087908
8827c9467j476126j747482m07395J351954J425401L03436J95832J355540J629754
8818B591447k98722k906008l585182j688024P77381J649236J298816J627809K479936
8809A946689J430276j703037l066730k01598L324081K606737j129833k464752
8801G41833k05950J341466k72323k194151j453774Q72222K401712K655619J959612
8792E846266L99631r46096q65721o86818k517606m648088l271265P24880K119443
8783c845374k41541j385736J232964L411966J844174j03629J076294K368429r4824
8774D262723l377096k375596J286729J943764o77946j612499O66528K244710O85927
$$ plain form
8765 3047244 1370453 -885487 -2306885 -2535952 -1311399 982502 2839722 3375390 3450168
8756 3450168 3791203 3484583 1760490 -232773 -978619 -556803 397493 2277592 5332998
8747 5332998 7955869 7866220 4640403 136344 -3076891 -3334778 -1022511 1353012 1310127
8738 1310127 -1030999 -3611666 -5447752 -7050969 -7909577 -6298166 -2496797 386511
8730 386511 252099 -1450101 -2391266 -2406822 -2244390 -1428942 442368 1839353 1039855
8721 1039855 -1117783 -2145512 -1104922 525374 851797 -490913 -2053409 -1826431 648424
8712 648424 3453016 4448569 3741454 2594502 944636 -1401340 -2025636 1696090 7198921
8703 7198921 8126485 2635546 -3695540 -5299758 -3120447 -1185801 -614370 -538912 -1709918
$$ packed form
8765C047244j676791k255940j421398k29067J224553K293901J857220N35668P4778
8756C450168L41035l06620j724093j993263p45846M21816R54296J880099L055406
8747E332998K622871q9649l225817m504059l213235k57887K312267K375523m2885
8738A310127k341126k580667j836086j603217q58608J611411L801369K883308
8730C86511j34412j702200r41165j5556J62432Q15448J871310J396985p99498
8721A039855k157638j027729J040590J630296L26423j342710j562496K26978K474855
8712F48424K804592R95553p07115j146952j649866k345976o24296L721726N502831
8703G198921R27564n490939o331086j604218K179311J934646N71431P5458j171006
$$ plain form
8694 -1709918 -4912830 -7835835 -7506099 -4571341 -1907533 -413323 656676 777217 -920081
8685 -920081 -2947695 -3003302 -1339406 184398 1081312 1438637 7390 -3398440 -5457838
8676 -5457838 -3535493 -826753 -2414524 -6959828 -7729290 -2309448 3978231 5825517
8668 5825517 4372781 3587423 4113825 3804855 1980429 268513 203111 1698453 3290697
8659 3290697 3305167 1716705 722852 1936824 3512780 2445349 -556359 -1578373 664165
8650 664165 2725434 1406271 -2001160 -4144782 -3998764 -2957940 -2287699 -2300536 -2906952
8641 -2906952 -3519651 -3222637 -1939838 -558875 590636 2138116 4047604 5008778 4172507
8632 4172507 2316762 706414 -138016 -219865 217880 574735 653268 1367084 3204296
$$ packed form
8694a709918l202912k923005L29736K934758K663808J494210J069999J20541j697298
8685i20081k027614n5607J663896J523804Q96914L57325j431247l405830k059398
8676e457838J922345K708740j587771m545304p69462N419842O287679J847286
8668E825517j452736p85358N26402l08970j824426j711916o5402J495342J592244
8659C290697J4470j588462r93853J213972J575956j067431l001708j022014K242538
8650F64165K061269j319163l407431k143622J46018J040824O70241j2837o06416
8641b906952o12699K97014J282799J380963J149511J547480J909488R61174q36271
8632D172507j855745j610348q44430q1849M37745L56855P8533P13816J837212
$$ plain form
8623 3204296 4362669 2500549 -1692062 -4916478 -5425838 -4444004 -3258894 -1701033 -256882
8614 -256882 -757360 -3409335 -5521762 -4995246 -3231991 -2808125 -3786136 -4166311 -3012989
8605 -3012989 -1580941 -1783162 -4242038 -7246041 -7658467 -4232073 52067 947018 -1587050
8596 -1587050 -3342782 -1906292 138702 -480820 -2895306 -3827382 -2289996 -198529 567066
8587 567066 -228744 -1568575 -1610910 1159425 5559603 7597788 4668342 -790605 -3660115
8578 -3660115 -1900308 1576199 2702059 521006 -2717406 -4715723 -5318914 -5311642 -4083687
8569 -4083687 -426743 4007675 4760119 320888 -4351639 -3567949 1154923 3140713 92516
8560 92516 -3300679 -3035584 -965835 -200420 -20179 1371043 2730230 2115870 634849
$$ packed form
8623C204296J158373j862120m192611l224416n09360R81834J185110J557861J444151
8614b56882n00478k651975k112427N26516J763255M23866r78011l80175J153322
8605c012989J432048k02221k458876l004003m12426L426394M284140Q94951k534068
8596a587050j755732J436490K044994o19522k414486r32076J537386K091467P65595
8587E67066p95810j339831m2335K770335M400178K038185k929446n458947k869510
8578c660115J759807L476507J125860k181053l238412j998317o03191P272J227955
8569d083687L656944M434418P52444m439231m672527P83690M722872J985790l048197
8560I2516l393195K65095K069749P65415J80241J391222J359187o14360j481021
$$ plain form
8551 634849 322329 514871 -307426 -1143634 -367278 875100 692894 192732 1410253
8542 1410253 2843358 1184907 -3003525 -5322187 -3499885 -36590 1630115 896246
8534 896246 -596203 -1095958 149881 2224008 2957541 1497480 -107659 361694 1841818
8525 1841818 1550998 -620477 -1922150 -926176 542119 142657 -2122286 -4338317 -4829700
8516 -4829700 -3634343 -2400159 -2473566 -2952117 -1947084 27147 312653 -1404030 -2011457
8507 -2011457 -192225 818784 -1354812 -3593121 -2174944 769614 791956 -1283625 -1213945
8498 -1213945 670122 -111232 -3852073 -5304445 -1862811 2771976 4849395 5031681 4574776
8489 4574776 2559965 -226172 114564 4351029 6954586 3551836 -2034879 -2936789 1210565
$$ packed form
8551F34849l12520J92542q22297q36208P76356J242378j82206n00162J217521
8542A410253J433105j658451m188432k318662J822302L463295J666705p33869
8534H96246j492449m99755J245839K074127P33533j460061j605139M69353J480124
8525A841818k90820k171475j301673R95974J468295l99462k264943k216031m91383
8516d829700J195357J234184p3407m78551J005033J974231K85506j716683o07427
8507b011457J819232J011009k173596k238309J418177K944558K2342k075581O9680
8498a213945J884067p81354l740841j452372L441634M634787K077419J82286m56905
8489D574776k014811k786137L40736M236465K603557l402750n586715r01910M147354
$$ plain form
8480 1210565 4786650 4651410 3193897 3281189 4472492 5004881 4489642 3619153 3058032
8471 3058032 3217206 3847549 3706218 1702663 -1645364 -4666364 -6143379 -5932360 -4666158
8462 -4666158 -3434824 -2948288 -2515668 -841902 1820871 3688560 3999094 3799529 3585408
8453 3585408 2299252 -171712 -1670109 -653702 1343053 1945861 1170093 652059 1018612
8444 1018612 1779683 2550818 2666884 960759 -2197887 -4036327 -2676834 -51362 786679
8435 786679 79302 320709 1525301 759865 -3208326 -7563931 -8872001 -6943829 -4061690
8426 -4061690 -1790632 -93104 1054755 878784 -750755 -2020994 -700286 2748694
8418 2748694 4877935 3189919 -625465 -2949717 -2826759 -2122015 -1805376 -1080180 -230432
$$ packed form
8480A210565L576085j35240j457513Q7292J191303N32389n15239q70489n61121
8471C058032J59174O30343j41331k003555l348027l021000j477015K11019J266202
8462d666158J231334M86536M32620J673766K662773J867689L10534j99565k14121
8453C585408j286156k470964j498397J016407J996755O02808p75768n18034L66553
8444A018612P61071P71135J16066j706125l158646j838440J359493K625472Q38041
8435G86679p07377K41407J204592p65436l968191m355605j308070J928172K882139
8426d061690K271058J697528J147859j75971j629539j270239J320708L448980
8418B748694K129241j688016l815384k324252J22958P04744L16639P25196Q49748
$$ plain form
8409 -230432 -843114 -2286997 -1578090 1536904 2972167 372903 -2519957 -1028812 3608126
8400 3608126 6566273 6656099 6713439 7754535 7417283 4520506 1166896 -645845 -1358342
8391 -1358342 -1872119 -2006523 -1897399 -2493596 -3666574 -3931732 -2890057 -1949026 -1881979
8382 -1881979 -1733577 -992413 -750753 -1534198 -1830424 -216664 2383925 3911866 3679189
8373 3679189 2569431 1532813 917248 835227 1373696 2441818 3511643 3444822 1206422
8364 1206422 -2512279 -5070420 -4492919 -1886811 -18141 21340 -681350 -1088439 -1110207
8355 -1110207 -561633 837253 2381650 3025257 3040438 3305218 3225338 1526737 -1004534
8346 -1004534 -2089743 -1532600 -1556356 -2857911 -3087541 -683673 2138138 2161344 -608620
$$ packed form
8409b30432o12682j443883P08907L114994J435263k599264k892860J491145M636938
8400C608126K958147Q9826N7340J041096l37252k896777l353610j812741p12497
8391a358342n13777j34404J09124n96197j172978k65158J041675R41031O7047
8382a881979J48402P41164K41660p83445k96226J613760K600589J527941k32677
8373C679189j109758j036618o15565q2021N38469J068122J069825o6821k238400
8364A206422l718701k558141N77501K606108J868670L9481p02690m07089k1768
8355a110207N48574J398886J544397O43607J5181K64780p9880j698601k531271
8346a004534j085209N57143k3756j301555k29630K403868K821811K3206k769964
$$ plain form
8337 -608620 -3304323 -3821242 -2629511 -1524610 -1526235 -1778552 -532694 2147811 3449067
8328 3449067 1228934 -2468790 -3896223 -2993593 -2821318 -3667622 -2248454 1860043 3782245
8319 3782245 345873 -4467464 -4991295 -1724965 601574 409419 -62271 81495 -374517
8310 -374517 -879020 588650 2951836 2324950 -1963549 -5494304 -4443462 -78790 3753991
8301 3753991 4828845 3063192 -264873 -2460168 -1334849 1340050 1002669 -3519583
8293 -3519583 -7781349 -7528513 -3925563 -707220 1063368 2349637 2609970 687444 -1939129
8284 -1939129 -2373008 -431972 1338419 1492006 864116 267020 -259282 -58069 1516184
8275 1516184 3060554 2509522 721295 693336 2701502 3416846 985014 -2118309 -3010311
$$ packed form
8337f08620k695703n16919J191731J104901j625k52317J245858K680505J301256
8328C449067k220133l697724j427433R02630J72275q46304J419168M108497J922202
8319C782245l436372m813337n23831L266330K326539j92155m71690J43766m56012
8310c74517n04503J467670K363186o26886m288499l530755J050842M364672L832781
8301C753991J074854j765653l328065k195295J125319K674899l37381m522252
8293c519583m261766K52836L602950L218343J770588J286269K60333j922526k626573
8284a939129m33879J941036J770391J53587o27890n97096n26302K01213J574253
8275A516184J544370n51032j788227k7959K008166P15344k431832l103323q92002
$$ plain form
8266 -3010311 -2354747 -2183098 -2200565 -987541 864677 1696735 1735407 2301206 2746629 977973
8256 977973 -3044686 -6711718 -7817267 -6276001 -2921963 1220717 4341573 4781764 3175179
8247 3175179 1851170 1647231 1131868 -563403 -2170642 -2335497 -1382853 -164888 1033863
8238 1033863 1538159 246332 -2215114 -3347866 -2361920 -1808657 -3571454 -5298498 -3734594
8229 -3734594 -88404 1515290 386113 178214 2838777 5390719 4629918 2090618 1577828
8220 1577828 3490169 4613438 3024590 421097 -862583 -911698 -1170649 -1844409 -1910919
8211 -1910919 -1068362 -123915 540807 1479671 2722349 3156746 2340426 1723013 2478967
8202 2478967 3014299 911740 -2849514 -4413643 -2588905 -997291 -2832801 -6042434
$$ packed form
8266c010311O55564J71649j7467J213024J852218Q32058L8672N65799M45423j768656
8256I77973m022659l667032j105549J541266L354038M142680L120856M40191j606585
8247C175179j324009k03939n15363j695271j607239j64855R52644J217965J198751
8238A033863N04296j291827k461446j132752R85946N53263j762797j727044J563904
8229c734594L646190J603694j129177k07899K660563K551942p60801k539300n12790
8220A577828J912341J123269j588848k603493j283680m9115k58951o73760o6510
8211a910919Q42557R44447O64722R38864J242678M34397q16320o17413P55954
8202B478967N35332k102559l761254j564129J824738J591614j835510l209633
$$ plain form
8194 -6042434 -6564577 -4452833 -3160109 -3662905 -3337691 -946071 1147452 982484 -112211
8185 -112211 -409011 -642489 -1728877 -2048919 263532 3893138 5825571 5249999 3729066
8176 3729066 2439588 1496951 1181001 1485268 1035824 -1251389 -3914394 -4632040 -3725850
8167 -3725850 -3538474 -4609431 -5086880 -3891662 -1715503 1255087 5513376 9518011 10148388
8158 10148388 7340948 5255927 6821707 9725564 10110934 7834176 5277898 3031343
8150 3031343 167671 -2398407 -2424757 -32280 2111716 2460021 1967876 1762529 1809174
8141 1809174 1940698 1874408 302660 -3396655 -6618697 -5894255 -2210116 -398670 -2109912
8132 -2109912 -3267731 -699180 2528880 1951095 -1052335 -1424060 1618050 3632148 1982816
$$ packed form
8194f042434n22143K111744J292724n02796L25214K391620K093523j64968j094695
8185a12211k96800k33478j086388l20042K312451L629606J932433n75572j520933
8176C729066j289478r42637l15950L04267m49444k287213k663005p17646R06190
8167c725850J87376j070957m77449J195218K176159K970590M258289M004635O30377
8158A0148388k807440k085021J565780K903857L85370k276758k556278k246555
8150C031343k863672k566078k6350K392477K143996L48305m92145k05347M6645
8141A809174J31524o6290j571748l699315l222042P24442L684139J811446j711242
8132b109912j157819K568551L228060n77785l003430l71725L042110K014098j649332
$$ plain form
8123 1982816 -670129 -1190274 -546790 -1366524 -3504297 -4683195 -4195291 -3556500 -3939585
8114 -3939585 -4861710 -5425533 -5366284 -4556960 -2707466 -313084 889665 -369158 -2732776
8105 -2732776 -3104410 -573024 1662599 27374 -4272839 -6167953 -3215362 1269382
8097 1269382 2765039 888704 -1640717 -3197836 -3857466 -3458031 -1987544 -865882 -1032290
8088 -1032290 -761197 1593736 3761908 2195569 -2019285 -4044249 -2152944 564232
8080 564232 1780610 2458838 2659070 87270 -4657815 -6353899 -2350597 2672925 3405638
8071 3405638 1707025 2674341 5778869 5833144 1505392 -2942082 -4414808 -4302473 -4303083
8062 -4303083 -3565491 -1445666 596476 1431619 1676676 1508331 -85109 -2706045 -4024912
$$ packed form
8123A982816k652945n20145O43484q19734k137773j178898M87904O38791l83085
8114c939585r22125n63823N9249Q09324J849494K394382J202749j258823k363618
8105b732776l71634K531386K235623j635225m300213j895114K952591M484744
8097A269382J495657j876335k529421j557119o59630L99435J470487J121662j66408
8088a032290K71093K354933K168172j566339m214854k024964J891305K717176
8080E64232J216378O78228K00232k571800m745085j696084M003302N023522P32713
8071C405638j698613R67316L104528N4275m327752m447474j472726J12335o10
8062d303083P37592K119825K042142Q35143K45057j68345j593440k620936j318867
$$ plain form
8053 -4024912 -3219563 -2314222 -2609341 -2358722 75769 2934464 3235720 907923 -1360555
8044 -1360555 -1682312 -680163 16989 -320395 -1137467 -1413380 -741416 326168 990022
8035 990022 810372 -494955 -2691259 -3892732 -1649240 3248469 6017691 3480428 -1303455
8026 -1303455 -3249009 -2510913 -3191735 -5695451 -5904465 -2775681 -1040574 -3752546 -7040429
8017 -7040429 -5979297 -1856110 710717 1097903 2411619 5400420 7226674 6143299
8009 6143299 3711112 1962765 1148469 763464 615810 361390 -499573 -1927757 -3600674
8000 -3600674 -5370341 -6422874 -5005162 -619109 4292883 6562349 5633841 3279839
7992 3279839 928243 -928325 -1500145 -68964 2529384 4409872 4517182 2954639 218416
$$ packed form
8053d024912Q05349R05341k95119K50619K434491K858695L01256k327797k268478
8044a360555l21757J002149O97152l37384q17072k75913O71964J067584O63854
8035I90022j79650j305327k196304j201473K243492M897709K769222k537263m783883
8026a303455j945554P38096o80822k503716k09014L128784J735107k711972l287883
8017g040429J061132M123187K566827L87186J313716K988801J826254j083375
8009F143299k432187j748347q14296l85005j47654k54420q60963j428184j672917
8000c600674j769667j052533J417712M386053M911992K269466r28508k354002
7992C279839k351596j856568n71820J431181K598348J880488J07310j562543k736223
$$ plain form
7983 218416 -2594623 -3855491 -3334113 -3037205 -4281896 -5083373 -2789358 1570369 4254099
7974 4254099 3757206 2153271 1573821 2008173 2872505 4087162 4752270 3093215 -909771
7965 -909771 -4368831 -4296997 -863054 2843207 3796892 1640645 -1146660 -1825548 -510801
7956 -510801 148669 -985471 -1562727 473861 2977261 2429246 -393636 -1195565 1440561
7947 1440561 4079579 3693414 1531189 229641 -9326 -260572 -113823 1512214 3968369
7938 3968369 5281464 4457363 2257954 316945 92674 1658055 3008986 1909829 -1039212
7929 -1039212 -2788442 -1896306 -194586 551776 1231034 2817988 3504883 1201247 -2448979
7920 -2448979 -3646428 -1621749 675814 1254746 1563435 3276207 5126433 4892803 2959847
$$ packed form
7983B18416k813039j260868N21378K96908j244691q01477K294015M359727K683730
7974D254099m96893j603935n79450M34352Q64332J214657O65108j659055m002986
7965i09771l459060P1834L433943L706261R53685k156247k787305o78888J314747
7956e10801O59470j134140n77256K036588K503400n48015k822882q01929K636126
7947A440561K639018l86165k162225j301548k38967k51246J46749J626037K456155
7938C968369J313095q24101k199409j941009k24271J565381J350931j099157k949041
7929a039212j749230Q92136J701720P46362O79258J586954O86895k303636l650226
7920b448979j197449K024679K297563N78932L08689J712772J850226k33630j932956
$$ plain form
7911 2959847 1558697 1114864 -113868 -2393916 -3035800 -219825 3472568 3879056 866868
7902 866868 -1716138 -1733430 -1153496 -1668703 -1381490 1583766 4979938 5490963 3982643
7893 3982643 3676435 4296637 2708119 -755051 -1663826 1441046 3930021 1536642 -3620377
7884 -3620377 -6350063 -4998320 -1836707 901866 2317206 1851969 64303 -675049 1022488
7875 1022488 2873100 1496520 -2927859 -6768436 -7142027 -4130653 321537 3637655
7867 3637655 3579180 300188 -3028130 -3617119 -2427050 -2179815 -3047763 -2940225 -1422410
7858 -1422410 -395780 -892091 -1905237 -2608903 -3152319 -2985033 -1091549 1523323 2260588
7849 2260588 777412 -75922 1629146 4099837 4507322 2465386 -540061 -3153545 -3986449
$$ packed form
7911B959847j401150m43833j228732k280048o41884K815975L692393M06488l012188
7902H66868k583006j7292N79934n15207K87213K965256L396172N11025j508320
7893C982643l06208O20202j588518l463170r08775L104872K488975k393379n157019
7884c620377k729686J351743L161613K738573J415340m65237j787666p39352J697537
7875A022488J850612j376580m424379l840577l73591L011374M452190L316118
7867C637655n8475l278992l328318n88989J190069K47235q67948J07538J517815
7858a422410J026630m96311j013146p03666n43416J67286J893484K614872P37265
7849B260588j483176q53334J705068K470691M07485k041936l005447k613484q32904
$$ plain form
7840 -3986449 -1585513 3152456 6133560 4289069 -200210 -2433715 -1051019 689317
7832 689317 82319 -1684964 -2422321 -2624921 -4145137 -6571672 -7395905 -5609437 -3046482
$$ packed form
7840c986449K400936M737969K981104j844491m489279k233505J382696J740336
7832F89317o06998j767283p37357k02600j520216k426535q24233J786468K562955
$$ [...]
##END NTUPLES=NMR SPECTRUM
##END=
