##TITLE=31Pdec_SR55_pr
 , 124 sc
 26.04.2021
##JCAMPDX= 6.0         $$ Bruker NMR JCAMP-DX V2.0
##DATA TYPE= NMR FID
##DATA CLASS= NTUPLES
##ORIGIN= UXNMR, Bruker Analytische Messtechnik GmbH
##OWNER= root
$$ XWIN-NMR		Version 3.5
$$ Mon Apr 26 14:27:35 2021 Russian Standard Time (UT+4h)  she@DPX200
##.OBSERVE FREQUENCY= 81.013821
##.OBSERVE NUCLEUS= ^31P
##.DELAY= (6, 6)
##.ACQUISITION MODE= SIMULTANEOUS
##.ACQUISITION SCHEME= undefined
##.AVERAGES= 41
##.DIGITISER RES= 16
##SPECTROMETER/DATA SYSTEM= spect
##.PULSE SEQUENCE= zgpg30
##.SOLVENT NAME= D2O
##.SHIFT REFERENCE= (INTERNAL, D2O, 0, 243.863)
##AUDIT TRAIL= $$ (NUMBER, WHEN, WHO, WHERE, WHAT)
$$ ##TITLE= Audit trail, XWIN-NMR		Version 3.5
$$ ##JCAMPDX= 5.01
$$ ##ORIGIN= Bruker BioSpin GmbH
$$ ##OWNER= she
$$ F:/spectra/data/she/nmr/P31/1/audita.txt
$$ ##AUDIT TRAIL=  $$ (NUMBER, WHEN, WHO, WHERE, WHAT)
(   1,<2021-04-26 14:25:28.09 +0400>,<she>,<DPX200>,
      <created by zg, POWCHK disabled, PULCHK disabled
       terminated by command 'halt'
       configuration hash MD5:
       00 E9 B6 7A A2 85 ED C7 34 08 36 98 17 FE 4E 26
       data hash MD5: 32K
       25 A5 0D 49 4F 11 BE 3B BF 04 A0 71 7E E7 29 AC>)
$$ ##END=
$$ 
$$ hash MD5
$$ 19 CC 84 34 30 22 77 7B 85 6A C1 1C B6 F9 3C 6C
##$RELAX= 
##$RELAX= 
##$RELAX= 
##$RELAX= 
##$RELAX= 
##$RELAX= 
##$RELAX= 
##$RELAX= 
$$ Bruker specific parameters
$$ --------------------------
##$DU= <F:/spectra>
##$EXPNO= 1
##$NAME= <P31>
##$PROCNO= 1
##$TYPE= <nmr>
##$USER= <she>
##$AMP= (0..31)
100 100 100 100 100 100 100 100 100 100 100 100 100 100 100 100 100 100 
100 100 100 100 100 100 100 100 100 100 100 100 100 100 
##$AQSEQ= 0
##$AQ_mod= 1
##$AUNM= <au_zg>
##$AUTOPOS= <>
##$BF1= 81.014009
##$BF2= 200.13
##$BF3= 200.13
##$BF4= 200.13
##$BF5= 200.13
##$BF6= 200.13
##$BF7= 200.13
##$BF8= 200.13
##$BYTORDA= 1
##$CFDGTYP= 0
##$CFRGTYP= 5
##$CHEMSTR= <none>
##$CNST= (0..31)
1 1 145 1 1 1 1 1 1 1 1 1 1 1 1 1 1 1 1 1 1 1 1 1 1 1 1 1 1 1 1 1 
##$CPDPRG= <waltz16>
##$CPDPRG1= <>
##$CPDPRG2= <waltz16>
##$CPDPRG3= <>
##$CPDPRG4= <mlev>
##$CPDPRG5= <mlev>
##$CPDPRG6= <mlev>
##$CPDPRG7= <mlev>
##$CPDPRG8= <mlev>
##$CPDPRGB= <>
##$CPDPRGT= <>
##$D= (0..31)
0 1 0 0 0 0 0 0 0 0 0 0.03 2e-05 3e-06 0 0 0 0 0 0 0 0 0 0 0 0 0 0 0 0 
0 0 
##$DATE= 1619432727
##$DBL= (0..7)
120 120 120 11 120 120 24 19 
##$DBP= (0..7)
150 150 150 150 150 150 150 150 
##$DBP07= 0
##$DBPNAM0= <>
##$DBPNAM1= <>
##$DBPNAM2= <>
##$DBPNAM3= <>
##$DBPNAM4= <>
##$DBPNAM5= <>
##$DBPNAM6= <>
##$DBPNAM7= <>
##$DBPOAL= (0..7)
0.5 0.5 0.5 0.5 0.5 0.5 0.5 0.5 
##$DBPOFFS= (0..7)
0 0 0 0 0 0 0 0 
##$DE= 6
##$DECBNUC= <off>
##$DECIM= 3
##$DECNUC= <off>
##$DECSTAT= 4
##$DIGMOD= 1
##$DIGTYP= 9
##$DL= (0..7)
0 0 52 120 120 21 21 25 
##$DP= (0..7)
150 150 150 150 150 150 150 150 
##$DP07= 0
##$DPNAME0= <>
##$DPNAME1= <>
##$DPNAME2= <>
##$DPNAME3= <>
##$DPNAME4= <>
##$DPNAME5= <>
##$DPNAME6= <>
##$DPNAME7= <>
##$DPOAL= (0..7)
0.5 0.5 0.5 0.5 0.5 0.5 0.5 0.5 
##$DPOFFS= (0..7)
0 0 0 0 0 0 0 0 
$$ [...]
##$SUBNAM1= <"">
##$SUBNAM2= <"">
##$SUBNAM3= <"">
##$SUBNAM4= <"">
##$SUBNAM5= <"">
##$SUBNAM6= <"">
##$SUBNAM7= <"">
##$SUBNAM8= <"">
##$SUBNAM9= <"">
##$SW= 501.771253377433
##$SWIBOX= (0..15)
0 1 3 0 0 0 0 0 0 0 0 0 0 0 0 0 
##$SW_h= 40650.406504065
##$TD= 32768
##$TD0= 1
##$TE= 0
##$TE2= 300
##$TE3= 300
##$TEG= 300
##$TL= (0..7)
0 120 53 12 22 120 120 120 
##$TP= (0..7)
150 150 150 150 150 150 150 150 
##$TP07= 0
##$TPNAME0= <>
##$TPNAME1= <>
##$TPNAME2= <>
##$TPNAME3= <>
##$TPNAME4= <>
##$TPNAME5= <>
##$TPNAME6= <>
##$TPNAME7= <>
##$TPOAL= (0..7)
0.5 0.5 0.5 0.5 0.5 0.5 0.5 0.5 
##$TPOFFS= (0..7)
0 0 0 0 0 0 0 0 
##$TUNHIN= 0
##$TUNHOUT= 0
##$TUNXOUT= 0
##$USERA1= <user>
##$USERA2= <user>
##$USERA3= <user>
##$USERA4= <user>
##$USERA5= <user>
##$V9= 5
##$VALIST= <valist>
##$VCLIST= <CCCCCCCCCCCCCCC>
##$VD= 0
##$VDLIST= <DDDDDDDDDDDDDDD>
##$VPLIST= <PPPPPPPPPPPPPPP>
##$VTLIST= <TTTTTTTTTTTTTTT>
##$WBST= 1024
##$WBSW= 4
##$XGAIN= (0..3)
0 0 0 0 
##$XL= 0
##$YL= 0
##$YMAX_a= 24362
##$YMIN_a= -22203
##$ZGOPTNS= <>
##$ZL1= 120
##$ZL2= 120
##$ZL3= 120
##$ZL4= 120
##$ABSF1= 60
##$ABSF2= -190
##$ABSG= 5
##$ABSL= 3
##$ALPHA= 0
##$AQORDER= 0
##$ASSFAC= 0
##$ASSFACI= 0
##$ASSFACX= 0
##$ASSWID= 0
##$AUNMP= <proc_1d>
##$AZFE= 0.1
##$AZFW= 0.5
##$BCFW= 1
##$BC_mod= 2
##$BYTORDP= 1
##$COROFFS= 0
##$CY= 9.86611175537109
##$DATMOD= 1
##$DC= 1
##$DFILT= <>
##$DTYPP= 0
##$F1P= 182.46299112037
##$F2P= -745.623069630181
##$FCOR= 0.5
##$FTSIZE= 0
##$FT_mod= 0
##$GAMMA= 1
##$GB= 0
##$INTBC= 1
##$INTSCL= 1
##$ISEN= 30
##$LB= 1
##$LEV0= 0
##$LPBIN= 0
##$MAXI= 11.51145
##$MC2= 0
##$MEAN= 0
##$ME_mod= 0
##$MI= 1.244541
##$NCOEF= 0
##$NC_proc= 0
##$NLEV= 6
##$NOISF1= 0
##$NOISF2= 0
##$NSP= 1
##$NTH_PI= 0
##$NZP= 1
##$OFFSET= 243.8632
##$PC= 1.4
##$PHC0= -5507.458
##$PHC1= 88.6015
##$PH_mod= 0
##$PKNL= yes
##$PPARMOD= 0
##$PSCAL= 0
##$PSIGN= 0
##$REVERSE= no
##$SF= 81.0140731611343
##$SI= 65536
##$SIGF1= 0
##$SIGF2= 0
##$SINO= 80
##$SIOLD= 65536
##$SREGLST= <31P.CDCl3>
##$SSB= 0
##$STSI= 0
##$STSR= 0
##$SW_p= 25641.0256410257
##$SYMM= 0
##$S_DEV= 0
##$TDeff= 0
##$TDoff= 0
##$TI= <>
##$TILT= no
##$TM1= 0
##$TM2= 0
##$TOPLEV= 0
##$USERP1= <user>
##$USERP2= <user>
##$USERP3= <user>
##$USERP4= <user>
##$USERP5= <user>
##$WDW= 1
##$XDIM= 64
##$YMAX_p= 0
##$YMIN_p= 0
$$ End of Bruker specific parameters
$$ ---------------------------------
##NTUPLES= NMR FID
##VAR_NAME=  TIME,          FID/REAL,        FID/IMAG
##SYMBOL=    X,             R,               I
##VAR_TYPE=  INDEPENDENT,   DEPENDENT,       DEPENDENT
##VAR_FORM=  AFFN,          ASDF,            ASDF
##VAR_DIM=   16384,         16384,           16384
##UNITS=     SECONDS,       ARBITRARY UNITS, ARBITRARY UNITS
##FACTOR=    2.46e-05,      1,               1
##FIRST=     0,             0,               0
##LAST=      0.4030218,     0,               0
##MIN=       0,             -22203,          0
##MAX=       0.4030218,     24362,           0
$$ Real data points
##PAGE= N=1
##DATA TABLE= (X++(R..R)), XYDATA
$$ plain form
0 -1 0 0 7 -8 4 -16 19 -26 35 -42 46 -52 56 -71 82 -97 108 -122 138 -157 174 -207 238 -263 301 -344 402
27 402 -476 569 -697 876 -1184 1845 -10777 5024 -3340 4941 24362 -2542 3875 5349 -11944
42 -11944 4212 8123 -7511 6607 -61 -13120 1731 -5220 -8304 16367 5140 291 14930
55 14930 -8572 -10281 8533 -11366 -1862 13224 -7805 571 5640 -14419 654 3422 -6441
68 -6441 10234 4744 -6360 8206 -4359 -10763 9960 -2936 -5951 14767 -4366 -8895 10354
81 10354 -10639 -3930 10300 -6913 3089 8859 -8695 3585 2153 -10190 7528 3229 -6224
94 -6224 9529 -3584 -11616 4931 -5352 -8381 12831 240 -1315 13336 -4406 -3999 7710
107 7710 -7432 -1061 7273 -8317 1654 2359 -8903 4170 299 -3598 11248 2365 -2273 8021
$$ packed form
0aJ%Pj5J2k0L5m5O1p7Q8r8J08j27J53j79K05k30K60k95L31l81M45n01N64o45P46
27D02q78J045j266J573k060L029j2622J5801q364Q281J9421k6904O417J474j7293
42a1944J6156L911j5634J4118o668j3059J4851o951l084K4671j1227m849J4639
55A4930k3502j709J8814j9899R504J5086k1029Q376N069k0059J5073K768r863
68f441J6675n490j1104J4566j2565o404K0723j2896l015K0718j9133m529J9249
81A0354k0993O709J4230j7213J0002N770j7554J2280j432j2343J7718m299r453
94f224J5753j3113q032J6547j0283l029K1212j2591j555J4651j7742M07J1709
107G710j5142O371Q334j5590R971P05j1262J3073l871l897J4846q883m638J0294
$$ plain form
121 8021 -4472 -9446 4266 -7352 -5995 7599 -5223 -2127 7120 -3792 1685 7891 -1814 7378
135 7378 4360 -7552 3764 -4839 -8711 6305 -1499 -2860 8813 -4220 -3335 7476 -3054 29
149 29 8145 -3864 -651 2974 -7595 595 1698 -5588 5629 1989 -3564 5935 -2096 -6109 7424
164 7424 -2628 -4491 9549 -4410 -1135 5301 -7436 -1213 3956 -5799 885 4141 -5470 1151
178 1151 1450 -5364 4656 2703 -2928 8755 -1272 -4717 6492 -5513 -5322 6875 -6685 -4333
192 -4333 8712 -4145 -157 8889 -2719 5124 4296 -4928 2134 1470 -8443 2908 -572 -4450 6590
207 6590 -216 -2605 8648 -37 -4123 7645 -3212 -3500 5660 -6016 -3517 3693 -6995 431
221 431 2638 -4096 2795 4276 -2809 5056 1836 -3973 3525 -1202 -6286 4331 -3704 -6790 4571
$$ packed form
121H021j2493m974J3712j1618J357J3594j2822L096R247j0912N477O206r705R192
135G378l018j1912J1316q603l872J5016p804j361J1673j3033Q85J0811j0530L083
149B9Q116j2009L213L625j0569Q190J103p286J1217l640n553R499q031m013J3533
164G424j0052j863J4040j3959L275O436j2737O223N169r755O684L256r611O621
178A151K99o814J0020j953n631J1683j0027l445J1209j2005J91J2197j3560K352
192d333J3045j2857L988R046j1608P843q28r224P062o64r913J1351l480l878J1040
207F590o806k389J1253q685m086J1768j0857k88R160j1676K499P210j0688P426
221D31K207o734O891J481p085P865l220n809P498m727n084J0617q035l086J1361
$$ plain form
236 4571 -2797 -2744 6458 -896 421 4353 -2793 -722 2969 -2873 773 -908 -3999 3183 1459 -2511
252 -2511 3222 -369 -3850 4834 -1295 -3501 5627 -692 -829 4842 -2593 -887 3734 -2426 1152
267 1152 704 -3811 966 -2029 -1717 3014 -692 306 5271 -1131 -1936 2338 -5040 -2990 2493 -2423
283 -2423 -1631 1854 -2910 709 2812 -878 4881 2223 -1940 3221 -2833 -5302 1461 -3330 -2020
298 -2020 5520 -2827 -466 3023 -2690 -430 3644 -536 -33 2390 -3395 -740 -123 -2789 3093 469
314 469 -2416 5155 -769 -3231 3426 -3651 -2306 6469 -2143 -1825 3437 -4265 -3661 4009 -2831 103
330 103 6272 -1244 829 1634 -2954 -194 877 -485 2342 586 -2869 2754 -2510 -3625 2664 -1441
346 -1441 -654 4746 -1055 -2865 2645 -1658 -611 3584 1393 1600 943 -3233 -1244 192 -2716 2200
$$ packed form
236D571p368N3R202p354J317L932p146K071L691n842L646j681l091P182j724l970
252b511N733l591l481Q684o129k206R128o319j37N671p435J706M621o160L578
267A152m48m515M777k995L12M731l706R98M965o402q05M274p378K050N483m916
283b423P92L485m764L619K103l690N759k658m163N161o054k469O763m791J310
298b020P540q347K361L489n713K260M074m180N03K423n785K655O17k666N882k624
314D69k885P571n924k462O657p077J345Q775q612L18N262p702O04P670o840K934
330A03O169p516K073Q05m588K760J071j362K827j756l455N623n264j115O289m105
346a441P87N400n801j810N510m303J047M195k191K07o57m176J989J436k908M916
$$ plain form
362 2200 1997 -1785 1621 1896 -2223 3106 -1604 -222 3337 224 -1994 775 -3281 -3047 -557 106
378 106 1526 1439 1497 1347 -2962 -2036 749 -668 242 1698 -231 -2475 361 -3701 -1172 3091 -1067
395 -1067 1678 3113 -790 -1088 -36 -1091 1732 -1359 1155 1841 -1920 -2824 1638 -1653 294 4681
411 4681 -56 950 2490 -2320 -1080 2900 -2128 1658 1456 -2225 1778 -2431 -3461 1318 -378
426 -378 542 4255 -345 -635 1748 -2192 -2083 2702 -395 -125 3813 -3536 -1655 1400 -2126 1001
442 1001 4600 -53 3002 888 -2958 856 -1170 -599 3315 -567 -2481 2679 -1273 -2518 2726
457 2726 2211 178 5323 -358 -1814 1061 -2325 -2624 1438 -454 612 1289 -1579 141 -1621 -113
473 -113 2824 1635 1203 2222 -789 -1170 45 -1847 -461 2788 488 -1401 -66 -2311 -3113 1577
$$ packed form
362B200k03l782L406K75m119N329m710J382L559l113k218K769m056K34K490O63
378A06J420q7N8j50m309R26K785j417R10J456j929k244K836m062K529M263m158
395a067K745J435l903k98J052j055K823l091K514O86l761r04M462l291J947M387
411D681m737J006J540m810J240L980n028L786k02l681M003m209j030M779j696
426c78R20L713m600k90K383l940J09M785l097K70L938p349J881L055l526L127
442A001L599m653L055k114l846L814k026N71L914l882j914N160l952j245N244
457B726n15k033N145n681j456K875l386k99M062j892J066O77k868J720j762J508
473a13K937j189m32J019l011l81J215j892J386L249k300j889J335k245q02M690
$$ plain form
489 1577 246 -62 3031 1000 188 -1595 -1657 380 -631 1184 2309 -904 -812 -67 -779 646 1784
506 1784 286 2449 -986 1643 -1636 -987 24 1309 -394 1970 455 -2245 -523 1496 -1311
521 -1311 771 1209 -1558 766 1575 -2232 -1110 -151 -2782 924 700 -120 741 -1657 1142 985 -708
538 -708 1337 2290 -952 -1536 1083 -3417 -2629 754 -2473 197 3751 -1391 -784 2950 -2652 1223
554 1223 767 -577 2216 -154 -859 202 -383 -2118 2175 142 -774 1571 -1159 -1136 166 -3414 -2519
571 -2519 1468 -1094 -1441 3245 -2532 -1366 2719 -1169 914 1208 781 1053 403 -1412 -95 151 -224
588 -224 405 -904 -2063 1129 -251 -2531 694 993 -1785 665 100 -539 1102 -2280 -720 -294 240
605 240 530 -1814 -632 -1231 -695 63 -276 337 406 92 245 -987 289 -220 -1953 -488 430 148 -426
$$ packed form
489A577j331l08L093k031q12j783o2K037j011J815J125l213R2P45p12J425J138
506A784j498K163l435K629l279O49J011J285j703K364j515k700J722K019k807
521a311K082M38k767K324Q09l807J122R59k631L706k24q20Q61k398K799j57j693
538g08K045R53l242n84K619m500P88L383l227K670L554n142O07L734n602L875
554A223m56j344K793k370p05J061n85j735M293k033r16K345k730K3J302l580Q95
571b519L987k562l47M686n777J166M085l888K083K94m27K72o50j815J317K46l75
588b24O29j309j159L192j380k280L225K99k778K450n65o39J641l382J560M26N34
605B40K90k344J182n99N36P58l39O13O9l14J53j232J276n09j733J465R18k82n74
$$ plain form
624 -426 1899 -535 587 882 -5 -891 1526 1303 -1727 718 -924 -2548 1410 706 -427 354 15
641 15 1697 395 -52 897 1299 550 -571 274 -245 274 -712 -2578 495 2351 -1451 2456 2777 -3174
659 -3174 -1297 426 -799 1767 656 -592 -96 337 -245 1436 3188 1360 1911 -1841 -1989 535
675 535 -1003 -102 3265 -1403 791 2795 -1615 199 931 -1966 393 1247 1346 1059 781 884 1005 -246
693 -246 -563 -294 644 -1069 459 -1791 -1570 1663 -558 -1865 2453 -35 -212 992 -690 -1549 1685
710 1685 -537 -1111 897 1580 135 425 162 99 1036 709 -110 541 -1312 331 -913 -2765 246 525
728 525 -983 1774 -283 -2051 -235 332 938 569 2559 -1302 -1727 -590 -2176 -2421 900 -592 689
745 689 2347 -569 -330 660 1275 819 791 637 400 82 -1244 -977 -725 -701 2122 960 -1127 2028 -551
$$ packed form
624d26K325k434J122K95q87q86K417k23l030K445j642j624L958p04j133P81l39
641A5J682j302m47R49M02p49j121Q45n19N19r86j866L073J856l802L907L21n951
659c174J877J723j225K566j111j248M96M33n82J681J752j828N51l752j48K524
675E35j538R01L367m668K194K004m410J814P32k897K359Q54R9k87k78J03J21j251
693b46l17K69R38j713J528k250K21L233k221j307M318k488j77J204j682q59L234
710A685k222n74K008O83j445K90k63o3R37l27q19O51j853J643j244j852L011K79
728E25j508K757k057j768J816N67O06l69J990l861m25J137j586k45L321j492J281
745F89J658k916K39R90O15m56k8j54k37l18j326K67K52K4K823j162k087L155k579
$$ plain form
764 -551 -3044 756 650 -2132 765 1043 -400 96 -982 -1253 -1025 1044 357 655 852 -677 384
781 384 -936 993 1577 -1259 2568 1288 -1258 -1311 -607 -3732 697 1045 -911 -95 2116 -1428 47
798 47 1226 -1093 1176 1334 471 339 -160 -975 429 -2107 1065 1298 56 1699 519 -306 -845 1728
816 1728 -445 -2244 1512 -184 -1383 419 -789 -76 1705 1342 985 2858 -1908 -1178 416 -346
832 -346 778 -370 -610 597 -1399 -1490 1392 1065 369 2868 1885 -846 886 1031 -2326 -147 384
849 384 -272 -241 -310 -2070 -344 579 -813 -140 2754 -92 -1668 -1044 257 -1356 -310 -471 534 -842
867 -842 -689 -118 -2559 -685 1982 45 208 1660 649 -1382 1849 -1063 -1923 1670 -305 -791 175
884 175 -903 -799 1014 152 1234 960 -532 776 -365 -229 440 -1091 -918 -461 -336 -1568 231
$$ packed form
764e51k493L800j06k782K897K78j443M96j078k71K28K069o87K98J97j529J061
781C84j320J929N84k836L827j280k546n3P04l125M429L48j956Q16K211l544J475
798D7J179k319K269J58q63j32m99q15J404k536L172K33j242J643j180q25n39K573
816A728k173j799L756j696j199J802j208P13J781l63l57J873m766P30J594p62
832c46J124j148k40J207j996r1K882l27o96K499r83k731J732J45l357K179N31
849C84o56L1o9j760J726R23j392O73K894k846j576O24J301j613J046j61J005j376
867h42J53N71k441J874K667j937J63J452j011k031L231k912q60L593j975m86R66
884A75j078J04J813q62J082k74j492J308j141J36O69j531J73M57J25j232J799
$$ plain form
901 231 1218 -1346 2551 1707 -206 -45 778 -1532 -861 305 -622 1460 -589 -200 605 -523 525
918 525 1169 232 1896 1586 -735 -1411 576 -2477 -1878 289 -2830 462 3122 -1855 258 2843 -1193
935 -1193 -11 3279 857 578 147 -12 -1233 1688 293 -446 603 -1368 155 -1585 -1783 1610
951 1610 1444 -456 2329 -754 -2064 -291 -34 -1252 313 -44 -1674 -968 503 -199 -197 649 196 707
969 707 -752 -445 -94 -512 -171 -192 436 84 -58 -2297 576 2756 -580 510 1572 -457 -140 1411
987 1411 -365 -868 325 98 -1600 335 141 -598 649 281 728 -177 -1010 1857 -123 -1026 1526
1004 1526 -840 -987 16 -70 -2593 2860 1131 -1120 1952 450 -1613 1909 78 -1295 518 -1708
1020 -1708 -690 -173 103 -1068 1931 334 -640 1211 916 -694 -185 -1076 -270 1468 -1862 -410 559
$$ packed form
901B31R87k564L897q44j913J61Q23k310O71J166r27K082k049L89Q05j128J048
918E25O44r37J664l10k321o76J987l053N99K167l119L292K660m977K113K585m036
935a193J182L290k422k79m31j59j221K921j395p39J049j971J523j740j98L393
951A610j66j900K785l083j310J773K57j218J565l57j630P06J471p02KQ46m53N11
969G07j459L07L51m18L41k1O28l52j42k239K873K180l336J090J062k029L17J551
987A411j776n03J193k27j698J935j94p39J247l68M47r05q33K867j980r03K552
1004A526k366j47J003q6k523N453j729k251L072j502k063L522j831j373J813k226
1020a708J018N17K76j171K999j597r74J851k95j610N09q91Q06J738l330J452R69
$$ plain form
1037 559 -3427 -976 1417 -1457 1241 519 -2001 901 1115 -35 671 -88 -804 -757 -1123 -2287 191
1054 191 -634 -776 115 -1066 -666 2719 -633 -1367 3463 -676 -1368 -567 -974 -1314 -448 -415 -2244 319
1072 319 1305 -115 1126 302 -884 -232 810 946 1086 -2204 -122 -254 -2094 2474 372 608 1168
1089 1168 2134 -1942 1008 387 -344 605 458 -1732 -390 803 -2264 1404 1855 -841 537 -40 252
1106 252 1527 615 -122 763 909 -188 319 -2172 -1479 1079 367 500 1440 -280 -1143 3056 -937 -699
1124 -699 2070 -798 -1727 1050 -1310 -2079 -5 -860 332 1003 -421 986 908 -857 1487 -434 -1157
1141 -1157 912 2059 -2547 410 878 -2064 -302 429 -2324 -759 1803 59 233 471 -1561 -1524
1157 -1524 867 -818 194 -256 -1807 367 -2136 -28 3133 -221 1062 2145 -1168 -1517 1502
$$ packed form
1037E59l986K451K393k874K698p22k520K902K14j150P06p59p16M7l66j164K478
1054A91q25j42Q91j181M00L385l352p34M830m139o92Q01m07l40Q66L3j829K563
1072C19R86j420J241q24j186O52J042J36J40l290K082j32j840M568k102K36N60
1089A168R66m076K950o21p31R49j47k190J342J193l067L668M51k696J378n77K92
1106B52J275r12p37Q85J46j097N07k491O93K558p12J33R40j720q63M199l993K38
1124f99K769k868r29K777k360p69K074q55J192O71j424J407p8j765K344j921p23
1141a157K069J147m606K957M68k942J762P31k753J565K562j744J74K38k032L7
1157a524K391j685J012m50j551K174k503K108L161l354J283J083l313l49L019
$$ plain form
1172 1502 103 869 710 -897 -913 955 -419 -923 1800 236 -213 841 -768 365 174 -1585 342
1189 342 25 -992 824 1274 -1175 848 -152 -1410 1738 1131 -639 749 669 -959 1344 1376 -1039
1206 -1039 702 1085 -2324 -115 -20 -457 552 222 1422 715 665 -182 -1728 -1414 -883 153 -1526 928
1224 928 1395 -2135 8 1389 -1123 415 1304 -940 337 1113 -1250 -47 489 -1095 812 1058
1240 1058 -391 -803 1435 -2278 -1117 964 -103 979 37 -2375 -2 -1462 -1942 806 862 -1967
1256 -1967 1164 522 -789 -110 -122 -944 2072 901 -336 1584 84 -928 1140 -1225 -1475 1206
1272 1206 -1366 -77 1479 -2587 670 404 -1625 -361 369 -1274 126 -242 -1420 -689 628 -1710
1288 -1710 593 1996 -1376 -85 650 -1177 111 47 -173 700 -313 -636 295 347 1464 501 534 -1010
$$ packed form
1172A502j399P66j59j607j6J868j374n04K723j564m49J054j609J133j91j759J927
1189C42l17j017J816M50k449K023j000j258L148o07j770J388q0j628K303L2k415
1206a039J741L83l409K209R5m37J009l30J200p07n0q47j546L14N31J036j679K454
1224I28M67l530K143J381k512J538Q89k244J277P76k363J203N36j584J907K46
1240A058j449m12K238l713J161K081j067J082r42k412K373j460m80K748N6k829
1256a967L131o42j311O79j2q22L016j171j237J920j500j012K068k365k50K681
1272A206k572J289J556m066L257k66k029J264P30j643J400l68j178P31J317k338
1288a710K303J403l372J291P35j827J288o4k20Q73j013l23R31N2J117r63L3j544
$$ plain form
1306 -1010 168 828 -1935 -302 681 -1844 1964 -167 -2803 607 -1721 -1558 874 -789 -189 566
1322 566 566 -571 -41 -799 401 1956 790 -883 451 -401 -7 619 -1841 1144 613 -2308 977
1339 977 1118 1013 -72 1629 -619 -1393 395 -423 123 498 -1332 -439 535 -48 686 1597 -1576 461
1357 461 -753 -445 2223 -470 -888 -179 -203 -755 839 467 -369 904 2500 -1479 853 458 -1038
1374 -1038 2377 -654 -599 1034 353 -1344 307 -725 -517 20 -927 1526 -572 -661 -226 -294 -1467 -114
1392 -114 128 -462 -364 371 -1393 1351 2447 -968 779 -226 -801 180 111 290 366 391 -1805 -1015 -414
1411 -414 -308 673 343 -571 1394 -120 -251 1450 -1461 -1152 1275 -932 -539 902 -462 -356 538
1428 538 315 -909 -366 588 -419 2056 -98 -877 411 -777 -430 254 44 1689 284 -1068 274
$$ packed form
1306a010J178O60k763J633R83k525L808k131k636L410k328J63K432j663O00P55
1322E66%j137N30p58J200J555j166j673J334q52L94O26k460K985n31k921L285
1339I77J41j05j085J701k248p74J788q18N46L75j830Q93R74n83P34R11l173K037
1357D61j214L08K668k693m18P09k4n52J594l72q36J273J596l979K332l95j496
1374a038L415l031N5J633o81j697J651j032K08N37r47K453k098q9M35o8j173J353
1392a14K42n90R8P35j764K744J096l415J747j005n75R81o9J79P6K5k196P90O01
1411d14J06R81l30r14J965j514j31J701k911L09K427k207L93J441j364J06Q94
1428E38k23j224N43R54j007K475k154p79J288j188L47O84k10J645j405j352J342
$$ plain form
1445 274 168 -300 1224 694 260 411 -204 -40 228 1187 -1071 -599 966 -866 53 15 -1729 919
1463 919 -446 348 1090 -716 74 -382 -416 130 51 -1607 -1641 45 -1665 332 -240 568 -1816 1191
1481 1191 -2029 -897 729 830 -604 510 -23 -11 -156 -1138 569 1149 -67 1568 8 -1584 1117
1498 1117 1408 -919 1255 1155 -2846 998 -338 -3197 1411 -133 -764 849 409 -1636 226 840
1514 840 -344 -192 -65 575 1543 -25 190 1210 -57 246 1219 -939 -174 1261 -2411 -427 1115
1531 1115 -1616 -883 942 118 234 28 -682 -274 783 -326 -439 824 -2024 -19 520 -51 138
1548 138 -795 -253 170 -152 -50 631 -246 -946 440 1373 -1249 55 1930 -2138 344 -126 -1131 578
1566 578 -453 -638 -180 535 -642 1587 -441 -678 990 -1127 -474 60 187 -1793 1220 -1210 80
$$ packed form
1445B74j06m68J524n30m34J51o15J64K68R59k258M72J565j832R19l8j744K648
1463I19j365P94P42j806P90m56l4N46p9j658l4J686j710J997n72Q08k384L007
1481A191l220J132J626J01j434J114n33J2j45r82J707N80j216J635j560j592K701
1498A117K91k327K174j00m001L844j336k859M608j544o31J613m40k045J862O14
1514H40j184J52J27O40R68j568K15J020j267L03R73k158P65J435l672J984J542
1531A115k731P33J825q24J16k06p10M08J057j109j13J263k848K005N39n71J89
1548A38r33N42M23l22J02O81q77p00J386R33k622J304J875m068K482m70j005J709
1566E78j031j85M58P15j177K229k028k37J668k117O53N34J27j980L013k430J290
$$ plain form
1583 80 1640 -28 -474 921 -2182 1068 1895 -1613 1283 609 -1000 -669 1106 -801 -299 753 1287
1600 1287 -657 123 167 -201 754 196 1506 -1264 -2343 592 -561 983 1764 -676 -501 455 -587
1617 -587 265 1780 -495 -51 908 1254 -968 438 -1006 -447 509 176 1223 95 722 -445 1055
1634 1055 -1370 1932 653 -1290 329 247 -324 840 100 -232 -760 972 -1399 -273 1538 -724
1650 -724 1022 404 -893 -305 238 -1040 2590 189 -987 443 -1246 612 908 233 -1508 1583
1666 1583 294 -451 179 -59 -1324 1189 -883 -902 1325 -580 -1030 555 -645 271 1111 -538 -65
1683 -65 -110 -77 245 1149 -1927 -633 1309 -328 2615 1339 -1419 803 992 -1351 1718 702 -702
1700 -702 1352 900 -949 -958 687 -297 -1183 710 -2324 773 1190 349 665 768 -973 777 -1096 -1287
$$ packed form
1583H0J560j668m46J395l103L250Q27l508K896o74j609L31J775j907N02J052N34
1600A287j944P80M4l68R55n58J310k770j079K935j153J544P81k440J75R56j042
1617e87Q52J515k275M44R59L46k222J406j444N59R56l33J047j128O27j167J500
1634A055k425L302j279j943J619q2n71J164p40l32n28J732k371J126J811k262
1650g24J746o18j297N88N43j278L630k401j176J430j689J858K96o75j741L091
1666A583j289p45O30k38j265K513k072j9K227j905m50J585j200R16Q40j649M73
1683f5m5L3L22R04l076J294J942j637K943j276k758K222J89k343L069j016j404
1700g02K054m52j849rJ645r84q86J893l034L097M17q41L16J03j741J750j873j91
$$ plain form
1718 -1287 1912 252 763 1576 -938 1045 1607 -639 -1639 2024 -1044 -1534 1783 170 -909 2046
1734 2046 -1932 -156 488 -901 82 1604 -695 463 -661 -2166 1662 -456 -940 45 -482 -318
1750 -318 1038 758 -1210 571 1696 -252 1545 -257 -1417 557 406 811 1384 -103 281 -365 322
1767 322 641 1194 594 -284 1755 318 -289 125 -976 -108 1839 -1104 -386 861 -1363 -1249 816
1784 816 -847 -1679 651 613 -689 412 -508 -682 -49 674 -749 621 -671 821 -877 -1074 1797
1801 1797 976 -481 294 1319 -445 22 -79 -1240 902 862 -50 1 153 -36 622 -691 -1594 918
1819 918 -257 -813 179 -719 1557 -262 -1013 933 511 -814 550 1036 -1194 -71 1096 -539 -261
1836 -261 1162 756 192 115 -2305 194 930 -557 568 -1061 -1720 -254 -660 -759 958 472 -1624 -357
$$ packed form
1718a287L199j660N11Q13k514J983N62k246j000L663l068m90L317j613j079K955
1734B046l978J776O44j389R83J522k299J158j124j505L828k118m84R85n27J64
1750c18J356k80j968J781J125j948J797j802j160J974j51M05N73j487L84o46O87
1767C22L19N53o00q78K039j437o07M14j101Q68J947k943P18J247k224J14K065
1784H16j663q32K330l8j302J101r20j74O33P23j423J370j292J492j698j97K871
1801A797q21j457P75J025j764M67j01j161K142m0r12N1J52j89O58j313r03K512
1819I18j175n56R92q98K276j819p51J946m22j325J364M86k230J123J167j635K78
1836b61J423m06n64p7k420K499P36j487J125j629o59J466m06r9J717m86k096J267
$$ plain form
1854 -357 245 89 -512 246 -1686 1203 188 -207 -156 1500 -97 1954 -517 78 167 -901 -938 835
1872 835 -2098 -690 770 97 319 551 402 -1312 1028 -1855 163 1374 -548 442 960 -196 -83
1889 -83 2269 -1557 1066 1313 -544 249 780 -1081 1132 148 -2458 122 1245 -1203 760 579 -1170
1906 -1170 669 259 218 1905 332 -1221 115 412 -540 685 164 -758 2060 888 -538 1596 3
1923 3 -1190 153 -505 647 1112 -769 -382 1215 -1708 197 -310 -1222 -560 -1121 -836 843 225 319
1941 319 225 -8 -743 -92 882 -771 555 -31 -1130 -65 32 -1023 565 1821 -349 -143 -193 195
1959 195 407 -1286 -1174 47 -300 -1176 1298 92 -155 384 -1731 -159 1283 -640 -191 793 -297
1976 -297 -1889 1448 -145 -424 670 -249 -253 1146 398 -394 410 -1040 -650 101 -888 34 -158 -1855
$$ packed form
1854c57O02j56o01P58j932K889j015l95N1J656j597K051k471N95Q9j068l7J773
1872H35k933J408J460o73K22K32j49j714K340k883K018J211j922R90N18j156J13
1889h3K352l826K623K47j857P93N31j861K213r84k606K580J123k448J963j81j749
1906a170J839m10m1J687j573j553J336K97r52J225n21r22K818j172j426K134j593
1923Cj193J343o58J152M65j881L87J597k923J905n07r12O62n61K85J679o18R4
1941C19r4k33p35O51R74j653J326n86j099J065R7j055J588J256k170K06n0L88
1959A95K12j693J12J221l47q76K474j206k47N39k115J572J442j923M49R84j090
1976b97j592L337j593k79J094r19mJ399p48p92Q04j450L90P51r89R22j92j697
$$ plain form
1994 -1855 469 615 -1234 928 311 66 568 1698 -466 443 602 -770 1326 -368 -1478 1113
2010 1113 -1284 1483 2389 -270 -933 1562 -100 695 5 -481 -373 9 -1176 -516 1429 -1147 -154
2027 -154 1279 -2018 77 962 -1167 -449 1635 -603 -190 1615 658 -170 431 -1699 -672 246 -381
2044 -381 975 421 -101 697 321 -1129 251 -723 -1599 783 455 -3250 477 -380 -475 1086 516 264
2062 264 135 318 -828 1317 -1902 -236 477 -1159 78 910 654 -1757 1071 -476 -619 1083 -338
2079 -338 161 1702 -2254 -759 132 -193 -360 -132 254 567 863 -1866 -89 -508 -24 367 1410 609
2097 609 954 -19 -623 271 -443 -120 1104 -26 -804 728 -607 -1061 1198 -530 -1235 979 644 -1763
2115 -1763 1209 -811 -937 473 -409 1543 2509 -294 418 985 -808 -190 181 -974 221 2089 -799
$$ packed form
1994a855K324J46j849K162o17k45N02J130k164R09J59j372K096j694j110K591
2010A113k397K767R06k659o63K495j662P95o90m86J08L82j185O60J945k576R93
2027a54J433l297K095Q85k129P18K084k238M13J805r57q28O01k130J027R18o27
2044c81J356n54n22P98l76j450J380r74q76K382l28l705L727q57r5J561n70k52
2062B64j29J83j146K145l219J666P13j636J237Q32k56k411K828j547j43J702j421
2079c38M99J541l956J495Q91l25j67K28L86L13K96k729J777m19M84L91J043q01
2097F09L45r73o04Q94p14L23J224j130p78J532j335m54K259j728p05K214l35k407
2115a763K972k020j26J410q82J952R66k803P12N67j793O18L71j155J195J868k888
$$ plain form
2132 -799 -797 1610 -974 1035 442 -1073 1014 1425 -1892 398 565 -354 -360 1144 -650 -549 658 59
2150 59 -725 -39 -219 583 1489 -291 779 695 -2212 716 3 -1170 1828 -9 -921 867 -749 -360
2168 -360 1060 1023 56 69 -268 -108 91 1374 389 869 349 -429 778 -2496 -317 295 223 462 908
2187 908 -1690 -441 300 -1190 -485 778 -639 -72 358 -767 192 1221 716 -245 2497 -1371 1440
2204 1440 1076 -1558 2198 1186 -573 451 -767 -784 -1228 81 -179 1449 -758 358 230 -152 171
2221 171 483 501 -723 232 366 738 587 -1761 -103 956 -292 893 1194 -784 -636 1636 -1254
2238 -1254 412 739 -1076 987 796 -1557 1411 559 -1921 1943 1663 -1270 1908 255 -964 -392
2254 -392 1029 -315 -211 -150 -341 1166 -342 -1327 1688 -1472 -11 2557 573 63 1094 -1936 107
$$ packed form
2132g99KK407k584K009n93j515K087M11l317K290J67r19oJ504j794J01J207n99
2150E9p84O86j80Q02R06j780J070q4k907K928p13j173K998j837r12J788j616L89
2168c60J420l7r67J3l37J60J99J283r85M80n20p78J207l274K179O12p2K39M46
2187I08k598J249P41j490P05J263j417N67M30j125R59J029n05r61K742l868K811
2204A440l64k634L756j012j759J024j218j7m44J309k60J628k207J116j28l82L23
2221A71L12J8j224R55J34L72j51k348J658J059j248J185L01j978J48K272k890
2238a254J666L27j815K063j91k353K968q52k480L864k80k933L178j653j219N72
2254c92J421j344J04O1j91J507j508r85L015l160J461K568j984n10J031l030K043
$$ plain form
2271 107 1487 -192 -1152 1034 210 172 2241 856 -508 1122 284 -497 960 -267 504 1485 -468
2288 -468 145 30 -844 188 993 -1476 -305 527 1131 838 160 -1394 -1568 1094 33 976 1743 -599
2306 -599 727 -227 -790 71 -367 -476 988 735 -1228 860 536 -18 -285 -314 -614 644 1479 -297
2324 -297 -284 -1041 397 2348 -863 467 2694 -1390 -404 -221 -1595 -151 1818 99 -559 1430 -866
2341 -866 39 -338 -858 904 -23 -1099 -439 1573 -1070 2423 -276 -1012 479 47 -389 -553 -158 -710
2359 -710 -25 -414 -11 951 -462 -1363 1562 71 -142 1308 -891 -155 834 -550 1418 1832 -839
2376 -839 1148 531 -1347 678 685 -1667 -351 1458 -105 -549 989 211 205 234 -906 -1240 125 -311
2394 -311 -784 281 -1004 -226 629 178 125 472 -816 70 -674 -1026 -169 1170 -968 1259 -982 -2553
$$ packed form
2271A07J380j679r60K186q24l8K069j385j364J630q38p81J457j227P71R81j953
2288d68O13j15q74J032Q05k469J171Q32O04k93o78j554j74K662j061R43P67k342
2306e99J326r54n63Q61m38j09J464k53j963K088l24n54k67k9l00J258Q35j776
2324b97J3p57J438J951l211J330K227m084R86J83j374J444J969j719o58J989k296
2341h66R05l77n20J762r27j076O60K012k643L493k699p36J491m32m36j64L95n52
2359g10O85l89M03R62j413r01K925j491k13J450k199P36R89j384J968M14k671
2376h39J987o17j878K025Pk352J316J809j563m44J538p78oK9j140l34J365m36
2394c11m73J065j285P78Q55m51n3L47j288Q86p44l52Q57J339k138K227k241j571
$$ plain form
2412 -2553 1798 -632 -782 1284 555 -1038 2389 -465 167 869 -503 -656 1629 112 -805 1890
2428 1890 286 212 463 -1408 -518 808 -901 1130 1722 -2319 992 446 -1671 404 649 -1651 -83
2445 -83 291 -1452 236 307 -1329 990 620 -809 106 -713 -968 -1438 -1178 -529 1145 188 -823 1331
2463 1331 460 -1920 1610 -286 -459 1162 554 -399 -451 52 -478 902 51 -1370 201 673 644 -244
2481 -244 -1819 1322 1036 -844 -878 -74 -1078 -661 1351 -18 -221 2101 -1738 2845 1156 -1646 1309
2498 1309 18 410 -131 659 -1102 1245 218 -593 1917 1 -75 -41 1100 -422 1442 -567 -630
2515 -630 1251 -779 -643 2135 784 -997 1298 -943 571 1672 281 -453 1516 -954 -1756 1597
2531 1597 -1401 -1232 492 457 515 303 -512 -619 477 -1356 -284 809 -1759 828 -1125 -1170 164
$$ packed form
2412b553M351k430j50K066p29j593L427k854O32P02j372j53K285j517r17K695
2428A890j604p4K51j871Q90J326j709K031N92m041L311n46k117K075K45k300J568
2445h3L74j743J688P1j636K319l70j429R15q19k55m70K60O49J674r57j011K154
2463A331q71k380L530j896j73J621o08r53n2N03n30J380q51j421J571M72k9q88
2481b44j575L141k86j880l4Q04j004M17K012j369k03K322l839M583j689k802K955
2498A309j291L92n41P90j761K347j027q11K510j916p6L4J141j522J864k009o3
2515f30J881k030J36K778j351j781K295k241J514J101j391p34J969k470q02L353
2531A597k998J69J724l5N8k12q15j07J096j833J072J093k568K587j953m5J334
$$ plain form
2548 164 449 -1764 906 874 -1355 1539 128 -1836 523 753 -1265 1685 214 -459 1340 936 176
2565 176 638 -1241 316 405 -778 353 218 -103 -649 372 -1134 285 3442 -936 -1034 795 -978
2582 -978 -287 1170 -537 377 920 -1142 -254 1926 -1273 207 -66 530 105 496 -1135 354 740
2599 740 -979 336 948 -1736 92 -303 -62 700 -545 -337 2083 607 -1235 260 -447 -745 265
2616 265 261 -218 768 626 -1337 1704 -1510 -1484 419 289 -108 2949 -402 -1407 911 -1101 -105 2257
2634 2257 -406 788 1396 -1334 2160 1496 -1252 -140 496 -595 881 629 -991 74 -253 418
2650 418 2111 -274 -1717 -298 520 -958 1983 -579 -1436 529 543 -425 931 408 -181 1367 -1451
2667 -1451 172 -198 -274 -118 1496 -477 -281 1042 -1137 -443 330 -785 -316 -441 329 314 149 -1278
$$ packed form
2548A64K85k213K670l2k229K894j411j964K359K30k018K950j471o73J799m04p60
2565A76M62j879J557Q9j183J131j35l21n46J021j506J419L157m378r8J829j773
2582i78O91J457j707R14N43k062Q88K180l199J480k73N96m25L91j631J489L86
2599G40j719J315O12k684J828l95K41P62j245K08K420j476j842J495p07k98J010
2616B65mm79R86j42j963L041l214K6J903j30l97L057l351j005K318k012R96K362
2634B257k663J194O08k730L494o64k748J112O36j091J476k52j620J065l27O71
2650D18J693k385j443J419Q18j478K941k562q57J965J4r68J356n23n89J548k818
2667a451J623l70p6J56J614j973J96J323k179O94P73j115M69j25P70j5j65j427
$$ plain form
2685 -1278 1032 880 -1657 439 1477 -1628 1034 986 205 1019 -398 -750 -82 -177 -2373 1296 1649
2702 1649 -1149 1764 361 -1196 615 240 -1148 832 -1484 -243 1117 839 -643 982 -1395
2717 -1395 -725 578 -1089 15 890 220 -1233 1590 -217 -1773 1478 343 374 1368 -433 -680 737
2734 737 402 -310 1938 -69 320 610 -948 672 378 -125 595 57 142 -879 1578 -1939 -1141 707
2752 707 -903 1665 1486 995 -68 -190 -916 1491 -1833 -1257 196 -15 -618 746 -730 -1361 1398
2769 1398 -340 -769 757 43 -1104 1662 -1054 -1481 661 -952 -128 1950 -1243 -312 -130 -182 -111
2786 -111 540 -1859 -509 -134 -192 -1081 -30 -1536 -604 1794 -2737 869 2079 -671 1403 1346 1171
2803 1171 1339 451 -1167 1830 1014 -956 69 366 -594 1280 -23 -813 466 6 -458 112 777
$$ packed form
2685a278K310j52k537K096J038l105K662m8p81Q14j417l52O68r5k196L669L53
2702A649k798K913j403j557J811l75j388J980k316J241J360k78j482J625k377
2717a395O70J303j667J104Q75o70j453K823j807j556L251j135L1R94j801k47J417
2734G37l35p12K248k007L89K90j558J620k94n03P20n38Q5j021K457l517P98J848
2752G07j610K568j79m91j063j22p26K407l324N76J453k11o03J364j476o31K759
2769A398j738m29J526p14j147K766k716m27K142j613Q24K078l193R31J82n2P1
2786a11O51k399J350L75n8q89J051j506R32K398m531L606J210k750K074n7j75
2803A171J68q88j618K997q16j970J025K97r60J874j303p90J279m60m64N70O65
$$ plain form
2820 777 -835 1570 -502 -779 482 -1174 -1261 615 6 -151 1118 167 -164 3013 320 308 -84 -2552
2838 -2552 650 1417 -839 508 665 58 1072 924 -937 -727 865 -545 838 862 -761 314 252
2855 252 -1591 1355 348 -369 1928 -1027 508 1267 -650 -232 1581 -1237 -749 863 -260 -1350
2871 -1350 964 272 -1213 1714 -1356 42 633 -1314 -572 1187 -1217 849 -130 -74 -114 805 -1338
2888 -1338 1958 1403 -1324 588 210 -1338 1777 462 -1035 788 91 -2141 1120 -938 -1167 1519
2904 1519 389 -1901 1075 -412 -1149 1341 587 -116 1353 -450 -1005 511 222 -616 493 -1133
2920 -1133 -1758 162 -1013 -669 807 305 -870 711 -322 -726 -699 -904 71 660 -1897 -2318 58
2937 58 -139 -923 875 -106 -445 1575 -1257 883 1344 -546 1485 281 -536 250 -1750 -1471 -145
$$ packed form
2820G77j612K405k072k77J261j656q7J876o09j57J269r51l31L177k693j2l92k468
2838b552L202P67k256J347J57o07J014j48j861K10J592j410J383K4j623J075o2
2855B52j843K946j007p17K297k955J535P59j917M18J813k818M88J612j123j090
2871a350K314o92j485K927l070J398N91j947P42J759k404K066r79N6m0R19k143
2888a338L296n55k727J912l78j548L115j315j497J823o97k232L261k058k29K686
2904A519j130k290K976j487p37K490p54p03J469j803n55J516k89q38J109j626
2920a133o25J920j175L44J476n02j175J581j033m04K7k05R75N89k557m21K376
2937E8j97p84J798r81l39K020k832K140M61j890K031j204q17P86k000K79J326
$$ plain form
2954 -145 965 451 383 706 -263 1079 -51 -1069 1367 -492 -604 2545 433 -583 39 19 -110 2096
2972 2096 -1145 288 1366 -638 -422 -746 54 374 238 -1097 -780 1406 -530 641 983 -619 -975
2989 -975 1305 -571 440 1007 -1504 509 1745 -119 163 1875 -1485 149 356 -1203 1150 197
3005 197 622 -281 -727 -1206 1261 -224 -2334 1902 -269 -447 1460 391 -1501 1028 -184 -993 886
3022 886 -175 -1409 391 63 -904 1245 359 660 1212 -1287 -255 263 -1208 -428 218 -1076 -265
3039 -265 2165 -961 1506 148 -1021 56 -319 228 1449 -46 -5 1851 851 -1561 167 -127
3055 -127 -1106 171 688 -484 1368 946 -2709 442 373 -911 404 -810 -288 1258 -176 -629 895
3072 895 -99 75 771 -459 -366 442 -558 513 300 -452 -1128 1099 -212 956 1100 -924 -1318 1281
$$ packed form
2954a45J110n14o8L23r69J342j130j018K436j859j12L149k112j016O22k0j29K206
2972B096l241J433J078k004K16l24Q00L20j36j335L17K186j936J171L42j602l56
2989i75K280j876J011N67k511K013J236j864K82J712l360J634K07j559K353r53
3005A97M25r03m46m79K467j485k110M236k171j78J907j069j892K529j212q09J879
3022H86j061j234J800l28r67K149q86L01N52k499J032N18j471P80O46j294Q11
3039b65K430l126K467j358j169J077l75N47J221j495M1J856j000k412J728k94
3055a27r79J277N17j172J852m22l655L151o9j284J315j214N22J546j434m53J524
3072H95r94J74O96j230R3Q08j000J071k13p52o76K227j311J168J44k024l94K599
$$ plain form
3090 1281 -1382 -2297 517 -34 514 1081 -871 -290 857 -478 644 465 -358 -999 996 -691 1670
3107 1670 136 -1763 518 -320 -83 757 -1307 -695 976 -2321 459 574 -1290 -188 682 -653
3123 -653 1772 1291 -383 -333 1593 -469 -110 951 -1816 828 -378 573 526 1168 -880 -257 658 -1012
3141 -1012 1832 -348 -1304 159 -290 -809 1491 2224 -1335 431 192 -1470 1417 237 -15 467 1912
3158 1912 230 1426 -871 -1664 5 -80 933 185 332 190 374 -841 -299 -133 53 170 1586 -1287
3176 -1287 -1266 2109 -1151 659 1945 670 -1424 1761 296 -361 946 -1027 -247 470 -1158 -492
3192 -492 2639 237 -325 205 1221 61 1590 -2631 -221 916 -1398 1857 -1035 -578 -40 232
3208 232 246 1360 -1094 -1279 637 -140 -683 437 -1080 -1268 252 1665 240 1819 -2333 735 448
$$ packed form
3090A281k663r15K814n51N48N67j952N81J147j335J122j79q23o41J995j687K361
3107A670j534j899K281q38K37Q40k064O12J671l297K780J15j864J102Q70j335
3123f53K425m81j674N0J926k062L59J061k767K644j206R51m7O42k048O23R15j670
3141a012K844k180r56J463m49n19K300P33l559J766k39j662K887j180k52M82J445
3158A912j682J196k297p93J669q5J013p48J47j42J84j215N42J66J86J17J416k873
3176a287K1L375l260J810J286j275k094L185j465o57J307j973P80P17j628O66
3192d92L131k402n62N30J016j160J529m221K410J137k314L255k892M57N38K72
3208B32J4J114k454j85J916p77n43J120j517j88J520J413j425J579m152L068k87
$$ plain form
3225 448 -341 -1130 523 -407 980 348 -378 -225 315 -1589 -1158 2600 -1488 -1155 818 -734 -199 398
3243 398 -1516 1697 1444 -1336 1059 351 -832 -102 117 611 1725 243 -368 -457 -890 -517 18 -538
3261 -538 -586 516 -1466 -637 619 -282 208 1260 556 -1697 1313 -28 172 1167 138 -978 281
3278 281 -362 -457 2375 -159 446 529 -2727 241 329 -1475 1262 873 -2099 392 1214 -755 224 256
3296 256 -99 1328 839 -821 -475 547 -190 1080 519 -326 498 495 -1477 485 -451 -911 1343 513
3314 513 -215 69 -683 613 533 -1108 -1383 -842 991 -1087 1648 -527 -1672 149 651 -248 1677
3331 1677 -654 -1414 1122 -474 377 160 -1020 -469 1580 -2070 481 -659 -2075 585 435 -1055
3347 -1055 1378 320 -623 1403 986 -1546 143 1238 191 1521 -327 -1312 -383 1024 -1969 2636
$$ packed form
3225D48p89p89J653r30J387o32p26J53N40j904M31L758m088L33J973j552N35N97
3243C98j914L213k53k780K395p08j183P30K19M94J114j482o11q9m33L73N35n56
3261e38m8J102j982Q29J256r01M90J052p04k253L010j341K00R95j029j116J259
3278B81o43r5K832k534O05Q3l256K968Q8j804K737l89k972K491Q22j969R79L2
3296B56l55J427m89j660L46J022p37J270n61q45Q24lj972J962r36m60K254q30
3314E13p28K84p52J296q0j641k75N41J833k078K735k175j145J821N02q99J925
3331A677k331p60K536j596Q51k17j180N51K049l650K551j140j416K660j50j490
3347a055K433j058r43K026m17k532J689J095j047J330j848r85R29J407k993M605
$$ plain form
3363 2636 958 -708 67 -562 -1199 1358 465 1601 1477 -1580 -1019 723 -770 -845 1559 -967 248
3380 248 640 50 -429 1134 -697 -713 -374 -690 -652 1866 -62 1051 1501 -2146 912 215 -427 1590
3398 1590 357 746 1312 646 -815 232 521 -1510 -374 1864 -607 1712 1366 -1552 1097 405
3414 405 -1165 -697 377 -461 1139 -1462 -108 1437 -247 -1105 2279 -1195 -294 488 -679 -989 225
3431 225 414 869 1454 -348 1019 1031 -670 -205 1617 -946 -391 17 -241 96 1735 -954 838 1534
3449 1534 -420 1419 -238 317 1067 427 -865 -112 1039 -716 367 685 -1151 1346 180 -460
3465 -460 717 -332 370 1394 280 472 161 554 -145 1049 802 -975 1646 -233 -255 888 495
3482 495 188 2040 -413 790 938 -2067 -96 844 -689 -416 -63 -999 1253 -185 802 576 1839
$$ packed form
3363B636j678j666P75o29o37K557q93J136j24l057N61J742j493p5K404k526J215
3380B48L92n90m79J563j831j6L39l16L8K518j928J113M50l647L058o97o42K017
3398A590j233L89N66o66j461J047K89k031J136K238k471K319l46k918K649o92
3414D05j570M68J074q38J600k601J354J545j684q58L384l474R01P82j167l10J214
3431B25J89M55N85j802J367J2j701M65J822k563N55M08k58L37J639k689J792O96
3449A534j954J839j657N55P50o40j292P53J151j755J083L18j836K497j166o40
3465d60J177j049P02J024j114J92l11L93o99J194k47j777K621j879k2J143l93
3482D95l07J852k453J203J48l005J971R40j533K73L53r36K252j438R87k26J263
$$ plain form
3499 1839 -1455 -318 502 -186 -157 184 -1267 -658 -58 -354 1512 -651 147 1395 105 -998 2370
3516 2370 -227 -151 1568 -1647 43 1212 -936 -137 -310 265 -19 779 1428 -367 1417 -492 -338
3533 -338 953 -1132 -85 1493 -1343 -286 1275 -108 409 1515 -1716 -132 -63 -1858 -176 1170
3549 1170 -601 62 14 -2291 2109 138 -335 268 -1391 164 1193 -1267 -928 797 -465 -864 964
3566 964 333 -1613 252 -1173 -525 1421 -982 -1289 115 -1074 -504 872 -738 616 752 -463
3582 -463 101 1283 -1583 -158 -445 -781 -1417 171 -903 552 422 -2033 84 728 -30 -108 392 -1283
3600 -1283 438 1527 -867 9 306 -1042 1022 -105 75 -369 1206 -2076 107 514 -2892 -942
3616 -942 353 -1371 1051 506 -1739 807 -846 -194 290 -1026 647 884 -304 -924 1584 -149
$$ packed form
3499A839l294J137Q20o88K9L41j451O09O00k96J866k163P98J248j290j103L368
3516B370k597P6J719l215J690J169k148P99j73N75k84P98O49j795J784j909J54
3533c38J291k085J047J578k836J057J561j383N17J106l231J584O9j795J682J346
3549A170j771O63m8k305M400j971m73O03j659J555J029k460L39J725j262l99J828
3566I64o31j946J865j425O48J946k403l07J404j189N70J376j610J354J36j215
3582d63N64J182k866J425k87l36o36J588j074J455j30k455K117O44p58p8N00j675
3600a283J721J089k394Q76K97j348K064j127J80m44J575l282K183M07l406J950
3616i42J295j724K422n45k245K546j653O52M84j316J673K37j188o20K508j733
$$ plain form
3632 -149 -185 538 -791 73 562 -748 -819 1141 -2545 349 320 -1464 680 -703 -1361 1279 968 -1450
3650 -1450 147 -545 -698 -51 778 -1005 619 1821 -323 1129 -408 -970 -782 1027 133 782 456
3667 456 -2474 1201 -368 -1448 851 -629 -1107 1404 -734 10 307 -1270 1343 1069 -1596 -512
3683 -512 1989 -1429 -404 1418 -774 1224 1504 -2157 -647 642 873 -612 529 -773 -104 467
3699 467 -844 1492 183 -1440 -656 759 -71 1029 465 -444 856 56 -696 2170 -500 -948 133
3716 133 -23 -631 1265 284 -2072 179 -1167 -405 2521 -836 -1264 804 436 -300 633 -1640 49
3733 49 676 99 -811 1571 -1479 383 841 -2398 63 -418 -613 1 658 -1177 270 1186 -853 329
3751 329 -105 -2087 1059 895 -497 658 -512 -705 303 554 -1234 242 1019 -2613 1003 -214
$$ packed form
3632a49l6P23j329Q64M89j310p1J960l686K894k9j784K144j383o58K640l11k418
3650a450J597o92j53O47Q29j783J624J202k144J452j537n62J88J809q94O49l26
3667D56k930L675j569j080K299j480m78K511k138P44K97j577K613k74k665J084
3683e12K501l418J025J822k192J998K80l661J510J289K31j485J141j302O69N71
3699D67j311K336j309j623P84J415q30J100n64r09J300q00p52K866k670m48J081
3716A33j56o08J896r81k356K251j346P62K926l357m28K068l68p36R33k273J689
3733D9O27n77r10K382l050J862M58l239K461m81j95O14O57j835J447R16k039J182
3751C29m34j982L146j64j392J155j170j93J008K51j788J476P77l632L616j217
$$ plain form
3767 -214 -1301 1644 -304 -358 1195 -1582 -242 1117 -772 -451 152 568 -168 384 418 393 1250 -1182
3785 -1182 -744 2700 364 -852 257 -705 -48 267 -1100 -59 866 -203 1692 1345 -1440 -1356 251
3802 251 -177 610 5 -2014 1042 -47 -1448 -552 234 -1558 -442 -240 -538 1218 -826 24 731
3819 731 -1060 -1466 2379 -472 933 235 334 1666 1391 509 1111 1379 -1619 715 -167 -1570 -1271 1873
3837 1873 -1991 742 1188 -2387 -826 2038 -471 -235 1419 -1304 -701 -437 -664 145 -118 -1574 1259
3854 1259 -237 -2178 1379 698 -78 1106 -935 -1544 1677 -2013 -498 1510 1302 -946 1339 -309
3870 -309 -1355 77 -313 -116 -834 -645 -66 562 -479 -1503 1408 186 -252 397 161 -78 -42 -729
3888 -729 -255 1368 -746 -221 1501 -113 1027 2043 -1406 75 1302 -1353 607 419 -345 -984
$$ packed form
3767b14j087K945j948n4J553k777J340J359j889L21O03M16p36N52L4k5Q57k432
3785a182M38L444k336j216J109r62O57L15j367J041R25j069J895l47k785Q4J607
3802B51m28P87o05k019L056j089j401Q96P86j792J116K02k98J756k044Q50P07
3819G31j791m06L845k851J405o98R9J332k75q82O02K68k998K334q82j403K99L144
3837A873l864K733M46l575J561K864k509K36J654k723O03K64k27Q09k63j456K833
3854A259j496j941L557o81p76J184k041o09L221l690J515K008k08k248K285j648
3870c09j046J432l90J97p18J89N79O28j041j024K911j222m38O49k36k39L6o87
3888g29M74J623k114N25J722j614J140J016l449J481J227k655J960j88p64o39
$$ plain form
3904 -984 -441 -856 2008 1731 -121 -84 216 133 250 -322 252 1496 1561 -732 -826 -1041 1244 1429 631 -1995
3924 -1995 638 787 685 -376 -437 433 279 -118 -723 2194 426 -623 1931 -2319 -171 927 -758
3941 -758 -344 420 -922 -315 1323 -525 1557 1138 -1652 371 -202 -79 -126 -319 -159 416 1584 -721
3959 -721 -290 668 -785 1099 -1071 -356 533 -30 -955 1960 -37 580 -512 -1946 -293 837 -1111
3976 -1111 -266 655 27 749 1903 -576 -916 573 -1005 -62 625 -1123 306 827 250 -166 1513
3993 1513 -258 -469 772 -1636 1416 58 -1337 283 406 -1292 -348 69 -275 111 -1323 -767 972
4010 972 2114 -1428 107 232 -90 990 1184 -651 1531 -375 -875 -500 -735 555 450 -483 -1039
4027 -1039 -398 -1098 -1283 1158 -1697 770 -35 -1520 685 2716 -360 -487 903 -312 -92 1147
$$ packed form
3904i84N43m15K864k77j852L7L00q3J17n72N74J244O5k293r4k15K285J85p98k626
3924a995K633J49j02j061o1Q70j54l97o05K917j768j049K554m250K148J098j685
3941g58M14P64j342O07J638j848K082m19k790K023n73J23m7j93J60N75J168k305
3959g21M31R58j453J884k170P15Q89n63r25K915j997O17j092j434J653J130j948
3976a111Q45R21o28P22J154k479l40J489j578R43O87j748J429N21n77m16J679
3993A513j771k11J241k408L052j358j395J620J23j698R44M17l44L86j434N56J739
4010I72J142l542J535J25l22J080J94j835K182j906n00L75k35J290j05r33n56
4027a039O41p00j85K441k855K467q05j485K205K031l076j27J390j215K20J239
$$ plain form
4043 1147 128 269 1689 -1441 -612 -1253 -348 1639 593 -843 -19 1078 -288 -110 1803 -40
4059 -40 593 11 -1792 1023 1198 -159 1586 -100 -1033 1033 -284 -286 1198 55 411 264 1577 1147
4077 1147 538 -843 235 1553 -704 -139 1620 -1440 18 -361 -1735 -354 348 160 -859 -484
4093 -484 -471 344 371 -1457 488 533 -312 652 511 -1027 1598 -55 -2455 487 -807 380 1390 -585
4111 -585 -420 993 433 -495 440 -930 -597 1571 -1315 -1052 721 -335 -1357 1406 806 -1025 880
4128 880 -806 644 1788 -683 155 1061 -721 717 737 -1907 1215 408 -1713 -498 1131 -1201
4144 -1201 149 406 -1069 2070 1212 -1671 186 1976 -1270 1789 1121 689 1609 -88 -945 185
4160 185 -292 -2178 -773 297 -1586 585 -1230 -1419 1404 -1445 -381 -329 -563 -783 1499 -694 -1102
$$ packed form
4043A147j019J41J420l130Q29o41R05J987j046j436Q24J097j366J78J913j843
4059d0O33n82j803K815J75j357J745j686r33K066j317kJ484j143L56j47J313m30
4077A147o09j381J078J318k257N65J759l060J458l79j374J381P02j88j019L75
4093d84J3Q15K7j828J945M5q45R64j41j538K625j653k400K942j294J187J010j975
4111e85J65J413n60r28R35j370L33K168k886K63J773j056j022K763o00j831J905
4128H80j686J450J144k471Q38R06j782J438K0k644L122q07k121J215J629k332
4144a201J350K57j475L139q58k883J857J790l246L059o68m32R20j697q57J130
4160A85m77j886J405J070j883K171j815j89K823k849J064N2k34k20K282k193m08
$$ plain form
4177 -1102 -369 -1573 -586 -29 720 -691 -253 -778 541 1221 -135 -236 254 -1138 -671 426 -1348
4194 -1348 -374 1254 -743 1495 1571 -738 1528 79 -2120 -504 1677 -850 794 671 -1361 719
4210 719 -1178 -501 1861 -190 -140 662 -2140 -1435 1198 228 -596 279 -463 -1069 1771 460 813 226
4228 226 -964 698 1318 -754 -733 1511 -761 -1299 905 -803 973 190 -539 -41 636 -462 1062
4245 1062 -147 -469 -58 406 -759 -469 1110 -2078 1251 328 -1282 248 106 -1818 760 2611
4261 2611 -631 571 449 -908 2098 355 -515 1250 -342 -50 1874 -10 299 307 -2333 628 420
4278 420 -692 -606 2642 -329 186 -392 -1210 -847 -106 -964 32 2039 -431 233 788 -675 1181 177
4296 177 -1497 1124 45 -1160 1871 484 -1289 1144 -35 -899 1250 -650 -1035 1684 184 -1346
$$ packed form
4177a102P33j204R87N57P49j411M38n25J319O80j356j01M90j392M67J097j774
4194a348R74J628j997K238P6k309K266j449k199J616K181k527J644j23k032K080
4210G19j897O77K362k051N0Q02k802P05K633r70q24Q75p42o06K840j311L53n87
4228B26j190J662O20k072K1K244k272n38K204j708J776p83p29M98O77j098J524
4245A062j209l22M11M64j165K90J579l188L329r23j610J530j42j924K578J851
4261B611l242J202j22j357L006j743q70J765j592K92J924j884L09Qk640K961k08
4278D20j112Q6L248k971N15n78q18L63P41q58R96K007k470O64N55j463J856j004
4296A77j674K621j079j205L031j387j773K433j179q64K149j900l85K719j500j530
$$ plain form
4312 -1346 897 814 -1652 299 203 -2056 2003 161 -768 980 -1282 -829 823 -820 685 984 -2392
4329 -2392 746 1112 134 229 1165 -6 -860 1285 -1225 24 1005 -2000 471 332 -405 624 69
4346 69 -1067 -830 -265 -996 1031 1672 -974 -59 1332 -2413 -232 265 -1820 781 29 -1198 864
4363 864 979 -1263 1727 2134 -107 63 -678 140 2499 -320 -527 -406 -1479 -323 -75 298 -49 1942
4381 1942 -1130 -250 1087 -1315 -1504 1105 -1063 -352 903 -1312 -878 1540 -1729 -691 143 -1197
4397 -1197 317 1189 -66 417 1899 -2274 830 -378 -1206 1392 -153 -1159 1353 681 -37 923
4413 923 1390 -669 27 366 -1916 -126 -776 -789 682 -1897 -1092 1053 -182 -873 -150 -520 -170 32
4431 32 -1600 -362 1770 -1189 -681 905 -134 -592 1272 -162 710 2046 -55 -80 190 -485 749
$$ packed form
4312a346K243q3k466J951r6k259M059j842r29J748k262M53J652j643J505K99l376
4329b392L138L66r78R5R36j171q54K145k510J249R81l005K471j39p37J029n55
4346F9j136K37N65p31K027O41k646R15J391l745K181M97k085K601p52j227K062
4363H64J15k242K990M07k241J70p41Q18K359k819k07J21j073J156K48L73l47J991
4381A942l072Q80J337k402j89K609k168P11J255k215M34K418l269J038Q34j340
4397a197J514Q72j255M83J482m173L104j208q28K598j545j006K512o72p18R60
4413I23M67k059O96L39k282J790o50j3J471k579Q05K145j235o91P23l70L50K02
4431C2j632J238K132k959N08J586j039m58J864j434Q72J336k101k5K70o75J234
$$ plain form
4448 749 -292 -269 1153 -303 -1133 1260 -683 -752 882 -779 -863 1442 223 -1252 1003 -610 -1668
4465 -1668 726 643 208 1423 -1154 404 1019 -811 605 1588 -188 91 -133 813 49 1069 -284
4482 -284 543 376 523 83 731 -704 -128 1902 261 -358 144 165 24 1574 -1122 -778 -72 -1212
4500 -1212 587 1391 -1352 1697 -680 -997 1372 17 -1900 544 1392 -1420 721 639 -18 -630 -454
4517 -454 -897 842 -999 -835 -798 -537 -491 902 -943 -754 990 -1191 793 785 -542 1119 1008 -434
4535 -434 751 1914 -1298 -930 -52 -2388 -220 215 -715 628 1744 -1914 955 -1167 -1377 411
4551 411 531 -2073 1173 -969 -2554 719 -111 -2239 -483 -328 -2051 479 3 -383 136 -147 -1619
4568 -1619 104 -766 909 856 -841 -756 838 186 -1635 917 -1070 426 199 -736 -638 1494 357
$$ packed form
4448G49j041K3J422j456q30K393j943o9J634j661q4K305j219j475K255j613j058
4465a668K394q3m35J215k577J558O15j830J416R83j776K79k24R46p64J020j353
4482b84Q27j67J47m40O48j435N76K030j641o19N02K1j41J550k696L44P06j140
4500a212J799Q04k743L049k377l17K369j355j917K444Q48k812K141q2o57o12J76
4517d54m43J739j841J64L7K61M6J393j845J89J744k181J984qj327J661j11j442
4535d34J185J163l212L68Q78k336K168M35r30J343J116l658K869k122k10J788
4551D11J20k604L246k142j585L273q30k128J756J55j723K530m76l86N19k83j472
4568a619J723q70J675n3j697Q5J594o52j821K552j987J496k27r35R8K132j137
$$ plain form
4585 357 -385 1706 -482 -1566 -777 -950 -170 1327 -1481 2227 1301 -850 -392 -1136 -1016 -442 66 -1885
4603 -1885 1514 -73 -1502 1319 1092 -920 542 -1541 -2511 -134 1056 -80 742 -1320 -1133 547
4619 547 43 666 11 -670 -216 2011 60 217 2760 -86 407 1697 -1939 -26 1217 138 -423
4636 -423 1288 -1182 789 -254 -1664 -970 762 995 491 890 439 681 1065 159 -417 916 -781
4653 -781 673 -472 739 524 -180 -730 444 -56 -989 497 810 364 1301 -1186 -22 -476 -532 -1868
4671 -1868 378 -518 358 1049 -1839 -149 -808 -279 -631 438 -203 134 1243 -552 616 908 -1632
4688 -1632 451 -874 -1327 753 1685 -653 435 991 482 -184 803 -1951 1439 291 -832 237
4704 237 995 -990 536 10 -541 1382 -289 -138 1784 -203 62 275 -1796 -2171 1983 -1175 -330
$$ packed form
4585C57p42K091k188j084P89j73P80J497k808L708r26k151M58p44J20N74N08j951
4603a885L399j587j429K821k27k012J462k083r70K377J190j136Q22k062J87J680
4619E47n04O23o55o81M54K227j951J57K543k846M93J290l636J913J243j079n61
4636d23J711k470J971j043j410O94J732K33n04L99m51K42L84r06n76J333j697
4653g81J454j145J211k15p04n50J174n00r33J486L13m46R37k487J164m54n6j336
4671a868K246q96Q76O91k888J690o59N29l52J069o41L37J109j795J168K92k540
4688a632K083j325m53K080R32k338J088N56n09o66R87k754L390j148j123J069
4704B37P58j985J526n26n51J923j671J51J922j987K65K13k071l75M154l158Q45
$$ plain form
4721 -330 298 -1327 740 1553 -957 -103 -195 -1568 1129 574 -1787 -344 900 -940 180 968 393
4738 393 2091 668 -1133 -98 -75 1306 732 483 -933 1052 984 353 1136 1051 -1213 788 -660 457
4756 457 1502 1068 -1380 891 -237 -146 1065 65 -834 2258 -87 -1317 607 -1055 -2024 1372
4772 1372 -1311 -831 1317 -662 -408 244 -1665 -664 1420 407 -1462 593 651 -253 1526 -262
4788 -262 -1031 59 -356 1572 -217 -253 -428 756 -2524 -443 214 68 526 -526 76 1591 -143
4805 -143 -1126 990 1452 -1444 175 -512 530 874 -452 -442 1517 -341 849 1300 -144 -775 851
4822 851 -1413 -1819 1167 -180 -549 912 -174 -492 1765 -1219 -492 950 -102 -73 1379 -516 544
4839 544 73 -743 248 903 -1558 348 214 -1012 -90 260 -1042 863 459 -2670 1169 999 -621
$$ packed form
4721c30O28j625K067Q13k510Q54r2j373K697n55k361J443J244j840J120P88n75
4738C93J698j423j801J035K3J381n74k49j416J985o8o31P83q5k264K001j448J117
4756D57J045m34k448K271j128R1J211j000q99L092k345j230J924j662r69L396
4772A372k683M80K148j979K54O52j909J001K084j013j869K055N8r04J779j788
4788b62p69J090m15J928j789l6j75J184l280K081O57j46M58j052O02J515j734
4805a43r83K116M62k896J619o87J042L44j326J0J959j858J190M51j444o31J626
4822H51k264m06K986j347l69J461j086l18K257k984P27J442j052K9J452j895J060
4839E44m71q16R91O55k461J906j34j226R22L50j302J905m04l129L839j70j620
$$ plain form
4856 -621 1302 364 -1873 1595 563 -36 1228 822 -549 96 471 570 59 -139 -91 1560 -760 151
4874 151 -4 -723 596 32 -1119 -1101 1662 -1049 180 -465 -527 131 1302 -1099 390 60 -771 400
4892 400 726 -1206 559 558 -230 1288 1721 -313 159 395 -725 54 1174 -2239 764 -1130 -1965 3154
4910 3154 1424 -942 -285 768 -1920 2424 -793 -858 594 -230 65 495 492 -948 929 -575 -984
4927 -984 251 -1217 -301 2073 -1118 11 1562 -514 -341 568 -1415 -365 182 -78 1326 -83
4943 -83 -1418 623 1322 -790 -21 839 -998 -342 517 -1134 665 -196 -1601 54 -1073 -1895 402
4960 402 549 -1012 1136 473 354 2163 555 -997 887 -1351 -892 1109 252 -531 1282 212 -1099
4977 -1099 559 -606 -1045 380 129 431 712 -1661 1404 176 -339 1382 1426 -1523 -354 794 -1589
$$ packed form
4856f21J923r38k237L468j032n99J264m06j371O45L75R9n11j98M8J651k320R11
4874A51j55p19J319n64j151J8K763k711J229o45o2O58J171k401J489l30q31J171
4892D00L26j932J765jp88J518M33k034M72K36j120P79J120l413L003j894q35N119
4910C154j730k366O57J053k688M344l217o5J452q24K95M30lj440J877j504m09
4927i84J235j468R16K374l191J129J551k076J73R09j983J050N47k60J404j409
4943h3j335K041O99k112P69Q60j837O56Q59j651J799q61j405J655j127q22K297
4960D02J47j561K148o63j19J809j608j552J884k238M59K001q57p83J813j070j311
4977a099J658j165m39J425k51L02K81k373L065j228n15J721M4k949J169J148k383
$$ plain form
4994 -1589 573 1663 91 1297 330 -1235 -516 333 -841 -694 217 -1162 229 16 -934 1554 148
5011 148 -1406 478 1411 -1254 667 -356 -932 841 159 -1256 -810 -993 -1341 1471 -1520 -1337 -23
5028 -23 -1918 -195 1467 -146 -888 950 -2483 1119 1691 369 99 342 549 -1070 467 553 -488
5045 -488 1093 -3013 18 353 -771 2616 -74 -1534 990 176 -730 490 1708 -1076 1052 -1060
5061 -1060 104 1188 317 -762 1160 -529 -1882 2318 -1997 -1948 1168 -1724 -1010 628 -1468 -344
5077 -344 531 -1450 -1127 872 -1122 743 1409 -60 1467 1294 -1389 55 838 -1271 -864 171 -375
5094 -375 -21 1201 -2381 -1730 190 -435 -166 853 -666 888 888 -2528 440 -1420 -1427 723 -436 -24
5112 -24 1964 1202 -177 -458 269 -778 1856 -1337 -932 862 -1269 -892 888 237 -1031 350 -448
$$ packed form
4994a589K162J090j572J206r67j565P19Q49j174J47R11j379J391k13r50K488j406
5011A48j554J884R33k665J921j023n76J773o82j415M46j83l48K812k991J83J314
5028b3j895J723J662j613p42J838l433L602N72j322k70K43K07j619J537Q6j041
5045d88J581m106L031L35j124L387k690j460K524q14r06J220J218k784K128k112
5061a060J164J084q71j079J922j689j353M200m315M9L116k892P14J638k096J124
5077c44Q75j981L23J999j994J865O66j469J527j73k683J444P83k109M07J035n46
5094c75L54J222l582O51J920o25K69J019j519J554%l416K968j860pK150j159M12
5112b4J988p62j379k81P27j047K634l193M05J794k131L77J780o51j268J381p98
$$ plain form
5129 -448 -596 972 -1611 -537 1610 -375 -1079 1354 217 -561 1030 -77 752 1220 -374 669
5145 669 518 -955 704 499 -2165 353 -622 -1339 1977 83 -927 -195 1187 -1423 584 1199 -420
5162 -420 1542 -1110 -853 564 -763 556 613 -389 838 911 -1863 511 1427 -1237 -254 1906 -753
5179 -753 -760 1095 -221 -179 1501 -1250 811 328 -1826 -405 1461 -1015 1012 921 36 250 791 -630
5197 -630 430 -35 -812 -163 478 -1614 181 685 -2753 1076 -626 -606 2106 -549 -1877 1489 -2037
5214 -2037 -2626 565 63 -414 421 1158 705 1377 -1168 -776 1751 -165 -582 798 320 -755 2212
5231 2212 1050 -9 1773 270 -195 246 -700 -956 906 436 -351 725 289 306 855 -376 685
5248 685 692 -1855 -28 89 -497 662 139 -30 262 -454 -583 1162 829 -528 1609 246 -73 1408
$$ packed form
5129d48j48J568k583J074K147j985p04K433j137p78J591j107Q29M68j594J043
5145F69j51j473J659k05k664K518r75p17L316j894j010P32J382k610K007O15j619
5162d20J962k652K57J417j327J319N7j002J227P3k774K374R16k664R83K160k659
5179g53pJ855j316M2J680k751K061m83k154J421J866k476K027r1q85K14N41j421
5197f30J060m65p77O49O41k092J795N04l438L829j702K0K712k655j328L366l526
5214b037n89L191n02m77Q35P37m53O72k545L92K527j916m17J380m78j075K967
5231B212j162j059J782j503m65M41r46k56J862m70p87J076m36J7N49j231J061
5248F85Pk547J827J17n86J159n23j69K92p16j29J745l33j357K137j363l19J481
$$ plain form
5266 1408 -1691 -1418 2352 253 -2495 1675 -462 -292 1297 844 -1027 323 -636 -627 110 -86 84
5283 84 861 -977 499 707 -986 134 -136 -1998 136 1759 -1363 839 1561 -715 333 271 -1031
5300 -1031 -49 458 -830 43 -438 -764 162 162 -1614 187 -365 -387 917 -764 164 1768 132 -1100
5318 -1100 1540 380 567 2027 271 -324 -863 593 -373 -60 -435 -421 1457 -854 -384 1265 -152
5335 -152 -885 1044 -287 -353 1364 -782 278 1323 -1100 505 741 -1906 244 1874 -2758 1274
5351 1274 461 -2180 590 215 -1359 746 987 -517 1454 -1202 -542 975 -270 -1114 1002 258
5367 258 -718 1968 -1662 -1975 1099 -535 -623 941 -680 -516 599 374 131 1819 -394 -669 442
5384 442 -70 -308 698 -806 -421 1760 -344 724 -299 -716 -253 443 -913 878 404 -649 1055
$$ packed form
5266A408l099K73L770k099k748M170k137J70J589m53j871J350r59RP37j96J70
5283H4P77j838J476K08j693J120k70j862K134J623l122K202P22k276J048o2j302
5300a031R82N07j288Q73m81l26R26%j776J801n52k2J304j681R28J604j636j232
5318a100K640j160J87J460j756n95n39J456r66L13l75J4J878k311M70J649j417
5335a52p33J929j331o6J717k146J060J045k423J605K36k647K150J630m632M032
5351A274q13k641K770l75j574K105K41j504J971k656O60J517j245q44K116p44
5367B58r76K686l630l13L074j634q8J564j621J64J115k25k43J688k213k75J111
5384D42n12k38J006j504L85K181k104J068j023m17M63O96j356J791m74j053J704
$$ plain form
5401 1055 -339 -2120 723 810 -1425 510 164 -46 375 936 -304 1874 -826 -245 439 -1251 -880
5418 -880 262 -537 111 851 -430 187 254 -1626 690 1953 -909 75 1694 -121 1026 1525 -2376
5435 -2376 1161 724 -811 1202 574 -409 -1018 134 -348 288 64 -1838 702 855 -833 1141 609
5452 609 206 809 -994 -1972 1154 883 -1152 1148 -15 -768 2741 927 -1803 1601 197 -2653
5468 -2653 95 267 -533 962 382 -1088 1867 -445 -540 1109 -1086 327 1353 -1570 -17 1460
5484 1460 3 -557 848 -1041 -665 1166 -1119 663 1259 -698 576 -68 -1835 273 1001 -75
5500 -75 1655 -1536 46 221 -750 -1454 989 50 -1657 2532 821 -1600 -305 564 -1302 1187 -1120
5517 -1120 -95 1066 -1140 29 -1409 133 -90 2507 -31 -346 623 114 -1033 717 -118 -880
$$ packed form
5401A055j394j781K843Q7k235J935l46k10M21N61j240K178k700N81O84j690L71
5418h80J142p99O48P40j281O17O7j880K316J263k862R84J619j815J147M99l901
5435b376L537m37j535K013o28r83o09J152m82O36k24j902K540J53j688J974n32
5452F09m03O03j803r78L126k71k035K300j163p53L509j814k730L404j404k850
5468b653K748J72q00J495n80j470K955k312r5J649k195J413J026k923J553J477
5484A460j457n60J405j889L76J831k285J782N96j957J274o44j767K108P28j076
5500g5J730l191J582J75r71p04K443r39j707M189j711k421J295Q69j866K489k307
5517a120J025J161k206J169j438J542k23K597k538l15R69n09j147J750q35p62
$$ plain form
5533 -880 -338 -735 -82 141 -1068 943 287 -1643 -502 375 -825 1602 1206 -2160 -409 -445 -1138 523
5551 523 2056 519 753 -211 -931 1519 132 -1563 156 600 -836 419 -572 -106 258 -1457 -1244
5568 -1244 677 770 -666 1567 159 127 902 -1447 -1186 205 917 -119 550 -722 225 -457 -1130 -207
5586 -207 527 -1579 458 871 -1543 95 1979 -1216 362 312 219 311 598 248 954 -292 -1132 2524
5604 2524 138 -1254 1189 -781 -832 -437 -1298 -543 1482 -200 -305 623 -962 -1598 -768 -507 -552 2706
5622 2706 -481 -1110 855 67 455 968 993 -951 838 -1182 -37 1259 -650 219 673 -1271 -68
5639 -68 598 -1717 1557 1374 -1286 -584 681 -1115 878 -551 -67 226 716 -570 632 883 -88
5656 -88 -580 -456 -1803 -211 -307 737 1239 -418 -569 937 -1097 -1657 1534 -188 -401 1148 746 -1101
$$ packed form
5533h80N42l97O53K23j209K011o56j930J141Q77j200K427l96l366J751l6o93J661
5551E23J533j537K34r64p20K450j387j695J719M44j436J255r91M66L64j715K13
5568a244J921R3j436K233j408l2P75k349K61J391P12j036O69j272R47o82o73R23
5586b07P34k106K037M13k414J638J884l195J578n0r3R2K87l50P06j246q40L656
5604B524k386j392K443j970n1L95q61P55K025j682j05R28j585o36Q30K61m5L258
5622B706l187o29J965p88L88N13K5j944J789k020J145J296j909Q69M54j944J203
5639f8O66k315L274j83k660P02J265j796J993j429M84K93M90j286J202K51r71
5656h8m92J24j347J592r6J044N02j657j51J506k034n60L191j722k13J549m02j847
$$ plain form
5674 -1101 1096 -1774 -74 1659 28 8 2684 -1320 -269 -935 355 -184 644 -1107 167 701
5690 701 -2253 -276 1067 -1046 487 1133 -885 582 110 -2141 1289 105 -1929 472 332 -1093
5706 -1093 542 284 -2501 1456 -1426 -534 163 -454 -685 383 -410 -108 1131 -685 446 442 -892
5723 -892 161 534 -449 -377 617 -246 860 1029 -443 -914 952 -817 -563 2777 -130 -601 748 -2097
5741 -2097 -226 1778 -473 -1 -298 -2073 1154 245 476 808 636 -486 -25 692 -753 1070 432
5758 432 -1219 1432 431 581 1214 699 -583 1016 1015 638 875 633 -542 1776 4 -853 787 394
5776 394 -542 1408 -1168 -109 1369 -1521 928 3008 -1100 -783 2043 587 23 124 -1307 -191
5792 -191 -94 -1120 515 -321 -880 -285 -69 -1279 19 334 -1784 531 397 47 904 1290 -459 1649
$$ packed form
5674a101K197k870J700J733j631k0K676m004J051o66J290n39Q28j751J274N34
5690G01k954J977J343k113J533O46k018J467m72k251L430j184k034K401j40j425
5706a093J635k58k785L957k882Q92O97o17k31J068p93L02J239j816J131mj334
5723h92J053L73r83P2R94q63J106J69j472m71J866j769K54L340k907m71J349k845
5741b097J871K004k251M72k97j775L227r09K31L32j72j122M61P17j445J823o38
5758D32j651K651j001J50O33n15j282J599jl77K37k42j175K318j772q57J640l93
5776C94r36J950k576J059J478k890K449K080m108L17K826j456n64J01j431J116
5792a91R7j026J635q36n59N95K16j210J298L15k118K315j34l50Q57L86j749K108
$$ plain form
5810 1649 158 -1290 1818 2282 -1257 49 -183 -321 929 84 -932 1611 480 -1402 1397 -2134
5826 -2134 -979 1608 -1378 -658 620 -260 341 1680 -396 -391 1080 -1136 -297 642 -813 1167 -379
5843 -379 -2891 168 726 -1458 -125 1132 -449 1168 -632 610 -1027 29 -1170 450 402 194
5859 194 276 -828 -614 1456 1267 -2116 1294 181 -410 877 -31 -2513 106 -1513 -659 1924 -1002
5876 -1002 -559 1140 -477 -1531 1547 -616 -1712 64 -774 321 1537 -1085 336 369 -1175 1400
5892 1400 1349 -2530 -359 289 -104 -124 382 -872 -467 102 -1537 -8 1069 -1898 1570 1764 -334
5909 -334 1608 586 -970 809 61 -1086 1490 -1588 -720 1089 -1403 255 1185 -1676 769 754
5925 754 -48 843 2319 -682 325 910 -1276 -692 417 -736 -266 -990 -862 -178 203 -588 -598 938
$$ packed form
5810A649j491j448L108M64l539J306k32j38J250q45j016K543j131j882K799l531
5826b134J155K587k986P20J278q80O01J339k076NJ471k216Q39R39j455J980j546
5843c79k512L059N58k184J333J257j581J617j800J242j637J056j199J620m8k08
5859A94Q2j104K14K070j89l383L410j113n91J287r08k482K619j619Q54K583k926
5876a002M43J699j617j054L078k163j096J776q38J095J216k622J421L3j544K575
5892A400n1l879K171O48l93k0N06j254M05N69j639J529J077k967L468J94k098
5909c34J942j022j556J779p48j147K576l078Q68J809k492J658R30k861K445j5
5925G54q02Q91J476l001J007N85k186N84J109j153M70p24J28O84L81p91j0J536
$$ plain form
5943 938 -1584 353 1497 -855 121 729 -1766 -102 187 -2190 2223 502 -1764 1154 1270 -210
5959 -210 -249 -128 245 188 -347 -612 1744 -249 -1352 2334 -392 -596 307 -1140 217 882 -573 94
5977 94 460 -418 -306 -307 -1902 -1340 504 -634 -127 252 -147 -964 659 -1671 682 1095 -989 135
5995 135 34 -1255 1082 511 -1619 663 1096 -1286 688 -877 -1787 737 -2056 61 1595 420
6011 420 -977 1139 5 -965 1123 -441 -1002 1409 70 -707 1804 -175 512 806 -1320 -346 816
6028 816 -998 66 2924 -1476 -706 811 -471 -1266 1533 -651 -312 1096 -1093 913 -142 -2086
6044 -2086 72 766 -1453 373 3247 -1117 -278 33 -654 1020 675 -1313 524 -203 -2042 1879
6060 1879 657 691 -114 -350 1415 1629 218 -1692 553 -506 -961 203 -1883 884 474 -1141 46
$$ packed form
5943I38k522J937J144k352R76O08k495J664K89k377M413j721k266K918J16j480
5959b10l9J21L73n7n35k65K356j993j103L686k726k04R03j447J357O65j455O67
5977I4L66q78J12jj595N62J844j138N07L79l99q17J623k330K353M13k084J124
5995A35j01j289K337n71k130K282M33k382J974j565r10K524k793K117J534j175
6011D20j397K116j134r70K088j564n61K411j339p77K511j979O87K94k126R74J162
6028H16j814J064K858m400P70J517j282p95K799k184L39J408k189K006j055j944
6044b086K158O94k219J826K874m364Q39L11o87J674l45j988J837p27j839L921
6060A879j222L4q05k36J765K14j411j910K245j059m55J164k086K767m10j615J187
$$ plain form
6077 46 -60 -1512 -844 872 55 -900 1923 -768 -210 1725 -345 94 -399 -812 1284 664 -359 635
6095 635 175 -1804 -173 -305 -1554 19 16 -541 632 -58 -832 -451 15 -926 663 -676 -413 228
6113 228 -21 -552 1942 149 -863 919 211 567 913 -284 -1007 894 -421 727 -924 -1696 -1717
6130 -1717 -337 -1349 -820 590 336 1128 839 -1076 -536 1742 -2030 -1018 138 -963 1112 4
6146 4 -396 -133 793 -1345 1290 439 -2057 -430 789 9 1165 424 247 1230 1757 -210 47 -694
6164 -694 -1013 1250 -60 190 634 -89 -1122 1018 87 -416 1393 -413 -646 2146 -722 -705 863
6181 863 -1154 -404 209 -1308 -376 178 -65 -212 -497 -1646 -606 1258 -555 1522 897 156 -360 1252
6199 1252 -721 27 1222 -2093 2173 -689 -1739 -369 -422 -496 550 401 -1099 1350 885 73 254
$$ packed form
6077D6j06j452O68J716q17r55K823k691N58J935k070M39m93m13K096o20j023R94
6095F35m60j979J631j32j249J573ln57J173o90p74L81M66r41J589j339K63O41
6113B28k49n31K494j793j012J782p08L56L46j197p23J901j315J148j651p72k1
6130a717J380j012N29J410k54P92k89j915N40K278l772J012J156j101K075j108
6146Dm00K63R26k138K635q51k496J627J219p80J156p41j77R83N27j967K57p41
6164f94l19K263j310K50M44p23j033K140r31n03J809j806k33K792k868J7J568
6181H63k017P50O13j517R32N54k43j47k85j149J040J864j813K077o25p41n16J612
6199A252j973P48J195l315M266k862j050J370n3p4J046j49j500K449m65q12J81
$$ plain form
6216 254 799 -1035 1112 -1064 -772 768 -83 -245 1169 -607 322 639 -81 7 829 -786 -153 760
6234 760 -916 -634 1141 228 -9 470 -994 1569 910 -498 -315 1393 -1260 1724 1115 -1235 -620
6251 -620 1513 -690 -389 565 -1492 1321 -35 -1361 506 -96 -2229 986 -244 -1877 -56 330
6267 330 674 289 1734 -152 -578 -1583 -120 1380 -369 497 207 970 -263 2231 516 -91 1807
6284 1807 -805 -190 934 -1089 -430 972 311 976 45 -1875 608 244 -1628 427 302 -622 1055
6301 1055 -356 -1365 122 380 -1059 550 131 -1675 2043 -342 -293 -289 553 -1226 173 -428 642
6318 642 553 -244 -478 -31 -593 -524 -387 -850 -973 392 -230 -1853 -259 -1006 1584 -343 -1174 148 1128
6337 1128 -1503 -880 1960 24 -667 2154 -1317 -1014 -499 82 -34 427 -827 401 959 -2252 -685
$$ packed form
6216B54N45j834K147k176K92J540q51j62J414j776R29L17p20Q8Q22j615O33R13
6234G60j676K82J775r13k37M79j464K563o59j408J83J708k653K984o09k350O15
6251f20K133k203L01R54k057K813j356j326J867o02k133L215j230j633J821L86
6267C30L44l85J445j886m26j005J463J500j749Q66k90P63j233K494j715o07J898
6284A807k612O15J124k023O59J402o61O65r31j920K483l64j872K055j25r24J677
6301A055j411j009J487K58j439J609m19j806L718k385M9MQ42j779J399o01J070
6318F42q9p97k34M47n62O9J37m63j23J365o22j623J594p47K590j927q31J322R80
6337A128k631O23K840j936o91K821l471L03N15N81j16M61j254J228N58l211J567
$$ plain form
6354 -685 -225 -750 1100 -256 -1908 1156 889 -256 1196 -837 -359 1163 -105 -1390 1308 1168
6370 1168 383 2423 -1065 -1734 2504 -600 -381 1702 465 -232 976 -759 -968 924 -575 -779
6386 -779 1220 -3 974 1191 -567 -77 -527 -1852 -210 1169 -1282 75 -496 483 1002 626 262
6403 262 286 -130 -631 758 176 -861 131 -30 -1750 459 -667 -1965 915 1536 -867 1860 254
6420 254 -611 81 -1018 -835 597 -968 -459 1391 2 -196 1220 -1071 993 917 1272 -1237 -86
6437 -86 289 324 1449 -1560 1227 113 -679 -1376 -391 -153 -607 -37 118 1924 1360 -1770 1631 1782
6455 1782 314 894 -813 -1586 349 -891 -775 56 -821 2 264 -1044 -1532 2720 -1427 49 1074
6472 1074 -980 -831 1405 -192 -1735 876 400 145 265 -370 -10 929 -2008 -1560 980 -1471 1119
$$ packed form
6354f85M60n25J850j356j652L064k67j145J452k033M78J522j268j285K698j40
6370A168p85K040l488o69M238l104K19K083j237o97J208j735k09J892j499k04
6386g79J999j223R77K17j758M90m50j325J642J379k451J357n71R79N19l76l64
6403B62K4m16n01J389n82j037R92j61j720K209j126j298K880O21k403K727j606
6420B54q65O92j099J83J432j565N09J850j389j98J416k291K064p6L55k509J151
6437h6L75L5J125l009K787j114p92o97R85K38m54N70J55J806n64l130L401J51
6455A782j468N80j707p73J935j240J16Q31q77Q23K62j308m88M252m147J476J025
6472A074k054J49K236j597j543K611m76k55J20o35L60R39k937M48K540k451K590
$$ plain form
6489 1119 -580 -1698 206 1496 -582 14 355 -1084 947 1838 -2049 1247 1406 -1450 1481 669
6505 669 -652 1199 -1456 -1542 1011 479 -1127 896 -81 -1689 -636 -505 -2620 197 -187 -684 1568
6522 1568 -361 -421 1843 105 -802 1569 4 -1185 577 -968 115 1348 -1181 -173 535 1070
6538 1070 425 -484 -1128 823 1578 -929 1647 1683 -603 2132 654 -590 119 891 -951 2577 -439
6555 -439 -1263 579 1312 2108 1380 -458 -395 411 344 -135 21 -342 78 1310 569 -1830 215 -794 -901
6574 -901 666 174 -64 1319 964 -2343 611 1041 -367 757 284 -406 1822 -1662 -151 -418 -2000
6591 -2000 -375 823 -412 1035 932 -770 1461 576 -378 940 213 -277 386 312 -947 1001 -281
6608 -281 -847 835 -1264 -313 -372 60 -298 760 7 150 2564 -1002 -1121 569 89 -148 -242 -1517
$$ packed form
6489A119j699j118J904J290k078N96L41j439K031Q91l887L296J59k856K931q12
6505F69j321J851k655q6K553n32j606K023r77j608J053J31k115K817l84m97K252
6522A568j929o0K264j738r07K371j565j189J762j545J083J233k529J008P08N35
6538A070o45r09o44J951P55k507K576L6k286K735j478j244P09P72j842L528l016
6555d39q24J842P33P96p28j838O3Q06o7m79J56l63M20J232p41k399K045j009j07
6574i01J567m92k38J383l55l307K954M30j408J124m73o90K228l484J511k67j582
6591b000J625J198j235J447j03j702K231q85r54J318p27m90O63p4j259J948j282
6608b81n66J682k099R51n9M32l58J058p53J43K414l566j19J690m80k37r4j275
$$ plain form
6626 -1517 999 1019 -1003 1618 1316 -1745 833 1118 -373 -1065 2490 -334 144 814 -777 2063 1454
6643 1454 -512 -1039 1064 21 550 723 -199 1128 1149 -448 -649 -4 91 788 821 -2122 254 -28
6661 -28 -589 2258 1316 -670 1285 -1038 -730 1645 878 -692 422 -105 -1470 411 524 542 -15 -383
6679 -383 -308 499 -690 -448 1356 -1349 -671 1095 -735 188 475 -757 93 -268 298 170 1066 -569
6697 -569 823 341 -890 207 -68 -1061 1523 102 -1534 274 608 -117 -232 -608 263 299 735 -1195
6715 -1195 598 -889 161 1267 -73 -1250 1369 -205 -539 -51 -766 -192 1695 565 -1083 3514
6731 3514 -1179 -753 1973 -937 625 -422 676 43 579 -815 976 618 -772 427 -299 -2605
6747 -2605 521 694 -1199 -318 -2 422 148 1299 -641 854 671 -423 -141 -1785 -1441 358 807
$$ packed form
6626a517K516K0k022K621l02l061K578K85j491o92L555k824M78O70j591K840o09
6643A454j966n27K103j043N29J73r22J327K1j597k01O45R5O97L3k943K376k82
6661b8n61K847r42j986J955k323L08K375p67j570J114n27j365J881J13J8n57l68
6679c83P5Q07j189K42J804k705O78J766j830R23K87j232Q50l61N66j28Q96j635
6697e69J392m82j231J097k75r93K584j421j636J808L34p25j15l76Q71L6M36j930
6715a195J793j487J050J106j340j177K619j574l34M88p15N74J887j130j648M597
6731C514m693M26K726k910J562j047J098o33N36j394J791l58j390J199p26k306
6747b605L126J73j893Q81L16M24k74J151j940J495j83j094K82j644L44J799M49
$$ plain form
6764 807 -138 1536 338 -584 2124 -531 -696 854 1095 -600 622 151 -907 987 -610 228 1553
6781 1553 -120 -620 -6 -31 -271 1392 -635 -690 -8 -414 -191 596 -345 560 -652 -1804 1025 575
6799 575 272 800 -687 -1143 1527 914 -1197 1150 -170 -1375 156 593 -1788 300 396 -1069 1539
6816 1539 65 -1349 1724 -744 -1151 -495 -1266 -889 604 -336 -16 2637 -1054 -1659 1561 -1035 766
6833 766 1099 -1157 1069 205 -375 -815 654 -1204 915 3786 -690 516 2098 -497 -721 1458
6849 1458 -861 40 1495 -814 1383 -404 -1251 -456 -69 -867 -309 1204 -800 15 462 -162 1819
6866 1819 -257 -93 -183 502 -958 1510 -620 -189 1050 -2240 -975 1017 -1205 -857 2144 -598
6882 -598 -1329 1446 -1619 562 482 -781 1009 -83 -1269 -301 91 -611 205 1071 -1042 54 314
$$ packed form
6764H07r45J674j198r22K708k655j65J550K41j695J222m71j058J894j597Q38J325
6781A553j673n00O14k5k40J663k027n5O82m06K23P87r41R05j212j152K829m50
6799E75l03N28j487m56K670o13k111K347j320j205J531M37k381K088R6j465K608
6816A539j474j414L073k468m07O56p71L77J493r40L20K653l691o05L220k596J801
6833G66L33k256K226q64n80m40J469j858K119K871m476J206J582k595k24K179
6849A458k319R01J455k309K197j787q47P95L87p98N58J513k004Q15M47o24J981
6866A819k076J64r0O85j460K468k130M31J239l290J265J992k222L48L001k742
6882e98p31K775l065K181q0j263J790j092j186R68L92p02Q16Q66k113J096K60
$$ plain form
6899 314 -717 1561 1510 -910 1956 1717 -1262 1426 468 -711 2259 290 -823 1635 -1156 -1219 721
6916 721 669 -1557 950 -1178 -1483 2341 -916 -533 2392 -333 -927 634 -632 484 1699 -1006
6932 -1006 138 -219 -135 -486 2224 -372 -1407 233 -319 74 2023 -2565 -198 1763 -1920 -626
6948 -626 679 -165 -831 880 -1587 -945 -55 -1010 961 420 -782 -648 -415 -941 926 -381 -446 693
6966 693 -539 -245 2248 -546 -971 1636 -431 -626 854 882 270 612 -690 258 351 -215 -587 1772
6984 1772 -1642 -1707 1309 -673 425 240 -1214 1545 -272 -1020 800 1076 -434 -1321 413 -1300
7000 -1300 690 437 581 -764 -322 715 128 -82 -1449 1423 1078 -978 1515 590 -334 1599 51
7017 51 -513 1086 -1242 -723 1822 1142 -692 1065 -1107 735 -927 -1088 -678 557 -509 -1773 1431
$$ packed form
6899C14j031K278n1k420K866k39k979K688r58j179K970j969j113K458k791o3J940
6916G21n2k226K507k128l05L824l257L83K925k725n94J561j266J116J215k705
6932a006J144l57Q4l51K710k596j035J640n52L93J949m588K367J961l683J294
6948f26J305q44o66J711k467O42Q90r55J971n41j202J34K33n26J867j307o5J139
6966F93j232K94K493k794m25K607k067j95J480K8o12L42j302R48R3n66l72K359
6984A772l414o5L016j982J098j85j454K759j817p48J820K76j510q87J734j713
7000a300J990k53J44j345M42J037n87k10j367K872l45k056K493r25r24J933j548
7017E1n64J599k328N19K545o80j834J757k172J842j662j61M10J235j066j264L204
$$ plain form
7034 1431 250 4 2005 -2049 -267 -47 -1607 480 -326 -99 -232 676 -341 -658 56 -1428 145
7051 145 1037 626 1090 1433 -493 11 562 -1833 1402 -424 -1401 467 -703 -1325 -213 524 -49 556
7069 556 459 -1199 485 -973 -1717 1189 -1001 -1812 1373 685 1017 -255 -741 446 1707 -317 470
7086 470 1853 -574 -208 396 -128 -699 1673 -1879 1458 601 -1005 924 1257 -1647 131 129 -1651
7103 -1651 311 -503 -163 272 -306 -632 1639 912 -350 1068 156 -464 88 -940 -703 585 204 -329
7121 -329 468 -593 -214 1334 -1006 -298 529 -743 176 858 -1690 584 1552 -884 -285 -449 -729 1180
7139 1180 639 -1069 279 -446 3 1335 1690 -33 -268 341 -730 537 -551 -1576 1806 1745 -1127
7156 -1127 1147 394 39 1774 1549 -1170 1128 485 -685 199 56 -256 1084 64 310 784 -1510
$$ packed form
7034A431j181k46K001m054J782K20j560K087q06K27j33R08j017l17P14j484J573
7051A45Q92m11M64L43j926N04N51k395L235j826r77J868j170o22J112P37n73O05
7069E56r7j658J684j458p44K906k190q11L185o88L32j272m86J187J261k024P87
7086D70J383k427L66O04n24n71K372l552L337q57j606J929L33k904J778kj780
7103a651J962q14L40M35n78l26K271p27j262J418r12o20N52j028K37J288l81n33
7121c29P97j061L79J548k340P08Q27j272R19O82k548K274R68k436N99j64k80J909
7139A180n41j708J348p25M49J332L55j723k35O09j071J267j088j025L382o1k872
7156a127K274p53l55J735k25k719K298o43j170Q84j43l12J340j020K46M74k294
$$ plain form
7173 -1510 -1065 1339 -1218 -862 1351 -235 -119 1441 310 -487 436 -1724 1047 1627 -536 247 -163
7190 -163 -2662 -376 1072 -766 367 -17 -878 -165 1257 -234 130 501 -1809 1338 -1061 -211 501
7207 501 266 -1629 758 -494 -1036 211 -207 -525 538 1109 -6 467 -1259 -896 100 -307 -822 665
7225 665 189 105 1330 336 378 1924 -1650 -385 -237 -1030 -47 1215 -1641 -157 1003 -370 145 2535
7243 2535 410 388 6 -925 411 -330 60 487 -901 -2061 482 -715 348 778 214 -778 -80 -49
7261 -49 -261 379 45 -977 872 -1217 -395 2448 110 25 927 333 -364 728 523 -704 547 -672
7279 -672 -2182 -690 -645 -562 626 -1539 -247 647 249 -833 1052 -1172 311 1494 -1186 1870 1639
7296 1639 -406 683 1408 -823 -957 943 -1507 -236 1158 -726 1021 2421 -436 683 -1106
$$ packed form
7173a510M45K404k557L56K213j586J16J560j131p97R23k160K771N80k163P83m10
7190a63k499K286J448j838J133l84q61P13J422j491L64L71k310L147k399Q50P12
7207E01k35j895K387j252n42J247m18l18J063N71j115M73j726L63R96m07n15J487
7225F65m76q4J225r94M2J546l574J265J48p93R83J262k856J484J160j373N15K390
7243B535k125k2l82r31J336p41L90M27j388j160K543j197J063M30n64r92O98L1
7261d9k12O40l34j022J849k089Q22K843k338q5R02n94o97J092k05j227J251j219
7279f72j510J492M5Q3J188k165J292Q94l98j082J885k224J483J183k680L056k31
7296A639k045J089P25k231j34J900k450J271J394j884J747J400k857J119j789
$$ plain form
7311 -1106 -1601 559 -390 -300 1003 1258 -1004 833 331 218 -117 334 1292 659 576 -1116 371 -1027
7329 -1027 -525 1596 -1238 136 1640 65 -255 1221 -103 246 49 -921 -517 1001 -1046 -692 994
7346 994 -1220 272 1501 -692 608 716 -1487 1565 1150 -1534 421 379 42 977 172 -975 -581
7363 -581 -414 2 616 1483 -1187 1347 -402 482 1545 -719 -896 1789 -682 -997 701 -1956 -580
7380 -580 2027 -464 -382 263 -937 -536 529 721 61 1521 -1262 -678 -142 -859 -204 982 -371 554
7398 554 1445 -1118 1082 859 -706 398 1064 -175 580 281 -1445 1242 890 -159 1215 -133 -424
7415 -424 728 -303 -511 456 -573 194 554 934 -1025 1326 -1027 508 -8 -293 -1077 979 -209
7432 -209 -376 483 -1517 145 1503 -997 -1027 -1029 83 -18 249 -538 1603 1347 -1270 499 1096 -529
$$ packed form
7311a106m95K160r49R0J303K55k262J837n02j13l35M51R58o33q3j692J487j398
7329a027N02K121k834J374J504j575l20J476j324L49j97r70M04J518k047L54J686
7346I94k214J492J229k193J300J08k203L052m15k684J955m2l37R35q05j147L94
7363e81J67M16O14Q67k670K534j749Q84J063k264j77K685k471l15J698k657J376
7380e80K607k491Q2O45j200M01J065J92o60J460k783N84N36p17O55J186j353R25
7398E54Q91k563K200k23j565J104O66j239P55k99j726K687l52j049J374j348k91
7415d24J152j031k08R67j029P67L60L80j959K351k353J535n16k85p84K056j188
7432b09j67Q59k000J662J358k500l0kJ112j01K67p87K141k56k617J769N97j625
$$ plain form
7450 -529 888 -380 -596 783 -293 -1251 26 -603 -912 925 430 -767 1584 -222 119 984 -170
7467 -170 79 2108 34 -1778 494 -1429 -392 -36 -910 -655 636 -494 121 -449 -1383 1432 644
7484 644 -532 -1447 1688 -124 363 298 -1287 14 1412 -1218 -896 1046 -1377 -255 -418 -1091 356
7501 356 433 -536 1122 -1083 -1157 389 539 -354 204 183 -696 1358 410 -1352 1055 1268 -1560 607
7519 607 -897 -419 2986 138 -81 1244 -842 -1256 1662 135 -1185 634 -1692 88 1248 -1498
7535 -1498 1368 999 -1113 370 1316 -1351 97 1842 -1181 559 1002 -1898 1227 427 -1477 1103
7551 1103 190 -1268 397 1527 469 500 -382 -621 700 334 -1833 1024 231 663 -376 209 -2461
7568 -2461 1375 -160 -804 1536 1018 748 1761 -925 -1788 1592 203 -360 1346 222 1253 336
$$ packed form
7450e29J417j268k16J379j076r58J277o29l09J837m95j197K351j806L41Q65j154
7467a70K49K029k074j812K272j923J037L56q74K55J291j130O15n70r34K815p88
7484F44j176r15L135j812M87o5j585J301J398k630L22J942k423J122j63o73J447
7501C56P7r69J658k205p4J546J50q93N58k1q79K054r48j762K407K13k828K167
7519F07j504M78L405k848k19J325k086m14K918j527j320J819k326J780J160k746
7535a498K866l69k112J483R46k667J448J745l023J740M43k900L125q00j904K580
7551A103r13j458J665J130j058L1q82k39J321l66k167K857p93M32j039N85k670
7568b461L836j535o44K340n18k70J013k686q63L380j389n63J706j124J031r17
$$ plain form
7584 336 -1038 -996 1561 -834 -337 981 -1996 -74 634 -524 309 -796 -2078 1192 437 -1221 707
7601 707 767 -362 798 -312 -1276 491 745 -1528 46 98 -1815 574 -147 -964 1375 -251 -134
7618 -134 878 -632 -589 -226 711 -477 1502 867 254 1169 359 466 1766 -438 538 987 180 771
7636 771 707 -261 138 1287 1343 -81 1548 -1488 182 1853 -998 1216 673 -1218 1367 952 -1833
7653 -1833 1644 2056 -821 1523 1295 231 425 29 -1687 404 -717 -874 1885 229 -374 1494
7669 1494 -635 -515 1387 377 -614 53 -885 -866 644 -907 -31 1226 -1662 -350 935 -553 1575
7686 1575 1824 181 849 1019 423 1220 -409 -872 666 847 -1473 -742 459 -733 493 -144 -1169
7703 -1169 939 82 -1464 2044 606 -504 688 -358 32 -189 1565 -974 228 -774 -122 -622
$$ packed form
7584C36j374M2K557k395M97J318k977J922P08j158Q33j105j282L270p55j658J928
7601G07O0j129J160j110r64J767K54k273J574N2j913K389p21q17K339j626J17
7618a34J012j510M3L63R37j188J979o35o13R15q10J07J300k204R76M49q07N91
7636G71o4r68L99J149N6j424J629l036J670J671k851K214n43j891K585m15k785
7653a833L477M12k877K344k28j064J94l96j716K091j121j57K759j656o03J868
7669A494k129J20J902j010r91O67r38J9J510j551Q76J257k888J312J285j488K128
7686A575K49j643O68J70n96P97j629m63J538J81k320P31J201j192J226o37j025
7703a169K108q57j546L508j438j110J192j046L90k21J754k539J202j002O52n00
$$ plain form
7719 -622 450 -19 474 -158 -275 1161 -2246 -562 -480 -570 -1092 682 -6 -627 508 -1743 -570 951
7737 951 -832 1013 1348 -177 941 187 -1041 -117 1405 -784 92 -58 -2569 825 1359 -2241 727
7754 727 2659 -1410 -355 282 -476 851 -922 -1990 1230 -784 340 1006 -204 -276 375 1525 266
7771 266 1462 -1501 -720 1088 463 498 2177 -1682 -577 917 -1006 -205 256 -733 -1223 1176 -1907
7788 -1907 280 185 -1160 137 1682 698 -413 688 -1998 -212 592 -499 600 1093 -472 138
7804 138 767 -2882 135 814 -565 2018 -839 -459 300 -1030 -293 1336 595 -901 1361 349 955
7821 955 343 1 -246 653 271 258 1403 -1296 294 1936 347 365 599 -1189 -246 1608 -909 771
7839 771 -620 -1110 -202 -161 -1548 1029 -445 -367 361 122 -313 -352 1003 256 249 442 -1844 -318 -257 -1825
$$ packed form
7719f22J072m69M93o32j17J436l407J684Q2r0n22J774o88o21J135k251J173J521
7737I51j783J845L35j525J118p54j228R24J522k189Q76j50k511L394N34l600K968
7754G27J932m069J055O37p58J327j773j068L220k014J124O66j210p2O51J150j259
7771B66J196k963P81J808o25L5J679l859J105J494j923Q01M61r89m90K399l083
7788a907K187r5j345J297J545r84j111J101k686J786Q04j091J099M93j565O10
7804A38O29l649L017O79j379K583k857L80P59j330P37J629p41j496K262j012O06
7821I55o12l42k47Q99l82j3J145k699J590J642j589J8K34j788R43J854k517J680
7839G71j391m90R08M1j387K577j474P8P28k39m35l9J355p47pJ93k286J526O1j568
$$ plain form
7859 -1825 2223 -649 637 -431 -336 -256 -324 480 -136 161 -1285 -2056 543 92 -960 2089 213 10
7877 10 1167 478 1025 185 -2307 794 404 -1207 -485 1076 257 623 208 -1129 -396 -217 -431 135
7895 135 1577 -801 1382 1147 -1540 536 1028 -1219 1328 1043 -1155 263 -214 -885 456 -1375
7911 -1375 -684 955 -377 -372 775 -479 -798 -164 -473 -979 2221 -10 -469 1334 -246 -398 -154 -1521
7929 -1521 -423 681 885 315 956 -1589 -511 764 -775 -507 1216 1317 -1192 138 -224 1531
7945 1531 500 -1064 282 205 -7 -161 -1105 -931 2107 1063 -1861 593 691 -359 1557 566 -522
7962 -522 1082 985 -1488 1541 169 -1409 1877 -863 -373 1194 -1549 236 1320 -407 -991 1885
7978 1885 442 559 2393 -1035 -321 -784 -1659 -174 1360 446 -119 682 -70 194 963 -1638 -466
$$ packed form
7859a825M048k872J286j068R5Q0o8Q04o16K97j446p71K599m51j052L049j876k03
7877A0J157o89N47q40k492L101l90j611P22J561q19L66m15j337P33J79k14N66
7895A35J442k378K183k35k687K076M92k247K547k85k198J418m77o71J341j831
7911a375O91J639j332NJ147j254l19O34l09n06L200k231m59J803j580j52K44j367
7929a521J098J104K04n70O41k545J078J275j539K68J723J01k509J330l62J755
7945A531j031j564J346p7k12j54r44J74L038j044k924K454R8j050J916r91j088
7962e22J604r7k473L029j372j578L286k740M90J567k743J785J084j727n84K876
7978A885j443J17J834l428P14m63q75J485J534r14n65Q01p52K64P69k601J172
$$ plain form
7995 -466 1353 -2214 584 -199 -815 1640 548 -897 176 545 -78 2312 -317 -1442 754 375
8011 375 -1017 6 70 -318 15 2036 -112 925 -282 -12 899 -1153 -835 1020 298 -353 1053
8028 1053 -1070 568 367 -500 -307 1295 59 213 538 -267 -1120 1379 -948 460 1194 -1198 1337
8045 1337 979 -2365 -966 1210 -907 707 169 192 1528 -369 -1360 637 487 402 595 820 -539
8062 -539 496 -822 -1200 178 595 -802 1509 830 -679 719 -1779 -436 888 -618 -257 1512
8078 1512 -19 -1411 -151 -384 372 404 -1101 426 713 -411 977 1106 -479 537 1018 391 168
8095 168 750 -1454 210 413 -2408 113 -1346 -431 170 745 172 528 126 -1473 146 -348 -1036 1188
8113 1188 -581 -963 763 887 -61 1737 -941 468 693 550 313 1057 -84 50 -942 304 50
$$ packed form
7995d66J819l567K798p83o16K455j092j445J073L69o23K390k629j125K196l79
8011C75j392J023O4l88L33K021k148J037j207K70R11k052L18J855p22o51J406
8028A053k123J638k01q67J93J602j236J54L25q05q53K499k327J408P34k392K535
8045A337l58l344J399K176k117J614n38K3J336j897r91J997j50q5J93K25j359
8062e39J035j318l78J378M17j397K311o79j509J398k498J343J324j506L61J769
8078A512j531j392J260k33P56L2j505J527K87j124J388J29j585J016M81o27k23
8095A68N82k204J664K03k821K521j459R15O01N75n73L56m02j599J619m94o88K224
8113A188j769l82J726J24r48J798k678J409K25j43k37P44j141J34r92J246k54
$$ plain form
8130 50 1759 -98 -859 1288 -1859 -7 1123 -356 150 19 -991 110 1431 -1010 -294 1376
8146 1376 -1110 489 465 -1041 957 1524 -1232 666 475 -820 1550 -174 -444 829 -408 -205
8162 -205 1510 92 -1121 802 287 163 834 927 -175 762 -687 -846 2015 -98 -670 2530 255
8179 255 679 -153 154 -1270 1682 -1254 769 693 -972 547 1033 -330 1057 -745 -1450 -42 1742
8196 1742 -950 400 -401 -692 700 758 -2375 -237 467 -1321 1181 65 -203 1393 -699 -937 -1218
8213 -1218 295 -278 1172 -600 -472 -176 61 -799 1164 1182 -1114 -426 -801 360 2022 -602 -121
8230 -121 1469 -1476 415 245 297 -843 1789 -1290 114 220 -1508 -111 21 -416 1134 1750 -1440
8247 -1440 712 815 -973 1058 -139 -930 569 24 947 1281 506 -925 1138 722 20 895 -883
$$ packed form
8130E0J709j857p61K147l147J852J130j479N06j31j010J101J321k441P16J670
8146A376k486J599k4j506J998N67k756J898j91j295K370j724k70J273j237K03
8162b05J715j418j213J923n15j24O71R3j102R37j449j59K861k113n72L200k275
8179B55M24q32L07j424K952k936K023p6j665J519M86j363J387j802p05J408J784
8196A742k692J350q01k91J392N8l133K138P04j788K502j116k68J596k092k38k81
8213a218J513n73J450j772J28K96K37q60J963J8k296O88l75J161J662k624M81
8230a21J590k945J891j70N2j140K632l079J404J06j728J397J32m37J550O16l190
8247a440K152J03j788K031j197p91J499n45R23L34p75j431K063m16p02Q75j778
$$ plain form
8264 -883 -558 -529 -11 -368 2825 -663 -653 417 -926 -304 1354 261 -1670 1539 -1079 1716 -126
8281 -126 -875 677 983 -1580 402 1127 -1444 -859 1224 -968 71 1203 -753 795 479 -1325
8297 -1325 1755 534 -282 378 -613 -2491 -992 -410 -426 2012 274 -263 1196 -640 273 473 773
8314 773 -780 2180 220 -212 -79 157 342 1147 22 -2113 1290 -1010 -891 1080 105 661 2292
8331 2292 -1144 903 854 -1218 -1479 -158 191 -615 249 -1251 370 1100 -122 863 601 -399 -1153
8348 -1153 -188 -2205 -588 915 -1654 331 1195 -2334 -602 352 -2522 383 -744 -1263 1691 -912
8364 -912 -1301 109 985 -657 1064 803 -116 1720 994 79 1390 -624 -1160 922 -271 281 -129
8381 -129 -1411 88 -523 -907 -1079 482 -891 -888 765 889 998 -660 -800 819 -221 -1758 578
$$ packed form
8264h83L25K9N18l57L193l488J0J070j343O22J658j093j931L209k618K795j842
8281a26p49J552L06k563J982P25k571N85K083k192J039J132j956J548l16j804
8297a325L080j221q16O60r91j878J499N82j6K438j738n37J459j836R13K00L00
8314G73j553K960j960m32J33K36J85Q05j125k135L403k300J19J971r75N56J631
8331B292l436K047m9k072k61J321L49q06Q64j500J621P30j222R85k62j000p54
8348a153R65k017J617J503k569J985Q64l529J732R54k874K905j127n19K954k603
8364i12l89J410Q76j642J721k61r19J836p26r15J311k014n36K082j193N52m10
8381a29j282J499o11l84j72J561j373LJ653J24J09j658j40J619j040j537K336
$$ plain form
8398 578 74 -2161 821 -354 -687 124 264 -1005 1748 496 -1030 1636 162 -689 167 -709 -1062
8415 -1062 2273 -813 -546 249 101 78 -121 -1196 -2650 192 -123 -1301 -16 248 -1741 1930 1451
8432 1451 -134 311 -832 -395 868 -1119 -610 1593 -680 524 226 -867 -88 319 -609 -227 -899
8449 -899 -1193 -175 739 -304 360 1069 771 70 38 84 277 -182 -168 -543 -1780 -1070 292 -256 201 947
8469 947 502 -625 -58 -2572 -70 1750 -895 -431 1663 -168 -224 1565 -1454 -63 706 -1265 533
8486 533 1495 -582 -460 1431 -501 430 1188 -1423 1374 565 -1541 772 741 -936 -843 484 -516
8503 -516 1255 255 472 278 -383 -1457 908 -235 -242 1207 122 -237 1357 447 -592 957 146
8520 146 -2305 1797 -944 -615 191 1253 1502 1037 -471 496 1726 224 1184 1176 1122 307 709 -626
$$ packed form
8398E78n04k235K982j175l33Q11J40j269K753j252j526K666j474q51Q56q76l53
8415a062L335l086K67P95j48k3j99j075j454K842l15j178J285K64j989L671m79
8432A451j585M45j143M37J263j987N09K203k273J204k98j093P79M07r28L82o72
8449h99k94J018R14j043O64P09k98p01l2M6J93m59J4l75j237P10J362n48M57P46
8469I47m45j127N67k514K502J820k645M64K094j831n6J789l019J391P69j971J798
8486E33R62k077J22J891j932R31P58k611K797q09k106K313l1j677R3J327j000
8503e16J771j000K17j94o61j074K365j143pJ449j085l59J594r10j039J549q11
8520A46k451M102k741L29Q06J062K49m65j508R67J230j502R60qn4q15M02j335
$$ plain form
8538 -626 523 -424 -1415 403 706 -553 -378 1531 -426 636 250 -1147 -191 190 -397 269 1691
8555 1691 -980 348 -60 -2048 78 702 -558 1549 -1592 -1253 1018 -182 326 1204 222 -1786
8571 -1786 -468 -577 -63 2257 -820 244 1907 -590 65 963 -910 -221 1213 -1594 -410 1410
8587 1410 -904 -224 528 -328 934 1161 -943 -1796 -528 -593 413 454 -839 955 468 -462 214 709
8605 709 317 541 497 423 81 -85 -915 1220 430 -2748 470 -515 -447 726 1453 -1058 1366 -1075 -370
8624 -370 1645 -1234 -1407 1156 -751 -1735 2007 277 -294 1429 -1447 147 1339 -40 693 -1182
8640 -1182 -876 1124 1320 -464 559 410 -756 209 193 -991 699 1217 -1417 533 1045 -1739 399
8657 399 1278 -1850 745 1002 -878 -147 636 -1434 467 192 -332 375 -70 -756 690 -45 -54 1713
$$ packed form
8538f26J149r47r91J818L03j259J75J909j957J062l86j397R56L81n87O66J422
8555A691k671J328m08j988K126O24j260K107l141L39K271j200N08Q78r82k008
8571a786J318j09N14K320l077J064J663k497O55Q98j873O89J434k807J184J820
8587A410k314O80P52q56J262K27k104q53J268o5J006M1j293J794m87r30O76M95
8605G09l92K24m4p4l42j66q30K135p90l178L218r85O8J173P27k511K424k441P05
8624c70K015k879j73K563j907r84L742j730n71J723k876J594J192j379P33j875
8640a182L06K000J96j784J023j49j166R65j6j184J690N18k634J950N12k784K138
8657C99Q79l128K595K57j880P31P83k070J901k75n24P07m45o86J446p35rJ767
$$ plain form
8675 1713 -390 -80 1253 669 -712 1927 248 -268 576 -347 -207 1831 -2023 -91 646 -435 1351
8692 1351 314 -2823 -818 2217 -774 710 1034 -826 745 230 -848 584 -73 -2035 734 488
8708 488 -1740 2577 -597 -450 635 80 -441 1775 -148 -773 774 -793 -1206 171 829 -914 615
8725 615 1467 -430 1648 -198 -873 2940 -217 -115 2289 -53 168 -579 -616 1194 968 -1277 832
8742 832 481 -1997 258 965 -2554 -979 940 276 1274 -556 -197 1044 261 -2547 1265 511 -746
8759 -746 1307 -633 514 1133 492 -1224 -311 -1041 -171 279 190 -790 832 215 -1594 -524 -1469 -1311
8777 -1311 -1131 -1678 760 -158 -654 607 355 -1478 287 2094 1100 593 -264 -1321 73 624 -1349
8794 -1349 -1497 1327 808 -308 429 -1132 1994 189 44 1333 -187 -2384 237 130 -1645 -206
$$ packed form
8675A713k103L10J333n84j381K639j679n16Q44r23J40K038l854J932P37j081J786
8692A351j037l137K005L035k991J484L24j860J571n15j078J432o57j962K769k46
8708D88k228M317l174J47J085n55n21K216j923o25J547j567m13J377O58j743J529
8725F15Q52j897K078j846o75L813l157J02K404k342K21p47l7J810k26k245K109
8742H32l51k478K255P07l519J575J919o64R98j830L59J241p83k808L812p54j257
8759g46K053j940J147O19o41j716R13p30Q70M50q9r80J622o17j809J070r45J58
8777a311J80n47K438r18m96J261k52j833J765J807r94n07q57j057J394N51j973
8794a349j48K824n19j116P37j561L126j805j45J289j520k197K621j07j775J439
$$ plain form
8810 -206 748 -802 886 -975 -666 1566 224 -835 1010 635 -1243 1903 804 -1397 963 -1149
8826 -1149 -753 519 -312 -598 1460 -175 381 506 -951 -86 1032 -660 606 -208 -900 -1075 267
8843 267 621 -1032 289 -1162 401 507 376 -796 123 -885 1166 489 -1154 844 -345 -2217
8859 -2217 922 843 -460 1697 358 -1922 -243 -512 -272 1346 -21 -1386 1322 85 -1631 885
8875 885 -122 -1210 497 117 -21 -458 -297 -2085 1084 -1915 -758 1731 -2412 -616 772 -2011
8891 -2011 -547 1202 -2487 -381 687 -568 979 870 -413 992 -1187 -727 -743 -441 -1384 218
8907 218 933 -1242 1040 374 -1269 -125 -208 -996 523 444 -1555 559 -1159 -1557 1021 817 -891
8924 -891 -64 112 374 1729 508 -1230 753 -1015 -1120 1850 -909 -368 694 -80 -438 758 -1607
$$ packed form
8810b06R54j550J688j861L09K232j342j059J845l75j878L146j099k201K360k112
8826a149L96J272q31k86K058j635N56J25j457Q65J118j692J266q14o92j75J342
8843B67L54j653J321j451J563J06j31j172R19j008K051o77j643J998j189j872
8859b217L139p9j303K157j339k280J679k69K40J618j367j365K708j237j716K516
8875H85j007j088J707l80j38m37J61j788L169k999J157K489m143J796J388k783
8891b011J464J749l689K106J068j255J547j09j283J405k179M60j6L02r43J602
8907B18P15k175K282o66j643J144q3p88J519p9j999K114j718l98K578k04j708
8924h91Q27J76K62J355j221j738J983j768j05K970k759N41J062p74l58J196k365
$$ plain form
8941 -1607 763 1365 -1061 -802 765 681 -123 936 -1914 312 900 -17 -280 271 -2042 1254 913
8958 913 -635 -850 457 398 796 -620 -263 1971 -367 684 1269 -1280 681 1027 -234 -607 1860
8975 1860 1565 111 1527 28 -948 -246 -453 158 1070 -123 -18 559 -868 -802 937 393 334 2181
8993 2181 -298 703 1092 -1078 -878 740 414 159 715 -1639 1770 1290 -1698 -1671 227 -142 800
9010 800 1207 -2542 1338 -238 183 1038 -671 -459 987 -296 -1430 91 -1349 -376 816 -827
9026 -827 -114 647 -974 -293 748 299 -495 1487 -1338 -812 1392 -755 733 990 -239 645 1862
9043 1862 -1537 -521 2027 26 730 1000 -373 247 -681 -21 883 -627 -994 651 -17 -1582 -1247
9060 -1247 755 -1851 768 -6 -145 811 -462 -250 1052 618 -1003 1130 -53 -834 885 -2058
$$ packed form
8941a607K370O02k426K59J567q4q04J059k850K226N88r17k63N51k313L296l41
8958I13j548k15J307n9L98j416L57K234k338J051N85k549J961L46j261l73K467
8975A860k95j454J416j499r76P02k07O11R12j193J05N77j427O6J739n44n9J847
8993B181k479J001L89k170K00J618l26k55N56k354L409m80k988K7J898l69R42
9010H00M07l749L880j576M21Q55j709K12J446j283j134J521j440R73J192j643
9026h27P13P61j621O81J041m49p94J982k825N26K204k147J488K57j229Q84J217
9043A862l399J016K548k001P04K70j373O20r28O60R04j510l67J645o68j565L35
9060a247K002k606K619p74j39R56j273K12J302m34j621K133j183p81J719k943
$$ plain form
9076 -2058 -291 823 -1396 815 1594 -295 731 870 -1739 -115 188 -1682 -471 811 -466 131
9092 131 628 -471 406 153 -1148 959 202 -354 -1193 774 -1010 1637 -472 -1570 1179 -170 -1836
9109 -1836 275 604 -2189 1837 335 -1219 2105 990 -1089 1704 -1405 -1210 172 400 52 696
9125 696 -1 -953 834 -565 325 1105 -885 203 -1347 -2086 543 275 60 502 1618 -330 1215
9142 1215 1550 -516 -593 274 -1204 80 776 -583 202 -5 -111 787 339 -861 583 980 -819 1071
9160 1071 1450 -473 1213 -160 -2506 1045 1310 -2477 2861 114 -1426 831 -480 -833 -453 -112
9176 -112 -288 2456 -18 -286 1555 -1158 -411 869 -1693 -537 1168 1544 1127 868 -463 999 -155
9193 -155 -1760 510 -892 -1175 -262 873 -648 -986 980 -1590 1992 1293 -1073 328 981 -239
$$ packed form
9076b058J767J114k219K211P79j889J026J39k609J624L03j870J211J282j277N97
9092A31M97j099Q77k53j301K107p57n56q39J967j784K647k109j098K749j349j666
9109a836K111L29k793M026j502j554L324j115k079K793l109J95J382K28l48O44
9125F96o97r52J787j399Q90P80j990J088j550p39K629k68k15M42J116j948J545
9142A215L35k066p7Q67j478J284O96j359P85k07j06Q98m48j200J444L97j799J890
9160A071L79j923J686j373k346L551K65l787N338k747j540K257j311l53L80L41
9176a12j76K744k474k68J841k713P47J280k562J156J705L76m17k59j331J462j154
9193a55j605K270j402k83R13J135j521l38J966k570L582o99k366J401O53j220
$$ plain form
9209 -239 631 1915 -649 442 -283 -932 1145 -773 -1238 1737 -79 -1525 1589 -12 -1401 365
9225 365 -536 -642 829 -700 -1008 1362 -1440 -820 1074 -520 -851 557 -2587 580 1113 -1404 -106
9242 -106 1420 -767 505 1246 -1169 711 1026 -1491 -349 848 -45 607 -80 -1473 -129 1805
9258 1805 -1530 637 -781 -492 426 -678 -1688 2434 -643 -847 1384 -200 355 2496 116 -1613
9274 -1613 900 -464 12 1797 -709 -280 -956 65 -861 -849 -1117 279 627 -1643 -613 -1139 502
9291 502 570 -691 -1474 -978 -493 -723 -739 417 1470 2256 -820 -838 647 937 -1204 574 -493 -132
9309 -132 1633 33 84 874 506 -398 976 1355 -775 19 -316 -648 48 694 -848 365 -407 718
9327 718 2731 -272 311 796 -1305 158 600 -327 -1335 628 -1541 74 1662 -529 231 2392
$$ packed form
9209b39Q70J284k564J091p25o49K077j918m65K975j816j446L114j601j389J766
9225C65r01j06J471j529l08K370k802O20J894j594l31J408l144L167N33k517J298
9242a06J526k187J272P41k415J880L15k517J142J197q93O52o87j393J344J934
9258A805l335K167j418K89R18j104j010M122l077k04K231j584N55K141k380j729
9274a613K513j364M76J785k506M29o76J021r26J2k68J396L48k270J030n26J641
9291E02O8j261p83M96M85k30j6J156J053P86l076j8J485K90k141J778j067L61
9309a32J765j600N1P90l68r04J374L79k130P94l35l32O96O46j542J213p72J125
9327G18K013l003N83M85k101J463M42r27j008J963k169J615J588k191P60K161
$$ plain form
9343 2392 -623 241 460 171 351 820 -2372 -142 166 215 1310 795 -1274 28 1083 -357 528
9360 528 939 320 900 288 -1368 -970 -624 -745 679 -813 -1422 462 -1155 -849 928 198 256 1320
9378 1320 1584 -672 1507 -98 1170 1299 -1048 936 -386 -510 -697 1115 -958 141 652 -398
9394 -398 -934 438 -590 1548 947 -648 -609 43 -1378 1627 -441 385 -262 1202 -794 367 383
9411 383 246 525 149 137 1922 -655 -1371 1072 -553 -323 280 146 -1802 558 -174 -681 1293 -313
9429 -313 -89 1889 -477 544 1438 -750 150 2421 -1979 -393 1494 -690 74 2052 -569 1037
9445 1037 -451 -499 1438 775 -1416 1428 403 -431 1377 1752 -841 1035 814 -1354 1953 304
9461 304 -289 237 1203 -868 907 275 -1467 99 179 284 1486 -210 255 685 -247 487 -467 -976
$$ packed form
9343B392l015Q64K19k89J80M69l192K230L08M9J095n15k069J302J055j440Q85
9360E28M11o19N80o12j656L98L46j21J424j492o09J884j617L06J777p30N8J064
9378A320K64k256K179j605J268J29k347J984j322j24j87J812k073J099N11j050
9394c98n36J372j028K138o01j595L9O52j421L005k068Q26o47J464j996J161J6
9411C83j37K79l76j2J785k577p16K443j625K30O03j34j948K360p32n07J974j606
9429c13K24J978k366J021Q94k188R00K271m400J586J887k184P64J978k621J606
9445A037j488m8J937o63k191K844j025q34J808L75k593J876k21k168L307j649
9461C04n93N26R66k071J775o32j742J566Q0J05J202j696M65M30r32P34r54n09
$$ plain form
9479 -976 -201 1037 -1310 88 1768 -1791 563 1432 -813 -851 1615 -270 73 2005 -466 -60 844
9496 844 -2250 424 448 -1008 -172 1299 -1040 1057 17 -885 391 414 -509 2022 38 -1411 993
9513 993 229 -318 308 -647 -586 1686 787 -442 1416 -1722 -896 250 -1310 297 1589 303 -2362
9530 -2362 1072 -680 -1014 -682 -549 -786 988 -1667 -1677 2195 -880 -758 361 -1830 -141 1027 -918
9547 -918 -320 442 -677 1036 1964 -2954 360 619 -467 2151 112 -1265 1002 1586 -985 1548
9563 1548 -455 -1231 1445 -1364 -480 1226 272 -824 1054 -879 255 1440 -371 -528 1341 403
9579 403 124 1450 -1118 -414 1550 437 -1407 1618 32 788 632 -1617 1505 972 -782 558
9595 558 -126 -834 670 1399 -1387 1353 497 -1508 1019 875 -2257 473 1117 -447 2033 1640 -939
$$ packed form
9479i76P75J238k347J398J680l559K354Q69k245l8K466j885L43J932k471M06R04
9496H44l094K674K4j456Q36J471k339K097j040r02J276K3r23K531j984j449K404
9513I93p64n47O26r55O1K272q99j229J858l138Q26J146j560J607J292j286k665
9530b362L434j752l34L32J33k37J774k655j0L872l075J22J119k191J689J168j945
9547i18N98P62j119J713R28m918L314K59j086K618k039j377K267N84k571K533
9563A548k003p76K676k809Q84J706r54j096J878j933J134J185j811j57J869r38
9579D03k79J326k568P04J964j113j844L025j586P56j56k249L122n33j754J340
9595E58o84p08J504P29k786K740q56k005K527j44l132K730O44j564K480l93k579
$$ plain form
9612 -939 1095 528 -732 832 -146 754 301 -1280 60 1021 -21 -443 977 -332 -563 456 -1180
9629 -1180 -511 -1084 -1738 497 223 -1183 -607 987 -1285 1112 963 -868 -1369 1066 2 616 875
9646 875 -1030 1129 1244 -147 596 -1125 -1251 -656 584 -369 403 41 28 2439 759 -1683 -908 533
9664 533 -535 360 -1047 -2317 -674 376 -1744 42 1205 -1149 718 -533 -1161 352 -411 -53
9680 -53 1315 -1310 -232 2258 -2009 -463 1539 -1426 1855 1401 -1452 564 740 -1278 457 2341
9696 2341 -1591 948 499 -1055 129 -285 -849 336 513 521 -709 -143 -633 1479 10 -1205 1694
9713 1694 -153 -518 1114 -509 -881 761 -556 78 674 153 -197 1267 -864 -627 489 -1453 -783
9730 -783 128 -1014 -223 1176 -475 594 774 -1721 -28 -762 -640 1121 36 -1679 398 1032 -1364
$$ packed form
9612i39K034n67j260J564r78R00m53j581J340R61j042m22J420j309k31J019j636
9629a180O69n73o54K235k74j406N76J594k272K397j49j831n01K435j064O14K59
9646H75j905K159J15j391P43j721j26N95J240r53P72l62j3K411j680k442P75J441
9664E33j068Q95j407j270J643J050k120J786J163k354J867j251o28J513p63L58
9680e3J368k625J078K490m267J546K002k965L281m54k853K016J76k018J735J884
9696B341l932K539m49j554J184m14n64J185J77Qj230N66m90K112j469j215K899
9713A694j847l65J632j623l72J642j317O34N96n21l50J464k131K37J116j942O70
9730g83R11j142P91J399j651J069J80k495J693p34J22J761j085j715K077O34k396
$$ plain form
9747 -1364 -343 2213 -1050 -283 1031 -1951 -165 -776 -1474 1022 777 -1391 -1019 368 -885 -586
9763 -586 -246 -1133 382 187 -4470 -283 533 -979 1840 -1015 -333 1483 -1317 160 1120 -805 -438
9780 -438 1897 316 -303 1280 153 103 1387 -899 -1007 2643 -482 400 1302 -1300 -944 1091 -180
9797 -180 -1318 545 60 -13 216 -822 1376 1359 427 -1490 319 452 677 162 -719 985 -1564 -1548
9815 -1548 2103 -1700 -461 631 60 -628 326 585 -843 2779 -343 -499 647 -1206 -12 1119
9831 1119 109 635 1252 -1319 -55 240 -494 -244 77 -150 1192 72 -1104 16 436 -150 953
9848 953 785 -3295 1706 887 -1755 221 1044 -657 -262 1165 -1435 456 -106 -370 1798 904 -697
9865 -697 1681 152 -625 1179 -24 208 2499 -629 271 -908 -1482 -1358 392 -1151 296 -299 472
$$ packed form
9747a364J021K556l263P67J314k982J786o11o98K496k45k168L72J387j253K99
9763e86L40q87J515j95m657M187Q16j512K819k855O82J816k800J477R60j925L67
9780d38K335j581o19J583j127n0J284k286j08L650l125Q82R02k602L56K035j271
9797a80j138J863m85p3K29j038K198j7r32j917J809J33K25n15q81J704k549J6
9815a548L651l803J239J092n71o88R54K59j428L622l122j56J146j853J194J131
9831A119j010N26O17k571J264K95p34K50L21k27J342j120j176J120M20n86J103
9848I53j68m080N001q19k642J976Q23j701L95J427k600J891n62k64K168q94j601
9865f97K378j529p77J804j203K32K291l128R00j179n74J24J750j543J447n95P71
$$ plain form
9882 472 286 1330 -124 -640 1109 -377 1578 119 -2051 326 1057 -1737 823 -245 -1004 512
9898 512 564 -2091 715 -56 -1688 1279 1344 -1830 547 787 -1880 826 59 -1819 2053 339 -1417
9915 -1417 410 1494 -321 757 -108 -1204 669 -2277 350 162 -1123 345 1118 646 -1125 820
9931 820 -893 -35 1736 -808 -820 1213 -259 -1045 618 -756 63 1408 -1179 -12 1700 -677
9947 -677 269 1548 -1779 1563 1380 -888 443 -461 -940 -191 609 110 1093 372 -1968 1064 665 -1494
9965 -1494 931 -864 -1086 1443 78 -1021 317 -648 -599 924 -663 382 1638 -444 117 976
9981 976 -1721 -900 1678 -765 783 326 65 -582 967 -285 322 62 -1107 401 -312 -2012 699
9998 699 323 -1263 922 627 -911 595 1039 -1628 533 17 -293 1512 193 -765 1708 1620 -1027
$$ packed form
9882D72j86J044j454n16J749j486J955j459k170K377P31k794K560j068p59J516
9898E12N2k655K806p71j632K967O5l174K377K40k667K706p67j878L872j714j756
9915a417J827J084j815J078q65j096J873k946K627j88j285J468P73m72j771J945
9931H20j713Q58J771k544j2K033j472p86J663j374Q19J345k587J167J712k377
9947f77R46J279l327L342j83k268J331r04m79P49Q00m99R83p21k340L032l99k159
9965a494K425j795k22K529j365j099J338r65M9J523j587J045J256k082N61Q59
9981I76k697Q21K578k443J548m57k61o47J549j252O07k60j169J508p13j700K711
9998F99l76j586K185k95j538J506M44k667K161n16l10J805j319r58K473q8k647
$$ [...]
16383C14
##END NTUPLES=NMR FID
##END=
