##TITLE=31Pdec_SR55_pr
 , 124 sc
 26.04.2021
##JCAMPDX= 6.0         $$ Bruker NMR JCAMP-DX V2.0
##DATA TYPE= NMR SPECTRUM
##DATA CLASS= NTUPLES
##ORIGIN= UXNMR, Bruker Analytische Messtechnik GmbH
##OWNER= root
$$ XWIN-NMR		Version 3.5
$$ Mon Apr 26 14:17:40 2021 Russian Standard Time (UT+4h)  she@DPX200
##.OBSERVE FREQUENCY= 81.013821
##.OBSERVE NUCLEUS= ^31P
##.ACQUISITION MODE= SIMULTANEOUS
##.ACQUISITION SCHEME= undefined
##.AVERAGES= 124
##.DIGITISER RES= 16
##SPECTROMETER/DATA SYSTEM= spect
##.PULSE SEQUENCE= zgpg30
##.SOLVENT NAME= D2O
##.SHIFT REFERENCE= (INTERNAL, D2O, 0, 248.564)
##AUDIT TRAIL= $$ (NUMBER, WHEN, WHO, WHERE, WHAT)
$$ ##TITLE= Audit trail, XWIN-NMR		Version 3.5
$$ ##JCAMPDX= 5.01
$$ ##ORIGIN= Bruker BioSpin GmbH
$$ ##OWNER= she
$$ F:/spectra/data/she/nmr/P31/1/pdata/1/auditp.txt
$$ ##AUDIT TRAIL=  $$ (NUMBER, WHEN, WHO, WHERE, WHAT)
(   1,<2021-04-26 14:15:42.10 +0400>,<she>,<DPX200>,
      <continue with go, POWCHK disabled, PULCHK disabled
       configuration hash MD5:
       00 E9 B6 7A A2 85 ED C7 34 08 36 98 17 FE 4E 26
       data hash MD5: 32K
       44 31 0D 5D 9C 64 83 29 37 2F 6F 35 E8 4C 70 8A>)
(   2,<2021-04-26 14:16:36.31 +0400>,<she>,<DPX200>,
      <Start of raw data processing
       efp BC_mod = 2 LB = 1 FT_mod = 6 PKNL = 1 PHC0 = -5590.552 PHC1 = 572.8018 SI = 64K 
       data hash MD5: 64K
       DE 67 96 CC BF AF 97 47 C4 FE 6B 2C 3C 3C 05 D9>)
(   3,<2021-04-26 14:16:59.45 +0400>,<she>,<DPX200>,
      <pk PHC0 = 4.188194 PHC1 = 3.8 
       data hash MD5: 64K
       91 88 8A B4 57 D5 2A 92 47 56 9C 26 D1 C8 E7 48>)
(   4,<2021-04-26 14:17:02.82 +0400>,<she>,<DPX200>,
      <abs ABSG = 5 
       data hash MD5: 64K
       CF 0D 43 EE 7D 20 1C D8 F5 ED 8B B4 E7 05 FC 1E>)
$$ ##END=
$$ 
$$ hash MD5
$$ DB AB 2A 20 7E B8 CD 3A F2 24 0A 69 01 91 A6 99
##$RELAX= 
##$RELAX= 
##$RELAX= 
##$RELAX= 
##$RELAX= 
##$RELAX= 
##$RELAX= 
##$RELAX= 
$$ Bruker specific parameters
$$ --------------------------
##$DU= <F:/spectra>
##$EXPNO= 1
##$NAME= <P31>
##$PROCNO= 1
##$TYPE= <nmr>
##$USER= <she>
##$AMP= (0..31)
100 100 100 100 100 100 100 100 100 100 100 100 100 100 100 100 100 100 
100 100 100 100 100 100 100 100 100 100 100 100 100 100 
##$AQSEQ= 0
##$AQ_mod= 1
##$AUNM= <au_zg>
##$AUTOPOS= <>
##$BF1= 81.014009
##$BF2= 200.13
##$BF3= 200.13
##$BF4= 200.13
##$BF5= 200.13
##$BF6= 200.13
##$BF7= 200.13
##$BF8= 200.13
##$BYTORDA= 1
##$CFDGTYP= 0
##$CFRGTYP= 5
##$CHEMSTR= <none>
##$CNST= (0..31)
1 1 145 1 1 1 1 1 1 1 1 1 1 1 1 1 1 1 1 1 1 1 1 1 1 1 1 1 1 1 1 1 
##$CPDPRG= <waltz16>
##$CPDPRG1= <>
##$CPDPRG2= <waltz16>
##$CPDPRG3= <>
##$CPDPRG4= <mlev>
##$CPDPRG5= <mlev>
##$CPDPRG6= <mlev>
##$CPDPRG7= <mlev>
##$CPDPRG8= <mlev>
##$CPDPRGB= <>
##$CPDPRGT= <>
##$D= (0..31)
0 1 0 0 0 0 0 0 0 0 0 0.03 2e-05 3e-06 0 0 0 0 0 0 0 0 0 0 0 0 0 0 0 0 
0 0 
##$DATE= 1619431921
##$DBL= (0..7)
120 120 120 11 120 120 24 19 
##$DBP= (0..7)
150 150 150 150 150 150 150 150 
##$DBP07= 0
##$DBPNAM0= <>
##$DBPNAM1= <>
##$DBPNAM2= <>
$$ [...]
##$SUBNAM3= <"">
##$SUBNAM4= <"">
##$SUBNAM5= <"">
##$SUBNAM6= <"">
##$SUBNAM7= <"">
##$SUBNAM8= <"">
##$SUBNAM9= <"">
##$SW= 501.771253377433
##$SWIBOX= (0..15)
0 1 3 0 0 0 0 0 0 0 0 0 0 0 0 0 
##$SW_h= 40650.406504065
##$TD= 32768
##$TD0= 1
##$TE= 0
##$TE2= 300
##$TE3= 300
##$TEG= 300
##$TL= (0..7)
0 120 53 12 22 120 120 120 
##$TP= (0..7)
150 150 150 150 150 150 150 150 
##$TP07= 0
##$TPNAME0= <>
##$TPNAME1= <>
##$TPNAME2= <>
##$TPNAME3= <>
##$TPNAME4= <>
##$TPNAME5= <>
##$TPNAME6= <>
##$TPNAME7= <>
##$TPOAL= (0..7)
0.5 0.5 0.5 0.5 0.5 0.5 0.5 0.5 
##$TPOFFS= (0..7)
0 0 0 0 0 0 0 0 
##$TUNHIN= 0
##$TUNHOUT= 0
##$TUNXOUT= 0
##$USERA1= <user>
##$USERA2= <user>
##$USERA3= <user>
##$USERA4= <user>
##$USERA5= <user>
##$V9= 5
##$VALIST= <valist>
##$VCLIST= <CCCCCCCCCCCCCCC>
##$VD= 0
##$VDLIST= <DDDDDDDDDDDDDDD>
##$VPLIST= <PPPPPPPPPPPPPPP>
##$VTLIST= <TTTTTTTTTTTTTTT>
##$WBST= 1024
##$WBSW= 4
##$XGAIN= (0..3)
0 0 0 0 
##$XL= 0
##$YL= 0
##$YMAX_a= 6653
##$YMIN_a= -11953
##$ZGOPTNS= <>
##$ZL1= 120
##$ZL2= 120
##$ZL3= 120
##$ZL4= 120
##$ABSF1= 248.5645
##$ABSF2= -253.2056
##$ABSG= 5
##$ABSL= 3
##$ALPHA= 0
##$AQORDER= 0
##$ASSFAC= 0
##$ASSFACI= 0
##$ASSFACX= 0
##$ASSWID= 0
##$AUNMP= <proc_1d>
##$AZFE= 0.1
##$AZFW= 0.5
##$BCFW= 0
##$BC_mod= 2
##$BYTORDP= 0
##$COROFFS= 0
##$CY= -3
##$DATMOD= 1
##$DC= 0
##$DFILT= <>
##$DTYPP= 0
##$F1P= 0
##$F2P= 0
##$FCOR= 1
##$FTSIZE= 65536
##$FT_mod= 6
##$GAMMA= 0
##$GB= 0
##$INTBC= 1
##$INTSCL= 5.30512e-09
##$ISEN= 30
##$LB= 1
##$LEV0= 0
##$LPBIN= 0
##$MAXI= 10000
##$MC2= 0
##$MEAN= 0
##$ME_mod= 0
##$MI= 50
##$NCOEF= 0
##$NC_proc= -5
##$NLEV= 6
##$NOISF1= 182.463
##$NOISF2= 159.3651
##$NSP= 0
##$NTH_PI= 0
##$NZP= 0
##$OFFSET= 248.5645
##$PC= 4
##$PHC0= -5586.364
##$PHC1= 576.6018
##$PH_mod= 1
##$PKNL= yes
##$PPARMOD= 0
##$PSCAL= 0
##$PSIGN= 0
##$REVERSE= no
##$SF= 81.014009
##$SI= 65536
##$SIGF1= 159.3651
##$SIGF2= -187.1042
##$SINO= 113.3802
##$SIOLD= 16384
##$SREGLST= <1H.CDCl3>
##$SSB= 0
##$STSI= 65536
##$STSR= 0
##$SW_p= 40650.406504065
##$SYMM= 0
##$S_DEV= 0
##$TDeff= 32768
##$TDoff= 0
##$TI= <>
##$TILT= no
##$TM1= 0
##$TM2= 0
##$TOPLEV= 0
##$USERP1= <user>
##$USERP2= <user>
##$USERP3= <user>
##$USERP4= <user>
##$USERP5= <user>
##$WDW= 1
##$XDIM= 65536
##$YMAX_p= 494677868
##$YMIN_p= -19622778
$$ End of Bruker specific parameters
$$ ---------------------------------
##NTUPLES= NMR SPECTRUM
##VAR_NAME=  FREQUENCY,     SPECTRUM/REAL,   SPECTRUM/IMAG
##SYMBOL=    X,             R,               I
##VAR_TYPE=  INDEPENDENT,   DEPENDENT,       DEPENDENT
##VAR_FORM=  AFFN,          ASDF,            ASDF
##VAR_DIM=   65536,         65536,           65536
##UNITS=     HZ,            ARBITRARY UNITS, ARBITRARY UNITS
##FACTOR=    0.620285442955139, 1,           1
##FIRST=     20137.2065510759, 0,            0
##LAST=      -20513.1999529892, 0,           0
##MIN=       -20513.1999529892, -19622778,   0
##MAX=       20137.2065510759, 494677868,    0
$$ Real data points
##PAGE= N=1
##DATA TABLE= (X++(R..R)), XYDATA
$$ [...]
13099h08019J037281M12387j444223j130945J687307L159142N74830l471945m244975
13090d229160r86872K401110K620886P22652j89064P16017J495237N46177j311686
13081A785297j986883m74212K096906L345504J782352j440744l332531k265943
13073d90254J48900J249432O52977J4829M4657k15436j052058j212316j94658
13064a053927M99663l23837j478722j071321Q44353K622129L069158J916672o01904
13055D422264l146060l391015o80361K251548K309449K41378n35657Q70928J552843
13046C895317n38184l226815l185098p10851Q17102k18323j519056k76255K655497
13037b306666L570689Q49505k569067k884158m87673Q79793k25251j057063N46299
$$ y = [-808019, 229262, 641649, -802574, -1933519, -246212, 2912930, 3487760, 15815, -4229160, -5216032, -2814922, -194036, 528616, 339552, 1055569, 2550806, 3096983, 1785297, -201586, -675798, 1421108, 4766612, 6548964, 5108220, 1775689, -490254, -341354, 908078, 1561055, 1575884, 1620541, 1405105, 353047, -859269, -1053927, -554264, -878101, -2356823, -3428144, -2583791, 38338, 3107496, 5024168, 4422264, 1276204, -2114811, -2795172, -543624, 1765825, 2007203, 1471546, 2342474, 3895317, 3357133, 130318, -3054780, -3765631, -2948529, -3166852, -4685908, -4962163, -2306666, 1264023, 2113528, -455539, -3339697, -3827370, -2947577, -3172828, -4229891, -3683592]
13028c683592K500206J911733k32290r33254k6780L68043Q6890P11387J691984
13019B394327Q30488j331326j836479m40765L4714p77884N6218K603131K616321
13010D148745r65399k786713L92616L311668K37735n014827m442961J434529M319838
13001F35231R39898k884217k105837R25514K205094K070111J992334O71458k522009
12992A927577m259648j779415K169800L009302Q39717n94779Q1677O85963l33035
12983A747159j745158j737016j72317J502795J553251l77588k280680j620287
12975c129841J266495L312455K937243J859055J623302J015753j197554l420742
12967D266166l468430j739382N816J160131J535591K88885k078541k837542p54631
$$ y = [-3683592, -1183386, 728347, 496057, -437197, -463977, -95934, -9044, 702343, 2394327, 3224815, 1893489, 57010, -383755, -349041, -1126925, -1070707, 1532424, 4148745, 3183346, 396633, 789249, 4100917, 4338652, -676175, -5119136, -3684607, 635231, 1575129, -1309088, -3414925, -2489411, -284317, 1785794, 3778128, 4449586, 1927577, -2332071, -4111486, -1941686, 1067616, 1907333, 1312554, 1394231, 2080194, 1747159, 2001, -1735015, -1907332, -404537, 1148714, 771126, -1509554, -3129841, -1863346, 1449109, 4386352, 6245407, 7868709, 8884462, 7686908, 4266166, 797736, -941646, -935830, 224301, 1759892, 2048777, -29764, -2867306, -3621937]
12958c621937J429730R97405n39106l92474O21823J4120j376141o02485K133994
12949a335071L561372K256647o0584j676215k075710q06578J523191K201152o2573
12940C525631j979713k06118K578473J270542l119827m570045j505518J253805
12932b752770Q00840j30363N01377M39125j346495j538454J455088L586111J479254
12923B493713j891608k216978n47747l89242j522377j460649l34852K22607P32965
12914d914168K131914K647065O87513j340749n07326J439008R70545j025929r95282
12905i07409P78432P76177j298048j984569j23768J456593R56998l015J70593
12896a78016R53786J680339K156761J101071k306108n220570l732913Q72239L026199
$$ y = [-3621937, -2192207, -1194802, -1733908, -2126382, -1504559, -1490439, -2866580, -3469065, -1335071, 2226301, 4482948, 4422364, 2746149, 670439, -136139, 1387052, 3588204, 3525631, 1545918, 1339800, 3918273, 5188815, 2068988, -2501057, -4006575, -2752770, -1951930, -2082293, -1580916, -1141791, -2488286, -4026740, -2571652, 1014459, 2493713, 602105, -1614873, -2162620, -2551862, -4074239, -5534888, -5869740, -5647133, -4914168, -2782254, -135189, 552324, -788425, -1295751, 143257, 1113802, 87873, -907409, -128977, 647200, -650848, -2635417, -2759185, -1302592, -345594, -348609, -178016, 775770, 2456109, 4612870, 5713941, 3407833, -1812737, -5545650, -4673411, -1647212]
12887a647212R93857q29672N01422J751897m66832l420085k454526J475783L307670
12878g87698J490487m13945L64782K154774K045104J2103j639889j520371m49311
12869A256036R6918r0375J5046Q56938J267071N2628j839297k089316p8869K106042
12859A552822K215909L24643j706467k308040j295047K55336Q22981j05232j243100
12850a486195j020618J69679N10435l46538n37999J154688L122279K809786O8750
12841D444267k509328k542406m89886R59059J43210j360547p37097J880771L052827
12832B840870R01970j739780j340587Q71242Q19955j822367l016011q70270J340874
12823b014104N59609j246772o37341J559303J768670l70374j463121J62928J931702
$$ y = [-1647212, -653355, -1483027, -981605, 770292, 303460, -3116625, -5571151, -4095368, -787698, 702789, 288844, 653626, 2808400, 4853504, 4865607, 3225718, 1705347, 1256036, 1352954, 1262579, 1277625, 2134563, 3401634, 3454262, 1614965, -474351, -553220, 1552822, 3768731, 4093374, 2386907, 78867, -1216180, -960844, -137863, -243095, -1486195, -2506813, -2337134, -1826699, -2173237, -2711236, -1556548, 1565731, 4375517, 4444267, 1934939, -607467, -1097353, -138294, 4916, -1355631, -2092728, -211957, 2840870, 3742840, 2003060, 662473, 1533715, 2353670, 531303, -2484708, -3354978, -2014104, -1454495, -2701267, -3338608, -1779305, -10635, -381009, -1844130, -1681202, 250500]
12814B50500J153561j038257j814546q51088K0099L48813J357494K605830J553957
12805C586363k006265l998487j476001K172703J534868k427079l399482N13441
12797e499939L767898K238532o33924l93307J011370j85713j949731k72194K513039
12788E96031J130014k635290k037196K594342L241734k342224n851555j435420
12780f739564M853340M849469O72054l15419K021117J743819k073147l892153
12772A119516j106976K320240K644599R87122k32830p79544r34238k32525O21405
12763D406769j53917k118339k398333k9669K270810K017513J32069j217442j679788
12754A229673j932819j612717J8208K146968K761195J018182j391516j677403
$$ y = [250500, 1404061, 365804, -1448742, -2299830, -2279731, -1930918, -573424, 2032406, 3586363, 1580098, -2418389, -3894390, -1721687, -186819, -2613898, -6013380, -5499939, -1732041, 506491, -127433, -520740, 490630, 304917, -1644814, -1917008, 596031, 1726045, -909245, -2946441, -352099, 2889635, 547411, -5304144, -6739564, -1886224, 2963245, 3635299, 3319880, 5340997, 7084816, 5011669, 1119516, 12540, 2332780, 4977379, 5964501, 5731671, 4952127, 4017889, 3785364, 4406769, 4252852, 2134513, -263820, -293489, 1977321, 3994834, 4126903, 2909461, 1229673, -703146, -2315863, -2297655, -150687, 2610508, 3628690, 2237174, 559771]
12746E59771Q36511L173431J742270k722957n252684k861096J557595L510028
12738E42869K682318J497023J78470k483438m692707k995061J656830L960006
12730C46310J705084j105270n88001J428102J022325j532879k556279n56355J998208
12721A61245K147454k65636k635498k032572J738947N088672M033920p78022m295168
12712C163342l226072J75957J899744J375661O10558J43636j012015k364125k122975
12703a356289m24571M45261l44550p68591P36066K509632J908373p77032k465865
12694e37566j243933J285511K180921P73810r24339j172277n95328p40395j533162
12685b506758j414050K97613K390076L197881K141164j35678k181136k399891
$$ y = [559771, 1396282, 4569713, 6311983, 3589026, -1663658, -4524754, -2967159, 542869, 3225187, 4722210, 4900680, 2417242, -2275465, -5270526, -3613696, 346310, 2051394, 946124, 358123, 1786225, 2808550, 1275671, -1280608, -1836963, 161245, 2308699, 2043063, -592435, -2625007, -886060, 4202612, 8236532, 7458510, 3163342, -62730, 113227, 2012971, 3388632, 3999190, 4142826, 3130811, 766686, -1356289, -1780860, -1335599, -1680149, -2448740, -1712674, 796958, 2705331, 1928299, -537566, -1781499, -495988, 1684933, 2458743, 1534404, 362127, -233201, -973596, -2506758, -3920808, -3623195, -1233119, 1964762, 4105926, 3970248, 1789112, -610779]
12677f10779n23973J533394J592802L8957p76585p8260L44793p14744j885290
12668a079685j580774m17417L32249R35092J876807J901693j87990k808098l274949
12659d303072j642875k51232K18710J312019L210381L714001J966635M16806J167704
12650E809077K488948J293073k225264m800804m350701j916188M10916J535908
12642a755035J198005l93594k066510k147795l46843J519303J453930l64961j678295
12633d581795n80510K281117M052316K595022q21573k532172p63484K038491K349044
12624D036456J50027j500653j053308j60936l69293p28841r6946M55626l46078
12615C86054j256677l46214J455227J381612r05572k645746j759258Q79772L156141
$$ y = [-610779, -1134752, 398642, 1991444, 2030401, 1253816, 1175556, 1520349, 805605, -1079685, -2660459, -3077876, -2745627, -1810535, 66272, 1967965, 1779975, -1028123, -4303072, -5945947, -6197179, -5978469, -4666450, -1456069, 2257932, 4224567, 4641373, 5809077, 8298025, 9591098, 7365834, 2565030, -1785671, -3701859, -3290943, -1755035, -557030, -950624, -3017134, -5164929, -5511772, -3992469, -2538539, -2903500, -4581795, -5162305, -2881188, 1171128, 3766150, 2944577, 412405, -351079, 1687412, 4036456, 4186483, 2685830, 1632522, 1471586, 1102293, 373452, 276506, 732132, 386054, -870623, -1216837, 238390, 1620002, 714430, -1931316, -3690574, -2810802, 345339]
12606C45339L630892J691065j799709l756004j608722K448570L023292j243897
12598B730826n163521l908352O05193L282995L030975K295389J473123j078600
12590C268028l980107l236627J127254L720211J344940k261981k293433J00035
12582b211680N99358j081692j500175J98616J110381o6456r17404J74894J187220
12573b506938J35213j471748j341919j75012O4047j96858O50934J723944O75477
12564b442860j888347k514715n1544K441249K167446K69597o13020p2433Q25900
12555a878727J977444L404381L468929P24626l146537m809851l384549q98527
12547d542811Q75959J687457J403876J17388n06942J001548K677437J071593k890277
$$ y = [345339, 3976231, 5667296, 3867587, 111583, -1497139, 951431, 3974723, 2730826, -2432695, -6341047, -5735854, -2452859, 578116, 2873505, 4346628, 3268028, -712079, -3948706, -2821452, 898759, 2243699, -18282, -2311715, -2211680, -1612322, -2694014, -4194189, -3995573, -2885192, -2951648, -3869052, -3694158, -2506938, -2371725, -3843473, -5185392, -5360404, -5296357, -5493215, -4842281, -3118337, -2442860, -4331207, -6845922, -6897466, -4456217, -2288771, -2019174, -2632194, -2704627, -1878727, 98717, 3503098, 6972027, 7696653, 4550116, -259735, -3644284, -4542811, -3666852, -1979395, -575519, -458131, -965073, 36475, 2713912, 3785505, 895228]
12538H95228l910965O9466M149287L287943m81048j641706L83587J231030q56066
12529C126756k434757o37408K524945L404976J433867j224591k669163k265674
12521A258951l27079J641271J683957k30885j707402r84603P14227J192787L70358
12512C611582l17083n76738j239686k007638j429963N20406J754663Q74891p19828
12503D70606p78442O24605J334558L07041r67066p65566L06551K43793j302238
12494e26158k283028j012526J365255K167761N54138j481898j712965l54435N78314
12485b705542J14566n21295J20493J477770J665375J81966j211264p96804Q10316
12476h64419J598198Q57455k24741n62343m50208m04383N7343J387005K438651
$$ y = [895228, -3015737, -2946271, 1203016, 4490959, 4009911, 2368205, 2751792, 3982822, 3126756, 691999, 54591, 2579536, 5984512, 7418379, 6193788, 3524625, 1258951, 931872, 2573143, 4257100, 4026215, 2318813, 1334210, 2048437, 3241224, 3611582, 3294499, 2717761, 1478075, -529563, -1959526, -1439120, 315543, 1190434, 470606, -307836, 316769, 1651327, 1958368, 991302, 225736, 532287, 776080, -526158, -2809186, -3821712, -2456457, -288696, 265442, -1216456, -2929421, -3283856, -2705542, -2590976, -3112271, -2991778, -1514008, 151367, 333333, -877931, -1674735, -864419, 733779, 1591234, 1366493, 804150, 353942, -50441, 6902, 1393907, 3832558]
12467C832558J429286j304933k871224j230433J717534K159515m39762k293169
12459I99372p08059J606088M61260k938575l243447O61416L337041J055588k225899
12450i95215j188978K270041K335571j088675k486943l9759J751024l0659k256585
12441a730178j632027K71331R86573J490929K912046L000538J19968k571019j433117
12432A415044J718418K476063N77160p32021m65028m43942j077473r78575k76043
12423B213603l31752o24083K73566J158805l20872k958517k950503K30249K903848
12414d05656K604854P30137p35069j481732j271043K92685J657352N95616j689174
12405B97970j549353J115116K074715m99462k929393k077912k99112r11354k269589
$$ y = [3832558, 5261844, 3956911, 1085687, -144746, 1572788, 3732303, 3292541, 999372, 291313, 1897401, 2358661, -579914, -3823361, -3161945, 175096, 1230684, -995215, -2184193, 85848, 2421419, 1332744, -1154199, -1193958, 557066, 526407, -1730178, -3362205, -3090874, -2104301, -613372, 2298674, 5299212, 5419180, 2848161, 1415044, 3133462, 5609525, 6186685, 5454664, 4989636, 4545694, 3468221, 2489646, 2213603, 1881851, 1257768, 1531334, 2690139, 2369267, -589250, -3539753, -3309504, -405656, 2199198, 2929335, 2194266, 712534, -558509, -265824, 1391528, 1987144, 297970, -1251383, -136267, 1938448, 1438986, -1490407, -3568319, -3867431, -4778785, -7048374]
12396g048374p60601K555605L171308L36124j579441K28396K777693J931264j274923
12387C37051k046571J085765L863964K288255j536437k402000M20783K411536
12379D422346Q10834j782024k381541j964638k050379j015670K088543L616092
12371A743563M52680l636696k778439J682284L173584L55347j478592J61218J305122
12362I80071q72444l317045k698275k81826J554201K767382L118305J096163k120143
12353B26389k609167j46817N98533j932657k886944O37876L957472K368064j142862
12344i30113j383368O20692Q35350j65443P03491K413921J725498o05519j482086
12335A732423j215529j937588k486701o92580J422912P72851o12554J021627L575508
$$ y = [-7048374, -7808975, -5253370, -2082062, -1745938, -3325379, -3096983, -319290, 1611974, 337051, -1709520, -623755, 3240209, 5528464, 3992027, 1590027, 2010810, 4422346, 5233180, 3451156, 1069615, -895023, -2945402, -3961072, -1872529, 1743563, 2196243, -1440453, -4218892, -2536608, 636976, 992323, -486269, -325051, 980071, 107627, -3209418, -5907693, -6189519, -4635318, -1867936, 1250369, 2346532, 226389, -2382778, -2529595, -1931062, -3863719, -6750663, -6112787, -2155315, 212749, -930113, -2313481, -1692789, -857439, -1022882, -319391, 2094530, 3820028, 3214509, 1732423, 516894, -1420694, -3907395, -4599975, -3177063, -2404212, -3016766, -1995139, 1580369]
12326A580369K019566k474361l874392j186898O83664O7566N50954K819554K572540
12317B758562j081240k781816R6700K503112P4740l498794k603906J400943K923999
12308b07700P85768j111381l06184J336193R73518j721608m376180m049418l09019
12299h986011L438996L308920j83648k797484k201105r2448J537264K762957L472960
12290B60401K342335m08619k259712j844842m75914O81667J874112K441420Q81209
12281C492057j659260j813683O56641J906885N4385j960492j567227l57046k12573
12272a460313J27643J677325K334373O59159j071821p81734o367k77482L339J630231
12262B834353J742295j024738k844015r16764J000259r73098l172221l32858M273698
$$ y = [1580369, 3599935, 1125574, -2748818, -3935716, -3252052, -3184486, -2633532, 186022, 2758562, 1677322, -1104494, -1007794, 1495318, 1570058, -1928736, -4532642, -3131699, -207700, 578068, -533313, -839497, 496696, 1470214, -251394, -4627574, -8676992, -8986011, -5547015, -2238095, -2421743, -5219227, -7420332, -7512780, -5975516, -3212559, 260401, 2602736, 2194117, -65595, -1910437, -2386351, -1704684, 169428, 2610848, 3492057, 1832797, 19114, 675755, 2582640, 2637025, 676533, -890694, -1247740, -1460313, -1332670, 344655, 2679028, 3338187, 2266366, 1484632, 1478265, 1200783, 1204122, 2834353, 4576648, 3551910, 707895, -208869, 791390, -181708, -3353929, -3686787, 586911]
12253E86911L284034k001745k871348K399175N135950J93958n592345m195184
12245c060594J383045K662319j026235k590161J022786M433490K502701k241663
12237C085688l856642j230674J550682J583084J93652n63088j035749j873839
12229b146886j520145J199836L634657K188516j904229l679152j527735J043871
12221b711267J494621J320701J460816o4005l095990l389229K03397K006175j619732
12212d394513m978497j699109L922147L229047k196262k748238L112493O180288
12204D27356J897348k388131n7948M346267L661887m83768k032223o12483K8891
12195D787196m51455o9816P6959j850135l277402q56716K900370K984407L6138
$$ y = [586911, 3870945, 1869200, -1002148, 1397027, 6532977, 6726935, 1134590, -3060594, -1677549, 984770, -41465, -2631626, -1608840, 2824650, 5327351, 3085688, -770954, -2001628, -450946, 1132138, 1325790, 762702, -273047, -2146886, -3667031, -2467195, 1167462, 3355978, 1451749, -2227403, -3755138, -2711267, -1216646, 104055, 1564871, 1500866, -1595124, -4984353, -4780956, -2774781, -4394513, -9373010, -11072119, -7149972, -3920925, -6117187, -8865425, -5752932, 427356, 2324704, -63427, -121375, 4224892, 7886779, 7403011, 5370788, 4758305, 4787196, 4335741, 4265925, 4342884, 2492749, -784653, -1641369, 1259001, 4243408, 4279546]
12186D279546j286236m45192o69761j626030M7729L008645J909451k923891m328641
12177b034380M94532M881113K791170k310117l616994q67728J510573K143623
12169B991792K601436K283141m62760l492040k892210N14217J851775m05586k455895
12160E33870j360233J107558K104692J485980L68486q50696j409463k9829K431449
12151D381814K899019M56101j860912j669999q79139k051687l680595k588431
12143d993829O35743K412104J600183M39342K56483n4721p97378l43562J483894
12134F38259K073853n6805k513600k312897k6288J511248J198698K33399l31862
12125D14005n73841p64104j019794j455632j593569m44207J722184K820118J549707
$$ y = [4279546, 2993310, 2548118, 1878357, 252327, 300056, 3308701, 5218152, 2294261, -2034380, -1539848, 3341265, 6132435, 3822318, 205324, -662404, 848169, 2991792, 5593228, 7876369, 7413609, 3921569, 1029359, 1543576, 3395351, 2989765, 533870, -826363, 281195, 2385887, 3871867, 4240353, 3389657, 1980194, 1950365, 4381814, 7280833, 7736934, 5876022, 4206023, 3326884, 1275197, -2405398, -4993829, -4358086, -1945982, -345799, 93543, 350026, 295305, -502073, -845635, 638259, 2712112, 2655307, 141707, -2171190, -2197478, -686230, 512468, 745867, 414005, -159836, -923940, -1943734, -3399366, -4992935, -5437142, -3714958, -894840, 654867]
12116F54867o00158j490963j221897j052217p69159N01172J848421J615250L29704
12107a84980q3754L26071j91483j511019j403768O01773K091710J473565J69625
12098A287740r2091J89767j78308j039691j668230j854546j250936N07389K250107
12089a848799K020444K07005n27959O37755J507016R35054O29412J097039k37703
12080D419264l898897n294228j135466M235144M243670k75347k690742q25107
12072a221709P35546r27498k585065r70139J885884K557592J469951Q79457P05606
12063B529625j96310r57401k94187N32223l61315j821467j153905J380760K656128
12054B314151J226031r35011j648776j187773r03559r76144o66623J71272Q43443
$$ y = [654867, 54709, -1436254, -2658151, -3710368, -4479527, -3978355, -2129934, -514684, -184980, -268734, 57337, -134146, -1645165, -3048933, -2447160, -355450, 1118115, 1287740, 1195649, 1385416, 1207108, 167417, -1500813, -3355359, -4606295, -4098906, -1848799, 171645, 378650, -149309, 488446, 1995462, 2930516, 3559928, 4656967, 4419264, 520367, -4773861, -5909327, -1674183, 2569487, 2294140, -396602, -1221709, -486163, -1413661, -3998726, -4968865, -3082981, -525389, 944562, 1824019, 2529625, 2333315, 1375914, 1081727, 1613950, 1252635, -568832, -1722737, -341977, 2314151, 3540182, 2605171, 956395, -231378, -1134937, -2111081, -2777704, -2606432, -1762989]
12045a762989P15420k13010j406880k053198j349158R07341L614823M639166K788366
12036E879881k88710j450403m8879R64265o20729k564151j462573J520677J979430
12027C908808p69842k323343j06976K481158J484223j482376k136338k73928M67203
12018A248589j362062l064088k073676P14993K559742J956002k61483j726850
12010b008833p12401J583906J984778k43152j754984n554K373173J446767j383088
12001A280612j139270K616781M393464R02784l784101l938752M3553K792867J225485
11992D393423k335548l775949j735575J513534K561255L04351k659895k698357
11984d432761N61319L719023L760470J269511j214626k423365k666048k179726
$$ y = [-1762989, -1047569, -1260579, -2667459, -4720657, -6069815, -5162474, -1547651, 3091515, 5879881, 5591171, 4140768, 4091889, 5056154, 4435425, 1871274, 408701, 1929378, 3908808, 3138966, 815623, 708647, 3189805, 4674028, 3191652, 1055314, 781386, 1248589, -113473, -3177561, -5251237, -4536244, -1976502, -20500, -281983, -2008833, -2721234, -1137328, 847450, 604298, -1150686, -1156240, 1216933, 2663700, 1280612, 141342, 2758123, 7151587, 8054371, 4270270, 331518, 375071, 3167938, 4393423, 2057875, -1718074, -3453649, -1940115, 621140, 925491, -1734404, -4432761, -3871442, -152419, 3608051, 4877562, 3662936, 1239571, -1426477, -3606203]
11976c606203q06376J118710K684633L063434J869546n01309k575554k807396
11968a560515j397023j71382j83661m90557J48450J500750K454820K319843R22802
11959C543527j448363l528039l662688j695342O87618J969175K054275J306239
11951g73598j4421r03583j61341J437795J571494r3813j108093k32510M31325
11942A53255p78107j915809p78532J021265P48162o43379l71417Q66294J9361
11933a678907k323433k013609J748811M312983K413417r19366j165148J109180
11925A483928J968769L72647j028283n87949K70247k0895q46346q74956o5088
11916F72074P25403R73507N57061n52343j906893k473633j680713l53297N3448
$$ y = [-3606203, -4412579, -3293869, -609236, 2454198, 4323744, 3822435, 1246881, -1560515, -2957538, -3128920, -3312581, -3803138, -3654688, -2153938, 300882, 2620725, 3543527, 2095164, -1432875, -5095563, -6790905, -6103287, -4134112, -2079837, -773598, -788019, -1691602, -1852943, -415148, 1156346, 1062533, -45560, -278070, 153255, -624852, -2540661, -3319193, -2297928, -1549766, -2193145, -2564562, -1698268, -1678907, -4002340, -6015949, -4267138, 45845, 2459262, 1539896, 374748, 1483928, 3452697, 3825344, 2797061, 2209112, 2479359, 2458464, 1612118, 737162, 672074, 1397477, 2370984, 2928045, 2375702, 468809, -2004824, -3685537, -4038834, -3985386]
11907c985386p75572j521451q41177Q25368J646268O71238r37649j403178m91693
11898f813232O27369J303625J986274K724114K417982N13090j423129j220130
11890A15963R07103K284074J203665q03740j233223k13863o7125j459086k221344
11881a487576q73742P93987M76861r37913r10952N16207J023967K46670L25336
11872h27155J636953J462364j450857m114231l480730q81410N07756N60334J330140
11863e256836K762797K861888J531773P61013Q84673r1557k715267m383541k646394
11854f291451J555641M886161M686391Q87268l771411n505956l037333P56495
11846e834195K226336J339993O83850J019545Q49505N5439L85618J761901J630111
$$ y = [-3985386, -4760958, -6282409, -7123586, -6298218, -4651950, -3980712, -4918361, -6321539, -6813232, -6185863, -4882238, -2895964, -171850, 2246132, 2759222, 1336093, 115963, 1023066, 3307140, 4510805, 3707065, 2473842, 2259979, 2192854, 733768, -1487576, -2361318, -1567331, -1090470, -2028383, -2939335, -2423128, -1399161, -1152491, -827155, 809798, 2272162, 821305, -3292926, -6773656, -7655066, -7147310, -6586976, -5256836, -2494039, 367849, 1899622, 2660635, 3545308, 3453751, 738484, -3645057, -6291451, -4735810, 150351, 4836742, 5724010, 1952599, -3553357, -6590690, -5834195, -3607859, -2267866, -1584016, -564471, 285034, 340473, 726091, 2487992, 4118103]
11837D118103p97815k905024k812220k041317k140850j698425P61837L466962
11829d048749L861582K461559J410630P94224o67931k418585k518873p79697R94275
11820i11565J462726N18780j524560l431891k859611P25503L845795K730260j207244
11811f51807k827338l28033K504849K051194k96299r57239M84152J307192M3437
11802A330108j574722j302193N54364J685179Q82871m39626k98152J063213J642179
11793C543221O91960m31006p08199p00345n44163Q16763K757547K081740k096717
11784E410801n022446k072979L540237M013746j921214o506268l538372L306584
11776b789911O089372L027169q76984j623898k97288K88912n34927j483681j247577
$$ y = [4118103, 3320288, 415264, -2396956, -4438273, -6579123, -8277548, -7515711, -4048749, -187167, 2274392, 3685022, 4479246, 3811315, 1392730, -1126143, -1905840, -911565, 551161, 1069941, -454619, -3886510, -6746121, -6020618, -2174823, 555437, -651807, -3479145, -3807178, -1302329, 748865, 452566, -504673, -20521, 1286671, 1330108, -244614, -1546807, -992443, 692736, 1575607, 1135981, 837829, 1901042, 3543221, 4235181, 3804175, 3095976, 2395631, 1851468, 2668231, 5425778, 7507518, 5410801, 388355, -1684624, 1855613, 5869359, 3948145, -2558123, -6096495, -2789911, 3299461, 6326630, 5449646, 3825748, 3528460, 3817372, 3282445, 1798764, 551187]
11767E51187L42825J913083J542291p01534k077547o62777J498502J082692j379694
11758B109028k075669K26433K141071P74513k006579k635020j072719j32223o63223
11749c334388n86171J111444K339829J175096r48800j258003L41737J413736P47274
11740A001754k43363k21144P8239l37185o41647L20685J598801J262021n09179
11731B308982j563927r92081r9224J41801M18294J084941J062308M3879k81762
11722B123211R35677J519121o13984l489437l242932K38918K950321K382487N70431
11713C373813L88314J300993P45930j700361l606085k846213j36907J830150J361008
11704G10642l39487o39877R45293J813324O7624k157377j567056J025192J679133
$$ y = [551187, 894012, 2807095, 4349386, 3647852, 1570305, 907528, 2406030, 3488722, 2109028, 33359, 259792, 2400863, 3175376, 1168797, -1466223, -2538942, -2671165, -3334388, -3920559, -2809115, -469286, 705810, -242990, -1500993, -1159256, 254480, 1001754, 758391, 537247, 615486, 278301, -363346, -42661, 1556140, 2818161, 2308982, 745055, -247026, -346250, -204449, 213845, 1298786, 2361094, 2404973, 2123211, 3058888, 4578009, 3964025, 474588, -2768344, -2529426, 420895, 2803382, 3373813, 3762127, 5063120, 5809050, 4108689, 502604, -2343609, -2480516, -650366, 710642, 371155, -268722, 676571, 2489895, 2557519, 400142, -1166914, -141722, 1537411]
11695A537411m03684j507438N33065K847437K330268K88622o87672j158176k430373
11686A349460k766336n61802J169690j058941m207048k086479M599527Q170223
11678D608294M973422N8777j357146q84139j924095l260419k419838j040440j612667
11669b858251k189123K01366L414496L146488K61861o79280P64517O27535j908314
11660G81295k746354j2037K474405J249295j584801k008569K38672K350712K547605
11651C290223J185897n42438j332314o06573L82052j05570j428083j242507O17249
11642B17936J737567J176820O91361R68164K41723j795765k471253o91151O80626
11633G56028k96554j079276O44166K221557L31971k850892k715879N04214K556407
$$ y = [1537411, 1133727, -373711, 159354, 3006791, 5337059, 5625681, 4938009, 3779833, 1349460, -1416876, -1978678, -808988, -1867929, -6074977, -8161456, -3561929, 4608294, 9581716, 9640493, 8283347, 7399208, 5475113, 2214694, -205144, -1245584, -2858251, -5047374, -4846008, -1431512, 1714976, 1976837, 1297557, 2062074, 2689609, 781295, -1965059, -1977096, 497309, 1746604, 161803, -1846766, -1608094, 742618, 3290223, 4476120, 3933682, 2601368, 1994795, 2376847, 2271277, 843194, -399313, 217936, 1955503, 3132323, 3823684, 4791848, 5033571, 3237806, 766553, 75402, 756028, 459474, -619802, 24364, 2245921, 2577892, -273000, -2988879, -2484665, 71742]
11624G1742K000427J082942N12002j224838l179090k051079J780679L318469J20367
11615B431621l731059l304367Q44362M430905M774551K144059j672320l936151
11607A981601k447281J355749K961405M89478k516927k216471J93049J125056
11599I25659K38551j14860N73724P72267K97095J97626j69584k135249l956304
11590c371075k184466K553885N242157L420966N81873L59526J018683p88838l600371
11581C232340l074689P79848L045783J068096j964390k207567m76134J23489p03028
11572a76252q73403j6236K70821j57744L50690J686536J268835j620302l494702
11563b761757j074932L619724N319243K075187k604008m228542k014886J171985
$$ y = [71742, 2072169, 3155111, 3667113, 2442275, -736815, -2787894, -1007215, 2311254, 2431621, -1299438, -4603805, -3759443, 671462, 5446013, 7590072, 5917752, 1981601, -465680, 890069, 3851474, 4340952, 1824025, -392446, -199397, 925659, 1164210, 1049350, 1623074, 2395341, 2692436, 2890062, 2720478, 585229, -3371075, -5555541, -3001656, 2240501, 5661467, 6243340, 6602866, 7621549, 6832711, 3232340, 157651, 937499, 3983282, 5051378, 3086988, 879421, 403287, 526776, -176252, -1049655, -1065891, -795070, -952814, -602124, 1084412, 2353247, 732945, -2761757, -3836689, -216965, 5102278, 7177465, 4573457, 344915, -1669971, -497986]
11555d97986K033467k78324l285668l259384N27893M054693L031995j121948k565300
11546a360562J051017N032812L940457j144423m574639l755547j334437j69316
11538b314638K86774J469550K434826J378400r04905j489567O39083K766801J701637
11529E967961j943781m154132k459252R09942K053373N68638m91981L62260R57913
11520A770941m64963j874648o38635J913343K369029O13378k94868N19836L77519
11511D290932j953481l501761j545059J883639K732448N28322j578349j519917
11503f63226l73681J65427M0380N2981M52413R33801J066290M08157r86942k080533
11493i84933j762838m08658L69809j86017r58407n51807O52378Q56208o47340
$$ y = [-497986, 1535481, 1257157, -2028511, -5287895, -4760002, -705309, 2326686, 1204738, -1360562, -309545, 4723267, 8663724, 7519301, 2944662, -810885, -2145322, -2314638, -2027864, -558314, 1876512, 3254912, 2350007, 860440, 1499523, 4266324, 5967961, 4024180, -129952, -2589204, -1679262, 374111, 942749, 450768, 813028, 1770941, 1305978, -568670, -1207305, 706038, 3075067, 3688445, 3393577, 3913413, 4290932, 2337451, -1164310, -2709369, -825730, 1906718, 2435040, 856691, -663226, -1036907, -871480, -831100, -778119, -325706, 608095, 1674385, 2082542, 1095600, -984933, -2747771, -3156429, -2786620, -2972637, -3931044, -4482851, -3830473, -2974265, -3621605]
11484c621605k037614r37358K144131L640506J314575k243528k560416O38961
11476c662348K983436J704062o49615n68819J079194J139210k45656m7914K081972
11467C813522K685722o7972l142286k740621O08735L187574K869943P60371j074726
11458F900262j628556j036827j94060k95925j626401k770238k019361L24692J976456
11449c69958J330494o34591j632451p27329R59711J889718J551101K54616j394590
11440A226721k295804j282060J169543K633727J602377k18439l49875N88039R2847
11431C167076j600818j574836O44205J801111J77318j600555j157800j01327l55002
11422f00628m11891J177774K039209M8067j977146p29329J288222j26976k820880
$$ y = [-3621605, -5659219, -6596577, -4452446, -811940, 502635, -1740893, -4301309, -3662348, -678912, 1025150, 375535, -193284, 885910, 2025120, 1779464, 1731550, 3813522, 6499244, 6431272, 3288986, 548365, 1157100, 4344674, 7214617, 7974988, 6900262, 5271706, 4234879, 4040819, 3744894, 2118493, -651745, -2671106, -2346414, -369958, 960536, 325945, -1306506, -2033835, -1074124, 815594, 2366695, 2621311, 1226721, -1069083, -2351143, -1181600, 1452127, 3054504, 2836065, 2486190, 3074229, 3167076, 1566258, -8578, 635627, 2436738, 2614056, 1013501, -144299, -245626, -600628, -1012519, 165255, 2204464, 2252531, 275385, -453944, 834278, 707302, -2113578]
11413b113578j385892K961949L471656r44235l655095j164219J790191R80936
11405e8287p69893K9855J123656l99358j956152r1458K837960K305395r59032
11396B062686k441515p20119J613646K299316J080084j285735k875783j641928
11388a909348J139280J499739r85956j765046J148265L246873J067511j655586
11380A785732n39856J740054M75462k661712k971536q87017Q4087K70157J645632
11371a058997K030397r45255l281276l55050L708168J743736l697316l767926
11363e623519J618244L517012o28716k985011O12927L802232J376308k189828
11355e00351j611241L69306o36463k543179j557033O74218Q25770O8442R36401
$$ y = [-2113578, -3499470, -537521, 2934135, 1989900, -1665195, -2829414, -1039223, -58287, -828180, -798325, 325331, -74027, -2030179, -2121637, 716323, 3021718, 2062686, -378829, -1098948, 514698, 2814014, 3894098, 2608363, -267420, -1909348, -770068, 729671, -256285, -2021331, -873066, 2373807, 3441318, 1785732, 1245876, 2985930, 3461392, 799680, -2171856, -3058873, -2974786, -2704629, -1058997, 971400, 26145, -3255131, -3610181, 97987, 1841723, -1855593, -5623519, -4005275, -488263, -1116979, -4101990, -3489063, 313169, 1689477, -500351, -2111592, -1742286, -2378749, -4921928, -6478961, -5804743, -4978973, -4910531, -3974130]
11346c974130K200848J771847P61458L82939r68609l454731l245475J296491N356795
11337A27433M276575L00923j778236j575239j170753m14333J074521J158890r18891
11328A080890j847924J12289J280485q96053k453957K11884L107108J106228k768086
11319a067136k292498J167391J193137k463216l674511l23997K983319L053941
11311a423570K049197K211247K432352J399599l36323k190508l766180l497123
11303c121309p39343J709636J101546o55427j53346J613272J501557M13661J329085
11294B999332K690056M25117m087358n037849j447557J348338L79292j342050
11286d072679j264948r30330j119991M80117M003765N263144K078553j876090
$$ y = [-3974130, -1773282, -1435, 760023, 1142962, 174353, -3280378, -6525853, -5229362, 127433, 4404008, 4704931, 2926695, 1351456, 180703, -233630, 840891, 1999781, 1080890, -767034, -654745, 625740, -270313, -2724270, -2512386, 594722, 1700950, -1067136, -3359634, -2192243, -999106, -3462322, -7136833, -7460830, -4477511, -1423570, 625627, 2836874, 5269226, 6668825, 6332502, 4141994, 375814, -3121309, -3860652, -2151016, -1049470, -1704897, -1858243, -244971, 1256586, 1670247, 2999332, 5689388, 6114505, 2027147, -3010702, -4458259, -3109921, -2730629, -4072679, -5337627, -6267957, -7387948, -6907831, -2904066, 2359078, 4437631, 2561541]
11278B561541k678020j444874r62543r79277k10218L88992j86855l69133J075748
11269b804639K018962K92300j999073j149392K311771L963930J524151k315855
11261A842155l604471j656227J036824K158046J584972L70563r00754j888190
11253a057082j634749K80481K009586J116400j625035k591927l70541K151109
11245a721758K043467R050j739552k419168j763335O41389L061693K204282j475102
11236a159034l010919l91061J760340k15204k681748j147363J721012R51671j893546
11227f065852j944842K42387R04472J098105L946003O120617J755757n904951
11219A51696o917928K84339N947324L496819j977935l138185l37584J933678J988004
$$ y = [2561541, -116479, -1561353, -2523896, -3503173, -3713391, -3324399, -3511254, -3880387, -2804639, -785677, -493377, -2492450, -3641842, -1330071, 2633859, 4158010, 1842155, -1762316, -3418543, -2381719, -223673, 1361299, 1731862, 831108, -1057082, -2691831, -2411350, -401764, 714636, -910399, -3502326, -3872867, -1721758, 321709, 330759, -1408793, -3827961, -5591296, -4949907, -1888214, 316068, -1159034, -4169953, -4561014, -2800674, -3015878, -5697626, -6844989, -5123977, -4172306, -6065852, -8010694, -7768307, -6863835, -5765730, -1819727, 4300890, 6056647, 151696, -6766232, -6481893, -534569, 2962250, 984315, -2153870, -2491454, -557776, 1430228]
11210A430228M23806j896304k441993J065146N304960M056585j855484m402766
11202A684178o50313K626283L46834k864793j354167K124679K037009p45190j981972
11193A222548j521017j405956p45015J417745K010671j156743l980283j803921
11185e961971K610862L253434K76363j365175n82081n87444j732802p30572K633196
11176b186190L968781Q82649l334329m257131j544004J663082K548076J051665
11168a207401m23032K58598K164585K437275N25585j035460q13061m17046r13535
11159E76508p45861P26862J152281o92955k069648o67085J264154N90509j582873
11150a448108j992118j81517J889414L130148L203460J318426j856555l242466
$$ y = [1430228, 1854034, -42270, -2484263, -1419117, 3885843, 7942428, 6086944, 1684178, 1033865, 3660148, 4006982, 1142189, -211978, 1912701, 3949710, 3204520, 1222548, -298469, -1704425, -2449440, -1031695, 978976, -177767, -4158050, -5961971, -3351109, -97675, 178688, -1186487, -1768568, -2356012, -4088814, -4819386, -2186190, 1782591, 2665240, -669089, -4926220, -6470224, -4807142, -2259066, -1207401, -1630433, -1371835, 792750, 3230025, 3755610, 2720150, 1907089, 1490043, 576508, -169353, 557509, 1709790, 1016835, -1052813, -1719898, -455744, 134765, -1448108, -3440226, -3621743, -1732329, 1397819, 4601279, 5919705, 4063150, 820684]
11142H20684j272080J337679J485098N0162m15357R0146R4384l17437m53681q83200
11132E36398j780410j667444j04640R28428M16582L9979N63215K05079j237663
11123b100476j048049J007499R58982k299955l658509R1884M184573L275150j40300
11114B70799p60987P14642N12165n85937L24285J635382K83893j604240m42275
11105C47727J393350m25566l520126k476717J151553J436361j056230n60028K559353
11096a150323J972683k553149l637910R97456M200143J345407k399957j474802
11088b700452J290802Q41279j525811j598239M86349J780884J704758J154517
11080A434087l52982k685614l233875o74409K108742K069284L31517m18356j50094
$$ y = [820684, -451396, 886283, 2371381, 2421543, 2006186, 2096332, 2190716, 1873279, 1419598, 536398, -1244012, -2911456, -3016096, -2087668, -1671086, -1631107, -1067892, -862813, -2100476, -3148525, -2141026, -1182044, -3481999, -7140508, -7048624, -2864051, 411099, 270799, -490188, 224454, 736619, 150682, 474967, 2110349, 2394242, 790002, 347727, 1741077, 1315511, -2204615, -4681332, -3529779, -2093418, -3149648, -3709676, -1150323, 822360, -1730789, -5368699, -4371243, -171100, 1174307, -1225650, -2700452, -1409650, -568371, -2094182, -3692421, -3206072, -1425188, 279570, 1434087, 1081105, -1604509, -4838384, -5512793, -3404051, -1334767, -1003250, -1421606, -1571700]
11071a571700j57487m2709R83672J836567J238487k2045n68936m78712k81956
11062I35181J91043P42283O35827K94406P28249Q90472j120938l746743l001270
11053c451490J047699L426710J759550j84314Q63549K349099R93954j192716p16358
11044D895683J061478N45075j658849k203424j151667j315803k427124j391649
11036c646280J620965K562602K3653k258899j265884Q05557M32817j775815k501130
11027f002414q02533J239108K211406K811314L335650K318913q55997l604908
11019F50539k656943J275043L555065J336544k517507l067345J63862K758448
11011A497706J558790j372523k201034n92897P10773M83228M09527J634403K448087
$$ y = [-1571700, -1729187, -1771896, -788224, 1048343, 2286830, 2264785, 1695849, 1217137, 935181, 1126224, 1868507, 2504334, 2798740, 3526989, 4417461, 3296523, -450220, -3451490, -2403791, 1022919, 2782469, 2598155, 3461704, 5810803, 6804757, 5612041, 4895683, 5957161, 6502236, 4843387, 2639963, 1488296, 172493, -2254631, -3646280, -2025315, 537287, 560940, -1697959, -2963843, -2158286, -1725469, -3501284, -6002414, -6804947, -5565839, -3354433, -543119, 2792531, 5111444, 4255447, 650539, -2006404, -731361, 2823704, 4160248, 1642741, -1424604, -1260742, 1497706, 3056496, 1683973, -517061, -1109958, -399185, 84043, 493570, 2127973, 4576060]
11002D576060R03941j898360l162047k196777p13945K64809J188239J487353m78821
10993b9548l660528l850942M18317M482138L600608j05882j203796O47611J326786
10984A624764L7085l2803J127890l43375m149459m403133O19159M264765J578772
10975C23665k781487k434833N44048L01395k287195j657846K402797M543333K716101
10966A669978K70215o09552j202489j739274m74617J944820K323172P9917j801115
10957D61055j663991j016254j052187j139790j015624r81854j54806J972343L059741
10948a531367J014904j573050p80373J941448J829294j051181j798536R30519
10940a018342K732442R02885j692266j992401q33455K46067J510605K422748J108664
$$ y = [4576060, 5480001, 3581641, 419594, -1777183, -2491128, -2226319, -1038080, 449273, -29548, -3690076, -7541018, -7122701, -2640563, 960045, 854163, -349633, 297978, 1624764, 1661849, 1629046, 2756936, 2413561, -1735898, -6139031, -5519872, -1255107, 323665, -2457822, -4892655, -4348607, -4047212, -6334407, -7992253, -5589456, -1046123, 1669978, 1940193, 1330641, 128152, -1611122, -2085739, -140919, 2182253, 2262170, 461055, -1202936, -2219190, -3271377, -4411167, -5426791, -6408645, -6563451, -4591108, -1531367, -516463, -2089513, -2869886, -928438, 900856, -150325, -1948861, -1018342, 1714100, 2616985, 924719, -1067682, -1901137, -1655070, -144465, 2278283, 3386947]
10931C386947j617191k114727K35487J485539m39848k235045p86858J880553K325795
10922B120652R34881K72042P95383J076987M24756p99962j888469j670127L74104
10913A640247K338860J725866o43070j568203n69800m07696j970762k711478j278984
10904c445020L19491O23208Q84706J722629J419309o00579k103659j631761m56201
10895c267877M61263J875811L242285K242831r21632k697260j543253k06043o87641
10886a501516j170468l22455k57168k087872k657295M67063M096340L646863j71784
10877D1708k823608k345107o64431L06430O68379J073756J590581J898912J511971
10868A258591L81876m08138J04726Q21233q8319j953431k279321p34508M84592
$$ y = [3386947, 1769756, -344971, -109484, 1376055, 936207, -1298838, -2085696, -205143, 2120652, 3055533, 3327575, 4122958, 5199945, 5624701, 4824739, 2936270, 1266143, 1640247, 3979107, 5704973, 5061903, 3493700, 2923900, 2516204, 545442, -2166036, -3445020, -3125529, -2502321, -1617615, 105014, 1524323, 923744, -1179915, -2811676, -3267877, -2806614, -930803, 2311482, 4554313, 3632681, 935421, -607832, -813875, -1501516, -2671984, -2994439, -3251607, -5339479, -7996774, -7529711, -3433371, 213492, 41708, -2781900, -5127007, -5791438, -5485008, -4816629, -3742873, -2152292, -253380, 1258591, 1640467, 1232329, 1337055, 2158288, 2069969, 116538, -2162783, -2897291, -2412699]
10859b412699M83862O15350J218398Q67912n68097j534016j804982k301112j958261
10850g393645Q12050L578342K187090j851476k401822J460809L340512r8907l451007
10841c818054j415250K822823L386840R03622k4993J122665J260040j62798j002320
10832C072575r51723j480125k245758j630705j12822L21701m68169p84471J40898
10823d138599J466638K091684J358516l84926j265947L5407J403623l32529l632513
10814c398646l206560J746169N120854K504168k364253l412449o56892J401475
10806b266134Q70249k85611k07360J119016K667738K586204m27657m154493m073697
10797d171745M11422M177485L134480o05023k821613k812846j968467l45407J902976
$$ y = [-2412699, -1928837, -1313487, -95089, 772823, 204726, -1329290, -3134272, -5435384, -7393645, -6581595, -3003253, -816163, -2667639, -5069461, -3608652, -268140, -367047, -3818054, -5233304, -2410481, 976359, 1879981, 1854988, 2977653, 4237693, 4074895, 3072575, 2120852, 640727, -1605031, -3235736, -3348558, -3026857, -3495026, -4279497, -4138599, -2671961, -580277, 778239, 393313, -872634, -837227, 566396, 233867, -3398646, -6605206, -4859037, 261817, 2765985, 401732, -3010717, -3667609, -2266134, -1395885, -1681496, -1888856, -769840, 1897898, 4484102, 4056445, -98048, -4171745, -3760323, 417162, 3551642, 2946619, 125006, -2687840, -4656307, -5001714, -3098738]
10788c098738K820716J697191Q87129J629067J393056j419444l701738k259581
10780b052342J038876K470016J752114N17264j280079l552559l854339j108875
10772f069924J336836N18612j135201J10392K940359L328132J010076r25236j188490
10763g4444q47399k45639Q17967J194154p491j336364j270361o67308m83988L90234
10753b530639K331936K922992P06849j854268k125268r94199q7458J114250K436330
10744A920525J440653j850736l110831n18490J386544p12997k617496K33124M125178
10735B95474K746108k134001l352982N04276M079046M060923K151601l1468k595189
10726E723788m197298k950694l68516M42966k11747p8656O9264j778537l612220
$$ y = [-3098738, -278022, 1419169, 2306298, 3935365, 5328421, 3908977, 207239, -2052342, -1013466, 1456550, 3208664, 3725928, 2445849, -1106710, -4961049, -6069924, -4733088, -4214476, -5349677, -5239285, -2298926, 1029206, 2039282, 1114046, -74444, -921843, -1167482, -349515, 844639, 837148, -499216, -1769577, -2436885, -2920873, -2530639, -198703, 2724289, 3431138, 1576870, -548398, -1542597, -1630055, -515805, 1920525, 3361178, 1510442, -1600389, -2118879, -732335, -1445332, -4062828, -3829704, 295474, 3041582, 907581, -2445401, -1941125, 2137921, 6198844, 8350445, 8318977, 5723788, 1526490, -1424204, -1792720, -1349754, -1561501, -1640157, -1570893, -3349430, -6961650]
10717f961650j912846J559857J814040q42612q37385L401553O484560M234856
10709F940373m31302k361096j032116J09705j178036l544593l869071p43427L434703
10700b674860M597877J928787j095270j656875r73049r24251n49129J198993K260643
10691B112866O70132j565143j550742k66099m38590j638301j344094O61040K452477
10682i06454L099749K695162R64669j463987k377469r57395Q36523J715874K654117
10673F260789L224407Q40806l692319m998319j135823K441509J248485j347502
10665B842033p83847O78538r96752l410330j843721K095760L221869J271481k55966
10656B819065j048677k810713l580662m27572L855824L674209p87392m033392
$$ y = [-6961650, -8874496, -7314639, -5500599, -6343211, -7180596, -3779043, 2705517, 6940373, 6509071, 4147975, 3115859, 3225564, 2047528, -1497065, -5366136, -6109563, -2674860, 1923017, 3851804, 2756534, 1099659, 126610, -797641, -1346770, -147777, 2112866, 2782998, 1217855, -332887, -598986, -1037576, -2675877, -4019971, -3358931, -906454, 2193295, 4888457, 5853126, 4389139, 2011670, 1054275, 1890798, 3606672, 6260789, 9485196, 10326002, 6633683, 1635364, 499541, 2941050, 4189535, 2842033, 2058186, 2736724, 1739972, -1670358, -3514079, -1418319, 1803550, 3075031, 2819065, 1770388, -1040325, -4620987, -5048559, -1192735, 2481474, 1694082, -2339310]
10648b339310l270438l86909K691487N101160M881310J152383k659105k615109
10640B555469Q269J092786m6531r67743o52635J84638J157101J376835m80997
10631D227192k738054j694632J482111R40618l594403m454922J335927N734337
10623A238174K609799j909645m89170K719227P29950k823587p74979L506908J923769
10614F730446l395135l969982j55142N53546k213286k013293J409318J957125
10606a096403p15418q49429J858281J717469j680400k437996P30708K524415P93951
10597H45178p86524l79447j62173p51850p10098p43954j829464j560148J084286
10588d994194J569246k144593l204577L231218R198905N366059k911691l960627
$$ y = [-2339310, -5609748, -5996657, -3305170, 1795990, 6677300, 7829683, 5170578, 2555469, 2563738, 3656524, 3609993, 2642250, 1989615, 2174253, 3331354, 4708189, 4227192, 1489138, -205494, 1276617, 2217235, -1377168, -5832090, -4496163, 1238174, 3847973, 1938328, 1449158, 4168385, 4898335, 2074748, 1299769, 4806677, 6730446, 3335311, -634671, -789813, -236267, -2449553, -4462846, -3053528, -1096403, -1811821, -2661250, -802969, 914500, -765900, -3203896, -2473188, 51227, 845178, 58654, -320793, -482966, -1234816, -1944914, -2688868, -4518332, -6078480, -4994194, -3424948, -5569541, -8774118, -5542900, 3656005, 9022064, 6110373, 2149746]
10580B149746J151796K164534k000710l409151p96650j27441j403770N29928L625579
10571A883861J398074l560324l119751J164615J027262k304906m02071N355226
10563A441986N156947j391875m720950k463567j547486l245619j776226K181435
10555f365355K030439r69425J83665L422124R16991m414123k807113L537286L613511
10546h52000j842615k004559K955540K499719k981386k366691M242501M957215
10538D607724j364457l281119J109754J703677k425110j325454M566118L791360
10530G382493l522537m931669O97477J750174k711004j876099L640974K399344
10522B829153l750706k182522M288855J535322o681790l915886O054310M580293
$$ y = [2149746, 3301542, 5466076, 3465366, 56215, -740435, -867876, -2271646, -1741718, 1883861, 3281935, -278389, -3398140, -2233525, -1206263, -3511169, -3913240, 1441986, 6598933, 5207058, 486108, -1977459, -3524945, -6770564, -8546790, -6365355, -4334916, -5304341, -5120676, -1698552, -781561, -5195684, -8002797, -4465511, -852000, -2694615, -4699174, -1743634, 756085, -2225301, -4591992, -349491, 4607724, 3243267, -37852, 1071902, 2775579, 350469, -974985, 3591133, 7382493, 3859956, -1071713, -374236, 1375938, -1335066, -3211165, 429809, 2829153, -921553, -3104075, 1184780, 2720102, -3961688, -7877574, -1823264, 2757029]
10514B757029n223653l482327O376826K769896r690697n586165J0903749J0011701
10506H836359o667173p031207R064212P690217j1170813r606415J2429365J0808233
10498A4352778j5929498j5680273J6346094J8768773j7813267j9667385K9110536
10491I487758L5154270k9403600l0216844J16497975K46470515J46687794j10942006
10484C83735862k40272517j34564278J5318559L0032735l0067227l0498169J5128685
10477H813650J6475646j8532608j8268283J3268213J5895271j0017222j3384637
10470e749970P970230J0928252p320409r690591O193175P241462q354268r636254
10462h418373N816227Q820050m784179q679244K657161O648537k135330m584358
$$ y = [2757029, -2466624, -5948951, 427875, 3197771, -6492926, -12079091, -1175342, 8836359, 2169186, -4862021, 4202191, 11892408, 721595, -8884820, 3544545, 14352778, -1576720, -17256993, -910899, 17857874, 44607, -19622778, 9487758, 44642028, 15238428, -14978416, 101519559, 347990074, 494677868, 383735862, 143463345, 8899067, 24217626, 54250361, 24183134, -6315035, 8813650, 25289296, 6756688, -11511595, 1756618, 17651889, 7634667, -5749970, 2220260, 13148512, 5828103, -3862488, 2330687, 9572149, 1217881, -8418373, -2602146, 6217904, 1433725, -7245519, -4588358, 2060179, -75151, -4659509]
10454d659509L098178L555333n346222o401310K339567M201002k926658l413280
10446i552899M292728M619216m189384o401998J365615N089107O29844p63480
10438d911251L405170K826479l166869l301880L251351M890613m04025k571365
10430A8223L33878L02271k526015n60216L534177O33534n174002k197730N765732
10421A29852M530217m146366n047765K515070L829027l324387m928308K257324
10413d185336M576707k676628o676708q75896M242605J664728q11329K375129
10405b366728M396186R40217j320105J244701K063022j834921l463937K14855
10397a26710K100586j248070l214789l12259J465333r18074j615418K048498L943030
$$ y = [-4659509, -1561331, 1994002, -3352220, -9753530, -7413963, -3212961, -6139619, -9552899, -5260171, -640955, -4830339, -11232337, -9866722, -4777615, -4147771, -4911251, -1506081, 1320398, -1846471, -5148351, -1897000, 2993613, 2589588, 18223, 352101, 654372, -1871643, -2431859, 1102318, 1735852, -3438150, -5635880, 129852, 4660069, 513703, -4534062, -2018992, 1810035, -1514352, -6442660, -4185336, 391371, -2285257, -8961965, -9837861, -5595256, -3930528, -4741857, -2366728, 2029458, 2969675, 1649570, 2894271, 4957293, 3122372, -341565, -126710, 1973876, 725806, -2488983, -2801242, -1335909, -2253983, -3869401, -1820903, 2122127]
10388B122127R41582j353169L25542J357262p91713j949480m46343k21124j657222
10379a672538k79685K980324J818193k997371l505671R37077K064331j851826
10371b507166k713989J886533L947001J67265k148308O43721K072977r50754j723233
10362a325953K718075M764083J50508l738839j207688J868439l66967l316131
10354d54473j629550P79204q45541k769558m45450K650337J978413J82657Q36206
10345B82245J278950j090333k562940j94434J892287J48955j407655J211880M120133
10336C679088K421640j212691j787448j89154L18814L71950J205214N52291k302389
10327C057315k977672O34615L183900K13856l897028k969544J050941K121533
$$ y = [2122127, 3063709, 1710540, 2036082, 3393344, 2601631, 652151, 205808, -15316, -1672538, -1952223, 1028101, 2846294, -151077, -3656748, -2719671, -655340, -2507166, -5221155, -3334622, 612379, 779644, -1368664, -724943, 1348034, 397280, -1325953, 1392122, 6156205, 6306713, 2567874, 1360186, 3228625, 2861658, -454473, -2084023, -1304819, -2150360, -4919918, -5365368, -2715031, -736618, -553961, 282245, 1561195, 470862, -2092078, -2286512, -394225, -245270, -1652925, -441045, 3679088, 6100728, 4888037, 3100589, 2911435, 3230249, 3602199, 4807413, 5359704, 3057315, 79643, 714258, 3898158, 4112014, 214986, -2754558, -1703617, 417916]
10319D17916j01494j304604k12854R23929J174097J152909N58453n04602k11396
10310A892354J669410K129315m10217l086372l023702j248746K58617J489194
10302c30147K097389N60001j984505j702331J667800L349610Q88972k022040j808062
10293G16687n9185N68185N59929P11215j75646j952270k013192Q5205J434803
10284a24269R74674Q51452J246089k65356k746886j944070J860787L115935L26402
10275C294758j370443M82242J732522J10837p08085O90096j16952m125196m916839
10266d927060L68251M681605K310644j691338p32244K326560J683342p07045J01675
10257C414390K183701P10906k668167l102704j418027j470047k119017N979K840162
$$ y = [417916, 316422, -988182, -1201036, -277107, 896990, 2049899, 2608352, 2103750, 1892354, 3561764, 5691079, 5280862, 2194490, -829212, -2077958, -1819341, -330147, 1767242, 2327243, 342738, -1359593, 308207, 3657817, 4546789, 2524749, 716687, 657502, 1225687, 1785616, 2496831, 2321185, 368915, -1644277, -1559072, -124269, 850405, 1701857, 2947946, 2682590, -64296, -2008366, -147579, 2968356, 3294758, 1924315, 2406557, 4139079, 4249916, 3541831, 4231927, 4114975, -10221, -4927060, -4558809, 122796, 2433440, 742102, 9858, 2336418, 4019760, 3312715, 3414390, 5598091, 6308997, 3640830, 538126, -879901, -2349948, -4468965, -4462986, -1622824]
10248a622824K066872o62357n35226J720340J651960m27429m65814J312542R18605
10239C956669j790825l002780j863757j120553j405370q00554N49308R36273J216862
10230c324727K986564M007541J309905k504678k376695P87598J444539j278128
10222A051919k506980l05413J408254J64274j065737L37388K028078R60222j532279
10213E39726k059587k15440J339626O91432j096711j284045J303313M208120L602916
10204G029350o90461m307904l872623j168638K72947K60503O56197J178994J66522
10195d75113j713258k038252l36478J632460K639885K569710J227010r12209j793790
10186G99965j88759J918484J741215m52994k131970k085957j026572L10409J479642
$$ y = [-1622824, 444048, -218309, -753535, 966805, 2618765, 2191336, 1725522, 3038064, 3956669, 2165844, -836936, -2700693, -3821246, -5226616, -6027170, -5477862, -4541589, -3324727, -338163, 3669378, 4979283, 2474605, 97910, 885508, 2330047, 1051919, -1455061, -1760474, -352220, -187946, -1253683, -916295, 1111783, 2072005, 539726, -1519861, -1735301, -395675, 295757, -800954, -2084999, -781686, 3426434, 7029350, 6338889, 2030985, -1841638, -3010276, -2737329, -2476826, -1820629, -641635, -475113, -2188371, -4226623, -4563101, -2930641, -290756, 2278954, 3505964, 2593755, 799965, 611206, 2529690, 4270905, 3817911, 1685941, -400016, -1426588, -1116179, 363463]
10177C63463J684091P10661l85983q61869j198069j414105n04648J235630J770274
10168A399445O37269J8969R30904J341038r3567j628566j794720j740142k040210
10159b969580r75129J444828J888062o80504k046866P29571L967784L020569m98107
10150C880628k037477j251229o25911p2735J584224K375617J60357k379810j453409
10141A80255J110568P63621j837601k099242M00850J548578J81338l77170J173338
10132A044535J900551J70600j624262j361518j07706N14754M06746l28933j560365
10123i45598j707975N07982K921243K181032q15398j728561N61279K145639K9449
10114C149092l653835m856288k413625J590782M224077L690920O31252k130822
$$ y = [363463, 2047554, 2758215, 2372232, 1510363, 312294, -1101811, -1606459, -370829, 1399445, 2036714, 2055683, 2986587, 4327625, 4234058, 2605492, 810772, -929370, -2969580, -3944709, -2499881, -611819, -1292323, -3339189, -2609618, 1358166, 4378735, 3880628, 1843151, 591922, -33989, -106724, 1477500, 3853117, 4013474, 1633664, 180255, 1290823, 2054444, 216843, -1882399, -1481549, 67029, 248367, -128803, 1044535, 2945086, 3115686, 1491424, 129906, 22200, 536954, 943700, 614767, -945598, -2653573, -2145591, 775652, 2956684, 2141286, 412725, 974004, 3119643, 3149092, -504743, -5361031, -7774656, -6183874, -1959797, 1731123, 2362375, 231553]
10106B31553k368371p44228O49552Q82821J21387j160518j388997J112576M363214
10097A698989L396240k319789o092169k998955K283299K468474j005928j044286
10089c614125K864087M024389J16823l116033j643726R78978O19991r77538n74609
10080a321763Q89643J014244L25626K42407l6156j224260j462194O08207K784144
10071A819898K424089N34292j80921M03323L11627j035053k299756k422313j421062
10062a865876L17194K049896K612883J547119j52520j098951q22467J86471R70480
10053C744229O46224o26322j423094q16158J72402J45482m22004k10222M18565
10044A629102m5315j641853k782915k340008l27046K621437M801524L920640K13167
$$ y = [231553, -2136818, -2881046, -2231494, -1348673, -1227286, -2387804, -3776801, -2664225, 1698989, 5095229, 2775440, -3316729, -6315684, -4032385, -1563911, -2569839, -3614125, -750038, 3274351, 3391174, 275141, -1368585, -389607, 230384, -747154, -1321763, -432120, 582124, 907750, 1150157, 1114001, -110259, -1572453, -964246, 1819898, 4243987, 4778279, 4597358, 5000681, 5312308, 4277255, 1977499, -444814, -1865876, -1548682, 501214, 3114097, 4661216, 4508696, 3409745, 2587278, 2773749, 3744229, 4390453, 3764131, 2341037, 1524879, 1697281, 1842763, 1420759, 1210537, 1629102, 1583787, -58066, -2840981, -5180989, -5508035, -2886598, 1914926, 5835566, 6048733]
10035F048733k559360j827873o0728p19653k534692k079544k32681p02568k913581
10026g581947k313769J705486M073415J950756q82073j59007K664710L415957
10018B873528J248547j279874k066365j103917K57218L56659j088154k030965
10010b833323p32334J055847M19062j673874j473148J403166L284344K464933
10002A914673J249092R44026j91676k266158k194065N71622J728069j056629l594994
9993b896040j578415K425248L077135L14911j631218j108291m8142N40893J421706
9984E17787K045424Q37539j385890j840503L0096J689574J288132j06085o08924
9975B467150O531N59347R6964j022241j318726M9767J599518R91348j355054k142053
$$ y = [6048733, 3489373, 1661500, 1600772, 881119, -1653573, -3733117, -3965798, -4668366, -7581947, -9895716, -8190230, -4116815, -2166059, -3048132, -3207139, -542429, 2873528, 4122075, 2842201, 775836, -328081, -70863, 285796, -802358, -2833323, -3565657, -2509810, -2090748, -3764622, -5237770, -3834604, -550260, 1914673, 3163765, 4107791, 3916115, 1649957, -544108, 27514, 1755583, 698954, -2896040, -4474455, -2049207, 1027928, 1342839, -288379, -1396670, -1444812, -903919, 517787, 2563211, 3400750, 2014860, 174357, 204453, 1894027, 3182159, 3076074, 2467150, 2473681, 3033028, 3129992, 2107751, 789025, 838792, 2438310, 3429658, 2074604, -67449]
9965f7449J72595K766138K267601o53816k658590k276277q31939J70165M10861
9956g00711L3708o51919j024899q97285r10329j336832j335338k53388J247622
9947e829371K120253K056977J258622K18419j29022M84546N78716j044082k592741
9938b877683j443086J270249J848703o0960j088015k89064n24740k147605j142044
9929f454245L424497N874881K249354k951453l580173q92790J20644n04582O41341
9920b072526K857489K600742M53715L1810J178531P66683q47535p74277N8819
9911D253451j556184m042082k912335O98575J258361j307702j413016J715102
9903c305830K366607r19390k233554R29774K951041L98276j830292J32557K184964
$$ y = [-67449, 105146, 2871284, 5138885, 4485069, 1826479, -449798, -1281737, -1111572, -700711, -667003, -1318922, -2343821, -3241106, -4151435, -5488267, -6823605, -7076993, -5829371, -3709118, -1652141, -393519, -175100, -304122, 180424, 759140, -284942, -2877683, -4320769, -3050520, -1201817, -1262777, -2350792, -2639856, -3164596, -5312201, -6454245, -3029748, 2845133, 5094487, 2143034, -1437139, -2329929, -2209285, -2713867, -2072526, 784963, 3385705, 3839420, 3871230, 5049761, 5816444, 4968909, 4194632, 4253451, 2697267, -1344815, -4257150, -3558575, -2300214, -3607916, -5020932, -3305830, -939223, -1858613, -4092167, -3162393, -211352, 186924, -1643368, -1510811, 674153]
9894F74153O55168o86513J248247J927440k020891n183120k954169m68266k379770
9885i187721k717900L223596O387126r50641o099724P226911K7332911K4555461
9877D9770019m302933k6628333j8870244J945073O991769l278862p625379m32442
9869b431332M310431K56297k873326P54513L795084Q89283k184395l69474J979432
9860D126513N23500j128803O63441K224956l62646l753856l154210k6225J645538
9851G58208J817375J922882O92038k328975l430901k95547K935921J604781j839325
9842A836457j849024J330482K747696R73601o39374k91310O746j166404k285795
9833F63075j687016L33666K583911L729870K285063j628885m888463m312847q22175
$$ y = [674153, 1329321, 642808, 1891055, 3818495, 1797604, -3385516, -6339685, -6807951, -9187721, -11905621, -8682025, -2294899, -3245540, -9345264, -2118353, 25214558, 49770019, 45467086, 18838753, -31491, 1913582, 8905351, 5626489, -1998890, -2431332, 1879099, 2135396, -737930, 16583, 3811667, 4700950, 2516555, 2147081, 4126513, 4650013, 3521210, 4184651, 6409607, 6046961, 2293105, -861105, -887330, 758208, 2575583, 4498465, 5190503, 2861528, -569373, -864920, 2071001, 3675782, 1836457, -12567, 1317915, 4065611, 5039212, 4399838, 4108528, 4115274, 2948870, 663075, -1023941, -690275, 1893636, 5623506, 7908569, 6279684, 1391221, -2921626, -3743801]
9824c743801J633735J049947q86702j739946q94906P40485J857160J616433N75663
9815B08068K30433P48442M32747j353753k490526j172515J040641J548713N63547
9806b44203L0091O667q68344k052360j385922J271305L354970K957884Q83359
9797C953447r68013j632847j273425n89783j78250J70646J022994J719846O30996
9788B855611k108389l862383k871669n67311J042023K164169L364997L238731
9780C255779P63850j911239k175708r16215n87031q62314J71086J746235J401658
9771H86101m26500r26776J52079K14072j277510j724925l1534J563041J476611
9762i5341J019296J194188P33907p90992j130102R22826K587369P59617l108070
$$ y = [-3743801, -2110066, -1060119, -1946821, -3686767, -4581673, -3841188, -1984028, -367595, 208068, 438501, 1186943, 1619690, 265937, -2224589, -3397104, -2356463, -807750, -244203, -214112, -207445, -1075789, -3128149, -4514071, -3242766, 112204, 3070088, 3953447, 2985434, 1352587, 79162, -510621, -688871, -518225, 504769, 2224615, 2855611, 747222, -3115161, -5986830, -6554141, -5512118, -3347949, 17048, 3255779, 4019629, 2108390, -67318, -983533, -1570564, -2432878, -2261792, -515557, 886101, 459601, -467175, -315096, -101024, -1378534, -3103459, -3134993, -1571952, -95341, 923955, 2118143, 2852050, 2061058, 930956, 1853782, 4441151, 5200768, 2092698]
9753B092698m701863k590187L51261J175444L12053P2612J134532J830274P78239
9744D55063r72864j350891k26264N91275L98748O10714J792078J866170p46206
9735B417823l875255m059775j348238R74468J102944N96650J306559K627200K685570
9726B427946J039990o40781m44083J287313J829529m13853k904134j957630J351235
9717A575532J979438j330645l494801q35584L031483K984337J47572j086140n55796
9708B415396j125873k335778j415951P76660R56505l98489j56123R66037m45887
9699g63503l226741k610465J125134K401133q2524j190966J092401J903000j224451
9690b576982l044369M46921M580107L586878q0814p14846R39605K28659k356207
$$ y = [2092698, -2609165, -5199352, -4848091, -3672647, -3360594, -3287982, -2153450, -323176, 455063, -517801, -1868692, -2094956, -1503681, -1104933, -494219, 1297859, 3164029, 2417823, -1457432, -5517207, -6865445, -5890977, -4788033, -4191383, -2884824, -257624, 2427946, 3467936, 2827155, 2383072, 3670385, 5499914, 5086061, 2181927, 224297, 1575532, 3554970, 2224325, -1270476, -2106060, 925423, 3909760, 4057332, 2971192, 2415396, 1289523, -1046255, -2462206, -1685546, -729041, -1127530, -1283653, -317616, -763503, -3990244, -6600709, -5475575, -3074442, -3156966, -4347932, -3255531, -1352531, -2576982, -5621351, -5174430, -594323, 2992555, 2911741, 2196895, 3136500, 3365159, 1008952]
9681A008952k240863O42697J477232j301094l639419k468352L43188J839087J794896
9672b543676J366652R44095N13808Q2975p15416j723414j361678J192375L491419
9663A247140K219550j899744m305753k298446J691030L416095J753315p27103
9655A096084j212786L33892J633607J151056n9903k36816K29003m50581k211092
9646B72464k984690k020261p75397J18718J871567M287976M532516J174588l020795
9637C456686m580337l511868j889305l91632J292213K363889J777684J17580j214143
9628b579233j511921l69139K195300M056933K296523k026794l681238l90098L209773
9619A200106K095686j845422l248886j360600J81517n9467m9416J038757J563182
$$ y = [1008952, -1231911, -589214, 888018, -413076, -4052495, -6520847, -6177659, -4338572, -2543676, -1177024, -232929, 280879, 363854, -351562, -2074976, -3436654, -2244279, 1247140, 3466690, 1566946, -2738807, -5037253, -3346223, 69872, 1823187, 1096084, -116702, 217190, 1850797, 3001853, 2941950, 2705134, 2934137, 2483556, 272464, -2712226, -4732487, -5507884, -5389166, -3517599, 770377, 5302893, 6477481, 3456686, -1123651, -4635519, -6524824, -6916456, -5624243, -3260354, -1482670, -1365090, -2579233, -4091154, -4460293, -2264993, 1791940, 4088463, 2061669, -1619569, -2009667, 1200106, 3295792, 1450370, -1798516, -3159116, -2977599, -3037066, -3086482, -2047725, -484543]
9610d84543Q72940J30203l40899j094940j273736K89248K157188K015497O56647
9601B927605M44960O39476j249763l946482l439473J18774J901875k2006j886639
9592d511673q79410O01182J01199l65202J295765K491899J88051l015853k057412
9583f151454K817429O123995M612204P20157j675415j631235n60853Q1968m37422
9574C899374j910544k968457k353332p06137J93175P1273M86256K095912L198225
9565B005745J994479p65271k610688k352472j119036l95667p3603R04047K468705
9556E6239L017575J426203j184875k442200j369973N51591J064256n34222k777515
9547b192921l424110j525384J517347L068594J880664n31465j650063q35663L82320
$$ y = [-484543, 388397, 518600, 177701, -917239, -2190975, -1901727, 255461, 2270958, 2927605, 3372565, 4012041, 2762278, -1184204, -4623677, -4504903, -2603028, -2625034, -4511673, -5391083, -4789901, -4688702, -5053904, -3758139, -1266240, -1078189, -4094042, -6151454, -3334025, 2789970, 7402174, 8122331, 6446916, 4815681, 4254828, 4336796, 3899374, 1988830, -979627, -3332959, -4039096, -3845921, -3774648, -3288392, -1192480, 2005745, 4000224, 3234953, 624265, -1728207, -2847243, -3242910, -3316513, -2412466, 56239, 3073814, 4500017, 3315142, 872942, -497031, 54560, 1118816, 584594, -2192921, -5617031, -7142415, -5625068, -2556474, -675810, -1207275, -2857338, -3693001, -3310681]
9538c310681P52563P88258J370802K119467K212928J963267K113270J960174j8977
9529I951071l301614m883437k936617M02047J604274L01818p70704l5209J162859
9520A494488J420636J301707J277062J24898k565965m317147k832164K22205J363959
9511b510321K91055l61166K93613M64016l25061N4774K391260M045164K683563
9502G026897l03702k115515k336546k325032k305866j372383L04446J255939O90014
9493a481748n35200j032926m04818M28690L98570j65694J63724J587314K333351
9484A291263J432844N89200J230196J545907l99602k292778o50750K669790K308796
9475G724866k065530m729762k713783J10189O3025q92099j02739O64448o36806
$$ y = [-3310681, -2558118, -1769860, -399058, 1720409, 3933337, 5896604, 8009874, 9970048, 9951071, 6649457, 1766020, -1170597, -768550, 835724, 1137542, 366838, 331629, 1494488, 2915124, 4216831, 5493893, 5618791, 3052826, -1264321, -4096485, -3874280, -2510321, -2219266, -2580432, -2286819, -1822803, -2147864, -2093090, 298170, 4343334, 7026897, 6723195, 4607680, 2271134, -53898, -2359764, -3732147, -3427701, -2171762, -1481748, -2016948, -3049874, -3454692, -3026002, -2627432, -2793126, -2629402, -1042088, 1291263, 2724107, 3313307, 4543503, 6089410, 5689808, 3397030, 2746280, 5416070, 7724866, 5659336, 929574, -1784209, -1674020, -1610995, -2503094, -2605833, -1941385, -2578191]
9466b578191j670124L14J889341Q83751r68985k61703J416297O39968j166840
9457a816172l67821J843337J520485o23430o17095J127486N98971j948914k235469
9448b518622j92051l29303k869460k496340J776901L562883j90318k998372J015043
9439e239639O965319O170703q27905n507562l594153P41119K490553J656330N50244
9430C405009j27429p43946j146572j134891r05172m03444M38096Q28986L1483
9421B42120r63484m20111J357266K013312M70205j332434j117062L99389M65833
9412A115034j538332k707552n81684K763876K978719l23000k566670p18686K272388
9403F94093K171600n5400l86618J288002J166271j731699l738683k463362j22895
$$ y = [-2578191, -4248315, -4248001, -2358660, -1474909, -2443894, -2705597, -1289300, -649332, -1816172, -2183993, -340656, 1179829, 556399, -60696, 1066790, 1665761, -283153, -2518622, -2710673, -3039976, -5909436, -8405776, -6628875, -3065992, -3256310, -6254682, -5239639, 1725680, 7896383, 7068478, 1560916, -2033237, -1292118, 1198435, 2854765, 3405009, 3277580, 2533634, 1387062, 252171, -653001, -1056445, -618349, 210637, 242120, -721364, -1141475, 215791, 2229103, 2699308, 1366874, 249812, 649201, 1115034, -423298, -3130850, -3712534, -948658, 2030061, 1707061, -859609, -1578295, 694093, 2865693, 2810293, 2423675, 3711677, 4877948, 3146249, -592434, -3055796, -3178691]
9394c178691O88994N26178L36704q96714l072650l105655N19931M273497M283209
9385C74803K027982J357071J946688M83074k667282l185031J70252K920481J270260
9376D698298k350496k936093M7441K359136J047896k001765l220871j986454m93393
9367d836301K662N93326J994665K604242R78755j216713j176918P65945J573358
9358A283021K40313q45719l6406J067423P39952M776K30100K38931j399016k929452
9348a406077j483202K200476M232647K781151J49339q46641l08925n7489n95307
9339D665972o76085N19452J806658J210143j181930k525200o88116K207715K063686
9330G402295j239504l276098j710757N6922j382822l462231j767237K129823K550392
$$ y = [-3178691, -2489697, -1963519, -1626815, -2523529, -5596179, -8701834, -8181903, -3908406, 374803, 2402785, 3759856, 5706544, 6189618, 3522336, 337305, 507557, 3428038, 4698298, 2347802, -588291, -540850, 1818286, 2866182, 864417, -2356454, -4342908, -4836301, -4833639, -4240313, -2245648, 358594, 1337349, 120636, -1056282, -290337, 1283021, 1523334, 677615, 641209, 1708632, 2448584, 2453360, 2683460, 2922391, 1523375, -1406077, -2889279, -688803, 3543844, 6324995, 6474334, 5627693, 5318768, 5261279, 4665972, 3989887, 4509339, 6315997, 7526140, 6344210, 3819010, 3130894, 5338609, 7402295, 6162791, 2886693, 1175936, 1232858, -149964, -3612195, -5379432, -3249609, -699217]
9321f99217j147054l222425n26222K767711K097687n92931q29176J078622J403734
9312C30729l68963j159250R9840R71381P5879p37848K3683R14286K39781j048194
9302f58676j041325J73003J040723R34474M48004M6111k33460k46393j903k0335
9292D40223n50501r11141m13846N72509J230148J374382J164113M54965n77153
9283B783699q44370L81481J991397K106559N24758j052454j325975r02050j142810
9274B520235k203677k727032j446196J080199K758747K435036J447975J492156
9266E357443J576368n14659l642977l538355P96066M218003K014174l235361n197492
9257b166790k434304Q07783J481683P43279J22843o59821j289679n13595P57702
$$ y = [-699217, -1846271, -5068696, -5594918, -2827207, -729520, -1322451, -2151627, -1073005, 330729, -38234, -1197484, -1097644, -126263, -50384, -788232, -764549, 149737, 389518, -658676, -1700001, -1526998, -486275, 448199, 896203, 942314, 708854, 462461, 460558, 440223, -110278, -1021419, -1435265, -862756, 367392, 1741774, 2905887, 3360852, 2783699, 1939329, 2320810, 4312207, 6418766, 6943524, 5891070, 4565095, 3663045, 2520235, 316558, -2410474, -3856670, -2776471, -17724, 2417312, 3865287, 5357443, 6933811, 6419152, 2776175, -762180, 33886, 4251889, 6266063, 3030702, -2166790, -4601094, -3793311, -2311628, -1568349, -1445506, -2105327, -3395006, -3908601, -3150899]
9248c150899P2708j792848j145418K084489L083546o4642k391934L57873M598801
9239A651676M285447J11067k183570p26456Q03948k30081k140686k592093j625359
9230b646107l25358O11812N77015l79519p69789M79721K044667K231296J861763
9221C685501K496380L026748J296412j756142l089209k225993j387674j194856
9213H51167k2647K002489K160819m92225l014747k451593L34243K118788J152279
9204B638573j422909k995329j932542O94526K150685J421509L65325M88569N42343
9195A950750p95283k009947j216068L93117O42631J17606M15583N06515j221625
9186a216721k940423j831280P75705J439597O20728J440648L271399K388692j031168
$$ y = [-3150899, -3078191, -4871039, -6016457, -3931968, -848422, -913064, -3304998, -2947125, 1651676, 5937123, 6048190, 3864620, 3138164, 3942112, 3712031, 1571345, -1020748, -2646107, -2971465, -2359653, -1782638, -2162157, -2931946, -2452225, -407558, 1823738, 3685501, 6181881, 9208629, 10505041, 8748899, 5659690, 3433697, 2046023, 851167, 828520, 2831009, 4991828, 4499603, 1484856, -966737, -632494, 1486294, 2638573, 1215664, -1779665, -3712207, -3017681, -866996, 554513, 919838, 1408407, 1950750, 1155467, -854480, -2070548, -1677431, -1034800, -917194, -501611, 4904, -1216721, -4157144, -5988424, -5212719, -3773122, -3152394, -1711746, 1559653, 3948345, 2917177]
9177B917177k558493q04369P84747M35212M23405J505594J021914j372550k032231
9168C20406P4513R57298j183876k258721M37206L007660J679873n02260P81703
9159C313802L273147J983019k210954m061172k203677j39552Q0700j4029P44064
9150G65348J406900J241136N90273m31737j577869j576339k2363J013123k03970
9141A204502j980065j587158N36226J697289R75099j79780m11950N15039J975264
9132B744466K202711l56200l893606m123804k81302K952059K050478m04153o64846
9123B25803J05341r01576k241919r33330J477262J226096j004041j317938P15241
9114b649061K048317J800350J492367O26501k194897m454143k272312K340388
$$ y = [2917177, 358684, -445685, 339062, 774274, 1197679, 2703273, 3725187, 2352637, 320406, 394919, 1352217, 168341, -2090380, -1653174, 1354486, 3034359, 2532099, 3313802, 6586949, 8569968, 6359014, 2297842, 94165, -45387, 35313, 21284, 765348, 2172248, 3413384, 4003657, 3571920, 1994051, 417712, 395349, 1408472, 1204502, -775563, -2362721, -1826495, -129206, 845893, 666113, 254163, 769202, 2744466, 4947177, 4590977, 697371, -3426433, -3707735, -755676, 1294802, 890649, 225803, 331144, -570432, -2812351, -3745681, -2268419, -1042323, -2046364, -3364302, -2649061, -600744, 1199606, 2691973, 3318474, 1123577, -3330566, -5602878, -3262490]
9106c262490L302790N1499j462289J296033L498395J488422j422917j466472q32828
9097A190143k825713n256102l937648L81695L477681L807659K922992J636876
9089A397583j53988j307633q13473p2897n17994n14326J805020M188191K924521
9080F935004j063836l184452k015003p38516j243742j308455P33750K582689J832071
9071B529510J19964K90726J581376J072665j245706k390361j240114k28145j353525
9062h63610l111236k843540l81240K179628L149157K352934N69064q14899m19926
9053a83668J491368K651375J331640j366876k958462k519316q91635J020794K438896
9044A014116K211467K59973j321488r22192k02216j382444k782175r46193L099294
$$ y = [-3262490, 40300, 91799, -1370490, -74457, 3423938, 4912360, 3489443, 2022971, 1190143, -1635570, -6891672, -10829320, -10447625, -6969944, -3162285, -239293, 1397583, 1243595, -64038, -877511, -950408, -1468402, -1982728, -177708, 4010483, 6935004, 5871168, 2686716, 671713, -66803, -1310545, -2619000, -1885250, 697439, 2529510, 2649474, 2940200, 4521576, 5594241, 4348535, 1958174, 718060, 489915, -863610, -3974846, -6818386, -7199626, -5019998, -1870841, 482093, 1051157, 236258, -183668, 1307700, 3959075, 5290715, 3923839, 965377, -1553939, -2445574, -1424780, 1014116, 3225583, 3485556, 2164068, 1241876, 1039660, -342784, -3124959, -4071152, -971858]
9035i71858M318836J152104k216443k664679k249730k865824j883561K559193
9027d821962O152820L922561j545029l367987m77209J650444K38878r64752J277815
9018B065579M116134L129025j031233l834477k913429j64438J367911O37460j181473
9009B191059k268175j727908r8692J442952K103039J617074Q2371j801420k944916
9000a404616k888452j999271m66793J636256L008867J870694r44957j907929M94644
8991b601557L135601K593916J15636o15273Q86233J785489O70197q29598j130046
8982D010598o72307m66997o63586q43375m31839R00680K260346J955378j8j380094
8972D668786j097297r32379k073052k487647m01240K120486K279225Q88588R5731
$$ y = [-971858, 3346978, 4499082, 2282639, -382040, -2631770, -5497594, -7381155, -4821962, 1330858, 5253419, 3708390, 340403, -136806, 1513638, 1752516, 787764, 2065579, 6181713, 9310738, 8279505, 4445028, 1531599, 1367161, 2735072, 3372532, 2191059, -77116, -1805024, -1903716, -460764, 1642275, 3259349, 3341720, 1540300, -1404616, -4293068, -6292339, -6759132, -5122876, -2114009, -243315, -1188272, -3096201, -2601557, 534044, 3127960, 3243596, 2628323, 3514556, 5300045, 5970242, 5140644, 4010598, 3338291, 2871294, 2207708, 1364333, 932494, 1833174, 4093520, 6048898, 6048880, 4668786, 3571489, 2639110, 566058, -1921589, -2322829, -202343, 2076882, 2965470, 3061201]
8963C061201p45430k763988l607766q32941K669579K209638j090139k097904j20618
8954c318368Q40876j05738L55183K464080K187382j041857k406960o3704J381681
8945B92575q76416k636537j18912L250940K714972k6980n71114N61317J1701j576530
8935A025016q41793J859415K859934J189830o36569j306875j819726k177853j043344
8926h91965J068631J679553m7292k126326k444489p42822J820494L385246K351802
8917D052832o99865k965313k747113j393472m65038P38604K598289K764139l16588
8908A566475l563553k930834M38496J844331L8758j606135q10437Q31156J330516
8899b861227R51095M59670k08178n95961K89520J798836J884348K27144j231639
$$ y = [3061201, 2315771, -448217, -4055983, -4888924, -2219345, -9707, -1099846, -3197750, -3318368, -2477492, -2583230, -2228047, 236033, 2423415, 1381558, -1025402, -1089106, 292575, -583841, -3220378, -3339290, -88350, 2626622, 2599642, 2028528, 2589845, 2601546, 1025016, 183223, 2042638, 4902572, 6092402, 5455833, 4148958, 2329232, 151379, -891965, 176666, 1856219, 1808927, -317399, -2761888, -3504710, -1684216, 1701030, 4052832, 3352967, 387654, -2359459, -3752931, -4217969, -3479365, -881076, 1883063, 1566475, -1997078, -4927912, -4489416, -2645085, -2606327, -4212462, -5022899, -4191743, -2861227, -1910132, -1450462, -1658640, -2254601, -1965081, -166245, 1718103, 1945247, 713608]
8890G13608j416498j244487j042086L29940K676266L535482J665656q13031j512117
8881B892733j027607j181839j737780j145564N03958J572896J499378J252597
8873B628772J118540k3835k416905l833709j846970K483418M762626K186073k515903
8864B542107l859030m16434L310588K933052j52856j490386k75096J85403j605590
8855A171758k879022j323954J140470J667099R66256J404878K285305P40184k920353
8846B252621m467237j580727K446382K926001j13944k451259j431172J279829
8838a139506K734796K225574R09860l42497j310210j541064n85154J029972K033625
8829D015396J708182M71037p15728j156216q82844n84883p55289q75770j86450
$$ y = [713608, -702890, -1947377, -2989463, -2659523, 16743, 3552225, 5217881, 4404850, 2892733, 1865126, 683287, -1054493, -2200057, -1696099, -123203, 1376175, 2628772, 3747312, 3723477, 1306572, -2527137, -4374107, -1890689, 2871937, 5058010, 2542107, -1316923, -1733357, 1577231, 4510283, 4357427, 2867041, 2591945, 2777348, 1171758, -1707264, -3031218, -1890748, -223649, 742607, 2147485, 4432790, 5172974, 2252621, -2214616, -3795343, -1348961, 1577040, 1463096, -988163, -2419335, -1139506, 1595290, 3820864, 4730724, 4388227, 3078017, 1536953, 951799, 1981771, 4015396, 5723578, 6194615, 5478887, 4322671, 3439827, 2854944, 2099655, 1223885, 1037435]
8820A037435P03290K74886j391035k211326j183451m0096k25664j83498J802815
8811a416644L714729K272896j422841k769704n46753J219419k78098k297059j367228
8802b891283Q73586M47266k331136l191506m45577K650129K820133R98238J18224
8793i51926Q30076J407276Q45426p04l44606q05473j965294k681513j319624J533871
8783c452491L196501K221784Q7666j308354k069775k636869j655458J658263M340956
8774C82223K685539j722614l142883J39722L013929J184216k345870k124232J319452
8765f10518K635885M1762k376108j290134J182705J319930p07011j789633p32134
8756b325256N79835O00121L61614J359589K677653J982636q35440k904240k147696
$$ y = [1037435, 1740725, 2015611, 624576, -1586750, -2770201, -2810297, -3035961, -3219459, -1416644, 2298085, 4570981, 3148140, 378436, -168317, 1051102, 773004, -1524055, -2891283, -2017697, -1570431, -3901567, -7093073, -7538650, -4888521, -2068388, -1070150, -951926, -121850, 1285426, 2130852, 2130148, 1785542, 980069, -985225, -3666738, -4986362, -3452491, -255990, 1965794, 2053460, 745106, -1324669, -3961538, -5616996, -3958733, 382223, 3067762, 1345148, -1797735, -1658013, 1355916, 2540132, 194262, -1929970, -610518, 2025367, 2067129, -308979, -1599113, -416408, 903522, 196511, -1593122, -2325256, -1745421, -1145300, -783686, 575903, 3253556, 5236192, 4400752, 1496512, -651184]
8747f51184k42341o7711j371791j501708J119O63718m92619j063421N60369K114582
8737b050987J111114q54860o80209J045326J134921o94736j414653j7018P10177
8728a710925q89690k171217l67289K693991L165883R61449m24019N38153J415419
8719C211755J21188j747454j635876N7809J068700Q45841N08882Q8092j305803
8710A213134k728295j927195P70771K161959R47096k63079M90166J137393n02402
8701A299548k355059j341734J190171J540579k54120r53370k213j06026j858826
8692b841050k539788j025169N35363R65546J609450K435839J244288j482143j716036
8683b813700J623729L948424J903663j424194j972683j133600k040688l111214
$$ y = [-651184, -893525, -961236, -2333027, -3834735, -3833616, -3169898, -3662517, -4725938, -4165569, -2050987, -939873, -1794733, -2474942, -1429616, -294695, -989431, -2404084, -2421102, -1710925, -2600615, -4771832, -5139121, -2445130, 720753, 1682202, 1258183, 1796336, 3211755, 3332943, 1585489, -50387, 7422, 1076122, 1921963, 2430845, 2518937, 1213134, -1515161, -3442356, -2671585, -509626, 437470, 174391, 664557, 1801950, 1299548, -1055511, -2397245, -1207074, 333505, 79385, -873985, -876198, -982224, -2841050, -5380838, -6406007, -5870644, -4905098, -3295648, -859809, 384479, -1097664, -2813700, -1189971, 2758453, 4662116, 3237922, 1265239, 131639, -1909049, -5020263]
8675e020263r79218K550848K582644q18893k473358j56679K438095J930029l4898
8666A8307j91027J529033K743865K173338O42066m40177n43522m09731j109347
8657D412805k342374k390631n09719J704643K362654J431452k24659k208179l555472
8648a319480k479051P37998K664938J144029j125052m10251K357248L121358P01271
8639E393008k232327l352754k540574k97355K424945L472478J782157k70743L0021
8630D408856J330762M78054j897732k315958l56076Q81678J54108n50674k35827
8621A897191j02337k36063M35603O23815j931405n057659l752101J558877M349556
8612b214523J772858j055245J48129J901173l40898l872368l256133O08400K459414
$$ y = [-5020263, -5999481, -3448633, -865989, -1684882, -4158240, -4314919, -1876824, 53205, 18307, -172720, 1356313, 4100178, 6273516, 6915582, 6475405, 5931883, 5522152, 4412805, 2070431, -320200, -829919, 874724, 3237378, 4668830, 4444171, 2235992, -1319480, -3798531, -3060533, -395595, 748434, -376618, -786869, 1570379, 4691737, 5393008, 3160681, -192073, -2732647, -3030002, -605057, 2867421, 4649578, 4378835, 4408856, 5739618, 6217672, 4319940, 2003982, 1647906, 2529584, 2683692, 2133018, 1897191, 1794854, 1558791, 1994394, 2618209, 686804, -4370855, -8122956, -6564079, -2214523, -441665, -1496910, -1348781, 552392, 211494, -3660874, -6917007, -6308607, -3849193]
8603c849193J339829Q18547J818004J563003m49977j305242j89432J96893j071009
8594a128577j320880N55396J699241L91789o20208R78429K444203K78299l347842
8585g0150l193323R59899L589257J474804j800603j490238J456242K416098J75982
8576C517968j793694j031075N22254J84842j147530p15437J584727L023165K012572
8567F157792j0433r76577o72421k06346k69973o72745q71634m86841K58949N72071
8557B821842R1342l97461n7326N30232R8847j307020k307269k064348r08637P53553
8547b746245K537998L047824Q03772k967459m361383j177069L833122N752964
8539D723524L082137r59059k656089j884473j284808k296855l375470k406837
$$ y = [-3849193, -2509364, -1690817, 127187, 1690190, 1240213, -65029, -254461, -57568, -1128577, -2449457, -1894061, -194820, 196969, -423239, 555190, 2999393, 3277692, -70150, -3263473, -2303574, 1285683, 2760487, 959884, -530354, 925888, 3341986, 3517968, 1724274, 693199, 1215453, 1400295, 252765, -462672, 1122055, 4145220, 6157792, 6147359, 5170782, 4498361, 4292015, 4022042, 3349297, 2477663, 1990822, 2249771, 2821842, 2913184, 2515723, 2458397, 2988629, 3087476, 1780456, -526813, -2591161, -3499798, -2746245, -208247, 2839577, 3643349, 675890, -3685493, -4862562, -1029440, 4723524, 7805661, 6846602, 4190513, 2306040, 1021232, -1275623, -4651093, -7057930]
8531g057930K30695K159443K130394J230556Q20101P90470N46511L04429L63786
8522A518455K35398m08522r79127j201860j818602k813493k419521L65244L549057
8513c972971M411329K954861J129927k53538j551634k221754j346419K86351J012413
8504D48565P54988N00539J10858r12567j419343k07725J205898N49182j225337
8495a94942j380651j41372m1740r22307j00240K219300K526366j4911j977652
8486b8149j573291j253325k302092j914219J149564K804248r8790l644816k154837
8477i015707K993113N257029K353663j414166k123293q09783q9321J9557R63955
8468a864953K541177K910681J146351j351323k301520j269407k13157n29016o74674
$$ y = [-7057930, -6827235, -4667792, -2537398, -1306842, -486741, 303729, 850240, 1154669, 1518455, 1753853, 1345331, 366204, -835656, -2654258, -5467751, -7887272, -7522028, -3972971, 438358, 3393219, 4523146, 4269608, 2717974, 496220, -850199, -563848, 448565, 1203553, 1704092, 1814950, 902383, -516960, -724685, 481213, 1030395, -194942, -1575593, -1716965, -1758705, -2681012, -2781252, -561952, 1964414, 1949503, -28149, -1601440, -2854765, -5156857, -7071076, -5921512, -3117264, -3216054, -6860870, -9015707, -6022594, -765565, 1588098, 173932, -1949361, -2759144, -2848465, -2828908, -1864953, 676224, 3586905, 4733256, 3381933, 1080413, -188994, -402151, -931167, -1605841]
8459a605841J156600K940814R94580l573626m973645r64909L386272L043819M5120
8450D49184p35973O06886M81193j222903j247358O93149J106289j175086k743860
8441c788479r33318K187653K932754O87131k066761k808500j056119J460037K261511
8432a124091P04711j061925p19941J317966K883599K906801J696219l96473k562529
8423C644337k986715j038993J036165R40322m33089j065056j388496k500510k556421
8414f348456O77647M689266M595440N64736k173034j261177Q4667m29284m83576
8405h3771J570653K863003J018585j211403m61850J502143R88626j323014j933014
8396B929958m87879M65841M22549R21520J323435n81518l653128l821623l27840
$$ y = [-1605841, -449241, 2491573, 3486153, -87473, -5061118, -6026027, -2639755, 404064, 449184, -286789, 320097, 801290, -421613, -1668971, -975822, 130467, -1044619, -3788479, -4721797, -2534144, 398610, 1085741, -981020, -3789520, -4845639, -3385602, -1124091, -419380, -1481305, -2201246, -883280, 2000319, 4907120, 6603339, 6206866, 3644337, 657622, -381371, 654794, 1595116, 1162027, 96971, -1291525, -3792035, -6348456, -5670809, -981543, 3613897, 4178633, 2005599, 744422, 829089, 399805, -83771, 1486882, 4349885, 5368470, 4157067, 3695217, 5197360, 6185986, 4862972, 2929958, 2442079, 2907920, 3330469, 4251989, 5575424, 4993906, 1340778, -2480845, -2808685]
8387b808685K788728K786549J625073J400965O29232j939016l518833j399324
8379d35311J746394J288016k064150l242822p35718J488798Q06445k30538R03364
8370d75522K015194J80518k791275l044760q27191L93731j38917P5091J592359
8361c020772J859730J42451o62053J023652K400895P46107k060132k485734o88276
8352b744132L14095m86431j176864l84595J039707J812032J626873O71341o97159
8343b5133j749629k017916j874166j556656l92879J764886L238352K340805k4857
8334b97193j238758k29240J482916J856071M18400j461093j723777L40585K754037
8325A901948K732777M17145j109377l99801K47856j006858j999876j54343K609931
$$ y = [-2808685, -19957, 2766592, 4391665, 5792630, 6421862, 4482846, 964013, -435311, 1311083, 2599099, 534949, -2707873, -3443591, -1954793, -1148348, -1378886, -475522, 1539672, 1720190, -1071085, -4115845, -4943036, -4549305, -4688222, -4613131, -3020772, -1161042, -1018591, -1680644, -656992, 1743903, 2490010, 429878, -2055856, -2744132, -2430037, -2916468, -4093332, -4477927, -3438220, -1626188, 685, 672026, -25133, -1774762, -3792678, -5666844, -7223500, -7616379, -5851493, -2613141, -272336, -297193, -1535951, -1765191, -282275, 1573796, 1992196, 531103, -1192674, -852089, 1901948, 4634725, 5051870, 3942493, 3542692, 3790548, 2783690, 783814, 629471, 3239402]
8316C239402K309165j019782l501774l115052j513948l50287N91950J327839J125460
8307i07027N47333R77070J660729L07434k813265m506602l139645n03424J505308
8298f872089K880733L340017J664746j312924k379055n01512J241401L77050j145624
8289b707257l53868J936174K559749O83480j582707k300255j348645L22139J525495
8280a265695J548634R14884N36534q4524j968333l780703k696203R10935K883386
8271c001085J167055r83157j89685J841025J710478K28181O05044K350629J703503
8262E431988j980576m564395k917521Q29555K398988P29829j331328q45659J749722
8253d99397L103215R89090k495087l171054l68633K001053J039642j125711j124848
$$ y = [3239402, 5548567, 4528785, 1027011, -2088041, -3601989, -3952276, -3360326, -2032487, -907027, -359694, 617376, 2278105, 2585539, -227726, -4734328, -7873973, -8377397, -6872089, -3991356, -651339, 1013407, -299517, -2678572, -3180084, -1938683, -1561633, -2707257, -3061125, -1124951, 1434798, 2118278, 535571, -1764684, -3113329, -2791190, -1265695, 282939, 1197823, 1734357, 1649833, -318500, -4099203, -6795406, -5884471, -3001085, -1834030, -2817187, -3006872, -1165847, 544631, 772812, 1377856, 3728485, 5431988, 3451412, -1112983, -4030504, -3200949, -801961, -72132, -1403460, -2249119, -499397, 2603818, 3592908, 1097821, -2073233, -2441866, -440813, 598829, -526882, -1651730]
8244a651730L20423J25900j678086k017259Q2473J988882J574682m8179p49009
8235b051903j53885P04394J012147P43863M45413N74600O19200l55922j685367
8226a47460j199937J409555L198790J807350j156742k746950k686880k158140
8218c680414q07919J709913L252978K075166L14257M52387M77742k259600m549864
8209c015354j475189M070533M081536j745931m589754m19263L499919P75672l655323
8200b473154k273053K410328K672701j275182k403269P39040K085116j008492
8192a525965l360230r63586K502332J892456j610564l056192j030203J403461
8184e748491J553309n4149j190111m93758J346934K262140R55699j483744k624574
$$ y = [-1651730, -1331307, -1205407, -2883493, -4900752, -4818279, -2829397, -1254715, -1302894, -2051903, -2205788, -1501394, -489247, 254616, 700029, 1274629, 1893829, 1537907, -147460, -1347397, 62158, 3260948, 5068298, 3911556, 1164606, -1522274, -3680414, -4488333, -2778420, 474558, 2549724, 2863981, 3316368, 3794110, 1534510, -3015354, -4490543, -420010, 3661526, 1915595, -2674159, -3093422, 406497, 1182169, -2473154, -4746207, -2335879, 336822, -938360, -3341629, -2602589, -517473, -1525965, -4886195, -5849781, -3347449, -1454993, -3065557, -6121749, -7151952, -5748491, -4195182, -4249331, -5439442, -5933200, -4586266, -2324126, -1368427, -2852171, -5476745]
8175e476745j139854K167245M925537M361367k50032n180147m854874R21521N167577
8166F41595K559138k717524k834735K034015M321487R28574k572815j341477J702589
8157B720847J750946l11498p18488N58977P44505n64860j441070j331827j096961
8148C10571n67937P27611J529825N03643j092241j136089o91M47563P9131M3529
8138H44915K14968j05801m6831J277875K079076Q7861l179389l811027j017650
8129c656003K040637L000913K539980J559382l24425k429559k417158K14527K529804
8120C058098J881492o32541k107867j658241o34157j98048k98737m21626j49723
8111a161350O39621J420604J337484L66195m06937r3317R02642J395103O68272
$$ y = [-5476745, -6616599, -4449354, 476183, 4837550, 4587518, -592629, -5447503, -4525982, 641595, 3200733, 483209, -2351526, -317511, 4003976, 4932550, 2359735, 1018258, 2720847, 4471793, 4160295, 3441807, 4000784, 4745289, 4180429, 2739359, 1407532, 310571, -257366, 470245, 2000070, 2503713, 1411472, 275383, 274692, 722255, 801386, 844915, 1059883, 954082, 907251, 2185126, 4264202, 4352063, 1172674, -2638353, -3656003, -1615366, 1385547, 3925527, 5484909, 5160484, 2730925, 313767, 528294, 3058098, 4939590, 4307049, 2199182, 540941, -93216, -291264, -590001, -1011627, -1161350, -521729, 898875, 2236359, 2602554, 2195617, 2102300, 3004942, 4400045, 5068317]
8102E068317q29183j784122j329006k77689k19713j000781o28075J293806K029083
8093B322637l23147l190088k850062n9628J280721L52362R2421J518809J970192
8084A114217K82326p35346O91893J810451M0177k122043q53502K544357L257422
8075F029952J27757k827701k297651K35678J283279p8453j742838j551732K99941
8066e21768J697751J199182j74704m81356J87532M1794r58532m87164K128551
8057B631286L832736J962466j563584k801283j096272Q77514J332374P86122r8781
8048E862578j281240k098804j693674o43086j49161j0814N09281N62817r20768
8039A37129k424964j520360R29254J630791P0338p67446M71894J472035O47451
$$ y = [5068317, 4239134, 2455012, 1126006, 848317, 628604, -372177, -1000252, 293554, 2322637, 1999490, -1190598, -4040660, -4100288, -2819567, -2467205, -2374784, -855975, 1114217, 1396543, 661197, 1353090, 3163541, 3203718, 1081675, 228173, 2772530, 6029952, 6157709, 3330008, 1032357, 1268035, 2551314, 2472861, 730023, -821709, -521768, 1175983, 2375165, 2200461, 1719105, 1906637, 1948431, 989899, 502735, 2631286, 6464022, 8426488, 6862904, 4061621, 2965349, 3842863, 5175237, 5961359, 5862578, 4581338, 2482534, 788860, 145774, -3387, -14201, 495080, 1057897, 137129, -2287835, -3808195, -2878941, -1248150, -1177812, -1945258, -1473364, -1329, 646122]
8030F46122j88117M33994P70055o06226j618690l32624R55093p26596l311184
8021c978173k137806K558769N199410K542624k124810l911937k238281J10097
8013c980107J342498J653171J280574K2963j562577k150560j079807R47643K578301
8004i47901K829213J703033J72682p05519q27233q18323q64220n56015J2287M0890
7994C8894o29188r30326k1645J386777J851343Q23677r95816k328108k042416
7985b846808j44776J531073Q37433j712508k833765n68586K760214L375441Q79326
7976A277044j678822j950493m00443J426013K499818K065455L3619j904094j611411
7967b43314M13195J313151P91j140044R3165K338528K621266L06152k490599l449780
$$ y = [646122, 458005, 891999, 1662054, 1055828, -562862, -895486, 59607, -666989, -3978173, -6115979, -3557210, 1642200, 4184824, 2060014, -1851923, -4090204, -3980107, -2637609, -984438, 296136, 319099, -1243478, -3394038, -4473845, -3526202, -947901, 1881312, 3584345, 3757027, 3051508, 2224275, 1405952, 541732, -14283, -1996, 38894, -590294, -1520620, -1542265, -155488, 1695855, 2519532, 1523716, -804392, -2846808, -2991584, -1460511, -623078, -2335586, -5169351, -5737937, -2977723, 397718, 1277044, -401778, -2352271, -2752714, -1326701, 1173117, 3238572, 3272191, 1368097, -243314, 169881, 1483032, 1483823, 343779, 436944, 2775472, 5396738, 5702890, 3212291, -237489]
7957b37489j828288J209490L042416J719430j371659k564292o81456J301799P69405
7948A359356q24722r44592k19024o65046j637177j122728K65646L79002k45273
7939c654558P93445L061976L458270J282549p28637r40320o00454m25425O10466
7930B857312J979232J176906j716612k982684r31055J125199K00369j601199r14830
7921h07362J320693J887720O45071Q51N20088P25931L44084L97376O61893J6344
7911E712689j121354j355159p96308n49353m64369M8380j05884k008061l626425
7902d265844j897475K158618L962007J659142j423400j801339k96342L43595j50635
7893a711673R24J075963J208258o61276k816005k530057N76802L644334L594547
$$ y = [-237489, -2065777, -856287, 2186129, 3905559, 2533900, -30392, -711848, 589951, 1359356, 534634, -409958, -628982, -1294028, -2931205, -4053933, -3788287, -3409285, -3654558, -2861113, 200863, 3659133, 4941682, 4213045, 3272725, 2672271, 2246846, 2857312, 4836544, 6013450, 4296838, 1314154, 383099, 1508298, 1708667, 107468, -807362, 513331, 2401051, 3046122, 3046973, 3567061, 4292992, 4637076, 5034452, 5696345, 5712689, 4591335, 3236176, 2439868, 1890515, 1426146, 1474526, 1368642, -639419, -4265844, -6163319, -4004701, -42694, 1616448, 193048, -1608291, -1904633, -1561038, -1711673, -1710749, -634786, 573472, -87804, -2903809, -5433866, -4857064, -1212730, 2381817]
7884B381817Q26901j252692p16459N10291m2805j444925j042692R59252J587697
7875A766385j48899j533233k41935K185925K695825R84425n27047k86519O60109
7866E555036O14120n20663j582735j954978k067288k205551j790993l94871J207055
7857c140868J887342J678270J402803J137975M07532k34834M59675K166163K749329
7848H513387R81124j934104m077806m505371k886865L43173K713576J230526l226041
7839b848401n474893k211644L413800N829083L842811O97229j096447j731601
7831D19937j728286q71333L56570Q21342N24352M92134Q96033R28978L56118k92503
7821A903342o79090n44351N14910J833910J563026n67491j955321p08224J199932
$$ y = [2381817, 3208718, 1956026, 1239567, 1749858, 1707053, 262128, -780564, 178688, 1766385, 1617486, 84253, -157682, 2028243, 4724068, 5708493, 5181446, 4894927, 5555036, 6169156, 5648493, 4065758, 2110780, 43492, -2162059, -3953052, -4347923, -3140868, -1253526, 424744, 1827547, 2965522, 3373054, 3138220, 3597895, 5764058, 8513387, 9494511, 7560407, 3482601, -1022770, -3909635, -3566462, -852886, 377640, -2848401, -8323294, -10534938, -7121138, -1292055, 2550756, 3247985, 2151538, 419937, -1308349, -2179682, -1823112, -1001770, -477418, 14716, 910749, 1839727, 2195845, 1903342, 1224252, 679901, 1194811, 3028721, 4591747, 4024256, 2068935, 1360711, 2560643]
7812B560643R66558n67523p08597K76185n3775j536320j493146M82841J749877
$$ y = [2560643, 3527201, 2959678, 2251081, 2527266, 2473491, 937171, -555975, -73134, 1676743]
$$ [...]
##END NTUPLES=NMR SPECTRUM
##END=
