##TITLE=31Pdec_SR55_oil3
 d2o, 124 sc
 12.05.2021
##JCAMPDX= 6.0         $$ Bruker NMR JCAMP-DX V2.0
##DATA TYPE= NMR SPECTRUM
##DATA CLASS= NTUPLES
##ORIGIN= UXNMR, Bruker Analytische Messtechnik GmbH
##OWNER= root
$$ XWIN-NMR		Version 3.5
$$ Wed May 12 13:15:04 2021 Russian Standard Time (UT+4h)  she@DPX200
##.OBSERVE FREQUENCY= 81.013821
##.OBSERVE NUCLEUS= ^31P
##.ACQUISITION MODE= SIMULTANEOUS
##.ACQUISITION SCHEME= undefined
##.AVERAGES= 124
##.DIGITISER RES= 16
##SPECTROMETER/DATA SYSTEM= spect
##.PULSE SEQUENCE= zgpg30
##.SOLVENT NAME= CDCl3
##.SHIFT REFERENCE= (INTERNAL, CDCl3, 0, 248.564)
##AUDIT TRAIL= $$ (NUMBER, WHEN, WHO, WHERE, WHAT)
$$ ##TITLE= Audit trail, XWIN-NMR		Version 3.5
$$ ##JCAMPDX= 5.01
$$ ##ORIGIN= Bruker BioSpin GmbH
$$ ##OWNER= she
$$ F:/spectra/data/she/nmr/P31/1/pdata/1/auditp.txt
$$ ##AUDIT TRAIL=  $$ (NUMBER, WHEN, WHO, WHERE, WHAT)
(   1,<2021-05-12 13:14:18.73 +0400>,<she>,<DPX200>,
      <continue with go, POWCHK disabled, PULCHK disabled
       configuration hash MD5:
       00 E9 B6 7A A2 85 ED C7 34 08 36 98 17 FE 4E 26
       data hash MD5: 32K
       F1 A5 04 71 07 F1 AA A6 82 D9 B3 15 99 C4 CA A6>)
(   2,<2021-05-12 13:14:20.32 +0400>,<she>,<DPX200>,
      <Start of raw data processing
       efp BC_mod = 2 LB = 1 FT_mod = 6 PKNL = 1 PHC0 = -6236.349 PHC1 = 102.0008 SI = 64K 
       data hash MD5: 64K
       A4 72 97 6B 1E F2 22 66 35 CE E1 0F 36 F6 94 29>)
(   3,<2021-05-12 13:14:36.89 +0400>,<she>,<DPX200>,
      <pk PHC0 = -72.28362 PHC1 = 232.9999 
       data hash MD5: 64K
       53 52 74 23 DE CF F0 22 21 63 2E 95 7A F7 AD C1>)
(   4,<2021-05-12 13:14:40.57 +0400>,<she>,<DPX200>,
      <abs ABSG = 5 
       data hash MD5: 64K
       66 45 78 5F 7F 7C AE 15 EF 84 64 87 E2 60 46 5C>)
$$ ##END=
$$ 
$$ hash MD5
$$ ED F7 4C 8B 40 1D 2F 14 47 A3 3E 80 27 F2 59 53
##$RELAX= 
##$RELAX= 
##$RELAX= 
##$RELAX= 
##$RELAX= 
##$RELAX= 
##$RELAX= 
##$RELAX= 
$$ Bruker specific parameters
$$ --------------------------
##$DU= <F:/spectra>
##$EXPNO= 1
##$NAME= <P31>
##$PROCNO= 1
##$TYPE= <nmr>
##$USER= <she>
##$AMP= (0..31)
100 100 100 100 100 100 100 100 100 100 100 100 100 100 100 100 100 100 
100 100 100 100 100 100 100 100 100 100 100 100 100 100 
##$AQSEQ= 0
##$AQ_mod= 1
##$AUNM= <au_zg>
##$AUTOPOS= <>
##$BF1= 81.014009
##$BF2= 200.13
##$BF3= 200.13
##$BF4= 200.13
##$BF5= 200.13
##$BF6= 200.13
##$BF7= 200.13
##$BF8= 200.13
##$BYTORDA= 1
##$CFDGTYP= 0
##$CFRGTYP= 5
##$CHEMSTR= <none>
##$CNST= (0..31)
1 1 145 1 1 1 1 1 1 1 1 1 1 1 1 1 1 1 1 1 1 1 1 1 1 1 1 1 1 1 1 1 
##$CPDPRG= <waltz16>
##$CPDPRG1= <>
##$CPDPRG2= <waltz16>
##$CPDPRG3= <>
##$CPDPRG4= <mlev>
##$CPDPRG5= <mlev>
##$CPDPRG6= <mlev>
##$CPDPRG7= <mlev>
##$CPDPRG8= <mlev>
##$CPDPRGB= <>
##$CPDPRGT= <>
##$D= (0..31)
0 1 0 0 0 0 0 0 0 0 0 0.03 2e-05 3e-06 0 0 0 0 0 0 0 0 0 0 0 0 0 0 0 0 
0 0 
##$DATE= 1620810662
##$DBL= (0..7)
120 120 120 11 120 120 24 19 
##$DBP= (0..7)
150 150 150 150 150 150 150 150 
##$DBP07= 0
##$DBPNAM0= <>
##$DBPNAM1= <>
$$ [...]
##$SUBNAM3= <"">
##$SUBNAM4= <"">
##$SUBNAM5= <"">
##$SUBNAM6= <"">
##$SUBNAM7= <"">
##$SUBNAM8= <"">
##$SUBNAM9= <"">
##$SW= 501.771253377433
##$SWIBOX= (0..15)
0 1 3 0 0 0 0 0 0 0 0 0 0 0 0 0 
##$SW_h= 40650.406504065
##$TD= 32768
##$TD0= 1
##$TE= 0
##$TE2= 300
##$TE3= 300
##$TEG= 300
##$TL= (0..7)
0 120 53 12 22 120 120 120 
##$TP= (0..7)
150 150 150 150 150 150 150 150 
##$TP07= 0
##$TPNAME0= <>
##$TPNAME1= <>
##$TPNAME2= <>
##$TPNAME3= <>
##$TPNAME4= <>
##$TPNAME5= <>
##$TPNAME6= <>
##$TPNAME7= <>
##$TPOAL= (0..7)
0.5 0.5 0.5 0.5 0.5 0.5 0.5 0.5 
##$TPOFFS= (0..7)
0 0 0 0 0 0 0 0 
##$TUNHIN= 0
##$TUNHOUT= 0
##$TUNXOUT= 0
##$USERA1= <user>
##$USERA2= <user>
##$USERA3= <user>
##$USERA4= <user>
##$USERA5= <user>
##$V9= 5
##$VALIST= <valist>
##$VCLIST= <CCCCCCCCCCCCCCC>
##$VD= 0
##$VDLIST= <DDDDDDDDDDDDDDD>
##$VPLIST= <PPPPPPPPPPPPPPP>
##$VTLIST= <TTTTTTTTTTTTTTT>
##$WBST= 1024
##$WBSW= 4
##$XGAIN= (0..3)
0 0 0 0 
##$XL= 0
##$YL= 0
##$YMAX_a= 11410
##$YMIN_a= -7554
##$ZGOPTNS= <>
##$ZL1= 120
##$ZL2= 120
##$ZL3= 120
##$ZL4= 120
##$ABSF1= 248.5645
##$ABSF2= -253.2056
##$ABSG= 5
##$ABSL= 3
##$ALPHA= 0
##$AQORDER= 0
##$ASSFAC= 0
##$ASSFACI= 0
##$ASSFACX= 0
##$ASSWID= 0
##$AUNMP= <proc_1d>
##$AZFE= 0.1
##$AZFW= 0.5
##$BCFW= 0
##$BC_mod= 2
##$BYTORDP= 0
##$COROFFS= 0
##$CY= -3
##$DATMOD= 1
##$DC= 0
##$DFILT= <>
##$DTYPP= 0
##$F1P= 0
##$F2P= 0
##$FCOR= 1
##$FTSIZE= 65536
##$FT_mod= 6
##$GAMMA= 0
##$GB= 0
##$INTBC= 1
##$INTSCL= 5.30512e-09
##$ISEN= 30
##$LB= 1
##$LEV0= 0
##$LPBIN= 0
##$MAXI= 10000
##$MC2= 0
##$MEAN= 0
##$ME_mod= 0
##$MI= 50
##$NCOEF= 0
##$NC_proc= -5
##$NLEV= 6
##$NOISF1= 182.463
##$NOISF2= 159.3651
##$NSP= 0
##$NTH_PI= 0
##$NZP= 0
##$OFFSET= 248.5645
##$PC= 4
##$PHC0= -6308.633
##$PHC1= 335.0007
##$PH_mod= 1
##$PKNL= yes
##$PPARMOD= 0
##$PSCAL= 0
##$PSIGN= 0
##$REVERSE= no
##$SF= 81.014009
##$SI= 65536
##$SIGF1= 159.3651
##$SIGF2= -187.1042
##$SINO= 113.3802
##$SIOLD= 16384
##$SREGLST= <1H.CDCl3>
##$SSB= 0
##$STSI= 65536
##$STSR= 0
##$SW_p= 40650.406504065
##$SYMM= 0
##$S_DEV= 0
##$TDeff= 32768
##$TDoff= 0
##$TI= <>
##$TILT= no
##$TM1= 0
##$TM2= 0
##$TOPLEV= 0
##$USERP1= <user>
##$USERP2= <user>
##$USERP3= <user>
##$USERP4= <user>
##$USERP5= <user>
##$WDW= 1
##$XDIM= 65536
##$YMAX_p= 438116928
##$YMIN_p= -20523343
$$ End of Bruker specific parameters
$$ ---------------------------------
##NTUPLES= NMR SPECTRUM
##VAR_NAME=  FREQUENCY,     SPECTRUM/REAL,   SPECTRUM/IMAG
##SYMBOL=    X,             R,               I
##VAR_TYPE=  INDEPENDENT,   DEPENDENT,       DEPENDENT
##VAR_FORM=  AFFN,          ASDF,            ASDF
##VAR_DIM=   65536,         65536,           65536
##UNITS=     HZ,            ARBITRARY UNITS, ARBITRARY UNITS
##FACTOR=    0.620285442955139, 1,           1
##FIRST=     20137.2065510759, 0,            0
##LAST=      -20513.1999529892, 0,           0
##MIN=       -20513.1999529892, -20523343,   0
##MAX=       20137.2065510759, 438116928,    0
$$ Real data points
##PAGE= N=1
##DATA TABLE= (X++(R..R)), XYDATA
$$ [...]
##PAGE= N=2
##DATA TABLE= (X++(I..I)), XYDATA
$$ plain form
13067 -5720273 -7748481 -6721232 -5457527 -5055762 -3476136 -615736 765311 131940
13059 131940 102030 1395421 1798160 1014665 1429390 2900030 2061318 -1516514 -3653319
13050 -3653319 -2242916 -694789 -1994021 -3907110 -3392152 -1775654 -1735236 -2260554 -670607
13041 -670607 2363183 3597398 2082309 324426 917868 3794986 6447216 6071149 2404403
13032 2404403 -1326036 -1809484 128867 1050545 364763 728069 2554107 2511841 -673129
13023 -673129 -3136798 -1474369 2112271 3575341 2887424 2478159 2400255 1182298 -311318
13014 -311318 -112074 810035 -240016 -2959429 -4338957 -3550673 -2937248 -3823924 -4708531
13005 -4708531 -4396711 -4036549 -4914168 -6385573 -6919646 -5531079 -1862838 3213989 6884215
$$ packed form
13067e720273k028208J027249J263705M01765J579626K860400J381047o33371
13059A31940k9910J293391M02739p83495M14725J470640q38712l577832k136805
13050c653319J410403J548127j299232j913089N14958J616498M0418n25318J589947
13041f70607L033790J234215j515089j757883N93442K877118K652230l76067l666746
13032B404403l730439m83448J938351R21678o85782L63306J826038m2266l184970
13023f73129k463669J662429L586640J463070o87917m09265p7904j217957j493616
13014c11318J99244R22109j050051k719413j379528P88284O13425q86676q84607
13005d708531L11820L60162q77619j471405n34073J388567L668241N076827L670226
$$ plain form
12996 6884215 6601453 3553203 1549160 1728337 1029176 -2693708 -6690971 -6833886 -3322144
12987 -3322144 -163741 154001 -1165790 -2141638 -2543701 -2975865 -3475993 -4044062 -5187605
12978 -5187605 -6893202 -8001737 -7571402 -6162372 -4928466 -4135303 -3531147 -3528082 -4752443
12969 -4752443 -6676314 -7924009 -7948620 -7307927 -6235759 -4191447 -1223025 1335838 2219225
12960 2219225 1639239 920539 1250424 2832339 4477968 4182035 1362318 -1568236 -1640532
12951 -1640532 500524 1210459 -651704 -1741093 439693 3165633 2516124 -541647
12943 -541647 -2099530 -1912366 -3304323 -6605108 -7711398 -4627008 -949897 -355439 -1400941
12934 -1400941 -1120635 -710269 -3354697 -8020514 -9924747 -7156725 -3023504 -1012731
$$ packed form
12996F884215k82762l048250k004043J79177o99161l722884l997263j42915L511742
12987c322144L158403L17742j319791r75848m02063m32164n00128n68069j143543
12978e187605j705597j108535M30335J409030J233906P93163O04156L065j224361
12969d752443j923871j247695k4611O40693J072168K044312K968422K558863Q83387
12960B219225n79986p18700L29885J581915J645629k95933k819717k930554p2296
12951a640532K141056P09935j862163j089389K180786K725940o49509l057771
12943e41647j557883J87164j391957l300785j106290L084390L677111N94458j045502
12934a400941K80306M10366k644428m665817j904233K768022M133221K010773
$$ plain form
12926 -1012731 -616985 404894 2178867 3185357 3045497 2720168 2559628 1994812 1108793
12917 1108793 911617 1543960 1417678 -830802 -4046228 -5377710 -3607046 -758050 259851
12908 259851 -944194 -2102949 -1386456 428146 1274959 455196 -823727 -1260749 -991387
12899 -991387 -1038054 -1612231 -1491740 550596 3794020 5740985 4825226 2453803 1313132
12890 1313132 1807108 1675672 -285055 -1786513 -27828 3791987 5300929 2596679
12882 2596679 -1168609 -2094658 -594533 -57440 -1536688 -2512983 -1097403 1159003 1792035
12873 1792035 767304 -192132 -82450 1165170 3546618 6206242 7004026 4996592 2401143
12864 2401143 1794689 2256139 1022575 -1688836 -2820949 -1406701 181526 525161 1076930
$$ packed form
12926a012731L95746J021879J773973J006490j39860l25329j60540n64816q86019
12917A108793j97176O32343j26282k248480l215426j331482J770664K848996J017901
12908B59851j204045j158755P16493J814602Q46813q19763j278923m37022K69362
12899i91387m6667n74177J20491K042336L243424J946965r15759k371423j140671
12890A313132M93976j31436j960727j501458J758685L819815J508942k704250
12882B596679l765288r26049J500125N37093j479248r76295J415580K256406O33032
12873A792035j024731r59436J09682J247620K381448K659624P97784k007434k595449
12864B401143o06454M61450j233564k711411j132113J414248J588227L43635N51769
$$ plain form
12855 1076930 2552972 3065194 1839275 1390302 3380435 5311444 4393587 2085846 1340191
12846 1340191 1564463 236652 -2084487 -2550681 -954055 262585 616469 2126427 4922612
12837 4922612 6176405 4417679 1720443 428092 409770 658663 1083204 1485178 960853
12828 960853 -432132 -1205591 -597168 472830 1236418 1969650 2385312 1250745 -1330531
12819 -1330531 -3114662 -2423238 -254712 1254215 1200066 75503 -1072716 -1074404 392485
12810 392485 1840232 1432312 -434402 -1825812 -2639851 -4832404 -8619256 -11074652 -9916290
12801 -9916290 -6548762 -3804560 -2515236 -1894120 -1570405 -1439764 -847190 361639 1053791
12792 1053791 539741 -35104 507626 1328185 972460 -65034 82848 1965860 4162253
$$ packed form
12855A076930J476042N12222j225919m48973J990133J931009r17857k307741p45655
12846A340191K24272j327811k321139m66194J596626J216640L53884J509958K796185
12837D922612J253793j758726k697236j292351j8322K48893M24541M01974n24325
12828I60853j392985p73459O08423J069998P63588P33232M15662j134567k581276
12819a330531j784131O91424K168526J508927n4149j124563j148219j688J466889
12810C92485J447747m07920j866714j391410q14039k192553l786852k455396J158362
12801i916290L367528K744202J289324O21116L23715J30641N92574J208829O92152
12792A053791n14050n74845N42730Q20559l55725j037494J47882J883012K196393
$$ plain form
12783 4162253 5098762 4420940 2723164 764383 -1088230 -2942088 -4608140 -4916357 -2846061
12774 -2846061 588415 2972403 3401520 3259292 3490994 2845145 81074 -3429553 -4927390
12765 -4927390 -3554494 -1267663 -719292 -2814583 -5980483 -7544097 -6280039 -3498806
12757 -3498806 -984220 1373170 4301169 6296206 4789687 393523 -2922590 -2882487
12749 -2882487 -1401528 -715857 35167 2145234 3873947 2751778 -189091 -1637565
12741 -1637565 -712085 448985 503740 480416 1160269 1362348 -80193 -2217916 -3048680
12732 -3048680 -1931616 -115753 752631 99456 -1375977 -2450737 -2214969 -599594 1348583
12723 1348583 1889960 312182 -1552970 -981786 1702803 2717645 -5981 -3253473
$$ packed form
12783D162253R36509o77822j697776j958781j852613j853858j666052l08217K070296
12774b846061L434476K383988M29117j42228K31702o45849k764071l510627j497837
12765d927390J372896K286831N48371k095291l165900j563614J264058K781233
12757c498806K514586K357390K927999J995037j506519m396164l316113M0103
12749b882487J480959O85671P51024K110067J728713j122169k940869j448474
12741a637565R25480J161070N4755k3324O79853K02079j442541k137723q30764
12732c048680J117064J815863Q68384o53175j475433j074760K35768J615375J948177
12723A348583N41377j577778j865152N71184K684589J014842k723626l247492
$$ plain form
12715 -3253473 -2881735 -50625 664152 -1602164 -3331137 -3050041 -3291083 -4882759 -4573752
12706 -4573752 -1044244 1483828 -534127 -3975612 -3699985 -263785 1722231 828247
12698 828247 -485739 -1060513 -1994252 -2907594 -2019831 -199576 -503288 -2841164 -3225181
12689 -3225181 158463 3677311 3107100 -918781 -4479429 -5426389 -4720157 -4013852 -4018890
12680 -4018890 -4831069 -6242099 -7524252 -7723415 -6473611 -4390004 -2620766 -1919809 -2076323
12671 -2076323 -2371887 -2440751 -2235121 -1476387 -95269 1088499 1528146 2451916 5060355
12662 5060355 7266023 5265810 -686988 -5366861 -5295627 -3139304 -2779206 -3316819 -1865964
12653 -1865964 371057 -187785 -3015368 -3866181 -1579233 340667 -370434 -1750617 -1874045
$$ packed form
12715c253473L71738K831110P14777k266316j728973K81096k41042j591676L09007
12706d573752L529508K528072k017955l441485K75627L436200J986016q93984
12698H28247j313986n74774r33739r13342Q87763J820255l03712k337876l84017
12689c225181L383644L518848n70211m025881l560648r46960P06232P06305n038
12680d018890q12179j411030j282153j99163J249804K083607J769238P00957j56514
12671b076323k95564o8864K05630P58734J381118J183768M39647R23770K608439
12662E060355K205668k000213n952798m679873P1234K156323L60098n37613J450855
12653a865964K237021n58842k827583q50813K286948J919900p11101j380183j23428
$$ plain form
12644 -1874045 -2001048 -3540174 -5358688 -6329674 -7517928 -9381852 -9505928 -6047873 -1474000
12635 -1474000 237494 -1044776 -1960066 -757367 791196 706851 -422241 -806974 71174
12626 71174 1357208 2169559 2099865 972655 -948141 -2677607 -3240325 -2823795 -2562352
12617 -2562352 -2907628 -2947593 -1967389 -927388 -1195533 -2233942 -2159631 -732830 -47763
12608 -47763 -1551607 -3920853 -4949195 -4318619 -3375440 -3158755 -3705562 -4413431 -4191337
12599 -4191337 -2226633 609731 2310598 2443865 2780166 4245149 5124555 3811830 1506429
12590 1506429 236393 -208056 -1217433 -2647855 -3459552 -3870770 -4536957 -4669557 -3363207
12581 -3363207 -1766576 -1454555 -1634366 -564284 1259536 2167704 2582241 3990569 5386501
$$ packed form
12644a874045j27003j539126j818514r70986j188254j863924j24076L458055M573873
12635a474000J711494j282270r15290J202699J548563q4345j129092l84733Q78148
12626G1174J286034Q12351o9694j127210j920796j729466n62718M16530K61443
12617b562352l45276l9965R80204J040001k68145j038409P4311J426801O85067
12608d7763j503844k369246j028342O30576R43179K16685n46807p07869K22094
12599d191337J964704K836364J700867J33267L36301J464983Q79406j312725k305401
12590A506429j270036m44449j009377j430422q11697m11218o66187j32600J306350
12581c363207J596631L12021j79811J070082J823820R08168M14537J408328J395932
$$ plain form
12572 5386501 4377687 1700606 860483 2739232 4120404 2616570 -165205 -1774508
12564 -1774508 -2363058 -3182112 -3849167 -3102550 -1062261 714653 862440 -557477 -1790105
12555 -1790105 -749728 2161098 3509471 1087765 -2318096 -2242260 1121717 3437139
12547 3437139 2880776 2098545 2718412 2321571 -994152 -4751000 -5644454 -4214158 -3090828
12538 -3090828 -2791505 -2208234 -1562080 -1819590 -2209179 -1121310 1053484 2331978 1982179
12529 1982179 930876 -206599 -1421884 -1918282 -619415 1635241 2266987 35489
12521 35489 -3314451 -5136564 -4654019 -3022036 -1503586 -564994 -385614 -1043553 -1775061
12512 -1775061 -977169 2004367 5374429 6347329 4321430 1592410 581263 1382872 2455926
$$ packed form
12572E386501j008814k677081q40123J878749J381172j503834k781775j609303
12564a774508n88550q19054o67055P46617K040289J776914J47787j419917j232628
12555a790105J040377K910826J348373k421706l405861P5836L363977K315422
12547C437139n56363p82231O19867l96841l315723l756848q93454J430296J123330
12538c090828K99323N83271O46154k57510l89589J087869K174794J278494l49799
12529A982179j051303j137475j215285m96398J298867K254656O31746k231498
12521C5489l349940j822113M82545J631983J518450R38592J79380o57939p31508
12512a775061P97892K981536L370062R72900k025899k729020j011147Q01609J073054
$$ plain form
12503 2455926 2554112 1375601 -498852 -1631075 -901793 764454 1278719 392344 -192940
12494 -192940 -209474 -1455507 -3880592 -4492706 -2324712 -841059 -2262077 -3216196 -381367
12485 -381367 2974722 1750030 -2189057 -2559698 1155887 3069290 599329 -2087444
12477 -2087444 -1728213 -573794 -999110 -1281331 241852 1657254 1174915 141383 -366380
12468 -366380 -1782774 -4211894 -4719373 -2516599 -1502282 -4138460 -7004511 -6419488 -4444109
12459 -4444109 -4600687 -5120611 -1887874 4150769 7893855 7286202 4975429 3434776 2522498
12450 2522498 1648537 1012481 786692 1400617 3779835 7226967 8709959 6686964 3692560
12441 3692560 2465610 1911947 192927 -863104 1152644 3824479 2760995 -1150330
$$ packed form
12503B455926R8186j178511j874453j132223P29282J666247N14265q86375n85284
12494a92940j6534j246033k425085o12114K167994J483653j421018r54119K834829
12485c81367L356089j224692l939087l70641L715585J913403k469961k686773
12477b087444L59231J154419m25316k82221J523183J415402m82339j033532n07763
12468c66380j416394k429120n07479K202774J014317k636178k866051N85023J975379
12459d444109j56578n19924L232737O038643L743086o07653k310773j540653r12278
12450B522498q73961o36056k25789O13925K379218L447132J482992k022995k994404
12441C692560j226950n53663j719020j056031K015748K671835j063484l911325
$$ plain form
12433 -1150330 -2550812 402105 3758495 4056322 2349129 831746 -515345 -2255502
12425 -2255502 -3661935 -4240402 -4690758 -5112949 -4416001 -2538340 -1287449 -2050274 -4244150
12416 -4244150 -6479425 -7703132 -7171479 -5091750 -3209934 -2934839 -3275158 -2669723 -2024449
12407 -2024449 -3164072 -5068659 -5212998 -4298446 -5370239 -7704739 -6368342 155611
12399 155611 6303903 6580322 2933847 1185874 2628397 3596018 2106729 257529 -226143
12390 -226143 -645972 -2095151 -2850022 -1230632 1143809 1533890 272908 135885 1947361
12381 1947361 3451229 2923514 1457658 605829 -61880 -1360941 -2231983 -1273831 593173
12372 593173 1245076 350168 -922721 -2277611 -3778895 -3811983 -836656 3067710 3975986
$$ packed form
12433a150330j400482K952917L356390K97827j707193j517383j347091j740157
12425b255502j406433n78467m50356m22191O96948J877661J250891p62825k193876
12416d244150k235275j223707N31653K079729J881816K75095l40319O05435O45274
12407b024449j139623j904587j44339R14552j071793k334500J336397O523953
12399A55611O148292K76419l646475j747973J442523R67621j489289j849200m83672
12390b26143m19829j449179p54871J619390K374441L90081j260982j37023J811476
12381A947361J503868n27715j465856q51829o67709j299061q71042R58152J867004
12372E93173O51903q94908j272889j354890j501284l3088K975327L904366R08276
$$ plain form
12363 3975986 1742552 195791 1105026 2014897 1327681 1110375 2554770 2928756 365922
12354 365922 -1965079 -486211 2764798 2976202 -455589 -3808898 -4579276 -3478729 -1932556
12345 -1932556 -865704 -1072013 -2018274 -1534709 822336 2130741 691259 -393809 1971306
12336 1971306 5191032 4890994 2232653 1735894 3417178 3302444 1012876 214328 1249055
12327 1249055 91640 -3939460 -5900517 -3029840 982941 2424513 2882141 4730256
12319 4730256 6241359 5300711 3882481 4423352 5090106 3187915 565654 899790 3457197
12310 3457197 4203194 2083410 -84837 -542997 -503556 -1053646 -1594839 -1920956 -3006159
12301 -3006159 -4884746 -5908051 -4984784 -3048380 -1690265 -1503490 -2105534 -2692693 -2267791
$$ packed form
12363C975986k233434j546761R09235R09871o87216k17306J444395L73986k562834
12354C65922k331001J478868L251009K11404l431791l353309p70378J100547J546173
12345a932556J066852k06309r46261M83565K357045J308405j439482j085068K365115
12336A971306L219726l00038k658341m96759J681284j14734k289568p98548J034727
12327A249055j157415m031100j961057K870677M012781J441572M57628J848115
12319D730256J511103r40648j418230N40871O66754j902191k622261L34136K557407
12310C457197P45997k119784k168247m58160L9441n50090n41193l26117j085203
12301c006159j878587j023305R23267J936404J358115J86775o02044n87159M24902
$$ plain form
12292 -2267791 -321955 2261448 3620237 2657030 180180 -1821503 -2023991 -945551
12284 -945551 -155829 -230387 -114854 925189 1656260 542179 -1540226 -2051278 -186477
12275 -186477 2202607 3169637 2462864 718107 -1221724 -2024417 -1032135 -69865 -1784876
12266 -1784876 -5530521 -7355579 -5184744 -1654046 -366015 -1542857 -3156482 -4347449
12258 -4347449 -5481219 -6156719 -5422363 -3432142 -1364147 -176655 -305583 -1600962 -2796598
12249 -2796598 -2467839 -1396672 -2130255 -4918501 -6296720 -3810184 -174155 141697 -2747558
12240 -2747558 -4403763 -2325623 1152283 2719513 2160894 1345897 1074688 587890 -605907
12231 -605907 -1791559 -1900456 -643090 1276103 2795765 3282403 2817570 1971292 1492372
$$ packed form
12292b267791J945836K583403J358789r63207k476850k001683k02488J078440
12284i45551P89722p4558J15533J040043P31071j114081k082405n11052J864801
12275a86477K389084R67030p06773j744757j939831q02693R92282R62270j715011
12266a784876l745645j825058K170835L530698J288031j176842j613625j190967
12258d347449j133770o75500P34356J990221K067995J187492j28928j295379j195636
12249b796598L28759J071167p33583k788246j378219K486536L636029L15852k889255
12240b747558j656205K078140L477906J567230n58619q14997k71209m86798j193797
12231f05907j185652j08897J257366J919193J519662M86638m64833q46278m78920
$$ plain form
12222 1492372 1929423 3019334 3561031 2519249 244525 -1964814 -3323867 -3834145 -3419840
12213 -3419840 -1981873 -321426 227232 -633535 -1904507 -2624487 -2454889 -1206758 747457
12204 747457 1800342 740058 -871755 -149629 2797751 4388263 2507576 -306885
12196 -306885 -284510 2711090 5600206 6143008 4702104 2671932 868599 -582344 -1735420
12187 -1735420 -2351305 -2044360 -1422701 -2297144 -5052615 -6521290 -3360120 2374122 4605402
12178 4605402 1308871 -2618289 -2675704 -985597 -1696492 -3693181 -2970976 -261325 -420629
12169 -420629 -4268380 -6629172 -4150971 -488314 -940667 -5117127 -8069699 -6871818
12161 -6871818 -3171976 -170542 399156 -1344653 -3763302 -4149931 -741599 4826826
$$ packed form
12222A492372M37051J089911N41697j041782k274724k209339j359053n10278M14305
12213c419840J437967J660447N48658q60767j270972p19980J69598J248131J954215
12204G47457J052885j060284j611813P22126K947380J590512j880687k814461
12196c06885K2375K995600K889116N42802j440904k030172j803333j450943j153076
12187a735420o15885L06945O21659q74443k755471j468675L161170N734242K231280
12178D605402l296531l927160n7415J690107p10895j996689P22205K709651j59304
12169d20629l847751k360792K478201L662657m52353m176460k952572J197881
12161f871818L699842L001434N69698j743809k418649l86629L408332N568425
$$ plain form
12153 4826826 8201066 6493222 1349598 -2967480 -4180086 -3609104 -3327811 -3376338 -2773971
12144 -2773971 -1873437 -1848238 -2504920 -2683417 -2576764 -3262278 -3749403 -1402483 3498992
12135 3498992 6462782 4302388 -131890 -1443656 1448056 4763276 5351599 3735395
12127 3735395 1744568 -37743 -1727659 -3123529 -4121013 -4777270 -4545719 -2829519 -563069
12118 -563069 289139 -789738 -2340443 -3195692 -3646227 -3895210 -3223558 -1577671 -148368
12109 -148368 842347 2988279 6470363 7840534 4016949 -2331221 -4934383 -1990087
12101 -1990087 1362292 347819 -2829276 -2802443 723364 2851246 1099601 -1438365
12093 -1438365 -1681116 -1073317 -1922977 -2593622 -67396 4595969 7192607 5989308 3045189
$$ packed form
12153D826826L374240j707844n143624m317078j212606N70982K81293m8527O02367
12144b773971R00534K5199o56682j78497J06653o85514m87125K346920M901475
12135C498992K963790k160394m434278j311766K891712L315220N88323j616204
12127C735395j990827j782311j689916j395870r97484o56257K31551J716200K266450
12118e63069Q52208j078877j550705q55249m50535k48983O71652J645887J429303
12109a48368R90715K145932L482084J370171l823585o348170k603162K944296
12101a990087L352379j014473l177095K6833L525807K127882j751645k537966
12093a438365k42751O07799q49660o70645K526226M663365K596638j203299k944119
$$ plain form
12084 3045189 373369 -1877045 -3357455 -2845742 -317298 2679319 5009106 6199332
12076 6199332 5211316 1925532 -553344 1202592 5527028 7123692 4577943 2055232
12068 2055232 2317553 2907479 1593920 749780 2705556 4881289 3967347 1789214 2253958
12059 2253958 4709213 5121203 2436798 -643445 -2160538 -2048250 120180 4237305
12051 4237305 7260086 6047020 2257930 306342 825267 599555 -1187292 -1682951 -91891
12042 -91891 394629 -1791607 -3555307 -2204183 253359 805149 290251 1218525 3000416
12033 3000416 2964294 1122231 657295 3454571 7278205 8067362 4218643 -1626051 -4828827
12024 -4828827 -3076919 1416538 4332263 3504544 161171 -3202017 -4722749 -3596076
$$ packed form
12084C045189k671820k250414j480410N11713K528444K996617K329787J190226
12076F199332r88016l285784k478876J755936M324436J596664k545749k522711
12068B055232K62321N89926j313559q44140J955776K175733r13942k178133M64744
12059B253958K455255M11990k684405l080243j517093J12288K168430M117125
12051D237305L022781j213066l789090j951588N18925k25712j786847m95659J591060
12042i1891M86520k186236j763700J351124K457542N51790n14898R28274J781891
12033C000416l6122j842063m64936K797276L823634P89157l848719n844694l202776
12024d828827J751908M493457K915725q27719l343373l363188j520732J126673
$$ plain form
12016 -3596076 -540937 2221462 3065948 2813859 3011059 3236764 2325541 1299285 2010492
12007 2010492 3356033 2476293 -88130 -379326 2838690 5801074 5348910 3285453 2848179
11998 2848179 3890249 4240786 3457089 2579009 2040625 2107695 3528408 5653380 5953298
11989 5953298 3579055 1196254 895469 691440 -1963669 -5442438 -6208268 -4074797 -1592451
11980 -1592451 319122 2249875 3062797 1182450 -1367787 -747805 2577390 3857620
11972 3857620 1126190 -1898816 -1567227 780745 1810338 1026093 106665 -267316 -390734
11963 -390734 57776 1365404 2663632 3135368 3231121 3359973 2752054 1009362 -668319
11954 -668319 -1288222 -1649602 -2596001 -3163729 -2123142 61309 2389138 4710248 6163228
$$ packed form
12016c596076L055139K762399Q44486k52089J97200K25705r11223j026256P11207
12007B010492J345541q79740k564423k91196L218016K962384m52164k063457m37274
11998B848179J042070L50537p83697q78080n38384O7070J420713K124972K99918
11989E953298k374243k382801l00785k04029k655109l478769p65830K133471K482346
11980a592451J911573J930753Q12922j880347k550237O19982L325195J280230
11972C857620k731430l025006L31589K347972J029593p84245r19428l73981j23418
11963c90734M48510J307628J298228M71736R5753J28852o07919j742692j677681
11954f68319o19903l61380r46399n67728J040587K184451K327829K321110J452980
$$ plain form
11945 6163228 4458637 -532279 -4484908 -3527204 -101477 178917 -3146572 -4845756
11937 -4845756 -2158551 1287917 1363681 -1025119 -2679753 -2725210 -1651997 976201 4510573
11928 4510573 5724947 3154381 658810 2461420 6439912 7138449 4370309 3364837
11920 3364837 6114686 8185280 5962726 2130916 891989 1567653 696245 -2029321
11912 -2029321 -3761966 -3107528 -1361476 205119 1408254 1776947 648272 -1249671
11904 -1249671 -2270491 -2035997 -1595163 -1457060 -985849 197021 1528155 2314691 2248140
11895 2248140 1288246 12181 -280342 1035913 2679537 2825076 1594459 1067970 2677184
11886 2677184 5327893 6238869 3452602 -2018635 -6348761 -6148942 -2069595 1872168
$$ packed form
11945F163228j704591m990916l952629R57704L425727K80394l325489j699184
11937d845756K687205L446468P5764k388800j654634m5457J073213K628198L534372
11928D510573J214374k570566k495571J802610L978492O98537k768140j005472
11920C364837K749849K070594k222554l831810j238927O75664q71408k725566
11912b029321j732645O54438J746052J566595J203135L68693j128675j897943
11904a249671j020820K34494M40834J38103M71211J182870J331134P86536o6551
11895B248140r59894j276065k92523J316255J643624J45539j230617n26489J609214
11886B677184K650709R10976k786267n471237m330126J99819M079347L941763
$$ plain form
11878 1872168 2986570 2393484 2118385 1894987 621812 -887968 -1071216 -328509 -84562
11869 -84562 -20157 1185627 2933410 3181980 1704512 443407 560812 1267190 1572883
11860 1572883 1201572 -71843 -1976055 -2984116 -2136173 -1031172 -1498732 -2070540 -63100
11851 -63100 3247553 3563897 204552 -2352446 -1047862 1464391 1312504 -1051196 -2476292
11842 -2476292 -1807352 -284124 868033 882755 -805924 -3066987 -3010729 303379 3617942
11833 3617942 3218192 -386993 -3635142 -4387955 -3089963 -926739 675379 -98828 -3423201
11824 -3423201 -6376241 -5969403 -3044475 -883204 -643233 -688830 41599 776989 1125392
11815 1125392 1988696 3602289 4540409 3435982 588148 -2368996 -3567009 -2103563
$$ packed form
11878A872168J114402n93086k75099k23398j273175j509780j83248P42707K43947
11869h4562O4405J205784J747783K48570j477468j261105J17405P06378L05693
11860A572883l71311j273415j904212j008061Q47943J105001m67560n71808K007440
11851f3100L310653L16344l359345k556998J304584K512253j51887k363700j425096
11842b476292O68940J523228J152157J4722j688679k261063N6258L314108L314563
11833C617942l99750l605185l248149p52813J297992K163224J602118p74207l324373
11824c423201k953040M06838K924928K161271K39971m5597P30429P35390L48403
11815A125392Q63304J613593R38120j104427k847834k957144j198013J463446
$$ plain form
11807 -2103563 750753 2207489 1083570 -664226 -1009179 -1062861 -2922590 -5615401 -6354200
11798 -6354200 -5218581 -4943287 -5804928 -4564688 123524 4644372 5005023 2060921 -231583
11789 -231583 -17201 1407959 2448751 2568268 1383128 -1186557 -3706124 -4030557 -1871869
11780 -1871869 647866 1519929 1006912 706535 1190498 1521281 1052067 701683 1622562
11771 1622562 3053439 2845117 514237 -1551824 -992206 1427191 3000372 2661196 1770411
11762 1770411 1751478 2690480 4158262 5629830 5977290 4350155 1886600 809854 1413126
11753 1413126 1731163 711092 -293517 -78242 359385 -330822 -1593702 -2052835 -1523824
11744 -1523824 -544186 783776 1994259 1684199 -419265 -1958211 -628178 2342352
$$ packed form
11807b103563K854316J456736j123919j747796l44953n3682j859729k692811p38799
11798f354200J135619K75294q61641J240240M688212M520848L60651k944102k292504
11789b31583K14382J425160J040792J19517j185140k569685k519567l24433K158688
11780a871869K519735Q72063n13017l00377M83963L30783m69214l50384R20879
11771A622562J430877k08322k330880k066061N59618K419397J573181l39176q90785
11762A770411j8933R39002J467782J471568L47460j627135k463555j076746O03272
11753A413126L18037j020071j004609K15275M37627o90207j262880m59133N29011
11744a523824R79638J327962J210483l10060k103464j538946J330033K970530
$$ plain form
11736 2342352 3531091 1786075 -715562 -1769576 -1422048 -644574 306347 1376713 1983695
11727 1983695 1816335 1596541 2254355 3721016 4978842 5116421 4266208 3685205 4659694
11718 4659694 7002278 9018047 9306414 7987136 5809519 3231031 1262828 1738469
11710 1738469 4888367 7645111 6744573 3232764 1425289 3090394 5111259 3890929
11702 3890929 -7978 -3087445 -3351191 -1973666 -1330170 -2667493 -5380374 -7697716
11694 -7697716 -8181767 -6878270 -4826456 -2734350 -891247 50944 -414622 -1499869 -2051493
11685 -2051493 -2605529 -4631654 -7515871 -8514653 -6452278 -3316262 -1219505 -27518
11677 -27518 746028 172871 -1968410 -3424586 -2235020 273296 1537020 1330278 944986
$$ packed form
11736B342352J188739j745016k501637j054014L47528P77474R50921J070366O06982
11727A983695j67360k19794O57814J466661J257826J37579q50213n81003R74489
11718D659694K342584K015769K88367j319278k177617k578488j968203M75641
11710A738469L149898K756744r00538l511809j807475J665105K020865j220330
11702C890929l898907l079467k63746J377525O43496j337323k712881k317342
11694g697716m84051J303497K051814K092106J843103R42191m65566j085247n51624
11685b051493n54036k026125k884217r98782K062375L136016K096757J191987
11677b7518P73546n73157k141281j456176J189566K508316J263724k06742l85292
$$ plain form
11668 944986 353408 -1033042 -2034982 -1184677 330500 252900 -948365 -1054519 -199233
11659 -199233 -381047 -1227906 -360625 1669612 1206623 -2432713 -4918833 -3148638 145191
11650 145191 795124 -890740 -1855487 -1486789 -1430672 -1702646 -672438 1507213 2617708
11641 2617708 1758185 633533 1025927 2677315 4040452 3926864 2253233 23586 -1457556
11632 -1457556 -1811041 -1542139 -622273 1495490 3784822 3475472 -408491 -4861651 -6255500
11623 -6255500 -4791324 -3533726 -3930405 -4662810 -4544668 -4162739 -4344346 -4791918 -4694134
11614 -4694134 -3566244 -1435481 864226 1917499 1281508 303803 341182 1002275 1487661
11605 1487661 2557690 5130939 7654415 7309741 3887106 370056 -665830 458511
$$ packed form
11668I44986n91578j386450j001940Q50305J515177p7600j201265j06154Q55286
11659a99233j81814q46859Q67281K030237m62989l639336k486120J770195L293829
11650A45191O49933j685864r64747L68698N6117k71974J030208K179651J110495
11641B617708q59523j124652L92394J651388J363137j13588j673631k229647j481142
11632a457556l53485K68902R19866K117763K289332l09350l883963m453160j393849
11623f255500J464176J257598l96679p32405J18142L81929j81607m47572R7784
11614d694134J127890K130763K299707J053273o35991r77705L7379O61093M85386
11605A487661J070029K573249K523476l44674l422635l517050j035886J124341
$$ plain form
11597 458511 1868695 2294235 1448911 -301700 -1969175 -2406526 -1125085 1490823 4218783
11588 4218783 5020052 2526724 -1497057 -3000061 -677717 1728544 582551 -2099354
11580 -2099354 -1664583 1914878 3950998 2000008 -1210951 -2411197 -1559461 -2169
11572 -2169 1622001 2389662 1267282 -450807 -115369 1696067 1344348 -1478995 -1905474
11563 -1905474 2609117 7103648 5773125 681555 -1404391 864729 2116981 -1002479
11555 -1002479 -5180713 -6174685 -4966978 -5391970 -8155043 -10284880 -9682620 -7654854 -6530633
11546 -6530633 -6429344 -5653077 -3836002 -3087448 -4997823 -7592128 -7226972 -3392906 525696
11537 525696 1786621 1402802 1724300 3033612 3998471 3680904 1623104 -2160702 -5701603
$$ packed form
11597D58511J410184M25540q45324j750611j667475m37351J281441K615908K727960
11588D218783Q01269k493328m023781j503004K322344K406261j145993k681905
11580b099354M34771L579461K036120j950990l210959j200246Q51736J557292
11572b169J624170P67661j122380j718089L35438J811436l51719k823343m26479
11563a905474M514591M494531j330523n091570k085946K269120J252252l119460
11555a002479m178234r93972J207707m24992k763073k129837O02260K027766J124221
11546f530633J01289P76267J817075P48554j910375k594305L65156L834066L918602
11537E25696J260925l83819L21498J309312R64859l17567k057800l783806l540901
$$ plain form
11528 -5701603 -5789996 -2194944 1119015 1379782 977057 2803665 4455528 1911007 -2838551
11519 -2838551 -3762543 -176308 1981883 -461380 -3153014 -1538980 2230145 3540240
11511 3540240 2379402 1760759 2077919 1648735 861486 1264178 1931240 1154266 626485
11502 626485 3161566 6766943 6252249 1376853 -1865002 42521 2982688 1833519
11494 1833519 -1721743 -2132878 1697038 5322521 5035861 1577134 -2235323 -4546993
11486 -4546993 -4892571 -3957026 -3325023 -3851862 -4338498 -3254236 -1181027 215768 815114
11477 815114 1362478 981358 -1670054 -5018180 -5674251 -3367038 -1504015 -1915074 -2393193
11468 -2393193 -967805 722243 637332 25424 977852 2449293 1878799 -597699 -2553765
$$ packed form
11528e701603q8393L595052L313959K60767m02725J826608J651863k544521m749558
11519b838551r23992L586235K158191k443263k691634J614034L769125J310095
11511C540240j160838o18643L17160m29184p87249M02692O67062p76974n27781
11502F26485K535081L605377n14694m875396l241855J907523K940167j149169
11494A833519l555262m11135L829916L625483k86660l458727l812457k311670
11486d546993l45578R35545O32003n26839m86636J084262K073209J396795N99346
11477H15114N47364l81120k651412l348126o56071K307213J863023m11059m78119
11468b393193J425388J690048q4911o11908R52428J471441n70494k476498j956066
$$ plain form
11459 -2553765 -3007846 -3049782 -3364664 -3559329 -3455694 -2983500 -1537596 538069 977867
11450 977867 -1410423 -3894305 -2891269 888574 3463894 3141774 1698397 359037
11442 359037 -1609830 -3933222 -4696510 -3637798 -2716331 -2398132 -881572 1614951 1575157
11433 1575157 -2444330 -6408697 -5810948 -1749100 1131476 1071306 328164 800320 1708681
11424 1708681 1798437 1478702 2006769 3657150 5179568 4896431 2684209 747623 1239002
11415 1239002 3065682 2950356 227816 -1741858 -323635 2502523 3190202 1833156
11407 1833156 1575655 3599362 5421078 4394036 890780 -2595697 -4237172 -4106587
11399 -4106587 -3277896 -2306823 -831180 1286574 3091364 3710155 3876394 4880592 6302468
$$ packed form
11459b553765m54081m1936l14882j94665J03635M72194J445904K075665M39798
11450I77867k388290k483882J003036L779843K575320l22120j443377j339360
11442C59037j968867k323392p63288J058712R21467L18199J516560K496523l9794
11433A575157m019487l964367N97749M061848K880576o0170p43142M72156R08361
11424A708681Q9756l19735N28067J650381J522418k83137k212222j936586M91379
11415A239002J826680j15326k722540j969674J418223K826158O87679j357046
11407A833156k57501K023707J821716j027042l503256l486477j641475J30585
11399d106587Q28691R71073J475643K117754J804790O18791J66239J004198J421876
$$ plain form
11390 6302468 6466737 4947058 2709568 125012 -2665335 -3767849 -1371436 2177906
11382 2177906 2272661 -843197 -1452258 2908390 6944497 5533283 1689468 1461517 4299728
11373 4299728 4727921 1689443 -448651 39014 -420305 -4046848 -7827612 -8321401 -6063015
11364 -6063015 -3154827 -230060 2127864 2444276 1169844 1415238 4490607 7417516
11356 7417516 7288889 5452884 4556820 3850361 949056 -3222075 -5051805 -3574332 -1868841
11347 -1868841 -2477120 -3965344 -3268973 137799 3766770 5116376 4074008 2402030
11339 2402030 1540334 1330530 780488 -461586 -1782518 -2372852 -1753946 130168 2590623
11330 2590623 4209513 4074351 2883438 1968432 1492668 751801 -10313 333462 1752219
$$ packed form
11390F302468J64269j519679k237490k584556k790347j102514K396413L549342
11382B177906R4755l115858o09061M360648M036107j411214l843815k27951K838211
11373D299728M28193l038478k138094M87665m59319l626543l780764m93789K258386
11364f063015K908188K924767K357924L16412j274432K45394L075369K926909
11356G417516j28627j836005q96064p06459k901305m171131j829730J477473J705491
11347a868841o08279j488224O96371L406772L628971J349606j042368j671978
11339B402030q61696k09804n50042j242074j320932n90334O18906J884114K460455
11330B590623J618890j35162j190913r15006m75764p40867p62114L43775J418757
$$ plain form
11321 1752219 2715168 2392217 1612979 917600 -626124 -3379113 -5415355 -4722443 -2273701
11312 -2273701 -883830 -1264424 -1272884 591233 2958742 3882148 3627174 3438349 2701521
11303 2701521 -208774 -4408824 -6542756 -5349534 -3779973 -4665667 -6290950 -5029759
11295 -5029759 -1056551 2015877 2800863 3634575 5786897 7065388 5949344 4615272
11287 4615272 5229364 6107022 4720251 2259787 1645966 2602617 2507710 1225916 1172998
11278 1172998 2680963 3029640 788455 -1894978 -2295362 -177281 2702189 4229731
11270 4229731 3013336 -95173 -1840846 -376771 1350629 -699645 -4971434 -5631984
11262 -5631984 -1254140 2586129 1439018 -1838079 -2372945 -914882 -1623054 -4601668
$$ packed form
11321A752219R62949l22951p79238o95379j543724k752989k036242O92912K448742
11312b273701J389871l80594q460J864117K367509R23406k54974j88825p36828
11303B701521k910295m200050k133932J193222J569561q85694j625283J261191
11295e029759L973208L072428P84986Q33712K152322J278491j116044j334072
11287D615272O14092Q77658j386771k460464o13821R56651r4907j281794n2918
11278A172998J507965L48677k241185k683433m00384K118081K879470J527542
11270D229731j216395l108509j745673J464075J727400k050274m271789o60550
11262e631984M377844L840269j147111l277097n34866J458063p08172k978614
$$ plain form
11254 -4601668 -5693465 -3111002 215422 1434415 1286417 1669002 2433706 2136718 371762
11245 371762 -1796946 -2815979 -1705484 809120 2264208 980225 -1411825 -1691534
11237 -1691534 584607 2508313 2124645 953703 985696 1512489 1066740 609959 1899773
11228 1899773 3771831 3362848 827110 -670992 -260215 -874884 -3711081 -4946311 -1324616
11219 -1324616 3854674 4766453 1489864 -566858 696881 1415846 -1059245 -3575255
11211 -3575255 -2608004 20868 701918 127597 1384051 3916923 4032659 791868 -2673679
11202 -2673679 -3792742 -3043733 -1546600 592312 2792249 3566201 2555792 1042829
11194 1042829 -135093 -1368813 -2664905 -3125855 -2435723 -1283019 -200530 534658 259978
$$ packed form
11254d601668j091797K582463L326424J218993j47998L82585P64704k96988j764956
11245C71762k168708j019033J110495K514604J455088j283983k392050k79709
11237a691534K276141J923706l83668j170942L1993N26793m45749m56781J289814
11228A899773J872058m08983k535738j498102M10777o14669k836197j235230L621695
11219a324616N179290R11779l276589k056722J263739P18965k475091k516010
11211c575255R67251K628872O81050n74321J256454K532872J15736l240791l465547
11202b673679j119063P49009J497133K138912K199937P73952j010409j512963
11194A042829j177922j233720j296092m60950O90132J152704J082489P35188k74680
$$ plain form
11185 259978 -915242 -913177 1872416 5274535 5297323 1451539 -2594242 -3849675 -2626398
11176 -2626398 -196760 2740289 4495011 2881172 -1138341 -3390807 -1891584 462272
11168 462272 413605 -1289826 -2284327 -2595710 -3357098 -3603076 -1583844 1768924 3475900
11159 3475900 2141363 -1014144 -4029901 -5368099 -4166086 -1245897 874677 707404
11151 707404 -239579 205480 1627833 2029550 1224141 1082215 2723098 5285930 7297395
11142 7297395 7728367 5992631 2451135 -1162057 -3054230 -3042665 -2145658 -1118279 -315705
11133 -315705 -169394 -595792 -657124 60860 609813 383434 511395 2028669 3829285
11124 3829285 4365533 4389348 5737326 8030865 9052000 8213169 7190470 6888449 6142318
$$ packed form
11185B59978j175220K065K785593L402119K2788l845784m045781j255433J223277
11176b626398K429638K937049J754722j613839m019513k252466J499223K353856
11168D62272m8667j703431r94501l11383p61388k45978K019232L352768J706976
11159C475900j334537l155507l015757j338198J202013K920189K120574j67273
11151G07404r46983M45059J422353M01717q05409j41926J640883K562832K011465
11142G297395M30972j735736l541496l613192j892173J1565Q97007J027379Q02574
11133c15705J46311m26398o1332P17984N48953k26379J27961J517274J800616
11124C829285N36248K3815J347978K293539J021135q38831j022699l02021p46131
$$ plain form
11115 6142318 4090784 1810643 726022 1003060 2220014 3989423 5130849 3960414
11107 3960414 630452 -2161006 -2089773 191567 2470307 3769984 4273506 3639075 1540458
11098 1540458 -540891 -343210 2032285 3995545 4107689 3820617 4453769 4551001 2345712
11089 2345712 -741600 -1905515 -1437933 -2132140 -4232422 -4681474 -2470871 -923858 -2343016
11080 -2343016 -3885683 -2233117 471597 -179170 -3530213 -4839459 -2973137 -1752012
11072 -1752012 -2997463 -3573408 -1231962 1449906 1815237 1666844 3570610 5983926 5985301
11063 5985301 4300409 3544263 3391286 1694257 -882254 -1580079 -263207 593789 384332
11054 384332 914445 2323785 2363293 471180 -1023261 -838919 -572166 -1319933 -1727364
$$ packed form
11115F142318k051534k280141j084621K77038J216954J769409J141426j170435
11107C960414l329962k791458P1233K281340K278740J299677N03522o34431k098617
11098A540458k081349J97681K375495J963260J12144k87072O33152R7232k205289
11089B345712l087312j163915M67582o94207k100282m49052K210603J547013j419158
11080b343016j542667J652566K704714o50767l351043j309246J866322J221125
11072a752012j245451n75945K341446K681868L65331j48393J903766K413316J375
11063E985301j684892p56146j52977j697029k576511o97825J316872Q56996k09457
11054C84332N30113J409340L9508j892113j494441J84342K66753p47767m07431
$$ plain form
11045 -1727364 -1100250 -1385514 -3792238 -5998627 -5259546 -2280517 496508 2550685 4373173
11036 4373173 4575355 1494563 -2868697 -4047368 -706777 3752591 5823510 5547016
11028 5547016 4685535 3856478 3061345 3013483 4017667 4933735 5040855 5626423 7695678
11019 7695678 9259570 7549448 3609502 1903956 4645259 8717701 9476673 6121809
11011 6121809 1986428 422766 1632658 3199913 2922170 1107839 104689 1269437
11003 1269437 2990470 2828624 1045736 113450 850850 1491217 1126318 1317575 2809613
10994 2809613 3212444 271347 -4401379 -7362734 -7766289 -7276748 -6655908 -5080388 -2331826
10985 -2331826 623734 2878388 3689602 2377369 92695 171072 3957419 7690710 6979149
$$ packed form
11045a727364O27114k85264k406724k206389P39081K979029K777025K054177J822488
11036D373173K02182l080792m363260j178671L340591M459368K070919k76494
11028E547016q61481q29057p95133m7862J004184R16068J07120N85568K069255
11019G695678J563892j710122l939946j705546K741303M072442P58972l354864
11011F121809m135381j563662J209892J567255k77743j814331j003150J164748
11003A269437J721033j61846j782888r32286P37400O40367l64899J91257J492038
10994B809613M02831k941097m672726k961355m03555M89541O20840J575520K748562
10985b331826K955560K254654Q11214j312233k284674P8377L786347L733291p11561
$$ plain form
10976 6979149 3263036 1715622 3289861 3701861 880493 -1645948 -725524 1550099
10968 1550099 1817724 694873 760733 2007822 2740496 3040949 3948200 4524689 3026134
10959 3026134 283405 -1059659 -443589 56077 -868669 -2080984 -2156718 -1405234 -947354
10950 -947354 -839160 39806 2371022 5021486 5785248 4007314 1876103 1877048 3412501
10941 3412501 3781874 2324483 1128317 1244648 1082729 -258714 -1035830 -227543 -110553
10932 -110553 -2710715 -5879660 -6154805 -3949519 -2383183 -2048753 -907540 928187 645030
10923 645030 -2117034 -3608673 -1482719 1441852 1725381 832532 2368418 5497758 5656354
10914 5656354 1807725 -1524617 -991449 816361 83139 -2083623 -2147165 -471723 -305610
$$ packed form
10976F979149l716113j547414J574239M12000k821368k526441R20424K275623
10968A550099K67625j122851O5860J247089P32674L00453R07251N76489j498555
10959C026134k742729j343064O16070M99666r24746j212315p5734P51484M57880
10950i47354J08194Q78966K331216K650464P63762j777934k131211R45J535453
10941C412501L69373j457391j196166J16331j61919j341443p77116Q08287J16990
10932a10553k600162l168945k75145K205286J566336L34430J141213J835727k83157
10923F45030k762064j491639K125954K924571K83529q92849J535886L129340J58596
10914E656354l848629l332342N33168J807810p33222k166762o3542J675442J66113
$$ plain form
10905 -305610 -1450954 -373974 2917579 3687815 99821 -3180364 -2097308 786594
10897 786594 1432889 1208815 3405726 6140165 4891003 507968 -1358076 1512929 5479851
10888 5479851 6820463 5218249 1572930 -2922441 -5402980 -3670090 -156825 794219
10880 794219 -574115 -393664 1808145 2634227 1387808 1030686 2018950 1588814 164457
10871 164457 1536385 4998805 4811175 249894 -1544523 3167636 8118585 7027637
10863 7027637 3270722 2994555 4524123 2363685 -2432058 -3845794 -516557 3247478
10855 3247478 4592589 4207972 2604986 -136932 -1936036 -884979 1240171 1805627
10847 1805627 1809594 3272681 4517652 2984697 554447 758843 2543435 2209917 -72079
$$ packed form
10905c05610j145344J076980L291553P70236l587994l280185J083056K883902
10897G86594O46295k24074K196911K734439j249162m383035j866044K871005L966922
10888E479851J340612j602214l645319m495371k480539J732890L513265R51044
10880G94219j368334J80451K201809Q26082j246419l57122R88264m30136j424357
10871A64457J371928L462420j87630m561281j794417M712159M950949j090948
10863G027637l756915k76167J529568k160438m795743j413736L329237L764035
10855C247478J345111l84617j602986k741918j799104J051057K125150N65456
10847A805627L967J463087J244971j532955k430250K04396J784592l33518k281996
$$ plain form
10838 -72079 -1183735 -989401 -1707035 -2592089 -1002068 2157785 3732316 4169584 6213419
10829 6213419 8530640 6995082 2222424 -570023 253009 866391 -828729 -2233111
10821 -2233111 -1713949 -1466136 -2742623 -3406374 -2385467 -1903124 -3142285 -4018811 -3341308
10812 -3341308 -3005297 -3854632 -3360829 45922 3729046 4459315 2609177 699622 101088
10803 101088 722387 1758944 1667393 -402341 -2643476 -2561407 -927659 -605522 -1489888
10794 -1489888 -580278 2445575 4101248 2708656 877544 721365 711600 -579047 -1419931
10785 -1419931 -172013 1622165 2012899 1801114 2450637 3216275 2669938 1010524 -1150441
10776 -1150441 -4154099 -7401378 -8212709 -4962846 86729 3175597 3256838 2266918 2181812
$$ packed form
10838g2079j111656J94334p17634q85054J590021L159853J574531M37268K043835
10829F213419K317221j535558m772658k792447Q23032O13382j695120j404382
10821b233111N19162K47813j276487o63751J020907M82343j239161q76526O77503
10812c341308L36011q49335M93803L406751L683124P30269j850138j909555n98534
10803A01088O21299J036557r1551k069734k241135Q2069J633748L22137q84366
10794a489888R09610L025853J655673j392592j831112j56179r765j290647q40884
10785a419931J247918J794178L90734k11785O49523P65638n46337j659414k160965
10776a150441l003658l247279q11331L249863N049575L088868Q1241r89920q5106
$$ plain form
10767 2181812 3186608 4108252 3767764 2335987 1399180 1891971 2524296 1713886 311756
10758 311756 256187 1132510 771888 -894205 -1475749 60642 1918855 2336493 1464087
10749 1464087 -108105 -2298072 -4386543 -5057637 -4216885 -3140000 -2652145 -2549489 -2295513
10740 -2295513 -826230 2960773 7486459 8332452 3943514 -605185 323549 4835902
10732 4835902 6379237 3417633 565112 531631 1156661 1152750 2561286 5577460 6472384
10723 6472384 3289131 -843274 -2441913 -1771384 -392780 1234303 1955628 168386
10715 168386 -2191317 -546246 5184380 9156035 7962799 5394560 5510080 6203122 4287730
10706 4287730 2268266 4040051 7071477 5535591 -79669 -2887622 481004 5370865
$$ packed form
10767B181812J004796R21644l40488j431777r36807M92791O32325q10410j402130
10758C11756n5569Q76323l60622j666093n81544J536391J858213M17638q72406
10749A464087j572192k189967k088471o71094Q40752J076885M87855J02656K53976
10740b295513J469283L787003M525686Q45993m388938m548699R28734M512353
10732D835902J543335k961604k852521l3481O25030l911J408536L016174Q94924
10723F472384l183253m132405j598639O70529J378604J627083P21325j787242
10715A68386k359703J645071N730626L971655j193236k568239J15520O93042j915392
10706D287730k019464J771785L031426j535886n615260k807953L368626M889861
$$ plain form
10698 5370865 6210922 3842382 2986835 5054386 6850700 5888968 3963387 4118497 5968622
10689 5968622 6575668 5409367 5100140 6324505 5640507 1101456 -3172989 -2022805 3320934
10680 3320934 7221502 7458053 6286116 4889827 2292814 -347388 21915 2947347
10672 2947347 4357400 2986335 2134125 3766532 5663705 6045241 6310846 7172980 6557598
10663 6557598 3753928 1625220 2147645 3282227 2710857 1445193 1349540 1919110 1671450
10654 1671450 364129 -1613351 -3590983 -3566625 142359 5447064 8067676 7309601 6618772
10645 6618772 7692889 8220381 6622533 4749921 4225092 4035860 3411046 3415597 4258860
10636 4258860 4575297 4356547 4752437 4392786 605860 -4781510 -6109539 -2034658 2040711
$$ packed form
10698E370865Q40057k368540q55547K067551J796314r61732j925581J55110J850125
10689E968622O07046j166301l09227J224365o83998m539051m274445J150184N343739
10680C320934L900568K36551j171937j396289k597013k640202L69303K925432
10672B947347J410053j371065q52210J632407J897173L81536K65605Q62134o15382
10663F557598k803670k128708N22425J134582n71370j265664r5653N69570k47660
10654A671450j307321j977480j977632K4358L708984N304705K620612p58075o90829
10645F618772J074117N27492j597848j872612n24829j89232o24814M551Q43263
10636D258860L16437k18750L95890l59651l786926n387370j328029M074881M075369
$$ plain form
10627 2040711 1671259 -1365126 -3499724 -4028184 -2999886 487705 5054159 6740071
10619 6740071 4852318 3727449 5819875 7524967 5224449 1361824 600042 2938536
10611 2938536 4331659 2326630 -1569037 -3985370 -2947557 -161327 343886 -2343549
10603 -2343549 -3755539 -454529 3894457 3866871 1177122 1708234 5531790 7453140 6418731
10594 6418731 6201343 7106206 5571945 2245461 1697170 3554457 2906399 178615 1051032
10585 1051032 5574651 7450493 5462456 4997623 6595382 4552525 -682187 -1040667
10577 -1040667 4776188 8020999 5303119 4290299 8745018 11285806 7749701 5366596
10569 5366596 8590172 9923516 4235524 -339055 3606196 9444767 8609381 5437797
$$ packed form
10627B040711l69452l036385k134598n28460J028298L487591M566454J685912
10619F740071j887753j124869K092426J705092k300518l862625p61782K338494
10611B938536J393123k005029l895667k416333J037813K786230N05213k687435
10603b343549j411990L301010M348986k7586k689749N31112L823556J921350j034409
10594F418731k17388R04863j534261l326484n48291J857287o48058k727784Q72417
10585A051032M523619J875842j988037m64833J597759k042857n234712l58480
10577a040667N816855L244811k717880j012820M454719K540788l536105k383105
10569E366596L223576J333344n687992m574579L945251N838571q35386l171584
$$ plain form
10561 5437797 7878935 12640095 11955587 7483265 5815189 6895692 7339544 8372191
10553 8372191 10768868 9401230 2393042 -2274727 1183720 6305047 6004017 4687581
10545 4687581 8112614 11074635 7234541 2012605 3225809 7544988 8630159 9772599
10537 9772599 15436366 19138110 13661692 5382692 4671903 9495648 11695920 11729395 14026760
10528 14026760 15756892 13236864 11250890 13645913 14210465 9187098 7437714 14800357
10520 14800357 21105192 17511777 12959375 17114678 21763853 17333349 12572311 17790039
10512 17790039 24129547 20945229 17420000 23845041 29033880 21795826 16081939 26444399
10504 26444399 38303903 34123152 27929890 38225085 49391182 41191941 32648478 48518413
$$ packed form
10561E437797K441138M761160o84508m472322j668076J080503M43852J032647
10553H372191K396677j367638p008188m667769L458447N121327l01030j316436
10545D687581L425033K962021l840094n221936J213204M319179J085171J142440
10537I772599N663767L701744n476418q279000p10789M823745K200272L3475K297365
10528A4026760J730132k520028j985974K395023N64552n023367j749384P362643
10520A4800357O304835l593415m552402M155303M649175m430504m761038N217728
10512A7790039O339508l184318l525229O425041N188839p238054n713887J0362460
10504B6444399J1859504m180751o193262J0295195J1166097q199241q543463J5869935
$$ plain form
10496 48518413 66937533 57250037 44762909 68991731 101780364 94206683 87593000
10489 87593000 163374034 271425455 240210187 16830916 -218896171 -270622738 -166716933
10482 -166716933 -81228753 -84918588 -101170607 -73827281 -44045778 -49808706 -60589353
10475 -60589353 -46539681 -30946376 -36528568 -42343890 -29247240 -17233132 -24991390
10468 -24991390 -34953732 -28460908 -18989433 -22788644 -28693717 -22938467 -15603633 -18502754
10460 -18502754 -22168632 -16859722 -13120880 -20686952 -28315077 -24163058 -16627349 -16813810
10452 -16813810 -18904831 -15123275 -12375514 -17271124 -21256523 -16598980 -11381673 -13639769
10444 -13639769 -16232159 -12131024 -9109767 -14116577 -18014329 -11476344 -2399154 -2047001
$$ packed form
10496D8518413J8419120r687496j2487128K4228822L2788633p573681o613683
10489H7593000P5781034J08051421l1215268k23379271k35727087n1726567J03905805
10482a66716933Q5488180l689835j6252019K7343326K9781503n762928j0780647
10475f0589353J4049672J5593305n582192n815322J3096650J2014108p758258
10468b4991390r962342O492824R471475l799211n905073N755250P334834k899121
10460a8502754l665878N308910L738842p566072p628125M152019P535709j86461
10452a6813810k091021L781556K747761m895610l985399M657543N217307k258096
10444a3639769k592390M101135L021257n006810l897752O537985R077190L52153
$$ plain form
10436 -2047001 -6432149 -6534263 -5210426 -8947904 -13525527 -12406625 -9699624 -11259371
10428 -11259371 -12435168 -7691821 -2905765 -5111760 -9209865 -7710171 -4658416 -6867273
10420 -6867273 -10073908 -7346172 -3371031 -6618335 -13894857 -15988434 -13040154 -11758577
10412 -11758577 -12434736 -10653245 -7425750 -6712168 -7292402 -6898683 -9036119 -15825149 -20134352
10403 -20134352 -15502814 -8009890 -7111685 -10349492 -9118023 -4597401 -4983840 -10144002
10395 -10144002 -11925725 -8326539 -5600651 -6661520 -7881498 -7545959 -8142878 -9771737
10387 -9771737 -9285464 -6357412 -3771863 -2180165 -519896 -151364 -2584814 -5075928
10379 -5075928 -4465359 -2965638 -4052561 -5540782 -3370131 596119 1488488 -497481
$$ packed form
10436b047001m385148j02114J323837l737478m577623J118902K707001j559747
10428a1259371j175797M743347M786056k205995m098105J499694L051755k208857
10420f867273l206635K727736L975141l247304p276522k093577K948280J281577
10412a1758577o76159J781491L227495P13582n80234L93719k137436o789030m309203
10403b0134352M631538P492924Q98205l237807J231469M520622l86439n160162
10395a0144002j781723L599186K725888j060869j219978L35539n96919j628859
10387i771737M86273K928052K585549J591698J660269L68532k433450k491114
10379e075928O10569J499721j086923j488221K170651L966250Q92369j985969
$$ plain form
10371 -497481 -1849818 -2877861 -5912095 -8743660 -7196614 -2532217 385746 441273 -424030
10362 -424030 -2589579 -6705460 -9053328 -6267903 -2204585 -2581715 -5246560 -3881727
10354 -3881727 737873 2066438 -796578 -2134265 -74359 864496 -1173447 -2042012
10346 -2042012 553928 2993352 2139028 -40527 -747189 -463578 -712999 -1659620 -3311889
10337 -3311889 -5646777 -7009990 -5866244 -4005050 -4270610 -5701458 -5114614 -2723301
10329 -2723301 -1427114 -1174720 686772 3579604 3701979 473742 -2151991 -1861704 -866161
10320 -866161 -1489172 -3091308 -4561151 -6030027 -6993465 -6234857 -4566609 -4349676 -5523778
10311 -5523778 -5354190 -2867312 -436536 -173823 -1477816 -2692452 -2682870 -649203 2969756
$$ packed form
10371d97481j352337j028043l034234k831565J547046M664397K917963N5527q65303
10362d24030k165549m115881k347868K785425M063318l77130k664845J364833
10354c881727M619600J328565k863016j337687K059906R38855k037943q68565
10346b042012K595940K439424q54324k179555p06662K83611k49421r46621j652269
10337c311889k334888j363213J143746J861194k65560j430848N86844K391313
10329b723301J296187K52394J861492K892832J22375l228237k625733K90287R95543
10320h66161o23011j602136j469843j468876r63438P58608J668248K16933j174102
10311e523778J69588K486878K430776K62713j303993j214636R582K033667L618959
$$ plain form
10302 2969756 5416526 4147216 398007 -2326908 -2899978 -2915383 -3050186 -2418548 -1303081
10293 -1303081 -1136918 -1675448 -1346717 -476500 -931623 -2332444 -1952222 895446 3342831
10284 3342831 2866505 364481 -1588717 -1722971 -641508 111147 -819440 -3262003 -5392435
10275 -5392435 -5846560 -5277278 -4868187 -4613415 -4409450 -5183987 -7064426 -8051235 -6694012
10266 -6694012 -4614929 -4149992 -4991414 -5485550 -5621675 -6067872 -5694850 -2983015 990848
10257 990848 3463404 3146866 724786 -2409230 -4208215 -2812308 564459 1829347
10249 1829347 -592619 -3087280 -2208590 170066 376160 -1209779 -1801100 -1334205 -1648744
10240 -1648744 -2374676 -1910678 -1040965 -1521609 -2458055 -2000066 -1134278 -1826098 -2990753
$$ packed form
10302B969756K446770j269310l749209k724915n73070j5405j34803O31638J115467
10293a303081J66163n38530L28731Q70217m55123j400821L80222K847668K447385
10284C342831m76326k502024j953198j34254J081463P52655r30587k442563k130432
10275e392435m54125N69282M09091K54772K03965p74537j880439r86809J357223
10266f694012K079083M64937q41422m94136j36125m46197L73022K711835L973863
10257I90848K472556l16538k422080l134016j798985J395907L376767J264888
10249A829347k421966k494661Q78690K378656K06094j585939n91321M66895l14539
10240a648744p25932M63998Q69713m80644r36446M57989Q65788o91820j164655
$$ plain form
10231 -2990753 -2455757 -1341909 -2178379 -4192877 -4922128 -4964642 -6418535 -7996940 -6659997
10222 -6659997 -3041710 -432354 501488 1128895 490719 -2961067 -6535058 -6267770 -3930962
10213 -3930962 -4720440 -8301192 -8914077 -4820753 -799706 -48252 -275497 328926 -251334
10204 -251334 -2671277 -3668421 -1781496 -372776 -1790017 -3431881 -3023986 -3175078 -6695107
10195 -6695107 -11126305 -12067393 -9293877 -6055568 -4485541 -4673541 -6200505 -7834894
10187 -7834894 -7511505 -5004087 -3017507 -3733093 -5966135 -7323239 -7259397 -6446482 -5070414
10178 -5070414 -3381634 -2290123 -2103979 -2111114 -2041130 -2123579 -1463229 1108846 4091810
10169 4091810 4120674 666482 -2785797 -3321005 -1810953 -546977 -154852 51347 745595
$$ packed form
10231b990753N34996J113848q36470k014498p29251m2514j453893j578405J336943
10222f659997L618287K609356R33842O27407o38176l451786l573991K67288K336808
10213c930962p89478l580752o12885M093324M021047P51454k27245O04423n80260
10204b51334k419943r97144J886925J408720j417241j641864M07895j51092l520029
10195f695107m431198r41088K773516L238309J570027j88000j526964j634389
10187g834894L23389K507418J986580p15586k233042j357104O3842Q12915J376068
10178e070414J688780J091511J86144p135O9984q2449O60350K572075K982964
10169D091810K8864l454192l452279n35208J510052J263976L92125K06199O94248
$$ plain form
10160 745595 2276719 3776643 2849635 -1272322 -4969494 -4149866 -351553 1276365 -338387
10151 -338387 -1581994 -1240952 -2170928 -4756677 -5134392 -2350741 -1057304 -3676150 -5787862
10142 -5787862 -3572228 -342542 -543194 -2107900 -772873 1875611 1233322 -1985853
10134 -1985853 -2778001 98668 3061103 4047124 4469318 5070544 4953828 4879610 6648255
10125 6648255 8672692 6914819 1398523 -2600629 -1735345 768329 98381 -3346160
10117 -3346160 -5111813 -3165190 -289352 19401 -2064871 -3555328 -3033018 -2444103 -3844283
10108 -3844283 -5902746 -5676670 -3140964 -1278883 -1652007 -2891373 -4096995 -6153546
10100 -6153546 -8301945 -7374870 -3059983 -234938 -2436895 -6098955 -5613900 -1656247
$$ packed form
10160G45595J531124J499924r27008m121957l697172Q19628L798313J627918j614752
10151c38387j243607L41042r29976k585749l77715K783651J293437k618846k111712
10142e787862K215634L229686k00652j564706J335027K648484o42289l219175
10134a985853p92148K876669K962435R86021M22194O01226j16716p4218J768645
10125F648255K024437j757873n516296l999152Q65284K503674o69948l444541
10117c346160j765653J946623K875838L08753k084272j490457N22310N88915j400180
10108c844283k058463K26076K535706J862081l73124j239366j205622k056551
10100f153546k148399R27075M314887K825045k201957l662060M85055L957653
$$ plain form
10092 -1656247 547814 -407646 -1065260 25906 163675 -1873749 -3395324 -2995363 -3469437
10083 -3469437 -6598428 -8898346 -6415529 -1247862 879836 -1497584 -3995827 -2826126
10075 -2826126 480743 1995892 641434 -1418235 -2429648 -2898735 -3700686 -4196574 -3385284
10066 -3385284 -1969607 -1736081 -2955862 -3770934 -2603569 -160137 1567944 1608012 795027
10057 795027 755273 2365585 4719571 5666798 4130124 1624830 297683 -158295 -1698341
10048 -1698341 -4000194 -3937182 -136440 4210591 4968971 1982715 -1415275 -2573044 -1434270
10039 -1434270 590389 1739652 653194 -2164271 -4117254 -3309323 -1071133 -285780
10031 -285780 -1733742 -3537661 -3800621 -2457701 -841455 -467523 -1784945 -3314028 -2866261
$$ packed form
10092a656247K204061r55460o57614J091166J37769k037424j521575L99961m74074
10083c469437l128991k299918K482817N167667K127698k377420k498243J169701
10075b826126L306869J515149j354458k059669j011413m69087q01951m95888Q11290
10066c385284J415677K33526j219781q15072J167365K443432J728081M0068q12985
10057G95027l9754J610312K353986R47227j536674k505294j327147m55978j540046
10048a698341k301853O3012L800742M347031P58380k986256l397990j157769J138774
10039a434270K024659J149263j086458k817465j952983Q07931K238190P85353
10031b85780j447962j803919k62960J342920J616246L73932j317422j529083M47767
$$ plain form
10022 -2866261 -478718 1059212 -279123 -3079357 -4703610 -4701310 -4249860 -3630080 -2410615
10013 -2410615 -1033063 -26796 1320453 3248456 3635316 586612 -3836956 -5463268
10005 -5463268 -3372439 -630242 323515 267130 871750 2256690 3335591 2702550 -658729
9996 -658729 -5419048 -7336405 -3695904 1960974 3109554 -1419190 -6084981 -6414280 -4159525
9987 -4159525 -3158307 -4021682 -5388470 -6975085 -8342094 -7493083 -4018316 -1307088 -2175054
9978 -2175054 -4210936 -3137182 639449 2654307 716768 -3080404 -6203985 -7849550
9970 -7849550 -7399177 -4550359 -1589469 -1995161 -5619512 -8242549 -7116521 -4120986 -2096415
9961 -2096415 -1016299 230788 910496 -68969 -1512984 -1433589 -108911 653726 410099
$$ packed form
10022b866261K387543J537930j338335k800234j624253K300M51450O19780J219465
10013b410615J377552J006267J347249J928003L86860l048704m423568j626312
10005e463268K090829K742197R53757n6385O04620J384940J078901o33041l361279
9996f58729m760319j917357L640501N656878J148580m528744m665791l29299K254755
9987d159525J001218q63375j366788j586615j367009Q49011L474767K711228q67966
9978b175054k035882J073754L776631K014858j937539l797172l123581j645565
9970g849550M50373K848818K960890m05692l624351k623037J126028K995535K024571
9961b096415J080116J247087O79708r79465j444015P9395J324678P62637k43627
$$ plain form
9952 410099 -12481 -711186 -2310098 -3665050 -2578057 714979 2959356 1754670 -1513705
9943 -1513705 -3573402 -2897975 -476170 2028790 3659891 4175547 3814610 3115151 2365533
9934 2365533 1279745 -288616 -1467175 -944128 1350339 3743312 4431782 3167091 859780
9925 859780 -1891646 -4848420 -7061082 -7390510 -6554217 -6960318 -9332919 -11003489 -9309764
9916 -9309764 -5503797 -3048894 -2823661 -2638579 -1175481 567295 2002790 3969379 6114943
9907 6114943 6341393 4257349 2260710 1522823 -3931 -3322651 -5318517 -3184071 578354
9898 578354 1266402 -1612035 -4603288 -5560101 -4980995 -3209644 -80152 3123694 4629118
9889 4629118 4679837 4453407 3634498 1815985 536624 800720 925470 330892 1922827
$$ packed form
9952D10099m22580o98705j598912j354952J086993L293036K244377j204686l268375
9943a513705k059697O75427K421805K504960J631101N15656l60937o99459p49618
9934B365533j085788j568361j178559N23047K294467K392973O88470j264691k307311
9925H59780k751426k956774k212662l29428Q36293m06101k372601j670570J693725
9916i309764L805967K454903K25233J85082J463098J742776J435495J966589K145564
9907F114943K26450k084044j996639p37887j526754l318720j995866K134446L762425
9898E78354O88048k878437k991253r56813N79106J771351L129492L203846J505424
9889D629118N0719k26430q18909j818513j279361K64096J24750n94578J591935
$$ plain form
9880 1922827 6024921 6973045 3329667 5955085 23612123 43233768 40490858 12949049
9872 12949049 -13124077 -16283203 -5635326 -2329092 -8686698 -11354066 -6325638 -2637730
9864 -2637730 -4031001 -3979228 -77172 1369913 -1739309 -2610634 1788012 4478071 207604
9855 207604 -5996056 -7626855 -5853437 -4234421 -1853455 2129592 3734068 529284
9847 529284 -2668483 -737677 3878566 6176073 6634931 7761922 7042242 911266 -7069533
9838 -7069533 -9572071 -5814163 -1955673 -1826290 -3176297 -3050744 -1589188 -6827 1050480
9829 1050480 894319 -206361 -58880 2210814 3385334 506173 -3597653 -3839412 -814603
9820 -814603 40574 -3054531 -5895837 -5024841 -1835767 1086571 3123969 3735223 1773355
$$ packed form
9880A922827M102094R48124l643378K625418J7657038J9621645k742910k7541809
9872A2949049k6073126l159126J0647877L306234o357606k667368N028428L687908
9864b637730j393271N1773L902056J447085l109222q71325M398646K690059m270467
9855B07604o203660j630799J773418J619016K380966L983047J604476l204784
9847E29284l197767J930806M616243K297507M58858J126991p19680o130976p980799
9838g069533k502538L757908L858490J29383j350007J25553J461556J582361J057307
9829A050480j56161j100680J47481K269694J174520k879161m103826k41759L024809
9820h14603Q55177l095105k841306Q70996L189074K922338K037398O11254j961868
$$ plain form
9811 1773355 -1468633 -2445801 -720875 -630060 -5120343 -10812841 -11943505 -7337986 -1199388
9802 -1199388 1732428 211125 -3129095 -4339981 -2173213 290114 -351389 -2676647
9794 -2676647 -2271621 1356211 3678035 2050592 -477161 -466028 720875 111562 -1834254
9785 -1834254 -3037580 -3940651 -5841575 -7268565 -6321337 -4977867 -6391968 -8864972 -7509705
9776 -7509705 -1931519 2635504 2669923 270462 -1560701 -2982340 -4553342 -4673241 -2792018
9767 -2792018 -1701290 -3251125 -4697256 -2988380 -154505 -176332 -2325974 -2367408 417899
9758 417899 2226882 959069 -1089351 -1776319 -2281586 -4058191 -6025991 -6739121 -6574915
9749 -6574915 -5995927 -4282875 -1763824 -606446 -1429946 -1875232 -791333 -899968 -4261793
$$ packed form
9811A773355l241988r77168J724926R0815m490283n692498j130664M605519O138598
9802a199388K931816j521303l340220j210886K166768K463327o41503k325258
9794b676647M05026L627832K321824j627443k527753J1133J186903o09313j945816
9785a834254j203326r03071j900924j426990R47228J343470j414101k473004J355267
9776g509705N578186M567023L4419k399461j831163j421639j571002j19899J881223
9767b792018J090728j549835j446131J708876K833875k1827k149642m1434K785307
9758D17899J808983j267813k048420o86968n05267j776605j967800p13130J64206
9749f574915N78988J713052K519051J157378q23500m45286J083899j08635l361825
$$ plain form
9740 -4261793 -7725253 -6729821 -1970701 1600115 1407705 -759616 -2588927 -3305840 -2307513
9731 -2307513 465481 2719512 1968204 -250351 74139 3209102 4857220 2571411 -820130
9722 -820130 -1888971 -1221709 -1123023 -1660119 -1631607 -1282750 -1457522 -1652140 -1224050 -1184385
9712 -1184385 -2641258 -4598750 -5275076 -4617358 -3734272 -2850564 -1626085 -609118 -560859
9703 -560859 -997039 -1030606 -1049508 -1977068 -3373829 -3859070 -3219920 -2766203 -3548229 -5108993
9693 -5108993 -6062749 -5513619 -4059510 -3374612 -4233702 -5218400 -4442308 -2199452 -318666
9684 -318666 742652 1909903 2720502 1509751 -1054724 -1951830 -675570 -670527 -3736044
9675 -3736044 -6419656 -5144824 -2005620 -1515345 -3727245 -4983149 -4197593 -3720548 -4273503
$$ packed form
9740d261793l463460R95432M759120L570816j92410k167321j829311p16913R98327
9731b307513K772994K254031p51308k218555L24490L134963J648118k285809l391541
9722h20130j068841O67262R8686n37096K8512L48857j74772j94618M28090L9665
9712a184385j456873j957492o76326O57718Q83086Q83708J224479J016967M8259
9703e60859m36180l3567j8902r27560j396761m85241O39150M53717p82026j560764
9693e108993r53756N49130J454109O84898q59090r84698P76092K242856J880786
9684c18666J061318J167251Q10599j210751k564475q97106J276260N043l065517
9675c736044k683612J274832L139204M90275k211900j255904P85556M77045n52955
$$ plain form
9666 -4273503 -3688640 -1478383 -601832 -3086912 -6846071 -8364924 -6376305 -2000417 2404063
9657 2404063 3806914 691347 -4125698 -5481445 -2121411 1544290 1524060 -641895 -1113710
9648 -1113710 480492 1681862 1857333 2561242 3895718 4078430 2867521 2165272 2348897
9639 2348897 991286 -3144203 -7236903 -7724259 -4968717 -2383256 -1795646 -1891189 -943709
9630 -943709 954822 2593130 3026343 2058231 561480 195348 1423491 2182826 455319
9621 455319 -2117533 -1864695 1332358 3316632 1878738 316807 2133171 5083297 4318663
9612 4318663 -293137 -4204756 -4849556 -4042801 -3586274 -2717385 -1166275 -999820 -3248649
9603 -3248649 -5380454 -4529556 -1565653 175640 -763560 -2548030 -2532859 -251979 1865938
$$ packed form
9666d273503N84863K210257Q76551k485080l759159j518853J988619M375888M404480
9657B404063J402851l115567m817045j355747L360034L665701k0230k165955m71815
9648a113710J594202J201370J75471P03909J334476J82712j210909p02249J83625
9639B348897j357611m135489m092700m87356K755542K585461N87610r5543R47480
9630i43709J898531J638308M33213r68112j496751l66132J228143P59335j727507
9621D55319k572852K52838L197053J984274j437894j561931J816364K950126p64634
9612D318663m611800l911619o44800Q06755M56527Q68889J551110J66455k248829
9603c248649k131805Q50898K963903J741293r39200j784470J5171K280880K117917
$$ plain form
9594 1865938 908037 -2715787 -4834420 -2582162 1316793 2237623 702032 1541597 5815818
9585 5815818 8524126 6294533 2680084 2457136 4384616 3853004 250909 -2752435 -2984633
9576 -2984633 -1769207 -703324 11703 169805 -426465 -522615 1289256 3747701 3979913
9567 3979913 1643497 -423376 -254557 699204 27664 -2193105 -3575619 -2426210 202836
9558 202836 1596694 500604 -1356801 -1766308 -1446960 -2864585 -5668679 -6343350 -3568328
9549 -3568328 -644482 -265888 -43087 3236095 7415237 7648181 4023033 1494390 2069145
9540 2069145 2012540 -1578254 -5725286 -5969392 -2901833 -891369 -1718677 -2823180 -1807465
9531 -1807465 174015 599875 -787037 -2334392 -3548635 -5519964 -7977977 -8345491 -5470417
$$ packed form
9594A865938r57901l623824k118633K252258L898955R20830j535591Q39565M274221
9585E815818K708308k229593l614449k22948J927480n31612l602095l003344k32198
9576b984633J215426J065883P15027J58102n96270r6150J811871K458445K32212
9567C979913k336416k066873J68819R53761o71540k220769j382514J149409K629046
9558B02836J393858j096090j857405m09507L19348j417625k804094o74671K775022
9549c568328K923846L78594K22801L279182M179142K32944l625148k528643N74755
9540B069145n6605l590794m147032k44106L067559K010464q27308j104503J015715
9531a807465J981480M25860j386912j547355j214243j971329k458013l67514K875074
$$ plain form
9522 -5470417 -2482189 -3162267 -6352254 -7270540 -4405357 -1471810 -1517675 -2790228 -2573708
9513 -2573708 -1802865 -2702793 -4209691 -3399552 -299524 2158980 2652542 2985721 4853073
9504 4853073 7358683 8371938 6984328 4165160 1630528 167868 -903640 -2091188
9496 -2091188 -2161429 93202 2985379 3513294 1930800 1509170 3128083 3901734 2468990
9487 2468990 1367619 1966210 1558906 -1272382 -2847126 -237789 2987573 1999275 -1485865
9478 -1485865 -2268168 -148232 616221 -1195525 -2823190 -3354818 -4716546 -6880952 -7373310
9469 -7373310 -5854320 -4515550 -3819246 -2353537 -740114 -955188 -1976678 -1098413 603447
9460 603447 -479861 -3720186 -4586022 -2344807 -1322811 -3232636 -4481596 -3115540 -2256453
$$ packed form
9522e470417K988228o80078l189987r18286K865183K933547m5865j272553K16520
9513b573708P70843q99928j506898Q10139L100028K458504M93562L33179J867352
9504D853073K505610J013255j387610k819168k534632j462660j071508j187548
9496b091188p0241K254631K892177N27915j582494m21630J618913P73651j432744
9487B468990j101371N98591m07304k831288j574744K609337L225362r88298l485140
9478a485865p82303K119936P64453j811746j627665n31628j361728k164406m92358
9469g373310J518990J338770O96304J465709J613423k15074j021490Q78265J701860
9460F03447j083308l240325q65836K241215J021996j909825j248960J366056Q59087
$$ plain form
9451 -2256453 -3831366 -4762062 -2902551 -1346646 -2724141 -4102191 -2242360 274492
9443 274492 -627201 -3330222 -3130303 77460 2038008 1029121 -353184 -209094 34405
9434 34405 -1254377 -3213711 -4010609 -3272901 -2158577 -1819942 -2115112 -1716177 116204
9425 116204 2118257 2543663 1831405 1973582 3313903 4184251 3849905 3310779 2879497
9416 2879497 1759947 514826 806727 1846235 501274 -3676630 -6862673 -6137547 -3135536
9407 -3135536 -685837 971028 2408814 2614046 1049229 -530142 -964562 -1908301 -4516384
9398 -4516384 -6453775 -5239368 -2405790 -1186275 -1894005 -2743508 -3583268 -5361633 -6983717
9389 -6983717 -6217956 -3519975 -2072608 -3767415 -7125194 -9305571 -8772833 -6169119 -3657075
$$ packed form
9451b256453j574913r30696J859511J555905j377495j378050J859831K516852
9443B74492r01693k703021J99919L207763J960548j008887j382305J44090K43499
9434C4405j288782j959334p96898P37708J114324L38635k95170L98935J832381
9425A16204K002053M25406p12258J42177J340321Q70348l34346n39126m31282
9416B879497j119550j245121K91901J039508j344961m177904l186043P25126L002011
9407c135536K449699J656865J437786K05232j564817j579371m34420r43739k608083
9398d516384j937391J214407K833578J219515p07730q49503q39760j778365j622084
9389f983717P65761K697981J447367j694807l357779k180377N32738K603714K512044
$$ plain form
9380 -3657075 -3076658 -4136605 -5112859 -5398135 -5752208 -5898795 -4412728 -1865052 -1247251
9371 -1247251 -3620868 -5949035 -5284591 -2734678 -991017 -176043 1138727 2517652 2162143
9362 2162143 -98015 -2659233 -4334578 -4913562 -4270766 -2413648 143935 2805390 4790951
9353 4790951 4657350 1905094 -941303 -741624 1412517 1323434 -1532255 -2719242 -166867
9344 -166867 1936492 -293105 -4237231 -5119483 -2964250 -835708 781607 3023747 4503958
9335 4503958 3209198 956594 1133620 3133931 3617831 2314164 1910935 2824990 2815018
9326 2815018 1699473 1903552 3901876 5280251 5009079 4793038 5235915 4260368 734223
9317 734223 -3264472 -5303265 -5463966 -5023253 -4068650 -1823509 1539351 4299342 4392743
$$ packed form
9380c657075N80417j059947r76254k85276l54073j46587J486067K547676O17801
9371a247251k373617k328167O64444K549913J743661Q14974J314770J378925l55509
9362B162143k260158k561218j675345n78984O42796J857118K557583K661455J985561
9353D790951j33601k752256k846397J99679K154141q9083k855689j186987K552375
9344a66867K103359k229597l944126q82252K155233K128542J617315K242140J480211
9335D503958j294760k252604J77026K000311M83900j303667m03229R14055r972
9326B815018j115545K04079J998324J378375k71172k16041M42877r75547l526145
9317G34223l998695k038793j60701M40713R54603K245141L362860K759991R3401
$$ plain form
9308 4392743 1604712 -1359682 -1358152 1115993 2301809 496483 -1635825 -1671680 -1198482
9299 -1198482 -2335890 -3576492 -2698307 -1234117 -1842068 -3203515 -2011991 1365998 3683362
9290 3683362 4140985 4421766 4371496 2452487 -2120 101934 2257932 2831273 1093712
9281 1093712 64514 911775 1378618 665741 1050790 3261492 4793721 4494375 4446040
9272 4446040 5407022 4756949 1429061 -1205812 -437479 1197164 -239424 -4214275 -6912231
9263 -6912231 -6391854 -3690967 -364916 2375554 3239510 2035915 616288 827390 2179928
9254 2179928 2894793 2347041 1179154 -36014 -898076 -744889 603603 2125446 2507184
9245 2507184 1455315 -248661 -1446343 -1287050 -56738 668067 -335476 -2226718 -3150324
$$ packed form
9308D392743k788031k964394J530K474145J185816j805326k132308l5855M73198
9299a198482j137408j240602Q78185J464190o07951j361447J191524L377989K317364
9290C683362M57623K80781n0270j919009k454607J04054K155998N73341j737561
9281A093712j029198Q47261M66843p12877L85049K210702J532229k99346m8335
9272D446040R60982o50073l327888k634873P68333J634643j436588l974851k697956
9263f912231N20377K700887L326051K740470Q63956j203595j419627K11102J352538
9254B179928P14865n47752j167887j215168q62062J53187J348492J521843L81738
9245B507184j051869j703976j197682J59293J230312P24805j003543j891242r23606
$$ plain form
9236 -3150324 -2841257 -2866251 -4246007 -6046308 -6442692 -4423610 -826531 1685921 818316
9227 818316 -2195164 -3341080 -1310558 48211 -2597180 -6302341 -5736211 -1219405 1980831
9218 1980831 1856079 1843660 4033264 5431745 3252332 -314370 -1594187 -673755 -154770
9209 -154770 -756413 -1010933 -223857 521443 -49544 -1931108 -3524037 -2610210 1272235
9200 1272235 5427270 6419018 3867383 371273 -1880716 -2488204 -1524037 480456 1476447
9191 1476447 -343141 -3605927 -5177874 -4476651 -3734257 -4249400 -5318324 -6483746 -7524227
9182 -7524227 -6683784 -2769271 1301215 1346682 -1774180 -3385833 -2492818 -2564565 -4304974
9173 -4304974 -3988691 -809456 610669 -1909726 -3892809 -1845194 587751 -921856
$$ packed form
9236c150324L09067k4994j379756j800301l96384K019082L597079K512452q67605
9227H18316l013480j145916K030522J358769k645391l705161N66130M516806L200236
9218A980831j24752j2419K189604J398481k179413l566702j279817R20432N18985
9209a54770o01643k54520P87076P45300n70987j881564j592929R13827L882445
9200A272235M155035R91748k551635l496110k251989o07488R64167K004493R95991
9191A476447j819588l262786j571947P01223P42394n15143j068924j165422j040481
9182g524227Q40443L914513M070486M5467l120862j611653Q93015p1747j740409
9173d304974L16283L179235J420125k520395j983083K047615K432945j509607
$$ plain form
9165 -921856 -3654332 -2295316 2456320 5406402 4445171 1543033 -1531650 -3720535 -3188534
9156 -3188534 -143649 988881 -2949767 -8272477 -9338435 -6865991 -5734466 -6326190
9148 -6326190 -4612313 -264127 2131134 874849 49116 2665797 6003417 6170040 3269866
9139 3269866 -325512 -3461553 -5630922 -5694937 -3446543 -551404 1566263 3001414 3733549
9130 3733549 3066474 1680688 1700030 3339592 3858096 1486187 -1711307 -2766105 -1874122
9121 -1874122 -1468234 -2353550 -2840229 -1419499 1223458 3042789 2753181 976768 -595478
9112 -595478 -1210093 -1788766 -3159173 -4251713 -3246993 -179524 2922195 4396234 4210539
9103 4210539 2995533 1235826 -376497 -1000819 -431699 877963 2485255 3943662 4603196
$$ packed form
9165i21856k732476J359016M751636K950082r61231k902138l074683k188885N32001
9156c188534L044885J132530l938648n322710j065958K472444J131525n91724
9148f326190J713877M348186K395261j256285q25733K616681L337620J66623k900174
9139C269866l595378l136041k169369o4015K248394K895139K117667J435151P32135
9130C733549o67075j385786J9342J639562N18504k371909l197494j054798Q91983
9121a874122M05888q85316m86679J420730K642957J819331k89608j776413j572246
9112e95478o14615n78673j370407j092540J004720L067469L101719J474039j85695
9103D210539j215006j759707j612323o24322N69120J309662J607292J458407O59534
$$ plain form
9094 4603196 4403715 4248186 4406622 3418770 311926 -2828209 -2762553 567314 3793012
9085 3793012 4301218 2537832 55952 -2219606 -3212810 -1842629 801046 1747630 136669
9076 136669 -1258649 -315278 912140 -367778 -2558680 -1661273 2243911 4526500 2803746
9067 2803746 427495 1135593 3409575 3382229 1211423 440848 1697046 1433150 -2149848
9058 -2149848 -5899981 -6450916 -4885309 -3964315 -3450388 -1650242 346220 -15471 -2136666
9049 -2136666 -3003509 -2347291 -3065500 -5981101 -8012121 -6760826 -3628136 -1002516 619818
9040 619818 1325188 675571 -410887 366097 2943445 3981776 1721651 -1179113 -1965881
9031 -1965881 -1864913 -2974136 -4138288 -3617529 -3287282 -5744601 -8897962 -8227800 -3896065
$$ packed form
9094D603196j99481j55529J58436r87852l106844l140135O5656L329867L225698
9085C793012N08206j763386k481880k275558r93204J370181K643675R46584j610961
9076A36669j395318R43371J227418j279918k190902Q97407L905184K282589j722754
9067B803746k376251P08098K273982k7346k170806p70575J256198k63896l582998
9058b149848l750133n50935J565607R20994N13927J800146J996462l61691k121195
9049b136666q66843O56218p18209k915601k031020J251295L132690K625620J622334
9040F19818P05370o49617j086458P76984K577348J038331k260125k900764p86768
9031a965881J00968j109223j164152N20759L30247k457319l153361O70162M331735
$$ plain form
9022 -3896065 -1017745 -2440387 -5274735 -5642983 -3524916 -1446062 -900495 -1602173 -2573959
9013 -2573959 -2800536 -1975286 -1238554 -2141420 -4615249 -6927543 -7540870 -6063173 -2998418
9004 -2998418 15724 478967 -2464140 -6067615 -6495122 -3305530 247874 1364012 531565
8995 531565 199304 2001001 5279701 7371103 5902183 1844996 -810237 151088 2157928
8986 2157928 1665043 -607688 -1139585 751508 2113483 970403 -1433162 -3145259 -3419391
8977 -3419391 -2001297 644394 2254864 858623 -1884846 -2569150 -1425169 -2076440 -5192768
8968 -5192768 -6638170 -3857490 -141313 403005 -1085128 -770187 1528662 2514656 925180
8959 925180 -899108 -1045523 -551517 -1091433 -2319806 -2645651 -1475903 219640 1110577
$$ packed form
9022c896065K878320j422642k834348l68248K118067K078854N45567p01678r71786
9013b573959k26577Q25250P36732r02866k473829k312294o13327J477697L064755
9004b998418L014142M63243k943107l603475m27507L189592L553404J116138q32447
8995E31565l32261J801697L278700K091402j468920m057187k655233R61325K006840
8986B157928m92885k272731n31897J891093J361975j143080k403565j712097k74132
8977c419391J418094K645691J610470j396241k743469o84304J143981o51271l116328
8968e192768j445402K780680L716177N44318j488133L14941K298849R85994j589476
8959I25180j824288j46415M94006n39916j228373l25845J169748J695543Q90937
$$ plain form
8950 1110577 857990 406012 802769 1574672 821602 -2522362 -6938181 -9475002 -8512109
8941 -8512109 -5049941 -1613929 -296450 -1508369 -3982495 -5833638 -5850470 -4064769 -1451259
8932 -1451259 761355 1878661 2230226 2647879 3311768 3658757 3587321 3759064 4194427
8923 4194427 3789225 2163496 712757 474764 212759 -1552634 -3640831 -3590296 -1399784
8914 -1399784 410818 313083 -833074 -1828805 -2350173 -2011043 -529458 780994 -54058
8905 -54058 -2621992 -4146047 -3304755 -1923860 -1892370 -2457765 -1976243 -698360 -220008
8896 -220008 -1177459 -2784854 -3989290 -4210763 -3550505 -2814162 -2714297 -2898723 -2628317 -2293929
8886 -2293929 -2936682 -4279816 -4845182 -4254459 -3759934 -4087021 -4344153 -3560827 -1879259
$$ packed form
8950A110577k52587m51978L96757P71903p53070l343964m415819k536821R62893
8941h512109L462168L436012J317479j211919k474126j851143j6832J785701K613510
8932a451259K212614J117306L51565M17653O63889L46989p1436J71743M35363
8923D194427m05202j625729j450739k37993k62005j765393k088197N0535K190512
8914a399784J810602r7735j146157r95731n21368L39130J481585J310452q35052
8905e4058k567934j524055Q41292J380895L1490n65395M81522J277883M78352
8896b20008r57451j607395j204436k21473O60258P36343R9865j84426K70406L34388
8886b293929o42753j343134n65366N90723M94525l27087k57132P83326J681568
$$ plain form
8877 -1879259 86668 1632057 1683949 -86542 -1915998 -1790160 -556172 -698367 -2059423
8868 -2059423 -1955638 82921 1514292 1850173 4164480 9120236 11790020 8369979 2714797
8859 2714797 1308964 3911291 4679704 1778406 18840 2846342 6849547 6936086 3369125
8850 3369125 348102 -301556 -647264 -2587948 -5197789 -6533612 -6081972 -4501688 -2183916
8841 -2183916 683659 3025465 3170254 802796 -2081350 -3047837 -1857313 -437243 -356813
8832 -356813 -1336001 -2372270 -3148209 -3751882 -4038312 -4114365 -4683373 -5951887 -6705430 -5462268
8822 -5462268 -2392464 655646 2022690 1651732 696417 138563 -46016 -383016 -765138
8813 -765138 -407231 746779 1377330 475929 -952399 -1137740 -36705 940115 1320479
$$ packed form
8877a879259J965927J545389N1892j770491j829456J25838J233988j42195j361056
8868b059423J03785K038559J431371L35881K314307M955756K669784l420041n655182
8859B714797j405833K602327P68413k901298j759566K827502M003205Q6539l566961
8850C369125l021023o49658l45708j940684k609841j335823M51640J580284K317772
8841b183916K867575K341806J44789k367458k884146r66487J190524J420070Q0430
8832c56813r79188j036269p75939o03673k86430p6053n69008j268514p53543J243162
8822e462268L069804L048110J367044l70958r55315n57854j84579l37000l82122
8813g65138L57907J154010O30551r01401j428328j85341J101035R76820L80364
$$ plain form
8804 1320479 1727191 1636290 -645576 -4902348 -8015551 -7499531 -4554067 -2122858 -1084369
8795 -1084369 2440 2031325 3850915 3775718 1757557 -343597 -784485 -177177 -788016
8786 -788016 -2956176 -3769306 -1235992 1709103 661635 -3384120 -4761143 -1390347 2074666
8777 2074666 1327391 -1502917 -1978003 -132168 883783 539557 863387 1859186 1300035
8768 1300035 -1095440 -2982870 -3171366 -2990986 -3492343 -3992206 -3840044 -3198243 -1697976
8759 -1697976 1275611 4443152 5088423 2482139 -983921 -2803513 -2928322 -2791517 -3275086
8750 -3275086 -4267549 -5083697 -4916187 -3711295 -2463407 -1758810 -774521 895627 1545191
8741 1545191 -243121 -2351352 -1290502 2447316 4363935 1957156 -2221175 -4660015
$$ packed form
8804A320479M06712r0901k281866m256772l113203N16020K945464K431209J038489
8795a084369J086809K028885J819590p5197k018161k101154m40888O07308o10839
8786g88016k168160q13130K533314K945095j047468m045755j377023L370796L465013
8777B074666p47275k830308m75086J845835J015951l44226L23830R95799n59151
8768A300035k395475j887430j88496J80380n01357m99863J52162O41801J500267
8759a697976K973587L167541O45271k606284l466060j819592j24809J36805m83569
8750c275086r92463q16148J67510J204892J247888P04597R84289J670148O49564
8741A545191j788312k108231J060850L737818J916619k406779m178331k438840
$$ plain form
8733 -4660015 -5234135 -5714881 -6293044 -5848427 -4288062 -2620107 -1534777 -1321635 -2249202
8724 -2249202 -3742455 -4231874 -3222797 -2574687 -4233567 -7420283 -9533456 -9289112 -7565122
8715 -7565122 -5605417 -3881240 -2558146 -1676272 -736798 740663 2037644 1645685 -746583
8706 -746583 -3475153 -4607523 -3849812 -2222954 -388965 1732837 3677769 3927854 1644669
8697 1644669 -1611926 -3180344 -2434489 -1411056 -1855241 -2899346 -2576079 -545051 1895254
8688 1895254 3646776 4281367 3356853 855321 -1976429 -3627752 -3981181 -3838831 -3379702
8679 -3379702 -2552405 -2306596 -3433872 -4536622 -3376006 -244927 2254582 2940629 3074266
8670 3074266 3234124 2027980 -848365 -2953435 -2463571 -1137032 -1683299 -3648285 -4236859
$$ packed form
8733d660015n74120m80746n78163M44617J560365J667955J085330K13142r27567
8724b249202j493253m89419J009077O48110j658880l186716k113173K44344J723990
8715g565122J959705J724177J323094Q81874R39474J477461J296981l91959k392268
8706g46583k728570j132370P57711J626858J833989K121802J944932K50085k283185
8697A644669l256595j568418P45855J023433m44185j044105L23267K031028K440305
8688A895254J751522O34591r24514k501532k831750j651323l53429J42350M59129
8679c379702Q27297K45809j127276j102750J160616L131079K499509O86047J33637
8670C074266J59858j206144k876345k105070M89864J326539n46267j964986n88574
$$ plain form
8661 -4236859 -2326191 523043 2584712 3532094 3574111 2640750 726485 -1769680 -4051591
8652 -4051591 -4990932 -3912829 -1788277 -584925 -738291 -544832 995259 2241680 1246936
8643 1246936 -1323380 -3273260 -3663403 -2706985 -181455 3706446 6782985 6886253 5033116
8634 5033116 4082765 4424880 3708977 1083053 -1147809 -1024024 309061 552170 -970114
8625 -970114 -3587333 -6429675 -8006169 -6472510 -2042489 2125693 3105725 1445715 -22880
8616 -22880 292247 1661519 2590083 2156802 488446 -1027865 -829632 526598 337136
8607 337136 -2616347 -5708661 -5707450 -3345439 -2152417 -3100138 -3250190 -412980 3308489
8598 3308489 4144893 1352678 -2259403 -3735488 -2667803 -907570 -582682 -2269286 -4484254
$$ packed form
8661d236859J910668K849234K061669R47382M2017r33361j914265k496165k281911
8652d051591r39341J078103K124552J203352j53366J93459J540091J246421r94744
8643A246936k570316j949880l90143R56418K525530L887901L076539J03268j853137
8634E033116r50351L42115p15903k625924k230862J23785J333085K43109j522284
8625i70114k617219k842342j576494J533659M430021M168182R80032j660010j468595
8616b2880L15127J369272R28564m33281j668356j516311J98233J356230j89462
8607C37136k953483l092314J211K362011J193022r47721j50052K837210L721469
8598C308489Q36404k792215l612081j476085J067685J760233L24888j686604k214968
$$ plain form
8589 -4484254 -5038265 -3206879 -398267 1470458 1886817 1791633 2052323 2264059 1182200
8580 1182200 -1517719 -4019959 -3719524 -403124 2743031 2530301 -297301 -2043680 -833978
8571 -833978 1369881 1860902 440435 -1305759 -2323024 -2336662 -1039821 1373750 3554390
8562 3554390 4282943 3995755 3908159 4116054 3689912 2185513 -14281 -2303318 -3663671
8553 -3663671 -2630750 958058 4625415 5431431 3428064 1321544 757747 799401 311518
8544 311518 -239227 -240860 -355772 -1146613 -1630380 -727376 707411 821403 -690460 -2329285
8534 -2329285 -2952268 -3004993 -3416118 -4152656 -4337461 -3501587 -2398791 -2373020 -3707542 -4873956
8524 -4873956 -4146229 -1966749 -711431 -1717729 -3600913 -4268335 -3602830 -3008089 -3053457
$$ packed form
8589d484254n54011J831386K808612J868725M16359r5184K60690K11736j081859
8580A182200k699919k502240L00435L316400L146155k12730k827602j746379J209702
8571h33978K203859M91021j420467j746194j017265j3638J296841K413571K180640
8562C554390P28553k87188q7596K07895m26142j504399k199794k289037j360353
8553c663671J032921L588808L667357Q06016k003367k106520n63797M1654m87883
8544C11518n50745j633j14912p90841m83767R03004J434787J13992j511863j638825
8534b329285o22983n2725m11125p36538j84805Q35874J102796K5771j334522j166414
8524d873956P27727K179480J255318j006298j883184o67422O65505N94741m5368
$$ plain form
8515 -3053457 -3050951 -2685073 -2512477 -2632786 -2218429 -896856 472894 1070367 1310741 2023931
8505 2023931 3082048 3624299 3192078 1944393 219775 -1365021 -1937510 -1515522 -1640415
8496 -1640415 -3478142 -5520500 -4935676 -1462922 2003258 3485708 4356357 6065498 6690338
8487 6690338 3711890 -1035742 -2860921 -689469 1507762 600236 -1848561 -3203717
8479 -3203717 -3850546 -5054436 -5553691 -3752530 -1491450 -1862427 -4110371 -4342424 -1154749
8470 -1154749 2788941 4989492 5703442 5708672 4573449 2356833 601631 420823 1495919
8461 1495919 3620048 6932896 9909670 9867500 6822993 4229714 4126001 4056128 1129461
8452 1129461 -2983772 -4042332 -1139342 2127603 2216954 -538669 -2701701 -1253799 3287294
$$ packed form
8515c053457K506L65878J72596j20309M14357J321573J369750N97473K40374P13190
8505B023931J058117N42251m32221j247685j724618j584796n72489M21988j24893
8496a640415j837727k042358N84824L472754L466180J482450Q70649J709141O24840
8487F690338k978448m747632j825179K171452K197231r07526k448797j355156
8479c203717o46829j203890m99255J801161K261080l70977k247944k32053L187675
8470a154749L943690K200551P13950N230j135223k216616j755202j80808J075096
8461A495919K124129L312848K976774m2170l044507k593279j03713o9873k926667
8452A129461m113233j058560K902990L266945Q9351k755623k163032J447902M541093
$$ plain form
8443 3287294 6731549 5302114 403924 -2551398 -1073290 1187479 134825 -2586935
8435 -2586935 -2542304 223661 1253874 -1344067 -4363950 -4849064 -4102921 -4495364 -5400331
8426 -5400331 -4937154 -3665239 -3568084 -4291806 -3288795 110908 3132723 3060331 742199
8417 742199 -829252 -620200 -477974 -1839660 -3272310 -2444713 555787 3436027 4647181
8408 4647181 4414675 3132318 804524 -1630161 -2514473 -1794115 -1317679 -2017875 -2674408
8399 -2674408 -2363815 -1952853 -1884612 -880216 1275713 2012819 -417301 -3550157 -3823421
8390 -3823421 -1546453 315430 956450 1776789 2479966 1116252 -1864393 -3362398 -2228877
8381 -2228877 -866862 -1186942 -1933667 -1451967 -602791 -1252563 -3605711 -6331357 -7936458
$$ packed form
8443C287294L444255j429435m898190k955322J478108K260769j052654k721760
8435b586935M4631K765965J030213k597941l019883m85114P46143l92443r04967
8426e400331M63177J271915R7155p23722J003011L399703L021815p2392k318132
8417G42199j571451K09052J42226j361686j432650Q27597L000500K880240J211154
8408D647181k32506j282357k327794k434685q84312P20358M76436p00196o56533
8399b674408L10593M10962O8241J004396K155929P37106k430120l132856k73264
8390c823421K276968J861883O41020Q20339P03177j363714k980645j498005J133521
8381b228877J362015l20080p46725M81700Q49176o49772k353148k725646j605101
$$ plain form
8372 -7936458 -7271830 -4310898 -1096252 -216978 -1742063 -3339824 -3723440 -3863589 -4413264
8363 -4413264 -4446342 -3549352 -2697901 -2171952 -1187136 -477229 -2089563 -5135902 -5236630
8354 -5236630 -674136 4098661 4340080 1692365 1054910 2856415 3131433 532828 -1562374
8345 -1562374 -672602 1138496 893042 -965780 -1771817 -252430 2613931 4943233 5009121
8336 5009121 2351341 -1091219 -2256393 -457136 1603813 1384948 -270501 -916360 -282251
8327 -282251 -167128 -1023618 -1020337 851416 2647956 1870557 -1050999 -3264868 -3102282
8318 -3102282 -1608935 -444021 13414 -260597 -2053626 -5442580 -8139965 -7378180 -3437383
8309 -3437383 469458 2145654 2553094 3348495 3987145 2697839 -645101 -4185891 -6330253
$$ packed form
8372g936458O64628K960932L214646Q79274j525085j597761l83616j40149n49675
8363d413264l3078Q96990Q51451N25949R84816P09907j612334l046339j00728
8354e236630M562494M772797K41419k647715o37455J801505K75018k598605k095202
8345a562374Q89772J811098k45454j858822q06037J519387K866361K329302O5888
8336E009121k657780l442560j165174J799257K060949k18865j655449o45859O34109
8327b82251J15123q56490L281J871753J796540p77399k921556k213869J62586
8318c102282J493347J164914M57435k74011j793029l388954k697385P61785L940797
8309c437383L906841J676196M07440P95401O38650j289306l342940l540790k144362
$$ plain form
8300 -6330253 -7068266 -7041305 -6366409 -4845417 -2770108 -859377 723266 2835003 6120310
8291 6120310 9241646 9472361 6040399 1985231 1001997 2735719 3205886 251021 -3530377
8282 -3530377 -4358780 -2053643 413675 1072777 815020 1361983 2879701 3975289 3412781
8273 3412781 1591820 328438 837700 2071813 1920518 40152 -1820251 -2575356 -3144465
8264 -3144465 -4127002 -3951755 -1084157 3149619 5959616 6633023 6692672 6923694 6421015
8255 6421015 4781057 3157145 2338340 1430066 -417319 -2182115 -2298573 -1178138 -834564
8246 -834564 -1887112 -2370178 -397847 2928073 4709517 4127762 3388330 4192311 5079754
8237 5079754 3882241 1416181 346985 1024958 1229609 185320 -115769 1430596 2824870
$$ packed form
8300f330253p38013K6961O74896J520992K075309J910731J582643K111737L285307
8291F120310L121336K30715l431962m055168r83234J733722M70167k954865l781398
8282c530377q28403K305137K467318O59102k57757N46963J517718J095588n62508
8273C412781j820961j263382N09262J234113j51295j880366j860403p55105n69109
8264c144465r82537J75247K867598M233776K809997O73407N9649K31022n02679
8255F421015j639958j623912q18805r08274j847385j764796j16458J120435L43574
8246h34564j052548m83066J972331L325920J781444n81755p39432Q03981Q87443
8237E079754j197513k466060j069196O77973K04651j044289l01089J546365J394274
$$ plain form
8228 2824870 2081943 283817 -492244 -375963 -587970 -767108 24760 841698 145902
8219 145902 -1169166 -817646 1116682 2181542 1443470 779835 1705717 3150520 3282977
8210 3282977 1852427 -63037 -1245249 -762104 1328370 3160647 2394599 -986394 -4440844
8201 -4440844 -5881042 -5545459 -4398912 -2364209 724202 3620643 4484970 2794329 -254229
8192 -254229 -2795619 -3422471 -2068413 -303212 -88236 -1771279 -3846214 -4871109 -4848889
8183 -4848889 -4520024 -4251936 -4074237 -4054687 -4236750 -4743670 -5940165 -7692925 -8656388
8174 -8656388 -7536490 -5088671 -3434891 -3200512 -2904691 -1542635 41570 1030811 1913378
8165 1913378 2763571 2226029 -99551 -1976185 -1338035 565267 1207793 871242 1775605
$$ packed form
8228B824870p42927j798126p76061J16281k12007j79138P91868Q16938o95796
8219A45902j315068L51520J934328J064860p38072o63635R25882J444803J32457
8210C282977j430550j915464j182212M83145K090474J832277p66048l380993l454450
8201d440844j440198L35583J146547K034703L088411K896441Q64327j690641l048558
8192b54229k541390o26852J354058J765201K14976j683043k074935j024895K2220
8183d848889L28865K68088J77699J9550j82063n06920j196495j752760r63463
8174h656388J119898K447819J653780K34379K95821J362056J584205R89241Q82567
8165A913378Q50193n37542k325580j876634O38150J903302O42526l36551R04363
$$ plain form
8156 1775605 3574162 3075880 -774827 -4624247 -5023400 -2750970 -916339 -625172 -925755
8147 -925755 -1727574 -3792362 -6081131 -6061394 -3399928 -960124 -979048 -2308685 -2868961
8138 -2868961 -2810698 -3208356 -3399502 -2415866 -1887438 -4111043 -7482391 -7565755 -3528217
8129 -3528217 52850 -544340 -3371346 -4548578 -3788585 -3104704 -2536814 -963122 534313
8120 534313 174307 -744535 235680 1775813 375112 -3156474 -4051307 -1298814 399306
8111 399306 -1584588 -3425885 -1536756 1332226 1229301 96170 2047157 5411396 4887031
8102 4887031 385168 -2720052 -2306383 -2281196 -5247290 -8042561 -7214588 -4351465 -2697526
8093 -2697526 -1979034 -122206 2386075 3313132 2274404 649403 -775878 -1634808 -912193
$$ packed form
8156A775605J798557m98282l850707l849420l99153K272430J834631K91167l00583
8147i25755q01819k064788k288769J9737K661466K439804j8924j329637n60276
8138b868961N8263l97658j91146R83636N28428k223605l371348q3364M037538
8129c528217L581067n97190k827006j177232P59993O83881N67890J573692J497435
8120E34313l60006r18842R80215J540133j400701l531586q94833K752493J698120
8111C99306j983894j841297J889129K868982j02925j133131J950987L364239n24365
8102D887031m501863l105220M13669K5187k966094k795271Q27973K863123J653939
8093b697526P18492J856828K508281R27057j038728j625001j425281q58930P22615
$$ plain form
8084 -912193 1391313 2872318 1646325 -570936 -1037722 -353752 -1007258 -2561722 -2217146
8075 -2217146 -60809 419805 -1953905 -3742855 -2192568 527022 1018799 -94679 91499
8066 91499 1488172 1120224 -1944596 -5141843 -6393217 -6746760 -7906832 -9337334 -9478232
8057 -9478232 -8406733 -7393343 -6443497 -4167675 -301768 3140718 4049701 2736732 1345094
8048 1345094 1104774 1156940 193711 -1624617 -2861126 -2367034 -244788 2214008 3152875
8039 3152875 1491768 -1603383 -3368871 -2611657 -1397877 -2009003 -2986821 -742996 4687231
8030 4687231 8377030 6488730 1245461 -2195027 -2111727 -909958 -679381 -1217577 -2212991
8021 -2212991 -4040539 -5522269 -3980470 535584 3406408 571372 -5642223 -8745715
$$ packed form
8084i12193K303506J481005j225993k217261m66786O83970o53506j554464L44576
8075b217146K156337M80614k373710j788950J550287K719590M91777j113478J86178
8066I1499J396673l67948l064820l197247j251374l53543j160072j430502j40898
8057i478232J071499J013390R49846K275822L865907L442486R08983j312969j391638
8048A345094k40320N2166r63229j818328j236509M94092K122246K458796R38867
8039C152875j661107l095151j765488P57214J213780o11126r77818K243825N430227
8030D687231L689799j888300n243269l440488Q3300J201769K30577n38196r95414
8021b212991j827548j481730J541799M516054K870824k835036o213595l103492
$$ plain form
8013 -8745715 -6059773 -1597845 -63285 -732751 208868 2934289 3326988 -450360 -4304376
8004 -4304376 -3523155 604485 2779985 1085907 -1484483 -2753960 -4168122 -6390168
7996 -6390168 -6455076 -2626554 1099498 -354126 -5713770 -8944585 -7502304 -4637403 -3460148
7987 -3460148 -3143672 -2091092 -864199 -71914 1428880 4051272 5761717 5011938 3272902
7978 3272902 2579715 2439484 1255871 -811282 -2440922 -3205521 -3222500 -2185314 -515124
7969 -515124 -5403 -1487109 -3288547 -3794447 -3903259 -4961530 -6021418 -5545476 -4262802
7960 -4262802 -3721990 -3404702 -2032671 -451657 -265198 -775309 -459233 -408223 -2710637
7951 -2710637 -6151862 -7435018 -6416948 -6029397 -6801459 -5844957 -2259995 799830 1248194
$$ packed form
8013h745715K685942M461928J534560o69466R41619K725421L92699l777348l854016
8004d304376P81221M127640K175500j694078k570390j269477j414162k222046
7996f390168o4908L828522L726052j453624n359644l230815J442281K864901J177255
7987c460148L16476J052580J226893P92285J500794K622392J710445p49779j739036
7978C272902o93187j40231j183613k067153j629640p64599j6979J037186J670190
7969e15124N09721j481706j801438n05900j08812j058271j059888M75942J282674
7960d262802N40812L17288J372031J581014J86459n10111L16076N1010k302414
7951b710637l441225j283156J018070L87551p72062R56502L584962L059825M48364
$$ plain form
7942 1248194 1267224 2923515 4030771 1513577 -3520335 -7161913 -7506816 -5382726 -1734756
7933 -1734756 2864642 6800023 7981850 5878343 1795901 -2261565 -4199260 -2747881
7925 -2747881 782589 2917093 1719503 -932724 -1971477 -686877 1589360 3648037
7917 3648037 4599008 3595182 1323299 249150 1369303 2373804 1331473 338511 2398406
7908 2398406 6066560 6879159 3625475 -375440 -2299531 -2656437 -2579342 -1641701 323027
7899 323027 1823133 1591373 80285 -1818529 -3776303 -5117433 -4885987 -3565010 -2832872
7890 -2832872 -2957820 -2432482 -810680 327030 14309 -831031 -1617499 -2929255 -4071826
7881 -4071826 -2822944 534758 2007907 -630460 -3843314 -3069813 690551 2781455
$$ packed form
7942A248194J9030J656291J107256k517194n033912l641578l44903K124090L647970
7933a734756M599398L935381J181827k103507m082442m057466j937695J451379
7925b747881L530470K134504j197590k652227j038753J284600K276237K058677
7917C648037R50971j003826k271883j074149J120153J004501j042331r92962K059895
7908B398406L668154Q12599l253684m000915j924091l56906P7095R37641J964728
7899C23027J500106k31760j511088j898814j957774j341130K31446J320977P32138
7890b832872j24948N25338J621802J137710l12721q45340p86468j311756j142571
7881d071826J248882L357702J473149k638367l212854P73501L760364K090904
$$ plain form
7873 2781455 1904761 1132013 2452720 4344229 5092376 4968494 4334312 2709861 759823
7864 759823 489715 2310058 4171790 4496024 3652021 1817573 -1797947 -6293386 -8470980
7855 -8470980 -6878337 -4210452 -3633548 -4707661 -5079223 -4310304 -3591521 -3188388 -2658195
7846 -2658195 -2365301 -2443345 -1567280 759957 2107201 199685 -3154513 -4529584 -4200767
7837 -4200767 -5048361 -6680801 -5364721 -634972 2656639 1028771 -2648481 -3577838 -1533391
7828 -1533391 1791 -971875 -3544135 -6066839 -7064973 -5278834 -1346449 1614170 1414014
$$ packed form
7873B781455q76694p72748J320707J891509P48147j23882o34182j624451j950038
7864G59823k70108J820343J861732L24234q44003j834448l615520m495439k177594
7855h470980J592643K667885N76904j074113l71562P68919P18783M03133N30193
7846b658195K92894p8044Q76065K327237J347244j907516l354198j375071L28817
7837d200767q47594j632440J316080M729749L291611j627868l677252r29357K044447
7828a533391J535182r73666k572260k522704r98134J786139L932385K960619k00156
$$ [...]
##END NTUPLES=NMR SPECTRUM
##END=
