##TITLE=31Pdec_SR55_oil2
 CDCl3, 24 sc
 30.04.2021
##JCAMPDX= 6.0         $$ Bruker NMR JCAMP-DX V2.0
##DATA TYPE= NMR SPECTRUM
##DATA CLASS= NTUPLES
##ORIGIN= UXNMR, Bruker Analytische Messtechnik GmbH
##OWNER= root
$$ XWIN-NMR		Version 3.5
$$ Fri Apr 30 15:09:14 2021 Russian Standard Time (UT+4h)  she@DPX200
##.OBSERVE FREQUENCY= 81.013821
##.OBSERVE NUCLEUS= ^31P
##.ACQUISITION MODE= SIMULTANEOUS
##.ACQUISITION SCHEME= undefined
##.AVERAGES= 24
##.DIGITISER RES= 16
##SPECTROMETER/DATA SYSTEM= spect
##.PULSE SEQUENCE= zgpg30
##.SOLVENT NAME= CDCl3
##.SHIFT REFERENCE= (INTERNAL, CDCl3, 0, 248.564)
##AUDIT TRAIL= $$ (NUMBER, WHEN, WHO, WHERE, WHAT)
$$ ##TITLE= Audit trail, XWIN-NMR		Version 3.5
$$ ##JCAMPDX= 5.01
$$ ##ORIGIN= Bruker BioSpin GmbH
$$ ##OWNER= she
$$ F:/spectra/data/she/nmr/P31/1/pdata/1/auditp.txt
$$ ##AUDIT TRAIL=  $$ (NUMBER, WHEN, WHO, WHERE, WHAT)
(   1,<2021-04-30 15:08:21.07 +0400>,<she>,<DPX200>,
      <created by zg, POWCHK disabled, PULCHK disabled
       configuration hash MD5:
       00 E9 B6 7A A2 85 ED C7 34 08 36 98 17 FE 4E 26
       data hash MD5: 32K
       12 E4 51 2C C1 1B 20 F7 DA 8D 26 77 5A 8F 19 BB>)
(   2,<2021-04-30 15:08:23.73 +0400>,<she>,<DPX200>,
      <Start of raw data processing
       efp BC_mod = 2 LB = 1 FT_mod = 6 PKNL = 1 PHC0 = -6478.54 PHC1 = 722.4009 SI = 64K 
       data hash MD5: 64K
       BC 3F 4D 71 CB 14 21 4A 1A 3D 86 1D 6D 97 64 AF>)
(   3,<2021-04-30 15:08:37.73 +0400>,<she>,<DPX200>,
      <pk PHC0 = -55.32964 PHC1 = 0 
       data hash MD5: 64K
       AE 72 8E 59 09 1C 69 75 88 78 50 34 23 6F 7F EB>)
$$ ##END=
$$ 
$$ hash MD5
$$ 99 26 78 22 48 50 DA 36 F4 52 CF 1E BC BF C7 FB
##$RELAX= 
##$RELAX= 
##$RELAX= 
##$RELAX= 
##$RELAX= 
##$RELAX= 
##$RELAX= 
##$RELAX= 
$$ Bruker specific parameters
$$ --------------------------
##$DU= <F:/spectra>
##$EXPNO= 1
##$NAME= <P31>
##$PROCNO= 1
##$TYPE= <nmr>
##$USER= <she>
##$AMP= (0..31)
100 100 100 100 100 100 100 100 100 100 100 100 100 100 100 100 100 100 
100 100 100 100 100 100 100 100 100 100 100 100 100 100 
##$AQSEQ= 0
##$AQ_mod= 1
##$AUNM= <au_zg>
##$AUTOPOS= <>
##$BF1= 81.014009
##$BF2= 200.13
##$BF3= 200.13
##$BF4= 200.13
##$BF5= 200.13
##$BF6= 200.13
##$BF7= 200.13
##$BF8= 200.13
##$BYTORDA= 1
##$CFDGTYP= 0
##$CFRGTYP= 5
##$CHEMSTR= <none>
##$CNST= (0..31)
1 1 145 1 1 1 1 1 1 1 1 1 1 1 1 1 1 1 1 1 1 1 1 1 1 1 1 1 1 1 1 1 
##$CPDPRG= <waltz16>
##$CPDPRG1= <>
##$CPDPRG2= <waltz16>
##$CPDPRG3= <>
##$CPDPRG4= <mlev>
##$CPDPRG5= <mlev>
##$CPDPRG6= <mlev>
##$CPDPRG7= <mlev>
##$CPDPRG8= <mlev>
##$CPDPRGB= <>
##$CPDPRGT= <>
##$D= (0..31)
0 1 0 0 0 0 0 0 0 0 0 0.03 2e-05 3e-06 0 0 0 0 0 0 0 0 0 0 0 0 0 0 0 0 
0 0 
##$DATE= 1619780900
##$DBL= (0..7)
120 120 120 11 120 120 24 19 
##$DBP= (0..7)
150 150 150 150 150 150 150 150 
##$DBP07= 0
##$DBPNAM0= <>
##$DBPNAM1= <>
##$DBPNAM2= <>
##$DBPNAM3= <>
##$DBPNAM4= <>
##$DBPNAM5= <>
##$DBPNAM6= <>
##$DBPNAM7= <>
##$DBPOAL= (0..7)
0.5 0.5 0.5 0.5 0.5 0.5 0.5 0.5 
##$DBPOFFS= (0..7)
0 0 0 0 0 0 0 0 
$$ [...]
##$SUBNAM2= <"">
##$SUBNAM3= <"">
##$SUBNAM4= <"">
##$SUBNAM5= <"">
##$SUBNAM6= <"">
##$SUBNAM7= <"">
##$SUBNAM8= <"">
##$SUBNAM9= <"">
##$SW= 501.771253377433
##$SWIBOX= (0..15)
0 1 3 0 0 0 0 0 0 0 0 0 0 0 0 0 
##$SW_h= 40650.406504065
##$TD= 32768
##$TD0= 1
##$TE= 0
##$TE2= 300
##$TE3= 300
##$TEG= 300
##$TL= (0..7)
0 120 53 12 22 120 120 120 
##$TP= (0..7)
150 150 150 150 150 150 150 150 
##$TP07= 0
##$TPNAME0= <>
##$TPNAME1= <>
##$TPNAME2= <>
##$TPNAME3= <>
##$TPNAME4= <>
##$TPNAME5= <>
##$TPNAME6= <>
##$TPNAME7= <>
##$TPOAL= (0..7)
0.5 0.5 0.5 0.5 0.5 0.5 0.5 0.5 
##$TPOFFS= (0..7)
0 0 0 0 0 0 0 0 
##$TUNHIN= 0
##$TUNHOUT= 0
##$TUNXOUT= 0
##$USERA1= <user>
##$USERA2= <user>
##$USERA3= <user>
##$USERA4= <user>
##$USERA5= <user>
##$V9= 5
##$VALIST= <valist>
##$VCLIST= <CCCCCCCCCCCCCCC>
##$VD= 0
##$VDLIST= <DDDDDDDDDDDDDDD>
##$VPLIST= <PPPPPPPPPPPPPPP>
##$VTLIST= <TTTTTTTTTTTTTTT>
##$WBST= 1024
##$WBSW= 4
##$XGAIN= (0..3)
0 0 0 0 
##$XL= 0
##$YL= 0
##$YMAX_a= 2389
##$YMIN_a= -7842
##$ZGOPTNS= <>
##$ZL1= 120
##$ZL2= 120
##$ZL3= 120
##$ZL4= 120
##$ABSF1= 0
##$ABSF2= 0
##$ABSG= 0
##$ABSL= 0
##$ALPHA= 0
##$AQORDER= 0
##$ASSFAC= 0
##$ASSFACI= 0
##$ASSFACX= 0
##$ASSWID= 0
##$AUNMP= <proc_1d>
##$AZFE= 0.1
##$AZFW= 0.5
##$BCFW= 0
##$BC_mod= 2
##$BYTORDP= 0
##$COROFFS= 0
##$CY= -3
##$DATMOD= 1
##$DC= 0
##$DFILT= <>
##$DTYPP= 0
##$F1P= 0
##$F2P= 0
##$FCOR= 1
##$FTSIZE= 65536
##$FT_mod= 6
##$GAMMA= 0
##$GB= 0
##$INTBC= 1
##$INTSCL= 5.30512e-09
##$ISEN= 30
##$LB= 1
##$LEV0= 0
##$LPBIN= 0
##$MAXI= 10000
##$MC2= 0
##$MEAN= 0
##$ME_mod= 0
##$MI= 50
##$NCOEF= 0
##$NC_proc= -6
##$NLEV= 6
##$NOISF1= 182.463
##$NOISF2= 159.3651
##$NSP= 0
##$NTH_PI= 0
##$NZP= 0
##$OFFSET= 248.5645
##$PC= 4
##$PHC0= -6533.87
##$PHC1= 722.4009
##$PH_mod= 1
##$PKNL= yes
##$PPARMOD= 0
##$PSCAL= 0
##$PSIGN= 0
##$REVERSE= no
##$SF= 81.014009
##$SI= 65536
##$SIGF1= 159.3651
##$SIGF2= -187.1042
##$SINO= 113.3802
##$SIOLD= 16384
##$SREGLST= <1H.CDCl3>
##$SSB= 0
##$STSI= 65536
##$STSR= 0
##$SW_p= 40650.406504065
##$SYMM= 0
##$S_DEV= 0
##$TDeff= 32768
##$TDoff= 0
##$TI= <>
##$TILT= no
##$TM1= 0
##$TM2= 0
##$TOPLEV= 0
##$USERP1= <user>
##$USERP2= <user>
##$USERP3= <user>
##$USERP4= <user>
##$USERP5= <user>
##$WDW= 1
##$XDIM= 65536
##$YMAX_p= 303479951
##$YMIN_p= -14530541
$$ End of Bruker specific parameters
$$ ---------------------------------
##NTUPLES= NMR SPECTRUM
##VAR_NAME=  FREQUENCY,     SPECTRUM/REAL,   SPECTRUM/IMAG
##SYMBOL=    X,             R,               I
##VAR_TYPE=  INDEPENDENT,   DEPENDENT,       DEPENDENT
##VAR_FORM=  AFFN,          ASDF,            ASDF
##VAR_DIM=   65536,         65536,           65536
##UNITS=     HZ,            ARBITRARY UNITS, ARBITRARY UNITS
##FACTOR=    0.620285442955139, 1,           1
##FIRST=     20137.2065510759, 0,            0
##LAST=      -20513.1999529892, 0,           0
##MIN=       -20513.1999529892, -14530541,   0
##MAX=       20137.2065510759, 303479951,    0
$$ Real data points
##PAGE= N=1
##DATA TABLE= (X++(R..R)), XYDATA
$$ [...]
##PAGE= N=2
##DATA TABLE= (X++(I..I)), XYDATA
13126B774817o42008j900585k5010K440268J770070k32988O04267K821776J431364
13117I041971k765941l625551j06578J541277j742852m636330k364963J781917
13109b877050K507054N31180n68458q91493k089191k474864K4001K838846K248835
13100g51140k71468n60611J169103J221394q61235j894793q36962J32109J93894
13091b459709P31119J410802J38550k424309k718627K34376L097420L178430J623616
13082B811668M24259m10779j216296j210771l22864j7241q60320j445475q82439
13073c130258j18272K81068J260922K894138L221890J141721j448580k084549
13065B018080q61605K95847K39904o93962j453417r25604R51230K283970J110237
$$ y = [2774817, 2132809, 232224, 207214, 2647482, 4417552, 4184564, 4788831, 7610607, 9041971, 6276030, 2650479, 2543901, 4085178, 2342326, -2294004, -4658967, -2877050, -369996, 161184, -407274, -1298767, -3387958, -5862822, -5838821, -2999975, -751140, -1022608, -1583219, -414116, 807278, -53957, -1948750, -2785712, -2653603, -2459709, -1728590, -317788, -179238, -2603547, -5322174, -5087798, -1990378, 1188052, 2811668, 3235927, 2825148, 1608852, 398081, 75217, 57976, -802344, -2247819, -3130258, -3248530, -2967462, -1706540, 1187598, 4409488, 5551209, 4102629, 2018080, 1156475, 1452322, 1692226, 998264, -455153, -1380757, -429527, 1854443, 2964680]
13056B964680j393209j835213M40050J996956M74016j640444r70009J261729J193137
13047B491693j362704k472623k80195J909212M42988l212890m268690r13157L501693
13038d164673M772319K562416j30052j076495q35082q39701j141193r49256l83092
13029b184809l25961q13457p84548L91327J974548K646363J700629m92593k588118
13020d76619k993950j325502Q75139J650829Q43910J0252K10040Q94572J112312
13011H00983P65928K92428j4363R0337P83997J541756J224489n00556k236608
13002B748391k084451J82133K567122K690327K10899k662473l328651j510301
12994a187004N60004P80298n93642j705467j383856k5132J245966J547368P98579
$$ y = [2964680, 1571471, -263742, 176308, 2173264, 2647280, 1006836, 36827, 1298556, 2491693, 1128989, -1343634, -1623829, 285383, 728371, -2484519, -6753209, -7666366, -4164673, 607646, 3170062, 3040010, 1963515, 1128433, 288732, -852461, -1801717, -2184809, -2510770, -3324227, -4108775, -3717448, -1742900, 903463, 2604092, 2111499, -476619, -3470569, -4796071, -3920932, -2270103, -1426193, -1415941, -1205901, -311329, 800983, 1566911, 1859339, 1844976, 1935313, 2719310, 4261066, 5485555, 4984999, 2748391, 663940, 846073, 3413195, 6103522, 6314421, 3651948, 323297, -1187004, -627000, 153298, -440344, -2145811, -3529667, -3554799, -2308833, -761465, 37114]
12985C7114k3289L02805J508085J656776l53207k888805l432111j687284N79721
12976d300195K159106L016860K689680M32488k550589l287420p64325K114671
12968d89724J922020q52753k451589p04030K318641L014560O24536k103073k461271
12959a182683r14247P5829l46791n27271P80548K244374J836717k39348j935841
12950b08713k011698r43017L00325J044227R17132L63052O15831J815123J977441
12941C869703k95702k899742k565470K04754J554435K6388j370796j80091J616023
12932d0498J133294n72061m79547J137633J185606q50477j766455J32799J976288
12923A856582O28834k290736k596220L14052K601305J523620r75159j532183q2364
$$ y = [37114, 13825, 316630, 1824715, 3481491, 3128284, 239479, -3192632, -4879916, -4300195, -2141089, 875771, 3565451, 3997939, 1447350, -1840070, -2604395, -489724, 1432296, 579543, -1872046, -2576076, -257435, 2757125, 3381661, 1278588, -1182683, -2096930, -2021101, -2367892, -2895163, -2114615, 129759, 1966476, 1727128, -208713, -2220411, -3163428, -2863103, -1818876, -901744, -538692, 77139, 1892262, 3869703, 3574001, 674259, -1891211, -1686457, -132022, -105634, -1476430, -1656521, -40498, 1092796, 520735, 41188, 1178821, 2364427, 1513950, -252505, -119706, 1856582, 2485416, 194680, -2401540, -2087488, 513817, 2037437, 1062278, -469905, -552269]
12914e52269P78262n9843j099934j027731m29352k92022n06517n31717k76385
12905c997508K24547R35101J374207J230001J338827K407567K993405J213587
12897G719734j435801j277839J552786K162463j780871n563676l889797J223873
12889a289128L559938J636988n19216m68650R5751p7668J67674Q47767K6191j986147
12879A993500j997876N96317J886687n08793l239051k188308J377886L092077
12871A012439J734040k27688r05098o05058K9753P60942R94004L40683m02926
12862B731091l48136P0429P7078K084L94153P42569M72572J21557J64747j09525
12852D318619j118419j704075r44114M2631j56396q75265n63907O78170J557034
$$ y = [-552269, 225993, 166150, -933784, -1961515, -2390867, -2682889, -3189406, -3721123, -3997508, -3772961, -2837860, -1463653, -233652, 1105175, 3512742, 6506147, 7719734, 6283933, 5006094, 6558880, 8721343, 6940472, 1376796, -2513001, -1289128, 2270810, 3907798, 3388582, 2919932, 3015683, 2938015, 3105689, 3953456, 3979647, 1993500, -4376, 591941, 2478628, 1969835, -1269216, -3457524, -2079638, 1012439, 2746479, 2518791, 1613693, 1008635, 1038388, 1799330, 2793334, 3134017, 2731091, 2382955, 2453384, 2530462, 2532546, 2926699, 3669268, 4141840, 4263397, 4428144, 4318619, 3200200, 1496125, 552011, 594642, 438246, -437019, -1000926, -322756, 1234278]
12843A234278J658329J384963P25827l37095j129434j378280j782448k150049
12835a773909p45012K620262M767960L015217o88186k336367j336705l51812o79180
12826B492268j145591j108214j160814r08381O76595K461985J965107n21755j783348
12817I67852n00765Q65014K34725r85028p24731K96929J52699r23937r85716N66052
12807a036906K089926J740092m36580k344737j805151P78188K269500N46048k362381
12798e62001k890677j065688j29736j037109r23774J690212L749572K236552q87298
12789A80053j577717K25167J013345n13536j687688l82120J735009J875203Q3980
12780I51696j215405o71498O05698R20348N424j167889j734937j416817j62207
$$ y = [1234278, 2892607, 4277570, 5003397, 4666302, 3536868, 2158588, 376140, -1773909, -2518921, 101341, 4869301, 7884518, 7196332, 4859965, 3523260, 3171448, 2492268, 1346677, 238463, -922351, -1830732, -1154137, 1307848, 3272955, 2751200, 967852, 467087, 1332101, 1566826, 581798, -142933, 153996, 306695, -617242, -1602958, -1036906, 1053020, 2793112, 2356532, 11795, -1793356, -1015168, 1254332, 1800380, -562001, -3452678, -4518366, -4648102, -5685211, -6608985, -4918773, -1169201, 1067351, 180053, -1397664, -1172497, -159152, -672688, -2360376, -2742496, -1007487, 867716, 951696, -263709, -935207, -329509, 590839, 596263, -571626, -2306563, -3723380, -3885587]
12771c885587J680255K853562K029205l41200k072579j890857r31274o28636m83923
12762c671034M67213J309960P20009j62047P81616K661884K392407j76647j478165
12753B845196J93703J793411L64567k236875k390554k92931Q44806n1658q91517
12744A78148k18160Q77478R94087L53736j31871k54836l96395p82043j004025
12735c83881p2475K339498M418286L534554l46k377296j173579J069608N39309
12726G893678k200565l372456j861134l91035q09654j598732r50877M87390J188647
12717a614738R33385K86394m09993o67474o9228N66279l2787j220084r29119Q58914
12707b298451J574435Q1042j285128m47949R30345J52294j944351k010943P48397
$$ y = [-3885587, -2205332, 648230, 2677435, 2336235, 263656, -1627201, -2558475, -3187111, -3671034, -3203821, -1893861, -1173852, -1335899, -554283, 2107601, 4500008, 4323361, 2845196, 3038899, 4832310, 5196877, 2960002, 569448, 276517, 1121323, 1069665, 178148, -40012, 837466, 1831553, 2185289, 2053418, 1798582, 1402187, 620144, -383881, -456356, 1883142, 6301428, 9835982, 9835636, 7458340, 6284761, 7354369, 7893678, 5693113, 2320657, 459523, 68488, -741166, -2339898, -3290775, -2803385, -1614738, -681353, -394959, -804952, -1472426, -1541654, -975375, -1008162, -2228246, -3157365, -2298451, -724016, -642974, -1928102, -2376051, -1445706, -1293412, -3237763, -5248706, -4500309]
12698d500309L228996K605248o5605j429546j00778J759871J307068j159520k320758
12689f75333k76914K474600K193464q34068k706374j541809K23576P7018r14707
12680a980547n21005Q88454J331056M53414m55143o81107l98382L63191J362749
12671C62680J614163P05900k90601n39547p87438j610719j943894j069679k94597
12662c853732n73374l69068J566609L168364J951467o40953j316800j31778K56057
12653E6792l69948J94502J762377J503895r51029k508486j748542q88698j190422
12644d139559o00883J877667L332116J339827j780782k210974L0099J855867J641326
12635A344704M19115l80528l46191N2084j31387j133147j420683L87967K544694
$$ y = [-4500309, -1271313, 1333935, 1268330, -161216, -261994, 1497877, 2804945, 1645425, -675333, -952247, 1522353, 3715817, 2881749, 175375, -1366434, -1142858, -1065840, -1980547, -2501552, -1613098, -282042, 171372, -283771, -964878, -1363260, -1000069, 362680, 1976843, 2682743, 2392142, 1852595, 1065157, -545562, -2489456, -3559135, -3853732, -4427106, -4796174, -3229565, -61201, 1890266, 1249313, -67487, -199265, 56792, -313156, -118654, 1643723, 3147618, 2196589, -311897, -2060439, -2949137, -4139559, -4740442, -2862775, 469341, 1809168, 28386, -2182588, -2152489, -296622, 1344704, 1763819, 1383291, 1037100, 1089184, 957797, -175350, -1596033, -1208066, 1336628]
12626A336628J950898p82930j749146j06149M10341j792951k844097m7260K849563
12617g75103J539199j643138j770320M81834O77523j312523j385012J327846L032892
12608A73198J667575m62807j164210r58353m87164N35165J115267l13853k397098
12599b292280j941278J032537L205086L146340K322747Q56557k525333n603755
12591a799379l690554K403177N301322J255556l927565l402471R26680K399668
12583e33566q6737j777525l88035J167284M89470p32006j94843J294318J314599
12574E52959o84751k752048k737806o84902J181799J142201K02695M50717J701513
12565a627623J891770O64849j79868j21191n95983j473902n20626K133782K880046
$$ y = [1336628, 3287526, 2504596, 755450, 649301, 1059642, -733309, -3577406, -3624666, -775103, 764096, -879042, -2649362, -2167528, -1490005, -2802528, -4187540, -2859694, 173198, 1840773, 1377966, 213756, -744597, -1231761, -696596, 418671, 104818, -2292280, -4233558, -3201021, 4065, 3150405, 5473152, 6329709, 3804376, -1799379, -5489933, -3086756, 2214566, 3470122, -457443, -3859914, -2933234, -533566, -620303, -2397828, -2785863, -1618579, -1129109, -1861115, -2055958, -761640, 552959, -131792, -2883840, -5621646, -6306548, -5124749, -3982548, -3779853, -3329136, -1627623, 264147, 928996, 749128, 627937, 31954, -1441948, -1962574, 171208, 3051254]
12556C051254K41061k251605j686589m13433j316932k133111O49434M966837N743810
12547F850726K686576M7423n82801j700545l966075m270905j156543K189995K355362
12538B453213O5071j571965r58572J027055K255457J052342j824779l291017j764052
12529b557247K85538J05163p30296P75326L059034J978413j771074k995750m30683
12520b281576J197375o08802j890837N39354L251676K110512o24996o00658P72114
12511A864162r55961m714834m763634N2429M040772K986047l94331j513744k61412
12502c660506N96697K94952Q0025J78451j27696l13885P01896K034809J598067
12493A382810m21957j326956O9573J469108O09239j213675j362487j90652k17008
$$ y = [3051254, 3292315, 1040710, -645879, -1059312, -2376244, -4509355, -3859921, 1106916, 6850726, 9537302, 9584725, 9001924, 7301379, 3335304, -935601, -2092144, 97851, 2453213, 2518284, 946319, -12253, 1014802, 3270259, 4322601, 2497822, -793195, -2557247, -2271709, -2166546, -2896842, -2121516, 937518, 2915931, 1144857, -1850893, -2281576, -1084201, -1693003, -3583840, -3044486, 207190, 2317702, 1692706, 1092048, 1864162, 908201, -3806633, -8570267, -8517838, -4477066, -1491019, -1885350, -3399094, -3660506, -3063809, -2768857, -2688832, -2510381, -2638077, -2951962, -2250066, -215257, 1382810, 960853, -366103, -296530, 1172578, 1781817, 568142, -794345, -984997, -1202005]
12484a202005j482000j145367J600955L585832K362625q1980p68936l18332r65057
12475A585735k033702j208017Q76586J366066Q2497l41980P00135R05878l80958
12466A552240q19206N26816J356474L58627m44376M18539J168956K67786p68753
12457C617103n72661n88785j679483j512247J168097K975949Q46813k314906j870999
12448F8881R39494J195455j288122j842768Q33282K440311L71160k203568j841448
12439a327323N7149M40161n81231j026968n54301K1181P05940J502029J331292
12430E67929j27539j087466r5713J516191J414517n95197k638886k961900j085722
12421e093786J890602L424672J773758j132886j368450J398720K828712K28605
$$ y = [-1202005, -2684005, -3829372, -2228417, 1357415, 3720040, 3638060, 2869124, 2550792, 1585735, -447967, -1655984, -779398, 586668, 669165, 327185, 1027320, 1933198, 1552240, 733034, 1259850, 2616324, 2974951, 2530575, 2949114, 4118070, 4385856, 3617103, 3044442, 2455657, 776174, -736073, 432024, 3407973, 4254786, 1939880, 68881, 1008375, 2203830, 915708, -927060, -93778, 2346533, 2717693, 514125, -1327323, -1270174, -830013, -1411244, -2438212, -2992513, -2971332, -2265392, -763363, 567929, 440390, -647076, -742789, 773402, 2187919, 1592722, -1046164, -4008064, -5093786, -3203184, 221488, 1995246, 862360, -506090, 892630, 3721342, 3949947]
12413C949947l067123k494869J014465K678846P38271j976712k699845j566722
12405c423742J47885J682038K321961J587209K54598m52942n77287q29400r37635
12396b27315l78931O7030m52607r57819j97126Q77426P10522R9596O01145J158465
12386A300386p0990j489239m1456K902650K612108j417441m050718k300571M26790
12377b128481L51536j033515o42724Q40708J133712P25604J104604J183643m94335
12368A040752k093088j048895J373310J982775O78473k56977m79916j158784j390123
12359a352473O09707L347676L427334R10411q72273q65854j299528k729624k619341
12350a443965j59347J666046P91415o48478j1809J740391K079191Q98798M042
$$ y = [3949947, 882824, -1612045, -597580, 2081266, 2819537, 842825, -1857020, -3423742, -3275857, -1593819, 728142, 2315351, 2569949, 2117007, 1539720, 710320, -227315, -606246, -539216, -991823, -1949642, -2146768, -1269342, -558820, -459224, 141921, 1300386, 1229396, -259843, -301299, 2601351, 5213459, 3796018, -254700, -2555271, -2128481, -1776945, -2810460, -3453184, -2612476, -1478764, -753160, 351444, 1535087, 1040752, -1052336, -2101231, -727921, 1254854, 1933327, 1676350, 1196434, 37650, -1352473, -742766, 2604910, 6032244, 6942655, 6070382, 5204528, 3905000, 1175376, -1443965, -1603312, 62734, 854149, 205671, 193862, 1934253, 4013444, 4912242, 4916284]
12341D916284m7752l94013j648528k695227j830134J098110L690912L104941r6640
12332F097953j873881j78070J631575k39194l692634l666828j52247J872474M38640
12323B37788r19220K82058J701289R66080m54228o61453n23789r06595n13439
12314g91509R21824R95435j089116k223945k88539K128405J922736N2867j100461
12305E27697j540761j687212k12373K636497L208555r0574l040466j641903J525080
12296c15460J760893k14735n48395P39642Q00970j98415j18896J04685j623438
12287C86851l195322j044586K917017L468986M37242j552144j152765j317589
12279a052310k253810o20307L224359M291931J146590j602768j182216n29628
$$ y = [4916284, 4868532, 4474519, 2825991, 130764, -1699370, -601260, 3089652, 6194593, 6097953, 4224072, 4046002, 5677577, 5438383, 1745749, -1921079, -2073326, -200852, 237788, -681432, -399374, 1301915, 2267995, 1813767, 1152314, 628525, -278070, -791509, 130315, 1125750, 36634, -2187311, -2475850, -347445, 1575291, 1628158, 527697, -1013064, -2700276, -2912649, -276152, 2932403, 2841829, -198637, -1840540, -315460, 1445433, 1230698, 682303, 1421945, 2222915, 2024500, 1905604, 2010289, 386851, -2808471, -3853057, -936040, 2532946, 2970188, 1418044, 265279, -1052310, -3306120, -3926427, -702068, 3589863, 4736453, 3133685, 1951469, 1421841]
12271A421841j657296j681968R67435K482380J73891k275466q66063J955022J696358
12262B216134p68727j513330l88676j93037r79932l81748J377084J484340n71533
12253B80575j961055p76974J480884K254568R47097q49678j291759l73669N1906
12244b38105r26453j411475L12476K087353P34791k071637j588192K053490L347487
12235B299735M04965j665356O45149L284193J656607j772891k273958p16097o52567
12226A209780j299480Q9610J771519K70390k476444j706222J696926K361640m15675
12217A502044j748454K05440J617321L12691q21318J14465N45348j218266k395806
12208a886535p71307J164851O07597p85898j51315J563652J487702m49146j970475
$$ y = [1421841, -235455, -1917423, -949988, 1532392, 1706283, -569183, -1435246, 519776, 2216134, 1447407, -65923, -454599, -647636, -1627568, -2009316, -632232, 852108, 280575, -1680480, -2457454, -976570, 1277998, 2225095, 1375417, 83658, -290011, -238105, -1164558, -2576033, -2263557, -176204, 558587, -1513050, -3101242, -1047752, 2299735, 2704700, 1039344, 1684493, 4968686, 6625293, 4852402, 2578444, 1862347, 1209780, -89700, -90, 1771429, 2041819, -434625, -2140847, -443921, 1917719, 1502044, -246410, -40970, 1576351, 1889042, 1067724, 1182189, 1727537, 509271, -1886535, -2657842, -1492991, -885394, -1671292, -1822607, -258955, 1228747, 779601, -1190874]
12199a190874k015940j085265N25975K369481L026945J834214K24316m38392q65385
12190B385075j881762k254559p69761J076718J060717k06066l43908Q78830J372566
12181A317850K52058r68446r60097k61679R0807r7208o97794j603423k017956
12172d945888q28700J577824L082991K332794N59692n4961Q55277J775481J550778
12163E905288N12976n20491j182328j285249p63753l46443j116778k603268k506301
12154c906347L17796L529546L790880J168033r64277m91128J051679J211779k36140
12145E471821j868775k656367k264981p44575Q87723J023291m07801j408167o68885
12136b636716M59002R4430j300947j724382m21196J502132K550525J930479L6989
$$ y = [-1190874, -3206814, -4292079, -3766104, -1396623, 1630322, 3464536, 3688852, 3250460, 2385075, 503313, -1751246, -2521007, -1444289, -383572, -589638, -933546, -54716, 1317850, 1569908, 601462, -358635, -620314, -529507, -626715, -1324509, -2927932, -4945888, -5774588, -4196764, -1113773, 1219021, 1778713, 1723752, 2579029, 4354510, 5905288, 6418264, 5897773, 4715445, 3430196, 2666443, 2320000, 1203222, -1400046, -3906347, -3588551, -59005, 3731875, 4899908, 3935631, 3444503, 4496182, 5707961, 5471821, 3603046, 946679, -1318302, -2062877, -1175154, -151863, -559664, -1967831, -2636716, -2177714, -2083284, -3384231, -5108613, -5529809, -4027677, -1477152, 453327, 490316]
12127D90316j427513j024194K13291q1022j714251j763664O06315K316922J335077
12118a048723Q0351R49144J762523l17124l113067k512793O89223K179342J151965
12109a79159O16957J314550R08367o41225n36113J214404J097721j608271l187617
12100a000386j868705n02276o83412K36961L241760M288720R72984k450284j633668
12091F01694O84803j83425k306121n60437L669519L809145j135582m411307j752615
12082a584326K491791K510225n64411j452531J036648K845759Q70585l016144
12074C137596m645553k451422J132915K631090J251209p46689j248235o74661
12066a613750m25867k94564Q09404K341902K484860R07855q17271j673980k133655
$$ y = [490316, -937197, -1961391, -1748100, -1829122, -3543373, -5307037, -4700722, -2383800, -1048723, -968372, -19228, 1743295, 1426171, -1686896, -4199689, -3510466, -1331124, -179159, 437798, 1752348, 2660715, 2019490, 1483377, 2697781, 3795502, 2187231, -1000386, -2869091, -3371367, -4054779, -3817818, -576058, 3712662, 4685646, 2235362, 601694, 1286497, 1103072, -1203049, -1763486, 1906033, 5715178, 4579596, 168289, -1584326, 907465, 3417690, 2853279, 1400748, 2437396, 5283155, 6153740, 3137596, -1507957, -3959379, -2826464, -195374, 1055835, 309146, -939089, -1613750, -2039617, -2334181, -1524777, 817125, 3301985, 4209840, 3392569, 1718589, -415066]
12057d15066k360214j523143L95429J897304J948551J132854N6495j645909l558678
12048d072377l544754m90733L119101L603503P97542j668754j107781J048992
12040b315261J744655N25873l49946M79230J611442J211035j96514o35311K35243
12031B310446O51560m05771j521335r77455O17750J240813L42997o89669p63286
12022H06050k57163J92283O59428J131530R36295k08185j387277j559426q56134
12013e42599r0992M52360Q91648Q71311j18826j610575k299214j558671j48890
12004d154448Q50692J255665J563192J905437J690076L45842j691802k934026
11996a169372k183296r0674J215185O09470n29533k65258J020719J268204J22341
$$ y = [-415066, -2775280, -4298423, -3902994, -2005690, -57139, 1075715, 1132210, -513699, -4072377, -7617131, -8107864, -4988763, -1385260, -587718, -2256472, -3364253, -2315261, -570606, -44733, -394679, 84551, 1695993, 2907028, 2710514, 2075203, 2310446, 2962006, 2556235, 1034900, 57445, 675195, 1916008, 2259005, 1569336, 806050, 548887, 741170, 1400598, 2532128, 3468423, 3260238, 1872961, 313535, -542599, -633591, -181231, 710417, 1581728, 1462902, -147673, -2446887, -4005558, -4154448, -3303756, -2048091, -484899, 1420538, 3110614, 3456456, 1764654, -1169372, -3352668, -3443342, -2228157, -1618687, -2148220, -2413478, -1392759, -124555, -2214]
11987b214l94969P28010J612386N49094r70203o09804Q09694O42254q76072p15796
11977G72380J666594K646618k15848l981959m119004o95298K092379J736525j06361
11968b03974r99519r37608j127025j388099m86681J473134K543546J401070m97963
11959b23119m15293J954562L647185K209034r61476k655529k173010j318503p72454
11950g08603N23191K231940K184867P2446j555046j410506j450987k830756l135056
11941f078510m13316K870694L239234J318308J31046K08052k22m87336k45255
11932E42695j08519j251372k099583o82814J196315M80669j606751j431961M73132
11923d488189K54671j956485j678260J949700L949917J504759j427523o44763
$$ y = [-2214, -397183, 330827, 1943213, 2492307, 1522104, 912300, 1721994, 2364248, 1488176, 772380, 2438974, 5085592, 4869744, 887785, -3231219, -3926517, -1834138, -97613, -203974, -1203493, -2141101, -3268126, -4656225, -5142906, -3669772, -1126226, 274844, -223119, -638412, 1316150, 4963335, 7172369, 6210893, 3555364, 1382354, 63851, -708603, -185412, 2046528, 4231395, 4303841, 2748795, 1338289, -112698, -2943454, -6078510, -6491826, -3621132, -381898, 936410, 1067456, 1275508, 1275286, 787950, 542695, 434176, -817196, -2916779, -3599593, -2403278, -1922609, -3529360, -4961321, -4488189, -4233518, -6190003, -7868263, -5918563, -1968646, -463887, -1891410, -2536173]
11915b536173J930485K137774Q0187j099995k74322J160022J829949J071367r08015
11906C391279k046987l30168K243897J384614k447213l552108J79511L406274
11898B229099J822252j070550n14907J427524M62815j748738j079135Q60528k53441
11889B135447k677200j190045K759972K278939l232955o161524k382048K961663
11881e507751M233068K729561J704860M51486k082936l146511p24684J875512
11873d67395R16735j636389j697522Q4006R4014j655391j827280L12581J965349
11864c911292J687467J199563J831361K353196J205265j230308l198897l160433
11856c224078r37447J687560K251297N66375p96734k04622O16749l49398j904444
$$ y = [-2536173, -605688, 1532086, 1612273, 512278, 237956, 1397978, 3227927, 4299294, 3391279, 1344292, 1014124, 3258021, 4642635, 2195422, -1356686, -1177175, 2229099, 4051351, 2980801, 2465894, 3893418, 4356233, 2607495, 1528360, 2388888, 2135447, -541753, -1731798, 1028174, 3307113, 74158, -6087366, -8469414, -5507751, -1274683, 1454878, 3159738, 3611224, 1528288, -1618223, -2342907, -467395, 449340, -1187049, -2884571, -2800565, -2706551, -4361942, -6189222, -5876641, -3911292, -2223825, -1024262, 807099, 3160295, 4365560, 3135252, -63645, -3224078, -4161525, -2473965, -222668, 343707, -453027, -657649, -40900, -390298, -2294742]
11847b294742j770980n07561j34130j46826J429246L618607L113936k85721k580842
11838D40987j147605J667926K181948J92071j673154j720655n41492M15804L30354
11829A46184l70152l66717Q52503J802393R09961o77881l97158J506708J837524
11820E243365n72946k687526j822143L10481N91060o64148q52616M29014J278568
11811A253109J050887Q53089Q21325l972j084176p59526M50900J09003j812080
11802H78559k154321M13691K777903J962619m13113j027921L3361L53504k11553
11793B612729K58762J567215J257751r75602k239278q97319R44007R68742L5544
11784C532551P930L88973l62727j653440j658784o45943n78972j488631j063789
$$ y = [-2294742, -4065722, -4573283, -4707413, -4854239, -3424993, 193614, 3307550, 3021829, 440987, -706618, 961308, 3143256, 3335327, 1662173, -58482, -599974, -184170, 146184, -223968, -590685, 261818, 2064211, 2974172, 2296291, 1899133, 3405841, 5243365, 4670419, 1982893, 160750, 471231, 1062291, 398143, -454473, -25459, 1253109, 2303996, 3157085, 3978410, 3974438, 2890262, 2130736, 2581636, 2690639, 878559, -1275762, -862071, 1915832, 3878451, 3465338, 2437417, 2470778, 2824282, 2612729, 2871491, 4438706, 5696457, 4720855, 2481577, 1584258, 2528265, 3497007, 3532551, 3540481, 3929454, 3566727, 1913287, 254503, -391440, -970412, -2459043, -3522832]
11775c522832J371375L031178J480259j518792k143584L44048K814044K575987
11767D431683M08815j318588j760590j601290j212547m13987M81785Q64981Q58440
11758G38702Q88960N28404p40949j810879r32303J274840J907306j64937k300572
11749f11428j685248O80137J564768L7893j716514j686180j80033J329480J938572
11740c28553J631741R28374L87067n0236q41075j589747j081815O61821J783881
11731A501458J243860M43622N62535J65007k090989m098210k893021M93301K299769
11722b372668J554282O68970Q00969N79878k75545j54421Q18702L52709j627231
11713C45645k141824k44398J063673j2538j004830J78496J424917L87312j170889
$$ y = [-3522832, -2151457, 879721, 2359980, 841188, -1302396, -958348, 1855696, 4431683, 4840498, 3521910, 1761320, 160030, -1052517, -1466504, -984719, -119738, 738702, 1627662, 2156066, 1415117, -395762, -1328065, -53225, 1854081, 1689144, -611428, -2296676, -1616539, -51771, -13878, -1730392, -3416572, -3596605, -2267125, -328553, 1303188, 2231562, 2618629, 2568393, 1727318, 137571, -944244, -282423, 1501458, 2745318, 3188940, 3751475, 3916482, 1825493, -2272717, -5165738, -4672437, -2372668, -818386, -149416, 651553, 1231431, 955886, 801465, 1620167, 1972876, 345645, -1796179, -2040577, -976904, -989442, -1994272, -1815776, -390859, -3547, -1174436]
11704a174436n85365J071256J290632N37806N60142N88574p84659j948667o82079
11695a126796J427583J249355n50749q31434M07196L53791j180670j348008N55575
11686a044157J859629J062188l03259j005694j643848k101728j028198J207970
11678b997097K269685J455303N92508O99382P72142M01132M13560M55894o79943
11669C382566j924932r22915J323996J133046j552702k361129K19951J852674
11661A150555m41682k989789j494927J770032J825020r09298j817767K29343J769307
11652i09206R02925k80427N0603Q09868O30391Q6775J43934O34006J126134J522669
11642D717672J311192r0563j907253k493357j498081j63220N48632P21342N19531
$$ y = [-1174436, -1759801, -688545, 602087, 1139893, 1700035, 2288609, 1503950, -444717, -1126796, 300787, 1550142, 999393, 167959, 575155, 928946, -251724, -1599732, -1044157, 815472, 1877660, 1574401, 568707, -1075141, -3176869, -4205067, -2997097, -727412, 727891, 1320399, 2019781, 2791923, 3193055, 3606615, 4062509, 3382566, 1457634, 534719, 1858715, 2991761, 1439059, -922070, -702119, 1150555, 708873, -2280916, -3775843, -2005811, -180791, -1090089, -2907856, -2678513, -909206, -6281, -286708, -236105, 573763, 1204154, 1290929, 1434863, 2068869, 3195003, 4717672, 6028864, 5938301, 4031048, 1537691, 39610, -123610, 425022, 1146364, 1665895]
11633A665895l5309m30430k47318j43193p58955j099015J40713J947380J858300
11624B898068m57017k584015k642369j177893N72406K148072K948322K052563
11616C758137P1461p27351N61875J998355J636303J48491r55648j948725l487660
11607A055238m025177j598187K219529L314391O77635j750783m66271K591090
11599B017465K808844n26326l285767k294953N06905J139361p89936j741636N50234
11590a615809L549890K971796j392152m765498l102449J578829L450102L47850
11582A022559l292249k324779K143431M318437J610018k232873k723666m20269
11574a899391J047079O20840M23170J469994J985568O34451j093558j144813R6673
$$ y = [1665895, 1630586, 1200156, 952838, 809645, 50690, -1048325, -907612, 1039768, 2898068, 2441051, -142964, -2785333, -3963226, -3390820, -1242748, 1705574, 3758137, 3829598, 3102247, 3664122, 5662477, 7298780, 7447271, 6491623, 4542898, 1055238, -2969939, -4568126, -2348597, 965794, 1643429, -107354, -573625, 2017465, 4826309, 4299983, 1014216, -1280737, -773832, 365529, -424407, -2166043, -1615809, 1934081, 4905877, 3513725, -1251773, -4354222, -2775393, 674709, 1022559, -2269690, -4594469, -2451038, 1867399, 3477417, 1244544, -1479122, -1899391, -852312, -231472, 191698, 1661692, 3647260, 4281711, 3188153, 2043340, 2140013]
11565B140013P24342K76319j0789L01626m9825j659436k586922o33797K822999
11556A324530L511659p1604l608886k061593L090804N057005P35094m898111n378218
11547b299320r51984K803266K754408J024810N40946J232821J407082M15735j129219
11538E798545k283566k200920p55889R33245J544893J042048K04219p43035j745535
11529A794005j971310r60248M5999j33148m18561O32361J765938R30026n72837
11520A112225L14236K782814K591805r94771l354415j623762P71988j18835k314275
11511h32990j453936J823130K887407L86169k130608j974249o61904m32413o86274
11502c075668K28908J772878J932183M08746p87547k08227Q64615K48767j587695
$$ y = [2140013, 2864355, 3140674, 3129885, 3431511, 3381686, 1722250, -864672, -1498469, 1324530, 4836189, 4764585, 1155699, -905894, 2184910, 7241915, 7977009, 3078898, -2299320, -3251304, -448038, 2306370, 3331180, 3872126, 5104947, 6512029, 6927764, 5798545, 3514979, 1314059, 558170, 1491415, 3036308, 4078356, 4282575, 3539540, 1794005, -177305, -1137553, -1091554, -1224702, -1643263, -1010902, 755036, 1685062, 1112225, 1426461, 4209275, 6801080, 5806309, 2451894, 828132, 1600120, 1481285, -832990, -2286926, -463796, 2423611, 2809780, 679172, -1295077, -1956981, -2389394, -3075668, -2846760, -1073882, 858301, 1267047, 479500, 271273, 1135888, 1384655, -203040]
11493b03040j622071J239583L678096K169187j620318k837855m89172J310176
11485A624586q6947j981976j109367J144600J352368n32459j660546p47769R06445
11476a091065J892060J682544R3849j992684k408171m06013J557449J019401p95598
11467d48228r81227O41258J930480K100771J911317J106719r64521k728070j923470
11458F45029L54590P51386r49205j274381J168190L080639J479592j740894k692503
11449H22443q48834J033640J160418M60081L77634P78801N38383o65861j786368
11440A870337j674418n86222J67048O1419j50774r1682m48711j186247p82125
11431b821375J233776K611599J331914j104403j722287l48951P49481O71689N01797
$$ y = [-203040, -1825111, -585528, 3092568, 5261755, 3641437, 803582, 314410, 1624586, 1537639, -444337, -1553704, -409104, 943264, 410805, -1249741, -1997510, -1091065, 800995, 2483539, 2577388, 584704, -1823467, -2229480, -672031, 347370, -448228, -1429455, -788197, 1142283, 3243054, 5154371, 6261090, 5296569, 2568499, 645029, 999619, 1751005, 801800, -472581, 695609, 3776248, 5255840, 3514946, 822443, -26391, 1007249, 2167667, 2627748, 3005382, 3784183, 4322566, 3656705, 1870337, 195919, -390303, -223255, -161836, -312610, -404292, -853003, -2039250, -2821375, -1587599, 1024000, 2355914, 1251511, -470776, -819727, -70246, 601443, 1103240]
11422A103240O22958K90408k87847j85207N8669p83692j848751j141233P64385
11413a407070J145369m99567j707157j120871m7160O65055J867399L255435K725123
11404D876556M0575j982195j548232k65886O2361J10232Q06531J277845Q25182
11395D202969L32852O7761j146665k944004k741703l5020J871711P78747r91367
11386f04719p61267K03029k38450q61333L09221J776075J032901q31779j054544
11377a030866M5073K86241J4017J025112K348424J426539j253960k774978k355678
11368b270076j424202k8306K555867M365070K598216j213501k525319m83858J226726
11359B800617O08751k92548n4824j82406j398123j949831j097830l20039J37420
$$ y = [1103240, 1726198, 2016606, 1728759, 1543552, 1602221, 818529, -1030222, -2171455, -1407070, -261701, -761268, -2468425, -3589296, -3636456, -2971401, -1104002, 2151433, 4876556, 4917131, 2934936, 1386704, 1120818, 1183179, 1293411, 2099942, 3377787, 4202969, 4535821, 4603582, 3456917, 512913, -2228790, -2263810, -392099, 386648, -604719, -1365986, -1162957, -1401407, -2262740, -1953519, -177444, 855457, 23678, -1030866, -985793, -699552, -685535, 339577, 2688001, 4114540, 2860580, 85602, -2270076, -3694278, -3722584, -1166717, 3198353, 5796569, 4583068, 2057749, 1573891, 2800617, 3409368, 3116820, 3061996, 2879590, 1481467, -468364, -1566194, -1886233, -1748813]
11350a748813J693802L360798K092430j310324k046706O97460J439678k532700
11342A645625n672327k634782K905725L940108O87690j140596J07601J106663
11334I45707O25400O67087J019631p76616l650650l405211K8835J618784p41786
11325c668819k766023q56119K336673K727793J067087O02268J520891J628866
11317B592617N98893n6024o2066l67840q34963n87584j32103p76333k169915k410948
11307d206266o39109J908459L401933K963422R98242j070566j706649p01444N56210
11298A504232P04874k14536j288318j761587j177514M25305J917504J815748K54203
11289B179911r02843n45264L13828L52870j96640l81639M132O66018J366716J510894
$$ y = [-1748813, -55011, 3305787, 5398217, 4087893, 2041187, 2738647, 4178325, 1645625, -4026702, -6661484, -3755759, 184349, 872039, -268557, -160956, 945707, 1571107, 2238194, 3257825, 2481209, -1169441, -4574652, -4545817, -2927033, -3668819, -6434842, -7290961, -4954288, -2226495, -1159408, -557140, 963751, 2592617, 3191510, 3135486, 3073420, 2705580, 1870617, 1283033, 1150930, 374597, -1795318, -4206266, -4845375, -2936916, 465017, 3428439, 4426681, 3356115, 1649466, 948022, 1504232, 2209106, 1994570, 706252, -1055335, -2232849, -1807544, 109960, 1925708, 2179911, 1277068, 731804, 1045632, 1398502, 1201862, 820223, 824355, 1490373, 2857089, 4367983]
11279D367983M86645r13692r97125J79570N59940o03993j468510r37412o62577
11270A0829j675951j750273Q44846L218778J411226l143935m874984j699581K403094
11261e255951L080627O39403j619569j461230R79579L824771M441932J646412
11253F275974k349519l875055k127774K35714J042420Q62123Q04669N70919j64148
11244A275323n93542l43022l54577r19752o41468J160672K656135J849955m69556
11235C620168j801374j131127L67478J189420Q42464j69958p80446k35119Q60419
11226B761925J016281j94387j545441j916272j544244j019135k47643Q68081J786205
11217c4630K033316J663333P17757o15897j240376k13224J218445P19622j502571
$$ y = [4367983, 4854628, 3940936, 2943811, 3123381, 3683321, 3079328, 1610818, 673406, 10829, -1665122, -3415395, -2570549, 648229, 2059455, -1084480, -5959464, -7659045, -5255951, -2175324, -1535921, -3155490, -4616720, -3637141, 187630, 4629562, 6275974, 3926455, 51400, -2076374, -1840660, -798240, 63883, 868552, 1439471, 1275323, 681781, 338759, -15818, -935570, -1577038, -416366, 2239769, 4089724, 3620168, 1818794, 687667, 1055145, 2244565, 3087029, 2917071, 2136625, 1901506, 2761925, 3778206, 3583819, 2038378, 122106, -1422138, -2441273, -2688916, -1820835, -34630, 1998686, 3662019, 4379776, 3763879, 2523503, 2310279, 3528724, 4248346, 2745775]
11208B745775k543608j122892N87603P81343P65232J793124J991457n03794l492179
11199A002061l349424m43159J631886J499659J126388J680550J818158O73707
11191E639826n36131q96613j210218j911645j835037l94020Q84443N10780o34789
11182c83404n96902Q70974K108940J776040L71448m65194J25400J070314N37869
11173E415485j440598k428493o90340K025741K467075K03893j941137j824315
11165A787311l87199L47910j06354r41225j472234j338328l46926R59138J385833
11156a12074N17058n86981p10153J17228R73043J109479K74575j226163k283367
11147a927355j616823O14973K413281J942291k95153j886922j084846J383096
$$ y = [2745775, 202167, -920725, -333122, 448221, 1213453, 3006577, 4998034, 4494240, 1002061, -2347363, -2790522, -1158636, 341023, 1467411, 3147961, 4966119, 5639826, 5103695, 4207082, 2996864, 1085219, -749818, -1143838, -259395, 251385, -383404, -980306, -109332, 1999608, 3775648, 4147096, 3681902, 3807302, 4877616, 5415485, 3974887, 1546394, 856054, 2881795, 5348870, 5552763, 3611626, 1787311, 1400112, 1748022, 1641668, 700443, -771791, -2110119, -2457045, -1497907, -112074, 404984, -181997, -892150, -774922, 198121, 1307600, 1582175, 356012, -1927355, -3544178, -2929205, -515924, 1426367, 1131214, -755708, -1840554, -457458]
11139d57458L068167K219067n51555k964901l298000j695310M85961J911740J818543
11130E36254L65519j072568r51892M37356J046130o7814j222998o77402O16154
11121i91261N99926n66159r50991j01640M36362j69929r13722q18113j25310P09099
11111b891738J590152K075056J605014O24293K2106m52363j514526k282387j085144
11102b309537J458565K471517N87353k284113l596718k737426n11396J924034
11094d997721L108796K316552R69337R14749J299401l882j911589j090918J813749
11085B418474J789449k482741n236726k136626K406684J790061k425207l254004
11077g130636N35495L118117J413555p71652p334J555175J092000J05573R06698
$$ y = [-457458, 2610709, 4829776, 4278221, 1313320, -1984680, -3679990, -3194029, -1282289, 536254, 901773, -170795, -1122687, -685331, 360799, 292985, -930013, -1607415, -991261, -391335, -957494, -1908485, -2010125, -1573763, -1743692, -2657414, -3475527, -3600837, -2891738, -1301586, 773470, 2378484, 3002777, 3024883, 2572520, 1057994, -1224393, -2309537, -850972, 1620545, 2207898, -76215, -3672933, -6410359, -6921755, -4997721, -1888925, 427627, 1396964, 2311713, 3611114, 3607232, 1695643, 604725, 2418474, 4207923, 1725182, -3511544, -5648170, -3241486, -1451425, -3876632, -7130636, -6595141, -3477024, -2063469, -2835121, -2842455, -1287280, -195280, -89707, 816991]
11068H16991K043981J160726m74339j95136J354350J486952P8190o02204J26626
11059E796137O89361J89781o73928j371410j879692j592182j29798J109930M71148
11050B609347j184689j503621k23557O22923J5114r59820j396818j491263r53092
11041d465476Q81116K870861K720544O05145n97027K37903P16063p98967k186379
11032a6217j264770K08382n56080k404199j833948J375257L714480K991682O61668
11023B876255j101489j749795j301452K90361J842331J456920n82714j538434
11015A91983J4524K049960K001768J68082j178073q05343O30889J771290J545703
11006F390783j30174j858895j860042j21690J568898K049729J822543J339038
$$ y = [816991, 2860972, 4021698, 3547359, 3352223, 4706573, 6193525, 6271715, 5669511, 5796137, 6485498, 6675279, 6001351, 4629941, 2750249, 1158067, 1028269, 2138199, 2609347, 1424658, -78963, -302520, 320403, 335517, -624303, -2021121, -3512384, -4465476, -3584360, -713499, 2007045, 2612190, 2015163, 2253066, 2969129, 2170162, -16217, -1280987, -1072605, -1628685, -4032884, -5866832, -4491575, -777095, 2214587, 2876255, 1774766, 24971, -1276481, -986120, 856211, 2313131, 1730417, 191983, 206507, 2256467, 4258235, 4426317, 3248244, 2442901, 3073790, 4845080, 6390783, 6260609, 4401714, 2541672, 2419982, 3988880, 6038609, 7861152, 9200190]
10998I200190J19872j652713k558654k004705j133064p26459j77983M50272k08221
10989A308535j886426j796853J082350L399816J987291j206942k096232n02983
10981B88556N78326L61479O51320J507509R14470j101887k116831j488837r97234
10972a403129q87773M61388K164135Q93638k995832m267133m29860L922777L883310
10963A341521J184623R7195J55360j539438l481659j683601K588594L579880J21843
10954B364318k245711r5778K611748J274804k033648k332500L68482J755911K49377
10945A917003j242928m14021J454135K212626J565392J86681j492859k646508
10937A539521k176017m95314M61571l4457l77398O86980J825379J096631r90974
$$ y = [9200190, 9320062, 7667349, 5108695, 3103990, 1970926, 1244467, 1066484, 1516756, 1308535, -577891, -2374744, -1292394, 2107422, 4094713, 2887771, 791539, 288556, 866882, 1228361, 1879681, 3387190, 4301660, 3199773, 1082942, -405895, -1403129, -2290902, -1829514, 334621, 1228259, -1767573, -6034706, -6464566, -2541789, 1341521, 2526144, 2623339, 2778699, 1239261, -2242398, -3925999, -1337405, 2242475, 2364318, 118607, 22829, 2634577, 3909381, 1875733, -456767, -88285, 1667626, 1917003, 674075, 260054, 1714189, 3926815, 5492207, 5678888, 4186029, 1539521, -636496, -1131810, -670239, -704696, -1082094, -395114, 1430265, 2526896, 1535922]
10928A535922k153020j473107k33520K16677k2657j76941K6478L02098K73353
10919a704717k02811p99470q87005k74649M87973Q76021R60907Q29666J95670
10910e18415p73687j113747m24708L34956M45651O98491J654428J885118L1154
10901B219241k349724k558494q45933J45476j20880N36041K525817K932426J62509
10892B646479k862538k572038L43557K352360J832575L4714j499399k169796j727476
10883c621562m27506P16029J202194J743643K545605K272017K55653j764175j972687
10874I49211j107162p32751m47938P33949J682974Q39447m22797N06223K797482
10865D798638K721588p08288l851008l294143l8286K496583K654949J316663r5952
$$ y = [1535922, -617098, -2090205, -2323725, -2107048, -2129705, -2306646, -2280168, -1978070, -1704717, -1907528, -2706998, -3594003, -3868652, -3380679, -2504658, -1543751, -714085, -518415, -1292102, -2405849, -2830557, -2495601, -2049950, -1351459, 302969, 2188087, 2219241, -130483, -2688977, -3534910, -3389434, -3510314, -2974273, -448456, 2483970, 2646479, -216059, -2788097, -2444540, -92180, 1740395, 1775109, 275710, -1894086, -3621562, -4049068, -3333039, -2130845, -387202, 2158403, 4430420, 4686073, 2921898, 949211, -157951, -890702, -1338640, -604691, 1078283, 1917730, 1494933, 2001156, 4798638, 7520226, 6811938, 2960930, -333213, -371499, 2125084, 4780033, 6096696, 6000744]
10856F000744r25504j156461r08367j43962R58698J316382k86793l018626m026928
10847b190817k014031O91286J415873Q45215J030281J390495Q5409j716950r71522
10838a434761J962080L222385J279847r58357j025270k27079m36532r12012m78310
10829I91991m3028n64802q90743j7607O43039j92891q39056P38954K947730K473665
10819E247252n28574k407837j293027N71413N86624o63326j161909q38247j027289
10810a514920j469092l55952K296830L659585J947511m73150k10577J891132J738623
10801G509990j638848m210533k855449J59327J099727L27177N55599J625661J063012
10792C635663j092399k029729p08677Q31048J001513M54006J4125l25330n0340
$$ y = [6000744, 5075240, 3918779, 3010412, 2866450, 3825148, 5141530, 4854737, 1836111, -2190817, -4204848, -3513562, -2097689, -1252474, -222193, 1168302, 1253711, -463239, -1434761, 527319, 3749704, 5029551, 4071194, 3045924, 2818845, 2382313, 1470301, 991991, 948963, 384161, -506582, -524189, 118850, -74041, -913097, -174143, 2773587, 5247252, 4718678, 2310841, 1017814, 1589227, 2175851, 1512525, 350616, -487631, -1514920, -2984012, -3339964, -1043134, 2616451, 4563962, 4090812, 3880235, 5771367, 7509990, 5871142, 1660609, -1194840, -1035513, 64214, 391391, 946990, 2572651, 3635663, 2543264, 513535, -195142, 635906, 1637419, 2091425, 2105550, 1780220, 1729880]
10783A729880J492402L089907K679763M96196j408140k514731l657821l933549
10775b026093j675545J392615J329592j838775l438890j053025K173723L003310
10767b133088K581430K841214K466480q1010k634034k216538K02180J296461K61432
10758B584527r08125q81167r6249P65616J312381J195737Q12189J177269J999021
10749G961199J509282n81443j936040q98291J009700J502743N45982n94551j343921
10740G174660j362876k27560R56074K1918k562576l208698m17909K398464J817439
10731D588936o59460j504203m30073N52510J106990J953018K007567r3683k738252
10722D783350l088334j272119K90006Q09847J228185J318933P9003j553849j665756
$$ y = [1729880, 3222282, 6312189, 8991952, 9488148, 8080008, 5565277, 1907456, -2026093, -3701638, -2309023, -979431, -2818206, -6257096, -7310121, -5136398, -2133088, 448342, 3289556, 5756036, 5675026, 3040992, 824454, 1026634, 2323095, 2584527, 1676402, 795235, 698986, 1464602, 2776983, 3972720, 4784909, 5962178, 7961199, 9470481, 8889038, 6952998, 6054707, 7064407, 8567150, 9113132, 8518581, 7174660, 5811784, 5584224, 6540298, 6562216, 3999640, 790942, 373033, 2771497, 4588936, 3929476, 2425273, 1995200, 2547710, 3654700, 5607718, 7615285, 7521602, 4783350, 1695016, 422897, 712903, 1522750, 2750935, 4069868, 4148871, 2595022, 929266]
10713I29266o91049o03677j150220k98465J588477J660322o65262k269585r70807
10704b471000J317298J808847Q60754O14794J256988J091782k23376q57967K45858
10695C643978J330964J33669k505394l200749o08029K329971K131520n44134k024418
10686F87378p27811J244545J543244K10483j481915k600375k349260l92880J846847
10677b019744K089291J94451j367700o80782J470148K957198K372935j74184k706184
10668B135429k393422R77190L483821J804712j637644j963767O74905J631620
10660D712844m01085j553146K20249J776295N21469j373600j121968M62339J434384
10651D677781J655805J072047j089536l342136k315528J655086L602000R96597
$$ y = [929266, 238217, -365460, -1515680, -1814145, -225668, 1434654, 769392, -1500193, -2471000, -1153702, 655145, 1515899, 2130693, 3387681, 4479463, 4256087, 3398120, 3643978, 4974942, 5108611, 2603217, -597532, -1205561, 1124410, 3255930, 2711796, 687378, -40433, 1204112, 2747356, 2957839, 1475924, -1124451, -3473711, -3866591, -2019744, 69547, 263998, -1103702, -1784484, -314336, 2642862, 5015797, 4841613, 2135429, -257993, 719197, 4203018, 6007730, 4370086, 2406319, 3081224, 4712844, 4311759, 2758613, 2978862, 4755157, 5276626, 3903026, 2781058, 3243397, 4677781, 6333586, 7405633, 6316097, 2973961, 658433, 2313519, 5915519, 6912116]
10643F912116k603149l436369k432466j494016J73717K668372L082712L28705
10635C199622k057539j474560j95058l09397L34037L143305M719356K319927j188577
10626H491116k298893k138594k390850j136588K234889L328978l32727l860860
10618A896471k568699K00351m90106k139734K9651L490414K572231j266451k066630
10609c42502K72291Q58297q13387p67605J316079J877580O92510Q27376J933653
10600E854292P92920j802289j693652J146056K265181O8727k320743k620586j655187
10591C4719l79621P53012L90840j498917j825308R63598L177380J535746r88563
10582B162886l89689J294906M06244r80344O99455K821269J004926k267490j679700
$$ y = [6912116, 4308967, 872598, -1559868, -3053884, -2880167, -211795, 2870917, 3199622, 1142083, -332477, -527535, -836932, -502895, 2640410, 7359766, 9679693, 8491116, 6192223, 4053629, 1662779, 526191, 2761080, 6090058, 5757331, 1896471, -672228, -471877, -961983, -3101717, -3072066, 418348, 2990579, 1724128, -342502, -70211, 788086, -25301, -792906, 523173, 2400753, 3093263, 3920639, 5854292, 6647212, 4844923, 3151271, 4297327, 6562508, 6631235, 4310492, 1689906, 34719, -344902, 408110, 798950, -699967, -2525275, -1561677, 1615703, 3151449, 2162886, 1773197, 3068103, 3474347, 2494003, 3193458, 6014727, 7019653, 4752163, 3072463]
10573C072463J383903J659802n33769r96389N5038l11677q17666R03708J823984
10564F239397j150485l567610o17309K837124J73529l974682j049236N411802
10556D302530N038378j137333k637489J807516K969386j393288l064071Q70794
10548F756423L225873M62127j958782r68575n12826k051209j779479N52974Q74638
10539D601164j57156J660668L986497R96519m185023l262915J866975J821471
10531G328200k914721k802151K745898M465931Q12722l16308J907452L73507l611246
10522G989284j417661M554974L072387m177756l803200M499108O510342m21366
10514A6806112l168942J647834K350851l039446k323779N173527N196128l066955
$$ y = [3072463, 4456366, 6116168, 5582399, 4586010, 4641048, 4329371, 3511705, 4415413, 6239397, 5088912, 1521302, 903993, 3741117, 3914646, -60036, -1109272, 4302530, 9340908, 8203575, 5566086, 7373602, 10342988, 8949700, 5885629, 6756423, 9982296, 10444423, 8485641, 7517066, 7004240, 4953031, 3173552, 3726526, 4601164, 4444008, 6104676, 10091173, 11087692, 6902669, 3639754, 5506729, 7328200, 4413479, 1611328, 4357226, 8823157, 9635879, 9319571, 11227023, 11600530, 7989284, 6571623, 11126597, 14198984, 10021228, 6218028, 10717136, 17227478, 16806112, 13637170, 15285004, 17635855, 14596409, 12272630, 17446157, 22642285, 19575330]
10506A9575330l529993N243661N665784m195162n057377N534787O506683m636358
10498B5107355m129914J0206586J0073900o809104n000112J9432618K0623262
10491F9504591r136185n257436N4845922P6139585k2770025j55909506j63013054
10484a55596108l5400120P1562602N8914003j892889j0142014J9988255K1809958
10477c0756313k786998o823071R742944J0343555n366517o879318O494759Q271483
10469a7759476l007008m482744N429759O575411k569128l802526M382062N176266
10461a0057384l150558m827212K683954N129774p47482k771826K156722L580181
10453h003831j003300k316876J541122K239805j427281j808826J552311J465519
$$ y = [19575330, 16045337, 21288998, 26954782, 22759620, 17702243, 23237030, 29743713, 25107355, 20977441, 31184027, 41257927, 34448823, 29448711, 48881329, 69504591, 60368406, 55110970, 109956892, 186096477, 163326452, 7416946, -155596108, -190996228, -119433626, -60519623, -62412512, -72554526, -52566271, -30756313, -33543311, -40366382, -30623438, -20279883, -25646400, -32525718, -26030959, -17759476, -20766484, -25249228, -19819469, -13244058, -15813186, -19615712, -15233650, -10057384, -13207942, -18035154, -15351200, -10221426, -10968908, -13740734, -11584012, -8003831, -9007131, -11324007, -9782885, -7543080, -8970361, -10779187, -9226876, -7761357]
10445g761357j566468k39791M060302L024613k231100k651508J833513K627473
10437b904323j146608k053669N93832K65727k771351j829598K244249K024343
10429e577398j953621j933988K071252K327134j590890k029014J969092L018059
10421c699374m79804j912265N65556J407775o16112l91567K487486K485977p55963
10412i08291j530955O90299M85091k245689j779318J743007J827007j969678k824326
10403f512853O33801J994629o76962j717055P58303J550247r63881j705878P88603
10394e851046J444742j045237j274681K355555M107705J291979j247707m17838
10386f36528L41456j201334k188950j520209k112018l691925j947185K629927
$$ y = [-7761357, -9327825, -9567616, -5507314, -2482701, -4713801, -7365309, -5531796, -2904323, -4050931, -6104600, -5510768, -5245041, -8016392, -9845990, -7601741, -5577398, -7531019, -9465007, -7393755, -5066621, -6657511, -8686525, -6717433, -3699374, -4179178, -6091443, -5525887, -4118112, -4734224, -5125791, -2638305, -152328, -908291, -2439246, -1748947, -1263856, -3509545, -5288863, -3545856, -1718849, -3688527, -6512853, -5879052, -3884423, -4561385, -6278440, -5520137, -3969890, -4933771, -6639649, -5851046, -4406304, -5451541, -6726222, -4370667, -262962, 1029017, -218690, -636528, -295072, -1496406, -3685356, -5205565, -7317583, -11009508, -12956693, -10326766]
10378a0326766L932933Q72058k98786K852334M708998J858766j548620k267899
10370b16982k786751l972862k023529L017297M679522O93361k446522m09360K098851
10361a366975P13358r24321R31350K569830R1809k787406j438847J195766J06814
10352i08622k834779k569912N31493K366917K160017J914770J643585M04060m52564
10343B254965L17458P20978j078496k849329j720099R17304J641417N6733j561175
10334a300244j822091r39644L03870O58645m99681j447527k19948J515346N69753
10325c181521j823637j242847K233388L413335M71658k012259p07531J625061
10317a224353J680703N38684R1466l95518j295776j000874J97154m65122k686852
$$ y = [-10326766, -6393833, -5521775, -5820561, -2968227, 1740771, 3599537, 2050917, -216982, -3003733, -6976595, -9000124, -5982827, -1303305, -609944, -3056466, -3465826, -1366975, -653617, -1577938, -646588, 1923242, 2015051, -772355, -2211202, -1015436, -908622, -3743401, -6313313, -5781820, -3414903, -1254886, 659884, 2303469, 2707529, 2254965, 2572423, 3293401, 2214905, -634424, -2354523, -1437219, 204198, 260931, -1300244, -3122335, -4061979, -3758109, -3099464, -3599145, -5046672, -5266620, -3751274, -3181521, -5005158, -6248005, -4014617, -601282, -129624, -2141883, -2849414, -1224353, 456350, 995034, 1086500, 690982, -604794, -1605668, -1408514, -1873636, -4560488]
10308d560488k402792J085164L133156J486182k32703L12955J58618k229118l032969
10299f281995k79587J707302K9828j125619J794744M618211K563593j169638j030974
10290H25865J439855J235700r67640r21459Q38924K92150k251917k645044k11916
10281b365482J568413J073083N294m86648o85590k61142P54859M97070j559371
10272a459514k262383L62493K740034R94721k246048j873112J192136J687045
10264h64628j168721k828720j074757J277991J730409J148611P68414L34541j39303
10255h16163j90882o23828k263528l415946j870264J155468K498984J804411J239724
10246b482024J237951M12925p86266m26833R63061P73129j090450j767069j65417
$$ y = [-4560488, -6963280, -5878116, -2744960, -1258778, -1491481, -1178526, -1019908, -3249026, -6281995, -6561582, -4854280, -4824452, -5950071, -4155327, 462884, 3026477, 1856839, 825865, 2265720, 3501420, 2533780, 1612321, 2451245, 2743395, 491478, -2153566, -2365482, -797069, 276014, 281308, -205340, -890930, -1152072, -397213, 99857, -1459514, -3721897, -3359404, -619370, 375351, -1870697, -3743809, -2551673, -864628, -2033349, -4862069, -5936826, -4658835, -2928426, -1779815, -1011401, -676860, -816163, -1007045, -1630873, -3894401, -7310347, -9180611, -8025143, -5526159, -3721748, -2482024, -1244073, -831148, -1617414, -2044247, -1081186, -308057, -1398507, -3165576, -3330993]
10237c330993J423089J287605O42932Q60687J117083K23168j180296j551099l92113
10228h99937J388526K240329J139717j096906k140252q65912R61690R71824o64285
10219A034794j799955j311545q7862M77774j51793j362856j822664q68548M37568
10210e455087Q09010Q93499J903535K696190J367128n93348L5629K149855J190250
10201D996661k684772l421925J138546M667411K010835k534909k565664M3295
10193A649478n78642l573824l256973M15132J786061n65427j875173R7328J819079
10184d082961J055900M35329J567252J637860j046949l173089j577314J589686
10176c594286K298762L77381j232846q56011P22832J839354J090226j482424l364776
$$ y = [-3330993, -1907904, -620299, 22633, 883320, 2000403, 2223571, 1043275, -507824, -899937, 488589, 2728918, 3868635, 2771729, 631477, -234435, 727255, 1699079, 1034794, -765161, -2076706, -2164568, -1686794, -1838587, -3201443, -5024107, -5892655, -5455087, -4646077, -3752578, -1849043, 847147, 2214275, 1620927, 1656556, 3806411, 4996661, 2311889, -1110036, 28510, 4695921, 6706756, 4171847, 1606183, 1649478, 1070836, -2502988, -5759961, -5344829, -3558768, -4124195, -5999368, -5902040, -4082961, -3027061, -2591732, -1024480, 613380, -433569, -3606658, -5183972, -3594286, -1295524, -918143, -2150989, -3007000, -2284168, -444814, 645412, -837012, -4201788]
10167d201788j846371J799693L013774Q1726l185949k734138K97128J803565N04128
10158d468232j214901j288779k29483N79338Q46417J007872J057376O22533j08922
10149c196781l28928K26366O33856j238j144516j661158j552024j363041m11149
10140h798613K083307M301385L366169Q0373j439318m8516N55798j621670k897418
10131d418503n6900L551240K908766p09972k118374m98780M35118o20888j303835
10122b832128r47967j477283k521316j138072K511315M310394K509089K01100
10114F15132k15857m45723j972052k721848r52668J169380J072737k5658L60684
10105c115873J583124J264153m37452j110262O6864J343100J113784k10476j142231
$$ y = [-4201788, -6048159, -4248466, -1234692, -1152966, -4338915, -7073053, -6775925, -4972360, -4468232, -5683133, -6971912, -7201395, -6622057, -5775640, -4767768, -3710392, -3087859, -3196781, -3525709, -3299343, -2665487, -2666725, -3811241, -5472399, -7024423, -8387464, -8798613, -6715306, -2413921, 952248, 1032621, -406697, -455213, 100585, -1521085, -4418503, -4475403, -924163, 1984603, 1274631, -843743, -1342523, -907405, -1528293, -2832128, -3780095, -5257378, -7778694, -8916766, -6405451, -2095057, 414032, 615132, 399275, -46448, -2018500, -4740348, -5693016, -4523636, -3450899, -3476557, -3115873, -1532749, -268596, -706048, -1816310, -1749446, -406346, 707438, 496962, -645269]
10096f45269q27182K69259R44082N94087j88953p15274j138274j414090n16716
10087c638330J648918K843479J417768n27822l6748J572868M75306k952492l874472
10078c071525m91375K903955K531677M55018J98239Q19346n46037k917046k881043
10069b998791m42237J015419K88525k81401N12218O04640j261744k530300m01600
10060e495271L497347M776495J979908j811200l234728k390177j458823j308040
10052e444489j068898j93227Q35675J594236J959918J411542k21926j366484j55069
10043b648722K328541K596539m61214l645551l747189j547443L24792J285348
10035e514899K043528J930081J83505j293307N6419L005931L453579J82462l204096
$$ y = [-645269, -1472451, -1203192, -259110, 334977, 146024, -569250, -1707524, -3121614, -3638330, -1989412, 854067, 2271835, 1744013, 1707265, 3280133, 3755439, 802947, -3071525, -3562900, -658945, 1872732, 2327750, 2525989, 3345335, 2799298, -117748, -2998791, -3441028, -2425609, -2137084, -2418485, -1906267, -1301627, -2563371, -5093671, -5495271, -1997924, 2778571, 4758479, 2947279, -287449, -2677626, -4136449, -5444489, -6513387, -6706614, -5870939, -4276703, -2316785, -905243, -1127169, -2493653, -2648722, -320181, 2276358, 1815144, -1830407, -5577596, -7125039, -6800247, -5514899, -3471371, -1541290, -1357785, -2651092, -2594673, 411258, 3864837, 4047299, 843203]
10026H43203l084905k69802J672876J012133o74281j076582n3871N26298l32630
10017a437561j093026m8282J559189J117801r13975j280392P72880K062427Q03743
10008A542804m01759P02710J980494P30141j707962k659530k393688k087328p31541
9999e025659J905090K656691k150j844706O45952L301800N50514m456245m144285
9990f412998R89875L207994L82506j406705P78499K199431k0601j615955N09236
9981a388718K439657N66669j912229j037780J056206O90829q00893l93437Q52228
9972G2532M44513o02888k09605N92080K09933j7482J020725J027047j466494l254360
9962b183999j465918J078508N45746j192463j35374K331431J673378j765692l147411
$$ y = [843203, -2241702, -2511504, -838628, 173505, -500776, -1577358, -1631229, -1104931, -1437561, -2530587, -2578869, -1019680, 98121, -815854, -2096246, -1323366, 739061, 1542804, 1141045, 1843755, 3824249, 4554390, 2846428, 186898, -2206790, -4294118, -5025659, -3120569, -463878, -466028, -2310734, -1664782, 1637018, 2187532, -2268713, -6412998, -5423123, -2215129, -1832623, -3239328, -2460829, -261398, -281999, -1897954, -1388718, 1050939, 1617608, -294621, -1332401, -276195, 414634, -386259, -779696, 72532, 517045, -85843, -295448, 296632, 506565, 489083, 1509808, 2536855, 1070361, -2183999, -3649917, -2571409, -2025663, -3218126, -3353500, -1022069, 651309, -1114383, -4261794]
9953d261794q98919J541006J756953J132623J101816R42629J53933l77203l26834
9944G64210m19740o63030l46709K58409K22095l71135q07988j046829j035680
9935c446397N952J870241K479501P02711j515252j792170l99067J092333K201379
9926A199231K671079J563436o46259j505916k26720Q15795K54052M6041J213899
9917E384638J221821j172424k551295l31348K301904J528328p37822o70202P10189
9908E683789J21772j595061j405345R8062L53470q5034N04176O79442j032426
9899C322845j801072O93607K569481l15758m218462k974460J648955L385052K102954
9890D413142J984368K248796k53571k312922N21878L377162k07275l444540L802703
$$ y = [-4261794, -5160713, -3619707, -1862754, -730131, 371685, 1314314, 1468247, 1091044, 764210, 344470, -318560, -665269, -406860, -184765, -555900, -1363888, -2410717, -3446397, -3440445, -1570204, 909297, 1612008, 96756, -1695414, -2094481, -1002148, 1199231, 3870310, 5433746, 4787487, 3281571, 3054851, 3870646, 4124698, 4170739, 5384638, 6606459, 5434035, 2882740, 2551392, 4853296, 6381624, 5643802, 4973600, 5683789, 5805561, 4210500, 2805155, 2903217, 3256687, 3171653, 3675829, 4355271, 3322845, 1521773, 2215380, 4784861, 4469103, 250641, -2723819, -1074864, 2310188, 4413142, 6397510, 8646306, 8392735, 6079813, 6601691, 9978853, 9771578, 6327038, 10129741]
9881A0129741J1946074L30596k6731491l6418590j2172500J9116405K2878936
9874a0920829L212666q752976j461434P543707M814117j557253j440406J344508
9866g217900N58825o30259J610669L003119j29891k680512L47558M380857K935494
9857B177960j451994k210823P3562j50632k940795k813222J580422M847501K963693
9848B075672j319045l050961j487330K89214J55168q61604q43541J61060N45150
9839d336217q0849k16559P62444J085060m82567k000294j171905P11852P95231
9830d933804n22314m52325J179935J836534R83569O36974R63268r5262k029608
9821b433033j453517J879743L612639J594769o03740N0671R79640q61438k990372
$$ y = [10129741, 22075815, 22406411, -4325080, -40743670, -52916170, -33799765, -10920829, -7708163, -16461139, -17922573, -10378866, -5564749, -7122002, -8562408, -7217900, -6659075, -7289334, -5678665, -2675546, -2805437, -5485949, -5138391, -757534, 2177960, 725966, -1484857, -1411295, -1561927, -4502722, -7315944, -5735522, -888021, 2075672, 756627, -2294334, -3781664, -3492450, -3337282, -4198886, -5042427, -4881367, -4336217, -4417066, -4633625, -3871181, -2786121, -3268688, -5268982, -6440887, -5729035, -4933804, -5456118, -5908443, -4728508, -2891974, -1908405, -1271431, -308163, -403425, -2433033, -3886550, -2006807, 1605832, 3200601, 2596861, 2647532, 3627172, 2765734, -224638]
9812b24638j567784J627014J985926k11104p02272J121911J490957n89598j367072
9803A563340Q12376K049556o65893l830694k401477K283000M193978J281516k046528
9794C239174j725146O52514J341138K22926j57493L09854q01769l313658l288874
9785c521334R72012N052208L855151j097178l735901j942108L23122k50797j790637
9776b135462j221023P91846J571035O95138k26410m58538l53468J29249R10679
9767b96954Q88948l98790j322281m38668R41313P47224m29797n52088J25836m01487
9757a136744j918616j814775O13608K665777K166093M06197l13661m4037k50504
9748C73338r26856p20066N55351J358332O62598m77299l58137R05193J348130
$$ y = [-224638, -1792422, -165408, 1820518, 1609414, 907142, 2029053, 3520010, 2930412, 1563340, 2375716, 4425272, 3759379, -71315, -2472792, -189792, 4004186, 5285702, 3239174, 1514028, 2166542, 3507680, 3730606, 3573113, 3882967, 3081198, -232460, -3521334, -2549322, 2502886, 6358037, 5260859, 1524958, -417150, -94028, -344825, -2135462, -3356485, -2564639, -993604, -298466, -524876, -983414, -1336882, -1207633, -296954, 591994, 193204, -1129077, -1567745, -626432, 120792, -309005, -861093, -735257, -1136744, -3055360, -4870135, -4256527, -1590750, 575343, 981540, 667879, 623842, 373338, -553518, -1273584, -718233, 640099, 1302697, 825398, 467261, 1372454, 2720584]
9739B720584j27040j942733j825315j6115J183958R84960R50576J619156J013262
9730D561293j635624l248211j010073K607708K606273j438039m722936l801680
9722f081289l59217K210460K738882J741219o7716j318803o15243J050907R83110
9713B82310r21801j474605N54730J765259n71850l464236k241351K173462M263054
9704C64972J705905j785541k015598N45482K458928J861917k42974j937269k276259
9695a320437j691215j205223j185307r81330n4746J089181J660250J588743J090904
9686a009180J35671p86875n33562Q12160J229297l53207j745166l86140K411413
9677b25589K926329L88734k117726k349938j463704j042284n51349O50942J313836
$$ y = [2720584, 2593544, 650811, -1174504, -1190619, -6661, 978299, 1928875, 3548031, 4561293, 2925669, -322542, -1332615, 1275093, 3881366, 2443327, -2279609, -6081289, -6440506, -4230046, -1491164, 250055, 182339, -1136464, -1751707, -700800, 282310, -639491, -2114096, -1559366, 205893, -365957, -3830193, -6071544, -3898082, 364972, 2070877, 285336, -1730262, -1184780, 1274148, 3136065, 2893091, 955822, -1320437, -3011652, -4216875, -5402182, -6383512, -6438258, -5349077, -3688827, -2100084, -1009180, -873509, -1660384, -2193946, -1381786, -152489, -505696, -2250862, -2637002, -225589, 2700740, 3089474, 971748, -1378190, -2841894, -3884178, -4435527, -3784585, -2470749]
9668b470749M67854k67586J041160L242916L417608J048419j412017k111951j799909
9659A155745j740915j545756l46511J039925Q32596r70619k117272j021847R82934
9650c731720J515123N33208J34047J078535J618975N24489q02871p15165j8163
9641A36458k52467p38189J40324J654564J556748j85745j290517q04188r2288
9632A24700K2975K58263N24201m13834k033992j825223P24648K782252K391023
9623B555013J178563R41679M93064j487413l132323k184441j41459q6016j669866
9614c533199j829983J48456J749938J382886L21919P1493L60488M10217K22647
9605f95138M3041p506L87427J159030J257924L5496j340030j427112p45108o76233
$$ y = [-2470749, -2002895, -2270481, -1229321, 2013595, 5431203, 6479622, 5067605, 2955654, 1155745, -585170, -2130926, -2477437, -1437512, -604916, -1575535, -3692807, -4714654, -3731720, -2216597, -1683389, -1549342, -470807, 1148168, 1672657, 869786, 154621, 136458, -116009, -854198, -713874, 940690, 2497438, 2311693, 1021176, 216988, 124700, 147675, 405938, 930139, 516305, -1517687, -3342910, -2618262, 163990, 2555013, 3733576, 4675255, 5168319, 3680906, 548583, -1635858, -1777317, -1863333, -3533199, -5363182, -5214726, -3464788, -2081902, -1759983, -1688490, -1328002, -917785, -695138, -652097, -659603, -272176, 886854, 2144778, 2180274, 840244, -586868, -1331976, -2008209]
9595b008209r86680n43874K95871L34538j53098j49749j10213q09727r70109Q09051
9585d292199K668420J776084o37802q21628J129554J325481r84486j866022L59633
9576a342965K021785N37071j191283l09143P94325p51700k424832m80635K992487
9567a54890K901952p06868k902332j501905O83369J144006N59896K3009n60076
9558e13839p50466K20478J180360K55097j524052j318795P11383J405822k33212
9549e67224j650133j176562j57100K38264P14536J380761J138253N05270J323272
9540A749337K651913J192163k714062m159205j135509J688062L4103l270360k884217
9531f847775R54560L543896K758930N57884j065547j571234m28128K087694L532314
$$ y = [-2008209, -2994889, -3538763, -3242892, -2908354, -3061452, -3211201, -3321414, -4131141, -5101250, -4292199, -1623779, 152305, -485497, -1307125, -177571, 1147910, 163424, -1702598, -1342965, 678820, 1215891, 24608, -284535, 509790, -241910, -2666742, -3147377, -154890, 2747062, 2040194, -862138, -2364043, -1680674, -536668, 23228, 46237, -513839, -1264305, -1043827, 136533, 391630, -1132422, -2451217, -1739834, -334012, -567224, -2217357, -3393919, -3551019, -3312755, -2598219, -1217458, -79205, 426065, 1749337, 4401250, 5593413, 2879351, -1279854, -2415363, -727301, -693198, -3963558, -6847775, -5893215, -2349319, 409611, 967495, -98052, -1669286, -2097414, -9720, 3522594]
9522C522594K029365o40926j685090j468801j719531j548513M94359K161024M23831
9513A568312k415239j296521K983947L866096r87217n656407m448318N68062L688946
9504b128339L131849R45531j313097l010723k822325k33869K693694L682536K985859
9495C931116J817112J11170j854118j975864N04955K350409L44036l420618m005094
9486b196896p33523J900047O50310k458348l451189j242686K022110L802517L262507
9477A554849J445575J3865m64814p46707j158847p31133R27171K166790J353364
9468D360113o15967j713629j830093k259616k768115j713668Q60343K643010K113774
9459i23848K44940j429570k591839l156065k238267M94190L394970M169386K482278
$$ y = [3522594, 5551959, 4911033, 3225943, 1757142, 37611, -1510902, -1016543, 1144481, 1568312, -846927, -2143448, 840499, 4706595, 3719378, -1937029, -6385347, -5817285, -2128339, 1003510, 1949041, 635944, -2374779, -5197104, -5430973, -2737279, 945257, 3931116, 5748228, 5859398, 4005280, 2029416, 2534371, 4884780, 5228816, 1808198, -2196896, -2930419, -1030372, -380062, -2838410, -6289599, -7532285, -5510175, -1707658, 1554849, 3000424, 3014289, 2549475, 1802768, 643921, -87212, 839959, 3006749, 4360113, 3744146, 2030517, 200424, -2059192, -4827307, -6540975, -5680632, -3037622, -923848, -678908, -2108478, -4700317, -7856382, -10094649, -9600459, -6205489, -2036103, 446175]
9450D46175L36131l04104L25131M82282n02149j398330j311540j348309k455678
9441e730391k860641m57074K846294K952957K25574j99724L345585N324816J259434
9432F706830m483347m540276O29233L936132K279290m79015j084975r89353j566554
9423D07965j152328P74645J437467m44744j960371r05533N94496L48849Q9473
9414h10081J661827K786098Q12573k092508k029366L49934J187331k51074j152044
9405D62690m89507l00206j330703j471677L87463K220441K011959N71321k30245
9396A831536j34691k4311j76744l08697m92218r41682j320777j026117o6256P23745
9386a936212N10853l95503n24753R63093K639937K169648m49797k448762j799104
$$ y = [446175, 782306, 478202, 803333, 1285615, 783466, -614864, -1926404, -3274713, -5730391, -8591032, -9048106, -6201812, -3248855, -3023281, -3223005, 122580, 5447396, 6706830, 2223483, -2316793, -1687560, 2248572, 4527862, 4048847, 2963872, 1974519, 407965, -744363, 30282, 1467749, 1023005, -937366, -1842899, -1248403, -899554, -810081, 851746, 3637844, 4450417, 2357909, 328543, 678477, 1865808, 1614734, 462690, -26817, -327023, -1657726, -3129403, -2741940, -521499, 1490460, 2061781, 1831536, 1696845, 1672534, 1495790, 1187093, 694875, -246807, -1567584, -2593701, -2659957, -1936212, -1425359, -1820862, -2345615, -1382522, 1257415, 3427063, 2977266, 528504, -1270600]
9377a270600K32900J071617J43517j002068r60911K15312J263604O63236j631038
9368a274431l128286j221483K813314M569522K311755o61546j131861m44552j209887
9359F22545k352144j234289J205562J729511K84517o8389J443726K110099N14791
9350D255929j236578j185573k49331M7087r0231o580J5394j11651K90737J092238
9340B821441J100707K41146l1653N74066K44099j884045l681848k728026K95388
9331c048725K460474K012366j70032j843628j453136L88492J268659j76116j963119
9322b524765j035002K159413L697618J525324j633552k124463n2930J737480J777669
9313C526792Q78213j48040j424446k743604l077997j807320L89331K097979K270993
$$ y = [-1270600, -1037700, 33917, 177434, -824634, -1785545, -1570233, -306629, 356607, -1274431, -4402717, -5624200, -2810886, 1758636, 4070391, 3408845, 2276984, 1832432, 622545, -1729599, -2963888, -1758326, -28815, 255702, 187313, 1631039, 3741138, 4255929, 3019351, 1833778, 1584447, 1631534, 1541303, 1534723, 1550117, 1438466, 1729203, 2821441, 3922148, 4163294, 4131641, 4705707, 4949806, 3065761, -616087, -3344113, -3048725, -588251, 1424115, 1254083, -589545, -2042681, -1654189, -385530, -561646, -2524765, -3559767, -1400354, 2297264, 3822588, 2189036, 64573, 11643, 1749123, 3526792, 4405005, 4256965, 2832519, 88915, -2989082, -4796402, -4407071, -2309092, -38099]
9304c8099R49871p07647j321364n53804O24634J041090N12569q0654J78859R88172
9294A593627P87603j195479k987702j682150K145427M057971J508893k194117
9286B034073k361651M15221J622547j60125j709412p26348J044922J272166K32709
9277A664102p34698j190279r25205J17080O08904o66522j818271M3080L269741
9268C67932K852037j553305l992464j222739J977777N84516k462050j395029K647493
9259b195832L577383K00780k464504j442506O09783R05022M74993R91344J667684
9250B324147J213403K2706r89129j504984j090378L75235J322760J14228j863578
9241g5590j651812N23354J237463p50668k525173j632788N11087J453317J149252
$$ y = [-38099, 911772, 204125, -1117239, -1671043, -1046409, -5319, 507250, 426596, 605455, 1593627, 2381230, 1185751, -1801951, -3484101, -1338674, 2719297, 4228190, 2034073, -327578, 87643, 1710190, 1550065, -159347, -885695, 159227, 1431393, 1664102, 929404, -260875, -1186080, -1069000, -460096, -1126618, -2944889, -2901809, 367932, 3219969, 1666664, -2325800, -3548539, -1570762, -986246, -3448296, -4843325, -2195832, 1381551, 1582331, -882173, -2324679, -1714896, -809874, -334881, 656463, 2324147, 3537550, 3560256, 2571127, 1066143, -24235, 351000, 1673760, 1787988, -75590, -1727402, -1204048, 33415, -717253, -3242426, -4875214, -4364127, -2910810, -1761558]
9232a761558P77945M91186J37868K11881N25945p2996j303647j041100J100111
9223i34365K217084K86820k323243k118354M33500J923945J079944m6162L34007
9214H53176J477473J760410Q15077n04999j307419j505282j784243k401480k076712
9205d673999N74604M095771M684178J038674l121695l482521o97641R94144j32470
9196g20955j489663n92769J442777J892637J10242k065287k666452j391761N11415
9187d969816J541913J221934K27448o44975j094011p80374O80502K433029K386858
9178A002508m8110k309025j690047P39275J546386l2707j159191O5890J832317
9169e2704J671737J4378j110681j251644j326205j291723j98583J730808K863922
$$ y = [-1761558, -983613, -492427, -354559, -142678, 383267, 310271, -993376, -2034476, -934365, 1282719, 1569539, -753704, -2872058, -2438558, -514613, 565331, 519169, 853176, 2330649, 4091059, 4906136, 4401137, 3093718, 1588436, -195807, -2597287, -4673999, -4099395, -3624, 4680554, 5719228, 2597533, -884988, -1582629, -588485, -720955, -2210618, -2803387, -1360610, 532027, 642269, -1423018, -4089470, -5481231, -4969816, -3427903, -2205969, -1978521, -2623496, -3717507, -4497881, -3817379, -1384350, 1002508, 954398, -1354627, -3044674, -2305399, -759013, -791720, -1950911, -1885021, -52704, 1619033, 1633411, 522730, -728914, -2055119, -3346842, -3545425, -1814617, 1049305]
9160A049305K125844P9486j859515k393909j003070J238340K022232L65633j648941
9151b4595j337188P04917J256116p94792k664867j647700J088870K293199R42983
9142a83057r73895j346122q8659J351957J555307L58321q71251p12903K19200
9133f91102r3254j714724j963246M48032K560608J170084j936389k374741k8500
9124d623232P93093j502080l032940o93817K891405L597414J804079O89513Q65004
9115G88439N21407n35684p73806j12923J78822K25652R53369J354094j57041k064985
9105C77344j344428J233045J652184p80977j978634J78914K192022Q28956j426716
9096I31710o87413J704312J461426j518458l030910j087043J668797K429126J544377
$$ y = [1049305, 3175149, 3254635, 1395120, -998789, -2001859, -763519, 1258713, 1624346, -24595, -1361783, -656866, 599250, -195542, -2860409, -4508109, -3419239, -1126040, -183057, -1156952, -2503074, -2591733, -1239776, 315531, 673852, -197399, -910302, -691102, -784356, -2499080, -4462326, -4014294, -1453686, -283602, -2219991, -4594732, -4623232, -3830139, -5332219, -8365159, -9058976, -6167571, -2570157, -766078, -76565, 788439, 1309846, 774162, 356, -112567, 66255, 291907, 1245276, 2599370, 2442329, 377344, -967084, 265961, 1918145, 1137168, -841466, -662552, 1529470, 2358426, 931710, 244297, 1948609, 3410035, 1891577, -1139333, -2226376, -557579, 1871547, 3415924]
9087C415924N38549k36281q17245p85860l59167o25823j805189k665741k239988
9078e580821q00172J078718K840141L226868J269015j534793k156940m0265J833337
9069A35088R62054j510420k954650k661649j409242N39393K729214L173035N01002
9060d96175k996328l200758N49703M208642L870095J88473l029129l325634j461695
9051e692806M33419J221643J215271J139595J197839J169689J036460R11786L55273
9042B988169j258281l119506k911008K61357L692457L810937Q70661j343433q49246
9033B142107O4100j020902k574989j664194J109062K318420P99233j063607j311157
9024a201927o83922j39263R37461K472523K334294m30949l032011k381025K87889
$$ y = [3415924, 3954473, 3718192, 2900947, 2115087, 1755920, 1130097, -675092, -3340833, -5580821, -6380993, -5302275, -2462134, 764734, 2033749, 498956, -1657984, -1698249, 135088, 1097142, -413278, -3367928, -6029577, -7438819, -6899426, -4170212, -997177, -496175, -3492503, -6693261, -6143558, -1934916, 1935179, 2123652, -905477, -4231111, -5692806, -5259387, -4037744, -2822473, -1682878, -485039, 684650, 1721110, 2632896, 2988169, 1729888, -1389618, -4300626, -4039269, -346812, 3464125, 4334786, 2991353, 2142107, 2206207, 1185305, -1389684, -3053878, -1944816, 373604, 1172837, 109230, -1201927, -1885849, -2025112, -1087651, 1384872, 3719166, 3288217, 256206, -2124819, -1836930]
9015a836930J246922j78793j189387l70792N26089J94113k52318p6377m39428
9006b376901j424990p77998J925546K926460m29870m474806l629419J308534M089484
8997b863960K055132o87633k28104J741251J866159N06916j54244m45943j824803
8988c5229l042784j683022J337894K571497J160343l42806m79819o26841j361134
8979b501901p36339J841386L147572N49569l179182l012953J145877M069145K438068
8970C761242q73209j420699N43582J192006q29889k700713j932524K90018J467884
8961e02302J219100O02232j78858j145106r87906J108858K925765J658473j349439
8952C350817j943887L25726J161324j468211l653677j900468Q86533K28337k248474
$$ y = [-1836930, -590008, -768801, -1958188, -2328980, -1802891, -1608778, -1861096, -1937473, -2376901, -3801891, -4579889, -2654343, 272117, -157753, -4632559, -8261978, -6953444, -2863960, -808828, -1496461, -1724565, 16686, 1882845, 2389761, 2235517, 1789574, -35229, -3078013, -4761035, -3423141, -851644, 308699, -34107, -513926, -1140767, -2501901, -3238240, -1396854, 1750718, 2300287, -878895, -3891848, -2745971, 1323174, 3761242, 2888033, 1467334, 2010916, 3202922, 2373033, -327680, -2260204, -1970186, -502302, 716798, 1319030, 1140172, -4934, -992840, 116018, 3041783, 4700256, 3350817, 1406930, 1732656, 2893980, 1425769, -2227908, -4128376, -3241843, -3013506, -5261980]
8943e261980j570606J922276K960552J62184j911674o88069O18830m11727q55762
8934e035976J719477L875214J714479k077400k180890Q64993J985169Q0053q18540
8925A26579J021028K223937L98676j926631j880681q08089j226118k139095q61070
8916e071464K089232L307482J387839j216895j626697J45504K082246K894502
8908C991749K591127J149037j515604l897852l201113R49241M394104K823284
8900G283973k034776l983006q75108K243975O71607l015451l270624J0695K157327
8891h11388J291207J24472M55156Q00294K06023n7346K21917o26957k227396j511825
8881b135843J938917L805763J053005l207052m034235j328303J100347J258263
$$ y = [-5261980, -6832586, -4910310, -1949758, -1787574, -3699248, -4387317, -3768487, -4180214, -5035976, -3316499, 558715, 2273194, 195794, -1985096, -1120103, 865066, 945119, 126579, 1147607, 3371544, 3770220, 1843589, -37092, -845181, -2071299, -4210394, -5071464, -2982232, 325250, 1713089, 496194, -1130503, -984999, 1097247, 3991749, 6582876, 7731913, 6216309, 2318457, -882656, 66585, 4460689, 7283973, 5249197, 1266191, 391083, 2635058, 3306665, 291214, -2979410, -2968715, -811388, 479819, 604291, 1059447, 1859741, 2065764, 2008418, 2230335, 1603378, -624018, -2135843, -196926, 3608837, 4661842, 1454790, -2579445, -3907748, -2807401, -1549138]
8873a549138M30799k2857k52643m86931k78603N78520J525441J643637L89634
8864A977859j388708j554154O05326K401955J118724j257161n48941K429841K373763
8855F158504j622998l655217m58986K793330R37026k466025j339288K318647J905468
8846D570461k283523l510904J8132K518943N21062k131196j566322L00329L67459
8837a195559n84992p53542p74329j147971k34345K048860K384841p08799l373817
8828d339653j845236J707553K710699R48563l76767l42876o60174j426147q01289
8819d425327J178244K078632Q64054n40253j68862J476497K465097J708235j26161
8810D510156j254167n59223Q15153N36198j668019l178117j886050R82543K652957
$$ y = [-1549138, -1118339, -1141196, -1393839, -1880770, -2159373, -1580853, -55412, 1588225, 1977859, 589151, -965003, -359677, 2042278, 3161002, 1903841, 1354900, 3784741, 6158504, 4535506, 880289, 421303, 3214633, 4151659, 1685634, 346346, 2664993, 4570461, 2286938, -1223966, -1205834, 1313109, 1834171, -297025, -1863347, -1563018, -1195559, -1780551, -2534093, -3308422, -4456393, -4690738, -2641878, -257037, -965836, -4339653, -6184889, -4477336, -1766637, -818074, -1194841, -1537717, -2197891, -3624038, -4425327, -3247083, -1168451, -304397, -844650, -1013512, 462985, 2928082, 4636317, 4510156, 3255989, 2696766, 3511919, 4048117, 2380098, -798019, -2684069, -1701526, 951431]
8801I51431K043529J4973k109938k936416j524743R66878J804614L50959p20805
8792a159518L85385J558718M15719j425775j081630M60348l4760k324190k881530
8783f087233o84423J355803J344557R07847J567083K110025J288108K17803J41516
8774B161086J95850n48104q64385N46253K248151J709804r82211l078961k639271
8765a251788n61311Q56257M04550j011287j361936K84128K400596K538647L89216
8756B687072j722087j842714p10632k43131q02369j166325n32839P08787J859885
8747a764353K397971J740917k60270k355462k499904j57053K546601K847005N19001
8738C014453j753115j560447L80645J417241N29253o74831o66581p8782j68835
$$ y = [951431, 2994960, 3009933, 899995, -2036421, -3561164, -2594286, -789672, -438713, -1159518, -774133, 784585, 1200304, -225471, -1307101, -846753, -881513, -3205703, -6087233, -6771656, -5415853, -4071296, -3163449, -1596366, 513659, 1801767, 2019570, 2161086, 2356936, 1808832, 944447, 1490700, 3738851, 5448655, 4466444, 1387483, -1251788, -1813099, -956842, -552292, -1563579, -2925515, -2641387, -240791, 2297856, 2687072, 964985, -877729, -1588361, -1831492, -2633861, -3800186, -4333025, -3624238, -1764353, 633618, 2374535, 2114265, -241197, -2741101, -2898154, -351553, 2495452, 3014453, 1261338, -299109, 81536, 1498777, 2028030, 1353199, 686618, 607836, 439001]
8729D39001o03756k68339O23572R10538M75291J75848R0342m02940q90316j88657
8719C60584J373620J833582L94284j341324j740443j159916o34075j06854P12818
8710c07724J040925J55068j031024j118460l81201k24301q20333q60231L08129
8701c239152J708468K203852J756742P91492o22960k209678k868816j661808P00930
8692c440930K200536J677809K01904k39368P44372J426809K63549j897985k665966
8683a729270r97272J539939K558514J330611p27393j588289m66230J478060K224515
8674C623185J046066o19541j046294n73417r01284k166784k440237p67348J011083
8665b834571Q36856m99394o99998M36637Q91072k18856j306451r31201Q2253K32602
$$ y = [439001, -164755, -433094, 190478, 1101016, 1576307, 1752155, 1842497, 1439557, 549241, 360584, 1734204, 3567786, 3962070, 2620746, 880303, -279613, -913688, -1020542, -307724, 733201, 888269, -142755, -1261215, -1642416, -1866717, -2687050, -3547281, -3239152, -1530684, 673168, 2429910, 3221402, 2598442, 388764, -2480052, -4141860, -3440930, -1240394, 437415, 639319, 399951, 1144323, 2571132, 2834681, 936696, -1729270, -2726542, -1186603, 1371911, 2702522, 1975129, 386840, -79390, 1398670, 3623185, 4669251, 4049710, 3003416, 2429999, 1528715, -638069, -3078306, -3845654, -2834571, -1997715, -2497109, -3197107, -2760470, -1869398, -2088254, -3394705, -4325906, -4243653, -4011051]
8655d011051k87276j77871P72482J454707J148954L40483j90693k39937k1165
8646a211367K26372L41349L67004N65284R56551J045260M69114l57972q50913
8637A550682j141592j527069j431753j91471J279425J258607l0760l15360J178844
8628F29553K055948L12480k194598k331605n57893q4456j489730j720874O78256
8619d702919K784131J753912p16569j191367J94223M92994r88976j854728q70448
8610e099747J95419j07530n03695N47891K058934K087001P74316j44460j43381
8601c35252l02033j044872j225234L2659J765177K243270J085774l84435p73398
8592A061656j18013L97154k677p39296o72053L61204J253272J065706L15048J99467
$$ y = [-4011051, -4298327, -4476198, -3703716, -2249009, -1100055, -759572, -950265, -1190202, -1211367, -984995, -643646, -276642, 288642, 1245193, 2290453, 2759567, 2401595, 1550682, 409090, -1117979, -2549732, -2741203, -1461778, -203171, -233931, -549291, 629553, 2685501, 2997981, 803383, -1528222, -2086115, -2170571, -3660301, -5381175, -4702919, -1918788, -164876, -881445, -2072812, -1878589, -1385595, -2374571, -4229299, -5099747, -4904328, -5011858, -5515553, -4967662, -2908728, -821727, -47411, -191871, -335252, -637285, -1682157, -2907391, -2874732, -1109555, 1133715, 2219489, 1835054, 1061656, 943643, 1340797, 1338120, 598824, -73229, 287975, 1541247, 2606953, 2922001, 3121468]
8582C121468O23788m0817k479464m433072k818717J804678M712652K507852k136428
8573H61940l600674p19940J917965P54919j835428j592377J176706K462226O95900
8564A21237j507032j774984q86871l52009J23598J170111J831431J011040m59903
8555g23382r79662n60027m43273r17781j077776n04742K43662Q34469J562742
8546b565770K288209K100229O47256r82473j499785j106814j015239j336202o67212
8537d137801J485929K993079J522124j644597k479550L45274L146189K130620
8529C361267j275616k639770q69699R22586P11849K12521J261584K628201K272599
8520F585522N73238p01309j064052j119676j018705q17085j163613j953169j545988
$$ y = [3121468, 3745256, 3704439, 1224975, -3208097, -6026814, -4222136, 490516, 2998368, 861940, -2738734, -3458674, -1540709, -785790, -2621218, -4213595, -3036889, -574663, 121237, -1385795, -3160779, -4047650, -4399659, -4276061, -3105950, -1274519, -263479, -723382, -1703044, -2263071, -2706344, -3624125, -4701901, -5206643, -4962981, -4128512, -2565770, -277561, 1822668, 2469924, 1487451, -12334, -1119148, -2134387, -3470589, -4137801, -2651872, 341207, 1863331, 218734, -2260816, -1915542, 1230647, 3361267, 2085651, -554119, -1423818, -501232, 210617, 423138, 1684722, 4312923, 6585522, 7158760, 6457451, 5393399, 4273723, 3255018, 2437933, 1274320, -678849, -2224837]
8511b224837Q21043L042566K682211N25936p20710n45688q21256k135414k716725
8502b092874j523446M1634M84098L37510P57968J492465J490624N47939o81862
8493H54056j581773j764633j127271k91074j62810n26582n1817J619916K857766
8484a74222K114803J66856r22697n22768J59938J48331j47395j4534M29108O55625
8474A893045M94557m1371j046183k156717k184162k72823K557303L913416K512844
8465E669909l44356k187816j842860j36705J285156J277947r0405j373986q59229
8456A397655J199457K132401Q4860k873349k951147N7667K165731P26378j910050
8447B9603j982804M49763K151717J308235q69362k432457k423862p36404J756032
$$ y = [-2224837, -1403794, 1638772, 4320983, 4846919, 4126209, 3580521, 2759265, 623851, -2092874, -3616320, -3574686, -3090588, -2753078, -1995110, -502645, 987979, 1535918, 854056, -727717, -2492350, -3619621, -3910695, -4073505, -4600087, -4651904, -3031988, -174222, 1940581, 2107437, 1184740, 661972, 821910, 970241, 822846, 808312, 1237420, 1893045, 2387602, 2346231, 1300048, -856669, -3040831, -3313654, -756351, 3157065, 5669909, 5325553, 3137737, 1294877, 1158172, 2443328, 3721275, 3630870, 2256884, 1397655, 2597112, 4729513, 4814373, 1941024, -1010123, -952456, 1213275, 1939653, 29603, -1953201, -1503438, 648279, 1956514, 1087152, -1345305, -3769167, -4505571, -2749539]
8438b749539L128586K187769J14369j084242j120670q64124k82463Q95618J472944
8429A698248M06895o83626K51926J616182J27916l228183l691224j37960K615916
8420a023910J028353j975768k061044M6375R31186K84301K2263j60236j769023
8411d677503l392856k180041J127691K873125K017885R96008J061719Q95202K04748
8402a074022N12285J471928N87831j992231k538477L52571K835744J573141j072256
8393F56514j052971R60588J250421o56741j650435l95683R40086O76774m3789
8384F84764M3979k1765j470545l161451k694254L06658L256304L260149L41031
8375E44870k434590k323015P1899J928281J862804R57343L19353k42884o34547
$$ y = [-2749539, 379047, 2566816, 2681185, 1596943, 476273, -387851, -670314, 225304, 1698248, 2105143, 1421517, 1673443, 3289625, 3417541, 189358, -3501866, -3639826, -1023910, 4443, -1971325, -4032369, -3985994, -3054808, -2770507, -2748244, -2908480, -4677503, -8070359, -10250400, -9122709, -6249584, -4231699, -3235691, -2173972, -1278770, -1074022, -561737, 910191, 1498022, -494209, -3032686, -2680115, 155629, 1728770, 656514, -396457, 564131, 1814552, 1157811, -492624, -888307, 51779, 728553, 684764, 728743, 706978, -763567, -3925018, -6619272, -6312614, -3056310, 203839, 544870, -1889720, -4212735, -4140836, -2212555, -349751, 607592, 926945, 684061, 49514]
8366D9514L3629J246602Q06952j596326k958538j269599J105403J085665l25256
8357a821954k91265P51258L83182p03134L68028K982586L210859K64299j968544
8348C175315j174434J09655n65307j587955q64068L69805L36410J04571R54449
8339H58441J232041o34328k432834j286964J432090K157916O10036o07241o79339
8330F49818r12036j232105l87346P58787J01355j613990j479696O32197J764627
8321a718389R33031L97632J066652R07881n93253p01100J569043K740548K50133
8312D852178k886136k484536L60939J346955k84888j398151o28673j16429j165831
8303b404572j895204n41464J613266K268991J281163K40072q395M578k76529n66686
$$ y = [49514, 83143, 1329745, 2136697, 540371, -2418167, -3687766, -2582363, -1496698, -1821954, -2113219, -1361961, -978779, -1681913, -1313885, 1668701, 4879560, 5143859, 3175315, 2000881, 2110536, 1545229, -42726, -906794, -536989, -200579, -96008, 858441, 2090482, 1456154, -976680, -2263644, -831554, 1326362, 1936398, 1329157, 649818, -262218, -1494323, -1881669, -1122882, -1021527, -2635517, -4115213, -3483016, -1718389, -785358, -387726, 678926, 1586807, 993554, 292454, 1861497, 4602045, 4852178, 1966042, -518494, -157555, 1189400, 904512, -493639, -1122312, -1238741, -2404572, -4299776, -4841240, -3227974, -958983, 322180, 562252, 553857, 558435, 281906, -284780]
8293b84780k85540N50224J181583Q68727k54125j328254j779130j721225j307973
8284d360493m26257O49871J114505O62017n0939m47208o75996o86967K14779J936507
8274b070181K767438J330987j237923k401164j244319O71236J298207J18000j588143
8265b355862j861993Q8999K657679L211875J307780n47784k38762J141187J185337
8256D588456k96435j460146j356492p51277m16493l74587o29873j121004j224454
8247c042305o44156j86530k41162M26487K392208L345735R88206k653933l228492
8238b843942k68324K182819J614059m396l72092j38512k18436M95317K148973
8229B595466J961743j442904m386644k657594K072458M295433K146924r90100
$$ y = [-284780, -570320, -20096, 1161487, 2030214, 1776089, 447835, -1331295, -3052520, -4360493, -4786750, -4136879, -3022374, -2360357, -2411296, -2858504, -3534500, -4221467, -4006688, -2070181, 697257, 2028244, 790321, -1610843, -2855162, -2183926, -885719, -767719, -2355862, -4217855, -4128856, -1471177, 1740698, 3048478, 2500694, 2261932, 3403119, 4588456, 4292021, 2831875, 1475383, 724106, 307613, -66974, -696847, -1817851, -3042305, -3686461, -3872991, -4114153, -3687666, -1295458, 2050277, 3038483, 384550, -2843942, -3112266, -929447, 684612, 680216, 308124, 169612, -48824, 446493, 2595466, 4557209, 3114305, -1272339, -3929933, -1857475, 2437958, 4584882, 3594782]
8221C594782j959435j178374k40410M54931Q18127M43180k69398l90778k50216
8212A022409q77346j603244p58578R90431R48995j177858k208222k70773K144334
8203a789852J898633l81124j857561j557465n14935O56468J870150K306669J411178
8194B042161M02258O29084J153671K11037j536322j707882m4924R38807l76070
8185A711820k425962k638085n14028K134481L159573J993558J75955k65888N66295
8176C897719M67490j349240k513647j176272M95975m24925k395246j558142J504946
8167c051342K093281r24896k925701r88539J460588O97197j038230K88973L417411
8158i71258L893157J205837j109049j277774n43226N33514K346433L205992P21739
$$ y = [3594782, 1635347, 456973, 216563, 671494, 1489621, 1932801, 1663403, 1272625, 1022409, 145063, -1458181, -2216759, -1226328, -277333, -1455191, -3663413, -3934186, -1789852, 108781, -272343, -2129904, -3687369, -4202304, -3545836, -1675686, 630983, 2042161, 2444419, 3073503, 4227174, 4438211, 2901889, 1194007, 1149083, 2087890, 1711820, -714142, -3352227, -3866255, -1731774, 1427799, 3421357, 3597312, 3331424, 3897719, 4365209, 3015969, 502322, -673950, -177975, -602900, -2998146, -4556288, -3051342, -958061, -1882957, -4808658, -5797197, -4336609, -3639412, -4677642, -4388669, -971258, 2921899, 4127736, 3018687, 1740913, 1197687, 1731201, 4077634, 7283626, 8005365]
8149H005365l574526n347328l548562j197037O8823J467419K652717J257750j723610
8140a938989j697126K023182L985444J110487k023465p59279J875064O72982k564567
8131F83733k129133J753680L257072L54514k702197k677653j256875o08454k35213
8122c560526K71061j39624r96042l4842K510132L239092Q81945j508262j469745
8113h06811n02265m63287l53912P28627R70165p29874j782597J61402K810288
8104C1736K456970k65937j610639m48266Q75769P75684J34284r5428j06462N3656
8094A801367N93410P35044m87094k145331k148716k08094J649886J683495J77154
8085A651121j353606j549871j80125J245694O60841j621219k517961l84874K050111
$$ y = [8005365, 4430839, -916489, -4465051, -5662088, -5593265, -4125846, -1473129, -215379, -1938989, -3636115, -1612933, 2372511, 3482998, 1459533, 700254, 2575318, 3248300, 683733, -1445400, 308280, 3565352, 3919866, 1217669, -1459984, -2716859, -3325313, -3560526, -3289465, -3429089, -4425131, -4459973, -1949841, 1289251, 2171196, 662934, -806811, -1309076, -1772363, -2126275, -1397648, -427483, -1157357, -2939954, -2778552, 31736, 2488706, 2222769, 612130, 163864, 1039633, 1815317, 1949601, 1854173, 1747711, 1801367, 2394777, 3129821, 2642727, 497396, -1651320, -1859414, -209528, 1473967, 1651121, 297515, -1252356, -1432481, -186787, 474054, -1147165, -3665126, -4050000, -1999889]
8076a999889J431249j032918j382105R42445K481929J329283l89501m13043N99793
8067A567243J157656J191478Q54859k76014j407954o30544J563827J676801j672946
8058D024406m675745l277334Q79637K817467J186474p38793n45363M47259L27138
8049D45146m90725p24087l53715R7323Q14630J907281K535031K002620Q75903
8040G109407L2751o17813j513292k238225k028641j076446l13072m4527L12412
8031c77446J103912J777214J529956J78901j698375l110667l155434j693604K70673
8022e174870J274265P94680j65478j31495J207752K533077K169280m5778k219073
8013B42360k146535J32581K031256J344939r08123j712944j13787J477305P73590
$$ y = [-1999889, -568640, -1601558, -2983663, -2041218, 440711, 1769994, 1380493, 967450, 1567243, 2724899, 3916377, 4771236, 4495222, 3087268, 2456724, 4020551, 5697352, 4024406, -651339, -3928673, -3049036, -231569, 954905, 216112, -329251, 118008, 445146, -45579, -769666, -1123381, -1026058, -211428, 1695853, 4230884, 6233504, 7109407, 7142158, 6524345, 5011053, 2772828, 744187, -332259, -645331, -689858, -377446, 726466, 2503680, 4033636, 4212537, 2514162, -596505, -3751939, -5445543, -5174870, -3900605, -3105925, -3271403, -3402898, -2195146, 337931, 2507211, 2461433, 242360, -1904175, -1771594, 259662, 1604601, 696478, -1016466, -1130253, 347052, 1120642]
8004A120642j053956j108485J007948K637837J676574j001123l039031l012798
7996b772392r44112K017332L720898K371398j141048l486638k624416j93897R92746
7987b060129O05901L05130O17605M76992l86747p13436K01519J256442J017013
7978A320290n52720k233222k672100j300155J023541K336859J509755k37711p98842
7969a604305M0252O18533R7448m96323k00411N55922J105605J449402J306692
7960B872815p5124k104411k473569j68265K432974K365787J50914j066331j24982
7951A809808P44968l68094k109785k033149k83177Q10792L30569m3059J106496
7942c4631K542576K086478k00109k027490j821665l02405R30054J102357L53592
$$ y = [1120642, 66686, -1041799, -33851, 2603986, 4280560, 3279437, 240406, -2772392, -3716504, -1699172, 2021726, 4393124, 3252076, -234562, -2858978, -3052875, -2060129, -1454228, -1149098, -531493, -54501, -441248, -1154684, -953165, 303277, 1320290, 767570, -1465652, -4137752, -5437907, -4414366, -2077507, -567752, -805463, -1604305, -1564053, -945520, -848072, -1344395, -1544806, -988884, 116721, 1566123, 2872815, 2797691, 693280, -1780289, -1948554, 484420, 2850207, 3001121, 1934790, 1809808, 2554776, 2186682, 76897, -1956252, -2239429, -1428637, -1098068, -1141127, -34631, 2507945, 4594423, 4394314, 2366824, 545159, 242754, 1172808, 2275165, 2628757]
7933B628757n81701m74391J149527K465072R61056k542985l811242q91811K398731
7924A301013J496709k193333l323783n27763J941474R73378j179624j171448M52513
7915b230864J098907M42025O1098L12748K03125m69549r81137j067187p64895
7906c395729L27632J975833K376375K09290k910285l866858j733339J436654L250363
7897b330064L081666J813701P45819O18123Q36374P7401j633476k395390j031386
7888b17232R21018J313377M35476R1012M18044j35630j849864k926460k081986
7879d032245l05029O04170J80257n40505m25041M19036O60331m18497j245861
7870e103384L43553L367869L997024R97142j737761o73086J748051P59382l016563
$$ y = [2628757, 2047056, 1572665, 2722192, 5187264, 6148320, 3605335, -205907, -1097718, 1301013, 2797722, 604389, -2719394, -3247157, -1305683, -332305, -1511929, -2683377, -2230864, -1131957, -689932, -628834, -316086, -112961, -582510, -1563647, -2630834, -3395729, -3068097, -1092264, 1284111, 1493401, -1416884, -5283742, -7017081, -5580427, -2330064, 751602, 2565303, 3311122, 3929245, 4765619, 4843020, 3209544, 814154, -217232, 703786, 2017163, 2452639, 2543651, 2961695, 2826065, 976201, -1950259, -4032245, -4337274, -3733104, -3552847, -4093352, -4518393, -4099357, -3439026, -3857523, -5103384, -4759831, -1391962, 2605062, 3602204, 1864443, 1191357, 2939408, 3698790, 682227]
7861F82227m200416q61422K667131K357925l26815j845576j659625j282498q79488
7852e348557L02147J688083K026049J292135J98477j084274k218257k073460m35856
7843e653513R81655Q87935L98285Q61652J161649m67519k921284l156267m56240
7834h363647K519609L212383J874147M02172n3643K86267O46601N44959J20170
7825A189018k79891p72309j565583j851422l80064K197416L117087J009328j713495
7816I50085j821235L66139J740644R59998k17295k30142J19633l33324r48334
7807E86169n12398N59241P06256n40814j867378j699043N9579J792961J667501
$$ y = [682227, -3518189, -4379611, -1712480, 645445, 318630, -1526946, -3186571, -4469069, -5348557, -5046410, -3358327, -1332278, -40143, 158334, -925940, -3144197, -5217657, -5653513, -4671858, -3783923, -3385638, -2523986, -1362337, -1829856, -4751140, -7907407, -8363647, -5844038, -2631655, -757508, -355336, -408979, -122712, 523889, 1068848, 1189018, 909127, 136818, -1428765, -3280187, -3660251, -1462835, 1654252, 2663580, 950085, -871150, -505011, 1235633, 2195631, 1978336, 1748194, 1867827, 1534503, 586169, 73771, 633012, 1339268, 798454, -1068924, -2767967, -2708388, -915427, 752074]
$$ [...]
##END NTUPLES=NMR SPECTRUM
##END=
