##TITLE=31Pdec_SR55_W
 D2O, 24 sc
 14.05.2021
##JCAMPDX= 6.0         $$ Bruker NMR JCAMP-DX V2.0
##DATA TYPE= NMR SPECTRUM
##DATA CLASS= NTUPLES
##ORIGIN= UXNMR, Bruker Analytische Messtechnik GmbH
##OWNER= root
$$ XWIN-NMR		Version 3.5
$$ Fri May 14 10:01:28 2021 Russian Standard Time (UT+4h)  she@DPX200
##.OBSERVE FREQUENCY= 81.013821
##.OBSERVE NUCLEUS= ^31P
##.ACQUISITION MODE= SIMULTANEOUS
##.ACQUISITION SCHEME= undefined
##.AVERAGES= 24
##.DIGITISER RES= 16
##SPECTROMETER/DATA SYSTEM= spect
##.PULSE SEQUENCE= zgpg30
##.SOLVENT NAME= D2O
##.SHIFT REFERENCE= (INTERNAL, D2O, 0, 248.564)
##AUDIT TRAIL= $$ (NUMBER, WHEN, WHO, WHERE, WHAT)
$$ ##TITLE= Audit trail, XWIN-NMR		Version 3.5
$$ ##JCAMPDX= 5.01
$$ ##ORIGIN= Bruker BioSpin GmbH
$$ ##OWNER= she
$$ F:/spectra/data/she/nmr/P31/1/pdata/1/auditp.txt
$$ ##AUDIT TRAIL=  $$ (NUMBER, WHEN, WHO, WHERE, WHAT)
(   1,<2021-05-14 10:00:29.29 +0400>,<she>,<DPX200>,
      <created by zg, POWCHK disabled, PULCHK disabled
       configuration hash MD5:
       00 E9 B6 7A A2 85 ED C7 34 08 36 98 17 FE 4E 26
       data hash MD5: 32K
       4D 38 5D 1E F6 27 CA 14 74 4A 46 EB ED FD DB BC>)
(   2,<2021-05-14 10:00:31.43 +0400>,<she>,<DPX200>,
      <Start of raw data processing
       efp BC_mod = 2 LB = 1 FT_mod = 6 PKNL = 1 PHC0 = -6717.788 PHC1 = 353.4005 SI = 64K 
       data hash MD5: 64K
       B2 E5 AE 39 F0 CF 52 2B 66 A9 12 E4 BD CB 31 D0>)
(   3,<2021-05-14 10:00:57.06 +0400>,<she>,<DPX200>,
      <pk PHC0 = -41.23687 PHC1 = 129.6 
       data hash MD5: 64K
       53 CE 55 8E 3E B1 B7 12 A9 34 BC 42 9A B3 A0 12>)
(   4,<2021-05-14 10:01:00.39 +0400>,<she>,<DPX200>,
      <abs ABSG = 5 
       data hash MD5: 64K
       DB 7B 1E A6 2D 2E 16 F1 57 8C 81 66 FF 83 64 B3>)
$$ ##END=
$$ 
$$ hash MD5
$$ DB DE 54 D8 E3 FB 32 34 2C 8A 0B 7B 92 60 76 25
##$RELAX= 
##$RELAX= 
##$RELAX= 
##$RELAX= 
##$RELAX= 
##$RELAX= 
##$RELAX= 
##$RELAX= 
$$ Bruker specific parameters
$$ --------------------------
##$DU= <F:/spectra>
##$EXPNO= 1
##$NAME= <P31>
##$PROCNO= 1
##$TYPE= <nmr>
##$USER= <she>
##$AMP= (0..31)
100 100 100 100 100 100 100 100 100 100 100 100 100 100 100 100 100 100 
100 100 100 100 100 100 100 100 100 100 100 100 100 100 
##$AQSEQ= 0
##$AQ_mod= 1
##$AUNM= <au_zg>
##$AUTOPOS= <>
##$BF1= 81.014009
##$BF2= 200.13
##$BF3= 200.13
##$BF4= 200.13
##$BF5= 200.13
##$BF6= 200.13
##$BF7= 200.13
##$BF8= 200.13
##$BYTORDA= 1
##$CFDGTYP= 0
##$CFRGTYP= 5
##$CHEMSTR= <none>
##$CNST= (0..31)
1 1 145 1 1 1 1 1 1 1 1 1 1 1 1 1 1 1 1 1 1 1 1 1 1 1 1 1 1 1 1 1 
##$CPDPRG= <waltz16>
##$CPDPRG1= <>
##$CPDPRG2= <waltz16>
##$CPDPRG3= <>
##$CPDPRG4= <mlev>
##$CPDPRG5= <mlev>
##$CPDPRG6= <mlev>
##$CPDPRG7= <mlev>
##$CPDPRG8= <mlev>
##$CPDPRGB= <>
##$CPDPRGT= <>
##$D= (0..31)
0 1 0 0 0 0 0 0 0 0 0 0.03 2e-05 3e-06 0 0 0 0 0 0 0 0 0 0 0 0 0 0 0 0 
0 0 
##$DATE= 1620972028
##$DBL= (0..7)
120 120 120 11 120 120 24 19 
##$DBP= (0..7)
150 150 150 150 150 150 150 150 
##$DBP07= 0
##$DBPNAM0= <>
##$DBPNAM1= <>
##$DBPNAM2= <>
$$ [...]
##$SUBNAM3= <"">
##$SUBNAM4= <"">
##$SUBNAM5= <"">
##$SUBNAM6= <"">
##$SUBNAM7= <"">
##$SUBNAM8= <"">
##$SUBNAM9= <"">
##$SW= 501.771253377433
##$SWIBOX= (0..15)
0 1 3 0 0 0 0 0 0 0 0 0 0 0 0 0 
##$SW_h= 40650.406504065
##$TD= 32768
##$TD0= 1
##$TE= 0
##$TE2= 300
##$TE3= 300
##$TEG= 300
##$TL= (0..7)
0 120 53 12 22 120 120 120 
##$TP= (0..7)
150 150 150 150 150 150 150 150 
##$TP07= 0
##$TPNAME0= <>
##$TPNAME1= <>
##$TPNAME2= <>
##$TPNAME3= <>
##$TPNAME4= <>
##$TPNAME5= <>
##$TPNAME6= <>
##$TPNAME7= <>
##$TPOAL= (0..7)
0.5 0.5 0.5 0.5 0.5 0.5 0.5 0.5 
##$TPOFFS= (0..7)
0 0 0 0 0 0 0 0 
##$TUNHIN= 0
##$TUNHOUT= 0
##$TUNXOUT= 0
##$USERA1= <user>
##$USERA2= <user>
##$USERA3= <user>
##$USERA4= <user>
##$USERA5= <user>
##$V9= 5
##$VALIST= <valist>
##$VCLIST= <CCCCCCCCCCCCCCC>
##$VD= 0
##$VDLIST= <DDDDDDDDDDDDDDD>
##$VPLIST= <PPPPPPPPPPPPPPP>
##$VTLIST= <TTTTTTTTTTTTTTT>
##$WBST= 1024
##$WBSW= 4
##$XGAIN= (0..3)
0 0 0 0 
##$XL= 0
##$YL= 0
##$YMAX_a= 7331
##$YMIN_a= -4842
##$ZGOPTNS= <>
##$ZL1= 120
##$ZL2= 120
##$ZL3= 120
##$ZL4= 120
##$ABSF1= 248.5645
##$ABSF2= -253.2056
##$ABSG= 5
##$ABSL= 3
##$ALPHA= 0
##$AQORDER= 0
##$ASSFAC= 0
##$ASSFACI= 0
##$ASSFACX= 0
##$ASSWID= 0
##$AUNMP= <proc_1d>
##$AZFE= 0.1
##$AZFW= 0.5
##$BCFW= 0
##$BC_mod= 2
##$BYTORDP= 0
##$COROFFS= 0
##$CY= -3
##$DATMOD= 1
##$DC= 0
##$DFILT= <>
##$DTYPP= 0
##$F1P= 0
##$F2P= 0
##$FCOR= 1
##$FTSIZE= 65536
##$FT_mod= 6
##$GAMMA= 0
##$GB= 0
##$INTBC= 1
##$INTSCL= 5.30512e-09
##$ISEN= 30
##$LB= 1
##$LEV0= 0
##$LPBIN= 0
##$MAXI= 10000
##$MC2= 0
##$MEAN= 0
##$ME_mod= 0
##$MI= 50
##$NCOEF= 0
##$NC_proc= -6
##$NLEV= 6
##$NOISF1= 182.463
##$NOISF2= 159.3651
##$NSP= 0
##$NTH_PI= 0
##$NZP= 0
##$OFFSET= 248.5645
##$PC= 4
##$PHC0= -6759.025
##$PHC1= 483.0005
##$PH_mod= 1
##$PKNL= yes
##$PPARMOD= 0
##$PSCAL= 0
##$PSIGN= 0
##$REVERSE= no
##$SF= 81.014009
##$SI= 65536
##$SIGF1= 159.3651
##$SIGF2= -187.1042
##$SINO= 113.3802
##$SIOLD= 16384
##$SREGLST= <1H.CDCl3>
##$SSB= 0
##$STSI= 65536
##$STSR= 0
##$SW_p= 40650.406504065
##$SYMM= 0
##$S_DEV= 0
##$TDeff= 32768
##$TDoff= 0
##$TI= <>
##$TILT= no
##$TM1= 0
##$TM2= 0
##$TOPLEV= 0
##$USERP1= <user>
##$USERP2= <user>
##$USERP3= <user>
##$USERP4= <user>
##$USERP5= <user>
##$WDW= 1
##$XDIM= 65536
##$YMAX_p= 335105573
##$YMIN_p= -14824923
$$ End of Bruker specific parameters
$$ ---------------------------------
##NTUPLES= NMR SPECTRUM
##VAR_NAME=  FREQUENCY,     SPECTRUM/REAL,   SPECTRUM/IMAG
##SYMBOL=    X,             R,               I
##VAR_TYPE=  INDEPENDENT,   DEPENDENT,       DEPENDENT
##VAR_FORM=  AFFN,          ASDF,            ASDF
##VAR_DIM=   65536,         65536,           65536
##UNITS=     HZ,            ARBITRARY UNITS, ARBITRARY UNITS
##FACTOR=    0.620285442955139, 1,           1
##FIRST=     20137.2065510759, 0,            0
##LAST=      -20513.1999529892, 0,           0
##MIN=       -20513.1999529892, -14824923,   0
##MAX=       20137.2065510759, 335105573,    0
$$ Real data points
##PAGE= N=1
##DATA TABLE= (X++(R..R)), XYDATA
$$ [...]
##PAGE= N=2
##DATA TABLE= (X++(I..I)), XYDATA
15199 -4077616 -5718272 -4531854 -1133992 971519 260995 -1502319 -2613020 -3243308
15191 -3243308 -3624727 -3063877 -1565112 -252274 656276 2246754 4408557 5144398 3769848
15182 3769848 2743060 4283186 6630141 6047927 1922199 -2365236 -3639924 -2181809
15174 -2181809 -490105 -351674 -1745820 -3561758 -4595992 -4263326 -2838142 -1059064
15166 -1059064 309466 477573 -983841 -3039547 -3294972 -501190 3449562 5440898
15158 5440898 4828009 3643344 3198487 2526360 791783 -888237 -1444846 -1964869 -3850009
15149 -3850009 -5973712 -5924848 -3726956 -2103264 -2697145 -3893583 -3238499 -727426 1316000
15140 1316000 949309 -1546609 -4112568 -4743917 -3244453 -1384629 -929372 -1573027 -1585854
15131 -1585854 -477800 212547 -656840 -1817015 -1233959 779503 1538021 -624644 -3959957
15122 -3959957 -5172632 -3423706 -1457761 -2136001 -4570320 -5152125 -2555543 126628
15114 126628 -496857 -3448610 -5059705 -4372282 -3871564 -4678573 -4327171 -916655 3190844
15105 3190844 4275827 2234539 162785 29089 1223202 2682971 3802251 3394456
15097 3394456 438701 -3665900 -5930385 -5606324 -5033717 -5699761 -5719048 -3000864 871222
15088 871222 2397900 1042096 -207306 632996 1779782 671649 -1924165 -2793096 -802208
15079 -802208 1566713 1876097 1127687 1838046 3770022 3963220 1172093 -2063058 -2889319
15070 -2889319 -1799485 -1148346 -1455855 -1380481 -657481 -674508 -1950225 -3011714 -2442964
15061 -2442964 -739728 471499 175118 -1356981 -2822662 -2762392 -1007549 837259 1201792
15052 1201792 467924 15893 -29060 -509328 -1153682 -767688 526362 1189447 512958
15043 512958 -929765 -2995798 -5818226 -7904899 -7232198 -4782369 -3949250 -5472718 -6280654
15034 -6280654 -4814906 -3759008 -5006369 -5698539 -3019196 188778 -670472 -4466279
15026 -4466279 -5970597 -3996199 -2495964 -3455710 -4201607 -3125691 -2858950 -5064480 -6401202
15017 -6401202 -3351348 1843377 3936037 1719303 -1189623 -1762725 -598851 363527
15009 363527 590344 837991 1743341 2885526 2687963 -135383 -4263398 -6038152 -3506792
15000 -3506792 672334 2031740 -592863 -4461815 -6944984 -8052573 -8761899 -8773367 -6999086
14991 -6999086 -3430344 305506 2091139 960823 -2046958 -4742057 -5806398 -5756285
14983 -5756285 -5697448 -5755463 -5238907 -3694797 -1194930 1709551 3714745 3470935 1490853
14974 1490853 208084 835303 1376422 -390645 -3019993 -3050431 -239729 1666382 7988
14965 7988 -3424702 -5248925 -4594043 -2743857 -362704 2736263 5699526 6611493 4813963
14956 4813963 2102929 920778 1654200 2224098 641045 -2232389 -3338871 -1353661
14948 -1353661 1112772 619419 -2531976 -4831864 -4515971 -3574706 -4127974 -5174481 -4516016
14939 -4516016 -2134962 253857 1778001 2528918 1981669 -476097 -3599053 -4879527
14931 -4879527 -3526683 -1488210 -1043017 -2349814 -3754113 -3769524 -2394322 -890563 -436451
14922 -436451 -897206 -1219344 -1099520 -1396086 -2414370 -2906304 -1795779 93895 1372621
14913 1372621 2276137 3862327 5637625 5955262 4626753 3162017 2234023 869527 -1316477
14904 -1316477 -2973852 -3036209 -2331183 -2075519 -2043767 -1479257 -860555 -1374725 -3022238
14895 -3022238 -4311684 -3789076 -1389976 1492338 3086892 2882584 2234504 2552916 2982363
14886 2982363 1324132 -2342536 -4737075 -3281754 496788 3081498 3392731 3101924
14878 3101924 3097536 2052064 -906309 -3973411 -4465218 -2065920 889001 2263686 2398157
14869 2398157 3147355 5040529 6206406 4624406 934915 -1994602 -2279536 -716690
14861 -716690 861323 1539348 1096862 -517289 -2291419 -2289462 -451486 121751 -2881481
14852 -2881481 -6707451 -6389210 -1859177 1332606 -411809 -3862773 -4020969 -1199926
14844 -1199926 411972 -502179 -1245491 -361082 205077 -800190 -1483313 -504766 -66462
14835 -66462 -2295138 -4987578 -4487019 -1438437 94254 -1271591 -2926025 -3269164 -3846947
14826 -3846947 -5146483 -4350727 23591 4470665 4863095 2174718 290613 19132 -576183
14817 -576183 -1123969 920435 4945379 6671513 4255241 926545 -144271 86875 -266088
14808 -266088 -313632 1175939 2520053 1728696 342278 1228988 3992849 5906196 6274610
14799 6274610 6459030 6373958 4627732 1974114 985077 1769549 1328628 -1788598 -5007224
14790 -5007224 -5226759 -2564642 649418 2688501 3051778 2037166 939615 1254435 2639289
14781 2639289 2950059 1060913 -1795722 -4141126 -5900173 -7034634 -6538757 -4287612
14773 -4287612 -2194103 -1782472 -1976230 -1114107 83423 -284264 -1954368 -2749860 -2056166
14764 -2056166 -1789163 -3312535 -5205543 -5264560 -3709010 -3027450 -4697149 -7103954 -7409116
14755 -7409116 -5097703 -2593285 -1976503 -2317662 -1557027 -112590 -437987 -2953387 -4809136
14746 -4809136 -3761750 -1344909 -557515 -1716590 -2465298 -1274325 768995 1608536 485452
14737 485452 -1547560 -2776677 -2565186 -2081524 -2735033 -3936541 -3670693 -1580331 207502
14728 207502 159765 -551354 -313037 380396 527074 1121164 3529684 6406796 7064705
14719 7064705 5604503 4878708 6032102 6674003 4424566 293483 -2625454 -2524603 -120167
14710 -120167 2336022 2606648 127708 -3145694 -4347211 -2666295 -46825 1253399
14702 1253399 905365 86023 -240755 -192714 -632604 -1995423 -3093865 -1825994 1930312
14693 1930312 5076683 4695167 2030757 873808 2294921 3627416 2902113 1374166
14685 1374166 692543 411157 -84550 234944 1786223 2482357 668318 -1675946 -1464958
14676 -1464958 787239 1618650 -479353 -3426912 -4678021 -3530985 -337466 3964723
14668 3964723 6990995 6123198 1858021 -1850149 -1892277 684531 2719866 2787574 1537341
14659 1537341 -461213 -3052010 -5088278 -4921834 -2869627 -1508301 -2444500 -4015156
14651 -4015156 -3686081 -1967803 -1869964 -4281383 -6172207 -4752231 -1541644 -18575 -448362
14642 -448362 -148727 1346326 1062831 -2275542 -5353984 -4972828 -2887830 -2667812 -3752760
14633 -3752760 -2743388 284367 1324124 -1128231 -3485364 -2716847 -932031 -1532222
14625 -1532222 -3528498 -3275090 -485134 1233547 -112061 -2097470 -1682858 580168
14617 580168 1914775 1489973 1095538 1891367 2549265 1625920 382530 1301544 4056432
14608 4056432 5265435 3255572 944349 1834179 4642624 4985685 1920699 -768274
14600 -768274 -560065 145584 -1578521 -4185607 -4209295 -1901415 -715604 -1906336 -3150365
14591 -3150365 -2716999 -1789547 -1681499 -1457233 83892 1951099 2252968 836063 -855527
14582 -855527 -1809657 -2041086 -1697286 -819168 192322 881917 1511115 2723500 4343747
14573 4343747 5250545 4857023 4248478 5104885 7353273 8603908 6689808 2494954 -752811
14564 -752811 -1100334 317982 1374889 1471471 1187933 863780 834583 1834606 3561517
14555 3561517 4020501 2283740 800408 2375398 5546573 6080706 3073342 195023
14547 195023 54640 680347 -678087 -3158835 -4087634 -3061705 -1746463 -1057552 -804683
14538 -804683 -950910 -1215884 -666385 391601 -254664 -3102018 -4428508 -828648 4788463
14529 4788463 5770162 508469 -5143849 -5396048 -1200443 2344411 2579146 912719 -414574
14520 -414574 -686404 -387291 -367227 -1274839 -2753064 -3345245 -1947828 798912 3017067
14511 3017067 3301493 1831980 191761 10396 1229289 2017784 1215992 232253 1046410
14502 1046410 2863494 2935431 758927 -1070273 -907488 -340589 -991760 -1537921 -169815
14493 -169815 1879809 1985195 171896 -1216629 -1261474 -1133007 -1223050 -498452 767838
14484 767838 351938 -2518182 -5212245 -4903768 -2393197 -917923 -1884254 -3586621 -4040038
14475 -4040038 -3395325 -2953237 -2969193 -2536076 -1265476 33753 674101 1276936 2863067
14466 2863067 5083105 6273277 5402306 3205882 1106787 -314861 -1394982 -2525381
14458 -2525381 -3635114 -4066763 -2814863 291362 3356701 3566891 450811 -2975413
14450 -2975413 -3456005 -1143291 1169709 1661186 774708 -518038 -1774433 -2322442 -1360401
14441 -1360401 525628 1435558 569875 -622846 -563765 290406 463117 -215240 -558918
14432 -558918 99079 1151109 1734156 1499943 296385 -1942394 -4538022 -5970951 -5149162
14423 -5149162 -2645020 -176171 1151823 1653017 2041631 2210695 1534492 -9592 -1767295
14414 -1767295 -3320796 -4683658 -5623134 -5735948 -5311924 -5027600 -4545138 -2800137 -226886
14405 -226886 981888 -53995 -1292886 -903271 -297796 -1599069 -3438056 -2544829 908652
14396 908652 3060110 1867634 -504785 -1728878 -2285130 -2813586 -2004406 283680 875080
14387 875080 -2271612 -5666470 -4298096 1158934 5089235 4406575 1430698 -758501
14379 -758501 -1915314 -2641021 -2344360 -898968 251876 272553 153026 526609 467355
14370 467355 -302237 -390072 588803 788885 -581010 -1295329 205860 1608896 186073
14361 186073 -2577601 -3289485 -2039468 -1605367 -2220800 -1409138 1043641 2303193 1460976
14352 1460976 1122963 2471619 2669687 -331431 -3653209 -3360938 -300084 1270263 -279140
14343 -279140 -2308780 -1931114 775210 3594279 4467006 2929589 436419 -945341 -813717
14334 -813717 -595849 -968726 -853390 -3897 -238049 -2046750 -2412600 779606 4028523
14325 4028523 2091235 -4141622 -8124948 -6459746 -2885260 -2039801 -3236294 -2998659
14317 -2998659 -745279 1253657 1861129 2010594 2416073 2754288 2849746 2841895 2267073 354202
14307 354202 -2715466 -5624508 -6853663 -5542667 -2185531 1142702 2259568 1137864
14299 1137864 -231437 -514600 -223938 78977 876405 2121837 2462179 1250535 -358422
14290 -358422 -1457156 -2539621 -3299822 -1815632 1867602 3832743 1161904 -3087737
14282 -3087737 -3498044 102088 2570963 848450 -2489023 -3814641 -3082614 -2341493 -2291495
14273 -2291495 -2199468 -1644029 -884835 -442998 -946723 -2340886 -3141206 -1935032 402221
14264 402221 1776754 2055672 2923044 4475492 4676764 2853587 979990 419398 92317
14255 92317 -761076 -776152 724299 1754775 866488 22402 1494437 3696985 3204193
14246 3204193 -153680 -3141654 -3489439 -1863361 52824 1086982 624545 -637137
14238 -637137 -489585 1964509 3944910 2083714 -2606730 -5849514 -6055196 -5810256 -6916973
14229 -6916973 -7534980 -5869870 -3643282 -3482783 -4916150 -5462663 -4422516 -3215537 -2619368
14220 -2619368 -1787438 20758 2174895 3271696 2326240 -287931 -2617201 -2681096 -940268
14211 -940268 -175423 -1913559 -4058236 -3471908 -122901 2902163 3095024 775148 -2094322
14202 -2094322 -3901661 -4173927 -3556887 -3171526 -3267673 -2782510 -1042633 678996 570018
14193 570018 -1125063 -2331646 -1859845 -554705 220080 -58987 -1163054 -2198731 -1754880
14184 -1754880 443713 2143812 803435 -2562444 -4015321 -1878986 1014209 1496107
14176 1496107 219269 -270225 244056 -128152 -1905633 -3484336 -3708370 -3243799 -3251810
14167 -3251810 -4027447 -4921970 -4684603 -2433038 681804 1758496 -383263 -2987534 -2536181
14158 -2536181 670493 3266916 3425860 2183606 732352 -547909 -409019 2423500
14150 2423500 5947688 5942825 1948188 -1068062 643566 4142186 4036925 74540 -3132011
14141 -3132011 -2866245 -1011460 62503 777639 2244125 3481770 2771901 562856 -893742
14132 -893742 -627267 -186608 -1245505 -2945650 -2888878 -671490 1180769 715607 -507788
14123 -507788 249455 2784414 4611056 5035327 5496655 5933758 4457753 1489320 374952
14114 374952 2069334 2907084 297894 -2784909 -2380249 346210 1518597 731443 490832
14105 490832 1248236 1538423 1793415 3269160 4041889 1198605 -3191822 -3670232 404521
14096 404521 3495376 2061839 -1012522 -2127891 -2093338 -2697165 -2700592 -947063 196150
14087 196150 -1393003 -3180294 -1598486 1936832 3030807 1230049 602285 3365200
14079 3365200 6665505 6699998 3472126 176856 -710373 326769 994539 30914 -1335771
14070 -1335771 -1148379 473473 1564812 1275134 855802 1379448 2365772 3166482 3656712
14061 3656712 3010063 260198 -3072143 -3755668 -1637734 -700838 -3380342 -6723293 -6762765
14052 -6762765 -4154688 -2472329 -2912212 -3771621 -3670768 -2465673 -284628 1854820 1984477
14043 1984477 87479 -835916 908536 2652333 1593900 -565074 -966820 -898138 -2935747
14034 -2935747 -4934095 -2630520 2704695 5230932 3288892 1374873 2427879 3780716
14026 3780716 2681690 782089 487534 938235 404967 -569653 -934459 -1249506 -1913246
14017 -1913246 -1903531 -1122274 -1294567 -2812904 -3525335 -2401126 -1394964 -1788748 -1874170
14008 -1874170 -462918 605427 104068 283484 2839075 4935649 3080198 -1193263
14000 -1193263 -3393838 -2291998 -383760 612738 1031165 869436 -245945 -1075825 -61505
13991 -61505 1563748 1090493 -1217248 -2054868 126376 3009369 3770204 2175820 -432124
13982 -432124 -3075974 -4976764 -5115551 -3292734 -883310 349600 -21612 -840215 -789873
13973 -789873 -136327 -692646 -3231342 -5462817 -4514354 -1399931 -250183 -2224392 -3460962
13964 -3460962 -1083164 2117565 2244340 632413 1249239 3677260 3815079 1061198 -381573
13955 -381573 1772947 4401825 3919632 1115741 -945461 -1000552 444241 2863563 5338047
13946 5338047 6132318 4590308 2457373 2009713 3616943 5758073 6479388 4644941 1049077
13937 1049077 -1688621 -1830256 -809284 -900318 -1309367 409492 3305944 3354607 -212307
13928 -212307 -2854766 -1036831 2810914 4195525 2545297 389598 -1040783 -2125700
13920 -2125700 -2400436 -1055000 888266 1522070 630749 -686776 -2102634 -3766055 -4786366
13911 -4786366 -4003486 -1709496 796107 2477597 2445314 321178 -2081803 -1839446 629611
13902 629611 1101288 -2052508 -4380015 -1888540 2232956 2384816 -544170 -1090910 1426065
13893 1426065 2228741 -220153 -1719148 -29190 1321195 -479604 -2875741 -2989162
13885 -2989162 -2337251 -2891063 -2885661 -611750 1456762 574099 -1555337 -2171823 -2311992
13876 -2311992 -3694318 -3984585 -656825 2909539 1333549 -4127461 -7010990 -5142470
13868 -5142470 -2447236 -1167918 1012695 4482911 4856727 -12867 -5268172 -5426591
13860 -5426591 -1945292 -317186 -2198298 -4460689 -4451446 -2429803 445564 3316981 4986669
13851 4986669 4590562 3016933 1938934 1600180 976280 -263137 -1396962 -1993717 -2391727
13842 -2391727 -3003987 -3955178 -5048841 -5542256 -4644929 -2775032 -1426492 -1299092 -1693300
13833 -1693300 -2162984 -3106454 -4002171 -3166984 -689602 484398 -1533279 -4335918 -4425943
13824 -4425943 -2321065 -1516938 -3016330 -4048372 -2534958 -59546 652105 -726285
13816 -726285 -2293701 -2495164 -1584444 -1061800 -2013719 -3648818 -3765243 -1352612 1803271
13807 1803271 3135016 2371361 1359777 1369636 2132714 3193094 4359392 4751896 3227647
13798 3227647 239722 -2168565 -2674954 -1729645 -110532 1930467 3550693 3172882 709714
13789 709714 -1412556 -1035868 737777 1089623 -264817 -397746 2515362 5979434 6163046
13780 6163046 3279506 1387073 2350271 2927097 -11122 -3882778 -3789647 -315127 817031
13771 817031 -2568604 -5650860 -4075553 -481039 19148 -2478660 -3849597 -2635134
13763 -2635134 -1062054 -574462 -577424 -952765 -1897319 -1803735 821381 3833484 3845903 1639780
13753 1639780 801017 1391422 163781 -2649234 -2624274 1218040 3864450 2119719 -394404
13744 -394404 268801 1686091 -435097 -4742892 -6487388 -4952932 -3493872 -3413136 -2649697
13735 -2649697 -306924 1650026 1652968 462680 -495747 -501943 601030 1965619 1736966
13726 1736966 -604416 -2858998 -3105443 -2730472 -3920723 -5540898 -4768208 -2005056 -657814
13717 -657814 -2123005 -4204074 -4751258 -3953129 -2611580 -878625 652197 949350 270641
13708 270641 -67276 93750 -198610 -639269 345654 2859661 4957814 5270292 4227601
13699 4227601 2395537 -246093 -2915566 -4046554 -3332432 -2019133 -939411 -176498
13691 -176498 -603017 -3153500 -6204482 -6538051 -3849154 -1573194 -2000887 -3290424 -2986087
13682 -2986087 -1796032 -1465911 -1109162 1217680 4349564 4584999 625776 -4371418 -6416049
13673 -6416049 -4882167 -2253350 -629272 300476 1688841 3006477 2481603 202649
13665 202649 -995306 777549 3165300 2222332 -2159544 -6055327 -6886281 -6286373 -6666879
13656 -6666879 -7440841 -6458029 -3580683 -921904 -223678 -1255012 -2289300 -1488219 1347546
13647 1347546 3847872 3043766 -974604 -4543763 -4485937 -1629421 643147 308542 -1886719
13638 -1886719 -3988585 -4546088 -3224171 -775754 1587101 3134691 3782972 3571193 2775407
13629 2775407 2321372 2888593 3626841 3092831 1494633 486782 609934 675497 65587
13620 65587 -176794 755338 1995723 2111714 380097 -3118132 -6958409 -8074851 -4485644
13611 -4485644 1383369 4834765 4888726 5006923 6975613 7900572 5353048 1837265 990186
13602 990186 2121755 1974359 -176464 -2577090 -4437986 -5934163 -6111283 -4073082 -1226428
13593 -1226428 566609 1813054 3461842 3863686 1290789 -1937685 -2004072 579072 1919616
13584 1919616 976565 356826 998962 824670 -690074 -1295173 -549469 -1151173 -3967578
13575 -3967578 -5960481 -5230991 -4172099 -5000199 -5804518 -4130441 -1367646 -205448 -298053
13566 -298053 87224 329151 -947366 -2228694 -923312 2167090 3841842 3431846 3227257
13557 3227257 4126279 4358378 3077185 2069871 2751107 3951223 4063876 3469209 3329714
13548 3329714 3338586 2209387 -259157 -2839582 -4373034 -4758949 -4423953 -3411014 -1465808
13539 -1465808 959433 2415525 1972971 751359 643602 1364643 491463 -2694794 -5246000
13530 -5246000 -4166370 -608621 1816277 2086851 2434229 3964171 4442366 1656134 -2962252
13521 -2962252 -5708196 -4692234 -1350987 1500442 2108698 695854 -1121728 -1828379
13513 -1828379 -1342632 -778805 -862598 -1156223 -1078086 -909504 -1155668 -1493428 -1194758 -289205
13503 -289205 572524 1274942 2236850 3100773 2640362 782672 -309296 1337681 4424485
13494 4424485 5595471 4045013 2828384 4311323 6251090 4824796 541077 -1901428
13486 -1901428 88398 3662642 4651753 2665275 316773 -859896 -1424806 -1792112 -1236994
13477 -1236994 677620 3071061 4451343 3818639 1260007 -1954952 -4224972 -5070261
13469 -5070261 -5223941 -5014455 -3840255 -1966868 -1335351 -3077258 -5327575 -5294093 -2841507
13460 -2841507 -342539 459963 -229853 -1455285 -2140833 -1070419 1624358 3247747 1172117
13451 1172117 -3219382 -5614707 -4212378 -1666636 -857115 -1244521 -868590 235565 682785
13442 682785 403234 535032 1277476 1596705 851179 -554259 -1953053 -2868439 -2882778
13433 -2882778 -1885199 -325232 1282403 2778718 3908809 4050796 2975958 1403320
13425 1403320 328540 301387 1628689 4369425 7500529 8996807 7722147 4771316
13417 4771316 2181840 792476 98712 -282767 40069 1440348 3349477 4274068 2943578
13408 2943578 -91890 -2329456 -1806082 377888 1365462 420785 -304784 603722 1604719
13399 1604719 969620 -224562 -26543 830624 -114554 -3054931 -5401567 -5482444 -4621994
13390 -4621994 -4847527 -6104607 -6624330 -5102121 -1871676 1441033 3067416 2440966 601660
13381 601660 -1055891 -2141328 -2812034 -2591136 -892755 1457950 2636909 2066832 1101772
13372 1101772 977913 1077186 23719 -2059268 -3319649 -2351340 -125507 774045 -966703
13363 -966703 -3716776 -4729512 -3342450 -1361949 -416927 -410524 -875039 -2004006 -3323654
13354 -3323654 -3110558 -751897 1681843 2024063 1008575 725922 1200049 883648 -182162
13345 -182162 -380789 466058 648281 -660977 -2466697 -4018322 -5541521 -6597852 -6085994
13336 -6085994 -4418726 -3366296 -3096813 -1833347 689549 2110960 1193768 121918
13328 121918 1066601 2604484 1933492 -900738 -3477831 -4681167 -5429376 -6170974 -5961762
13319 -5961762 -4330039 -2465640 -1965152 -3011782 -3964740 -2746072 753398 3700827
13311 3700827 3074838 -335322 -2473348 -1277385 750177 619233 -778396 -668239 1063795
13302 1063795 2252572 2304485 2530243 2973462 2018993 -434919 -2132049 -1623347 -88704
13293 -88704 858737 1166651 1134656 150187 -1888910 -3259359 -2146278 924074 3542425
13284 3542425 3920209 2233851 36528 -984101 -176507 1534471 2684721 3122724 4057638
13275 4057638 5907001 7216346 6555978 4442399 2173071 -305794 -3620236 -6510365
13267 -6510365 -6338467 -2604185 1866733 4251272 4701334 4704446 4112727 2015536 -453878
13258 -453878 -1076751 -275267 -830287 -3097466 -3736260 -1079308 1313554 -400185 -4119426
13249 -4119426 -4545109 -1039032 1698291 928709 -578298 308985 2273638 2296549 455548
13240 455548 -671598 300064 2638364 4912196 5556545 3365432 -876808 -4380083 -5271335
13231 -5271335 -4304122 -2847373 -1225894 -175040 -1209254 -3509060 -3185478 1455813
13223 1455813 6216244 6016130 1894887 -751100 192754 1673180 904797 -1170825 -2370080
13214 -2370080 -2033163 -535051 1461636 2640403 2002634 550013 198381 1171583 2351344
13205 2351344 3542463 4969034 5305244 3264324 682659 614865 2447257 2517807 -144762
13196 -144762 -2530804 -2794764 -2701124 -3569405 -3622776 -1403821 1459939 3101008 4129178
13187 4129178 5364835 5709285 4633175 4053844 5061520 5254508 2324605 -1742574 -3187846
13178 -3187846 -1668338 106084 698465 858414 888468 3992 -1883677 -3940714 -5613439
13169 -5613439 -6312076 -4854544 -1344364 1431965 1026620 -1002049 -1170106 714941 1507438
13160 1507438 -64374 -1476619 -766428 133969 -1549900 -4937751 -6439499 -4551288
13152 -4551288 -1685507 -1000875 -2791474 -4703249 -4786554 -3398304 -2132997 -1752136 -1696783
13143 -1696783 -1106367 389531 2544902 4395786 4607271 2819002 410801 -926711
13135 -926711 -962257 -305321 1141271 3460855 5169919 4621388 2702792 1734533 1768530
13126 1768530 767114 -1282268 -1643500 826539 3761235 5068539 5476629 5591123 3825989
13117 3825989 -117186 -2757939 -1129048 2716057 4787489 4722431 4757874 4997520 3808184
13108 3808184 1882316 1680675 3049983 3297923 1841782 1072469 1941405 2229004 487220
13099 487220 -1333365 -987708 561499 716280 -973819 -2342303 -1492153 959251 2681225
13090 2681225 2450674 1776919 2866820 5083236 5281966 2448353 -312701 -198466 1173296
13081 1173296 758811 -779748 -495900 1498617 2135400 591889 -535926 260982 1338347
13072 1338347 1263725 966981 1287987 1336106 787266 1189277 3250964 4996183 4413379
13063 4413379 2297530 868829 891336 1499267 1760612 1325653 441170 -46877 300390
13054 300390 350543 -1257676 -3491875 -3692007 -1530506 -33319 -1523164 -4396920 -5350591
13045 -5350591 -3449759 -623684 946044 769164 -72857 -273319 248530 377029 -263176
13036 -263176 -373899 700986 1007644 -1320937 -4392671 -4719412 -2614427 -1732203 -2977309
13027 -2977309 -3061661 -438837 1571186 126759 -2289075 -1833069 456709 336776 -2926553
13018 -2926553 -5245554 -3222973 1671702 5035743 4175223 439060 -2426968 -2330903 -1245187
13009 -1245187 -2622657 -6469740 -8848875 -6885936 -2270403 1285428 2184899 1308388
13001 1308388 70167 -440402 94605 414838 -1129042 -3689919 -4292523 -2122531 72619
12992 72619 337495 443753 2328241 4355539 3984835 1941034 658581 368375 -206465
12983 -206465 -890925 -917145 -1173173 -2295267 -2063128 1520552 5710774 5740218 1569637
12974 1569637 -2205916 -3111265 -3174459 -4016886 -3940430 -1600915 961253 1179278 -588186
12965 -588186 -2328888 -3096056 -2878547 -1659878 -221427 -227766 -1873898 -2810880 -1071793
12956 -1071793 1888250 2619847 -296816 -4703853 -7050722 -5544552 -1529171 1830815
12948 1830815 2488703 1199498 81186 106588 766776 1423069 1655331 830376 -1104301
12939 -1104301 -2742620 -2726542 -1788133 -1587991 -1954367 -1384648 -64181 134669 -982432
12930 -982432 -1126146 906514 3011162 2559339 -45700 -1958648 -1216171 1399099 3241962
12921 3241962 2262819 -732784 -2448871 -694795 2883425 5029373 5024491 4546154 4153392
12912 4153392 2821800 857523 13861 153036 -930654 -3366617 -4264786 -2456658 -807228
12903 -807228 -1596087 -2761028 -1638399 240821 -410572 -3238710 -4929803 -4307853 -3366395
12894 -3366395 -3567378 -4042212 -3501598 -1650939 1164562 3779986 4189162 1787002 -973695
12885 -973695 -1388337 -278727 -476395 -2221855 -3105202 -2376109 -1952213 -2583875 -2273654
12876 -2273654 193166 2879802 3511172 2502993 1489388 631156 -766201 -2238706
12868 -2238706 -2564528 -1489302 250422 2096301 3951538 5768348 7296439 7647543
12860 7647543 5344988 335185 -4139685 -4070240 136451 3438675 2423633 -720926
12852 -720926 -2302196 -2403146 -3105678 -3774087 -2249314 260124 -47526 -3521586 -5843705
12843 -5843705 -4156540 -942037 95305 -907210 -1390846 -604739 263226 747654 1329776
12834 1329776 1831366 1796114 1846075 2660213 3211605 2060520 -75419 -1127171 -717420
12825 -717420 -276424 -378492 -329707 -417464 -1899612 -4144350 -4451003 -1973559 521825
12816 521825 450081 -1109452 -1724935 -1619062 -2789582 -5144115 -6251169 -4829186 -2197146
12807 -2197146 -45301 1224163 1537586 508952 -1325711 -2152882 -953818 968474
12799 968474 1567911 537546 -729383 -1218439 -1321663 -1807173 -2599391 -2950368 -2383229
12790 -2383229 -976256 1105722 3592610 5258569 4004979 -852182 -6559843 -8931456
12782 -8931456 -7054430 -4431925 -4295936 -5377791 -4240666 -588454 2399014 2696418
12774 2696418 1569318 552755 -972296 -3724347 -6166181 -6267437 -4505177 -3213659
12766 -3213659 -3463361 -4118135 -3718160 -2045110 44546 1381635 1241937 73929 -814983
12757 -814983 -829151 -726411 -1119027 -1350660 -869159 -608363 -1509011 -2596205 -2373143 -1390409
12747 -1390409 -1188737 -1128378 933067 4450177 5641717 2507512 -2038372 -3917361 -2847327
12738 -2847327 -1466378 -1165901 -1369208 -1887910 -3120848 -4159521 -3380669 -1204320 95017
12729 95017 -218636 -432532 447787 1008960 162447 -606048 435139 2264044 2517101
12720 2517101 970341 -370168 -184400 890659 1675002 1620539 668619 -747673 -1542840
12711 -1542840 -871014 830017 2404511 3208946 3070213 1827318 11634 -911229 -400880
12702 -400880 -35254 -1123931 -2143364 -925558 1311626 1141154 -1811361 -3985809 -3116020
12693 -3116020 -1286496 -1275643 -2606992 -3280231 -3113739 -2943686 -2322384 -681913 509629
12684 509629 -465608 -2402797 -2528985 -701560 453744 -250983 -891083 169142 1426736
12675 1426736 326082 -3043948 -5850735 -5727780 -3071224 -193560 1121871 967128
12667 967128 531401 561597 970293 1504491 1886327 1415490 -357153 -2332275 -2598193
12658 -2598193 -1027794 255029 -186152 -1178005 -1097782 -443696 -621622 -1408335 -1577343
12649 -1577343 -1225256 -1434197 -2087932 -2055271 -1400847 -1433371 -2298686 -2274252 -170693 2652016
12639 2652016 3461112 1156415 -2086747 -2540974 888042 4504356 3629435 -1243378 -4664703
12630 -4664703 -3603500 -1438382 -2311506 -4732302 -4574127 -1995798 -595851 -946280 -170809
12621 -170809 2156090 2943855 1385410 874710 3208913 5188727 3565721 -103927 -2262172
12612 -2262172 -2156456 -1216380 -117678 888409 789482 -579681 -1553855 -1355697 -1749340
12603 -1749340 -3819104 -5360939 -4077225 -1313515 182315 310764 432469 3650 -2050902
12594 -2050902 -3944297 -2883222 230567 1658806 359265 -807450 259265 2317744
12586 2317744 3596664 4161684 4375780 3684179 2325747 1947933 2886964 2740896 -448595
12577 -448595 -4866331 -6685705 -4580922 -950054 1091368 637566 -1088552 -2573423
12569 -2573423 -3192277 -3059691 -2424085 -1465504 -445160 339664 808905 1065247 1115378
12560 1115378 860308 209797 -1055241 -3028986 -4715049 -4206206 -1205248 1375453 435570
12551 435570 -2933431 -4630317 -3358255 -2216279 -3382753 -4528650 -2919330 -333470
12543 -333470 -554351 -3573415 -5738798 -4988772 -2838312 -1353738 -890381 -958598 -1045188
12534 -1045188 -399898 1133119 2204670 1683968 858485 1842226 4216624 5559120 5020911
12525 5020911 3901905 2791206 847147 -1755984 -3299573 -3167904 -2802443 -3297439 -4036987
12516 -4036987 -4295737 -4193062 -3548306 -1891405 -143142 -21964 -1095195 -828530 1454972
12507 1454972 3124008 2114656 -39538 -781175 -167544 10735 -814909 -1929509 -3059340
12498 -3059340 -4206534 -4587530 -3556605 -2079848 -1733493 -2583458 -3359078 -3405575 -3251770
12489 -3251770 -3394522 -3535182 -3080437 -1838157 -249197 880536 1174648 1207310 1665297
12480 1665297 2123313 1561036 40813 -1220838 -1443100 -748327 796303 2975123 4262762
12471 4262762 2916763 -259433 -2275904 -1855075 -938033 -1321735 -2006157 -1415543 -215078
12462 -215078 136015 105839 1106102 2714587 2997034 1188960 -1533318 -3499112 -3462831
12453 -3462831 -848800 3365634 6560100 6778807 4824383 2918529 1868462 805604
12445 805604 -902591 -2916332 -4703572 -5763947 -5389507 -3360225 -662695 1294286
12437 1294286 1765439 515537 -2256724 -4945022 -4976516 -1854058 1359958 1411007 -1166967
12428 -1166967 -3255716 -3421821 -2813865 -2477471 -2318016 -2662893 -4313308 -6499629 -6993269
12419 -6993269 -5210855 -3508382 -4275701 -6911061 -8706937 -8003509 -5681925 -3997586
12411 -3997586 -4435588 -6413519 -7884525 -7414647 -5512801 -3660806 -2557633 -1888574 -1218163
12402 -1218163 -285601 1071446 2431248 2748233 1642896 111561 -895299 -1731358 -2820491
12393 -2820491 -3210605 -1877433 334212 1684873 1779751 1292747 348368 -986318 -1548194
12384 -1548194 -655553 -21273 -1495545 -3512494 -2798259 564794 3053535 2969234 2320301
12375 2320301 2580707 2188397 26035 -1888728 -1655565 -783197 -1416792 -2368020 -1062569
12366 -1062569 1887827 3270842 1883423 -319563 -1545274 -1917292 -1581946 355731
12358 355731 3845825 6615028 6387737 3662968 1129912 525408 903972 206768 -1997779
12349 -1997779 -3967847 -4008180 -2466307 -933646 -191315 -15431 -400642 -1384450 -1936968
12340 -1936968 -982676 351914 -259320 -2522565 -3203288 -895033 1382733 420483 -2443291
12331 -2443291 -3481010 -1955451 -271469 405686 1274486 2470427 1815959 -1662556 -5332077
12322 -5332077 -5894999 -3444324 -917714 -139522 29031 1385698 3300951 3010783 -690109
12313 -690109 -4926602 -5420394 -1830448 1422072 739265 -2062433 -2748161 -842276 101685
12304 101685 -1874745 -4284621 -3865356 -762597 2315861 3538505 3176421 2413616 2070931
12295 2070931 1961875 1036769 -1091135 -2747958 -1766213 1281352 3266669 2651992 1389734
12286 1389734 1407066 1422365 -488779 -2925198 -2865048 -643498 95213 -2156535 -4399405
12277 -4399405 -3536396 -749337 496908 -734965 -2247401 -2206678 -1146863 -447240 -512147
12268 -512147 -959902 -1442738 -1643113 -1189531 -157788 745642 863990 169386 -960625
12259 -960625 -2129048 -2967279 -3288678 -3378280 -3684615 -4108248 -4115986 -3618888 -3019015 -2275523
12249 -2275523 -916422 663530 1127570 219548 -344252 716059 1930482 870704 -2272655
12240 -2272655 -4716488 -4558690 -2502991 -147434 1529360 1695206 -204099 -2909815
12232 -2909815 -3709333 -1547116 1539170 3139179 3251421 3171668 3047968 2173996 729604
12223 729604 -403262 -930608 -955363 -284230 782956 950470 -234693 -1015508 280878
12214 280878 2469813 3157708 2445053 2457643 3471267 3358554 1393555 -96818 894700
12205 894700 3080931 3680862 1751782 -1431136 -4034191 -4671103 -3039669 -689480 -85279
12196 -85279 -1881701 -4105683 -4823296 -4325641 -3751101 -3148685 -2372716 -2370835 -3570473 -4142782
12186 -4142782 -2303301 267238 18899 -3293354 -5721180 -4354482 -1072545 534014
12178 534014 56437 -188112 691577 1264248 938360 1159696 2365357 2185477 -1163100
12169 -1163100 -5181399 -5486803 -1544371 2589585 3574912 2341077 1433515 1295512 973570
12160 973570 589894 813924 1072797 559550 142691 966511 1880527 826430 -1614218
12151 -1614218 -2806315 -2155380 -1709494 -2292430 -2128635 -374500 953222 267736 -914014
12142 -914014 -604751 508323 772234 552833 1059419 1714191 1347329 873770 1949597
12133 1949597 3614154 3142673 129887 -2946144 -4407391 -5011683 -5387159 -4488744 -1926098
12124 -1926098 242364 -174605 -2551383 -4376036 -4417624 -3576371 -2988616 -2663673 -2154615
12115 -2154615 -1570789 -1360099 -1451365 -1142762 7295 1378557 1704101 435865 -1460317
12106 -1460317 -2255096 -1019327 1479464 3307561 2998509 1022584 -532384 -152160 1530735
12097 1530735 2893536 3432168 3594135 3118073 1433953 -300159 156074 2695914 4295903
12088 4295903 3147909 1257104 1181371 2210257 2180444 1420330 1821691 2851729 1848452
12079 1848452 -1542075 -4223041 -3789225 -1481799 -30517 -482495 -2203599 -4332489
12071 -4332489 -6023646 -6485091 -5865323 -5220418 -4908895 -4050336 -2256846 -777892 -1011619
12062 -1011619 -2701880 -4391986 -4940794 -3978953 -1747204 719283 1995346 1743429 1295880
12053 1295880 2001782 3405515 3831149 2579511 888528 620695 2275867 4456731 5425840
12044 5425840 5099778 4862435 5135817 4318160 1397106 -1370326 -641437 3102118 5241186
12035 5241186 2689869 -2073344 -4318561 -3016791 -1357600 -1932359 -3731301 -4397568
12027 -4397568 -3576552 -2739457 -2671005 -2666132 -2106591 -1461860 -1197130 -767763 264757 795897
12017 795897 -698421 -3666007 -5576716 -4894323 -2627587 -474159 971781 1312361 -441422
12008 -441422 -3951720 -6245426 -4624043 -252570 3275940 4475727 4797572 5213997 4693160
11999 4693160 2660157 534615 -385079 -752941 -1607482 -2407813 -2003192 -582659 600493
11990 600493 867648 547625 219002 184543 322866 98676 -810478 -1751738 -1632162 -321188
11980 -321188 1268277 2535097 3614456 4299599 3721654 1619935 -951047 -2686934 -3201590
11971 -3201590 -2938668 -2597487 -2736105 -3267536 -3415716 -2837944 -2387012 -2819468 -3371075
11962 -3371075 -2999340 -2418373 -3013081 -4059851 -3289915 -471651 1766637 1401463 -516583
11953 -516583 -1648277 -1107644 280169 1166764 622105 -999440 -2051021 -1597826 -903193
11944 -903193 -1249401 -1265656 884079 3480463 3133027 620595 544069 4248900 7566641
11935 7566641 7357363 5755748 5250487 4079721 437879 -2613914 -1386537 1955401
11927 1955401 2398610 -67081 -911430 1364280 3448762 3301351 2959196 3940940 4214171
11918 4214171 1909982 -1208872 -2375722 -1649976 -950128 -873570 -445730 930733 2770815
11909 2770815 4139325 4105767 2333201 -56338 -1030095 167144 2006437 2482771 1331773
11900 1331773 -172079 -1071069 -1509326 -1718732 -1078991 1043046 3622460 4227784 1797010
11891 1797010 -1548428 -2720675 -1222253 1012212 2759365 4223065 4747868 2800725
11883 2800725 -852341 -2814537 -1491622 594850 623100 -857701 -1981847 -2671415 -3261965
11874 -3261965 -2577248 -333272 817465 -1004463 -3140818 -2030019 1081951 2134007
11866 2134007 685608 -86592 801278 1001038 -261673 -612510 1096804 2639333 2000905
11857 2000905 43978 -1565598 -2312465 -1809180 319489 2513766 2018966 -1267113 -4142146
11848 -4142146 -4300091 -2776858 -1355199 -165557 1029055 1721336 2131249 3479823 5525840
11839 5525840 5993163 3697409 292417 -2078713 -2883514 -2271966 -476599 967010 8096
11830 8096 -2679038 -3691354 -1408463 1868237 3432372 3189038 1919042 -384458 -2571700
11821 -2571700 -1826913 2288619 5841145 5406051 2774623 1830168 2722712 2605209 841176
11812 841176 -223512 640557 1937004 2231607 1926282 1676245 1092926 -234255 -1788552
11803 -1788552 -2730492 -2589162 -1294641 643958 2146154 2587917 2571452 2861589 2979167
11794 2979167 1886246 -181727 -1679575 -1666434 -916746 -770803 -1333008 -1325693 159441
11785 159441 2242621 3356533 3588810 4459401 5872640 5328819 1815202 -1450393 -802164
11776 -802164 2734115 5227429 5689409 6275160 7137215 5741637 2121397 208570 2061858
11767 2061858 4788254 5440434 5127313 5553811 5247329 2752516 414882 970341 2825744
11758 2825744 2901582 2117906 3417305 5641344 4481518 -388611 -3851016 -2284357 1738799
11749 1738799 3547397 2474031 1667173 3246172 5686957 5961434 3276989 127609
11741 127609 -648843 576682 906518 -722403 -1885399 -524546 1603600 1451633 -774122
11732 -774122 -2119807 -1285639 -64655 -312574 -1415545 -1299626 1024745 4164425 5336700
11723 5336700 3227514 -38734 -1110615 162184 602051 -1220533 -2513802 -710904
11715 -710904 2250473 2878391 1355218 626805 1626861 2715868 3105778 3633910 4411421
11706 4411421 4591981 4422605 4958941 5767519 5247425 3171949 796566 -1239590 -2941079
11697 -2941079 -3412820 -1785163 672707 1920417 2317295 3721626 5690797 5711535 3513663
11688 3513663 1976691 2769905 3853040 2682791 -268113 -2628094 -3139660 -2298310 -1203716
11679 -1203716 -788723 -1311563 -1969463 -1678685 -366848 1243978 2811206 4243787 4858915
11670 4858915 4041139 2393120 905011 -492656 -2141965 -3241251 -3000641 -2410554 -2794651
11661 -2794651 -3323743 -2243363 92426 1925947 3225324 5233619 7209390 6834003
11653 6834003 4216261 2462737 3442847 5477759 5968336 4108667 578056 -3089243
11645 -3089243 -4452102 -2022363 2286025 4930634 5165099 4995874 4769759 2507822 -1556262
11636 -1556262 -3796311 -2428081 -365138 -474539 -1243416 -131431 1587363 1035136 -966121
11627 -966121 -644283 3196713 7623928 9631160 9130131 7481343 5270397 2585728 240137
11618 240137 -495528 662544 2302132 2488649 856040 -1035530 -2016125 -3028756 -5104014
11609 -5104014 -6521026 -4460859 495648 4185912 3989985 1798450 769194 1331453
11601 1331453 1870492 1476341 333539 -1146425 -2027951 -999267 1731785 3931698 4122526
11592 4122526 3626776 4387545 5951480 6258422 4564393 2050780 144272 -523655 -85671
11583 -85671 577966 431512 -333913 -291715 1155858 2711695 2903045 1707573 -280855
11574 -280855 -2871872 -5387654 -6181869 -4483488 -1710548 267973 1132467 1276016 364154
11565 364154 -1653909 -3209563 -2687443 -804605 183787 -698265 -2464570 -3888555 -4544740
11556 -4544740 -4371983 -3483543 -2449290 -1864960 -1652777 -1439552 -1446482 -2322281 -4108049
11547 -4108049 -5814980 -6169765 -4867934 -3163785 -2694792 -3278970 -2807017 -386818 1558669
11538 1558669 292838 -2988937 -4564683 -3510604 -2458098 -2670124 -1936337 1139334
11530 1139334 4028724 3804696 1293689 -797243 -1851623 -2764211 -3058495 -1580642 744811
11521 744811 1556147 247579 -1500112 -2188864 -1859030 -1209891 -767541 -794194 -1131965
11512 -1131965 -1474769 -2137863 -3501476 -4374923 -2719640 1132977 3950693 3532747 1269670
11503 1269670 -503267 -1516832 -2363876 -2720651 -2807788 -4151736 -6469463 -6446807 -2757256
11494 -2757256 283583 -1815556 -6462202 -6931317 -1815167 3281639 3785114 1447718
11486 1447718 422129 1713869 3283848 3169710 1045663 -1659924 -2596087 -1045145
11478 -1045145 479757 -734844 -3425404 -3937897 -1662338 428408 741432 776085 1100229
11469 1100229 -340224 -4003595 -6345025 -4263076 468223 3639716 3576375 1623578
11461 1623578 -384725 -1008834 647358 3446248 4407652 2455968 361073 783267 2228941
11452 2228941 1733360 -62169 -124340 1380235 698511 -3599262 -7770824 -7678291 -4000469
11443 -4000469 -670091 235007 -196806 -624941 -1222792 -2186175 -2398264 -850550 1449447
11434 1449447 2355738 1280646 -188089 -695379 -923941 -2056869 -3460253 -3535619 -2547872
11425 -2547872 -2676096 -4747128 -6650002 -6135990 -3920606 -2499824 -2618321 -2583895 -983907
11416 -983907 1452604 3113534 3427756 2789320 1368887 -956393 -3643338 -5394494 -5436938
11407 -5436938 -4413815 -3512009 -2992653 -2234068 -1106597 -331822 -90188 697654 2671046
11398 2671046 4276353 3186810 -505873 -3903371 -4544150 -2862998 -819827 677129
11390 677129 1862886 2573316 2159434 697603 -1072983 -3000688 -5366398 -7325795 -7070142
11381 -7070142 -4291297 -1151611 292226 490717 876099 1090846 -168704 -2134673 -2437963
11372 -2437963 -944789 -417658 -2100395 -3156868 -686247 3574433 5328499 3517336
11364 3517336 1184465 832231 1700741 2033502 1587195 1067959 935594 1475447 2510995
11355 2510995 2741608 1144595 -821957 -658523 1202179 1517283 -905850 -3395066 -3758010
11346 -3758010 -3317005 -3561215 -2889900 263026 3565678 3743336 1764858 1224362 2484185
11337 2484185 2368326 -499692 -3805275 -5363065 -5422852 -4495022 -2141412 941009 2516073
11328 2516073 1858465 796759 555445 105356 -1014984 -1045090 808971 2102315 754728
11319 754728 -1051656 289741 4265362 6792739 5877210 3536297 1892310 523994
11311 523994 -1205964 -1964461 -526992 1784006 2817233 2551859 2275712 1775771 -68940
11302 -68940 -2076596 -1047606 3634999 7977947 7786071 3645943 -430154 -2222893 -2852143
11293 -2852143 -3667583 -4265357 -4044271 -3455244 -2752883 -1334724 569731 1189457 -398265
11284 -398265 -2390345 -2243031 297665 3415604 5636489 6637924 6328546 4703833 2508996
11275 2508996 842235 28188 -369708 -580103 -370465 374128 1311792 1706704 725664
11266 725664 -1652026 -3826506 -3709571 -1214900 1314087 1705483 34325 -2271549 -4040055
11257 -4040055 -4448780 -3054822 -708804 878346 1231831 1195118 431809 -2500635 -6226363
11248 -6226363 -5966539 139560 6680655 6884079 1465790 -2560610 -1329055 1910345
11240 1910345 2676825 1025905 -136529 515643 1920795 2460512 1256374 -1079256 -2431723
11231 -2431723 -1416147 248757 -375435 -2976365 -3915650 -1393625 1839342 2267948 -50909
11222 -50909 -2518985 -3564177 -3401600 -2526246 -1214671 117122 1256943 2357579 3104022
11213 3104022 2622941 844999 -1095601 -2443875 -3642571 -4951180 -5629397 -5363101 -5093894
11204 -5093894 -5264472 -4497026 -1478623 2654928 5238627 4964834 2774046 287927 -1567785
11195 -1567785 -2543704 -2594577 -1663190 260323 2770598 4837330 5464055 4549822 2608452
11186 2608452 -35463 -2846630 -4244594 -2703059 1030142 4118884 4466270 2310508
11178 2310508 -1022135 -4359127 -6365070 -5958711 -4088937 -3414116 -4834092 -5758996 -3501012
11169 -3501012 702500 3023946 1874398 -631365 -2116297 -2885693 -4508203 -6758606
11161 -6758606 -7463789 -5273984 -1491780 1365485 2297284 2424627 3010640 3730626 3330449
11152 3330449 1449344 -820466 -2018960 -1630344 -506777 -103936 -944794 -1937633 -1911990
11143 -1911990 -1551139 -2382322 -3822426 -3351437 -522446 1469542 28261 -2918739 -3564476
11134 -3564476 -1373561 984123 1766559 1423281 453356 -1018980 -1836644 -959785 30569
11125 30569 -1370453 -4233915 -4858536 -2467420 -780504 -2414374 -4873493 -4355795 -1134622
11116 -1134622 1431014 1700994 1043032 1065561 1707537 2021946 1483947 390889 -427491
11107 -427491 -419332 -31029 -228335 -1312669 -2716228 -3631651 -3177655 -801481 2217091
11098 2217091 2764829 -516693 -4444816 -4679440 -1460778 939764 391396 -803785 -316985
11089 -316985 995073 1641885 2168764 3393552 4389703 4120066 3236046 2754059 2625537
11080 2625537 2650033 2891170 2473317 434545 -1454794 157996 4890638 7810087 5960493
11071 5960493 2488832 1765870 3504303 4774585 5020342 5378341 5158665 2984409 205039
11062 205039 -459010 1046786 2486738 2940937 3139267 3058696 2119249 1028835 628136
11053 628136 -204186 -2508048 -4091006 -1953568 2576656 4799442 2903526 -140847
11045 -140847 -1408335 -1378494 -1523647 -1668899 -1377058 -1678458 -3669726 -6669649 -8827860
11036 -8827860 -8598810 -5371034 -120954 4321730 5408151 3765129 2424252 2893357
11028 2893357 3775969 3618050 2938994 2478100 1455645 -852170 -3173532 -3591829 -2222480
11019 -2222480 -1154602 -1873300 -3644090 -4469781 -3172751 -537130 1436250 1480892 225663
11010 225663 -707853 -433826 698401 1822931 2099461 897799 -1730385 -4779811 -6947619
11001 -6947619 -7406645 -5817972 -2430075 1257518 2985856 2072699 569769 812836 2344016
10992 2344016 2695164 947410 -1051368 -1234273 187243 1287306 736013 -933841 -2097419
10983 -2097419 -1851298 -901197 -320689 185416 1571613 2998310 2016956 -1774902 -5137275
10974 -5137275 -5098555 -3072990 -2748073 -4724973 -5993285 -4695080 -2608732 -1947398 -1988650
10965 -1988650 -606406 2173284 4059340 3638546 2145564 1802662 3327384 5569440
10957 5569440 7005883 6933344 5543052 3718279 2725280 3058854 3407546 2092546 -36917
10948 -36917 -66689 2443490 3755115 1238301 -1856214 -744629 3152701 3712925 -703980
10939 -703980 -4899099 -4933882 -3184759 -2743013 -2023037 956596 3310895 1574355 -1717954
10930 -1717954 -1351271 2363469 4226997 2280471 10364 251983 1696387 2354036 2408780
10921 2408780 2424262 2043477 1535499 1759442 1896710 148720 -2703315 -3549816 -1587175
10912 -1587175 413325 554187 471891 2071933 4312608 4965585 3460855 555373 -2801534
10903 -2801534 -4979329 -4133536 -641829 2665086 3927764 4170323 4777444 5155201 4313922
10894 4313922 2870880 1890389 1295503 802848 831624 1155692 368909 -1847883 -3636037
10885 -3636037 -3652307 -3030534 -2943108 -2264097 -46950 1530199 -116300 -3314306 -3683034
10876 -3683034 -367151 2560240 1797770 -946765 -2030560 -949926 -52313 -389091 -442985
10867 -442985 905149 2295122 1907535 384879 205448 2285932 4548161 4478939 2304919
10858 2304919 684593 1479569 3721901 4950276 3891336 1465757 -392718 -435079 1140795
10849 1140795 3029244 3753815 2696080 678966 -523795 216408 2039788 2787804 1376404
10840 1376404 -1009168 -2584834 -3173812 -3769734 -4376782 -3744120 -1457860 972536 1713659
10831 1713659 528420 -1295537 -2292278 -1880820 -727905 -145219 -592442 -1119154 -1074586
10822 -1074586 -1584680 -3788733 -6238433 -6193826 -3409289 -422766 1022008 1490979 1610978
10813 1610978 1041704 324680 908865 2313131 2108705 -32893 -1290670 -282307 501023
10804 501023 -938097 -2383549 -899447 2514754 4779934 5084963 4448543 3085378 1305145
10795 1305145 958096 2674610 3645313 1658858 -640299 538532 3985755 5473920
10787 5473920 4452415 3886393 4258488 3010819 56559 -1403249 -565584 -667809 -3231285
10778 -3231285 -4940669 -2575891 2283581 5764268 6227131 4321393 1080976 -1859300
10770 -1859300 -2249282 266487 2889226 2679952 -90912 -2800708 -3689043 -3144166 -2486496
10761 -2486496 -2208189 -1165476 2160584 6890253 9331258 7172948 3196272 2234585
10753 2234585 4827016 6830599 5482807 2644306 1105213 783628 383118 358452 1827910
10744 1827910 3856815 4111461 1974320 -477629 -769280 1419714 4184131 5584001
10736 5584001 5495208 4904330 3902614 1801897 -682239 -1365292 398479 2607112 3700344
10727 3700344 4548951 5738996 5448116 2611337 -33874 733111 3855066 5768170 5558037
10718 5558037 5044517 4953519 4527314 4064938 4361965 4282556 2227340 -614197 -1661439
10709 -1661439 -768874 485701 2073427 4476164 5781474 4015688 1230655 772477
10701 772477 1535921 -117307 -3575399 -4638285 -2695393 -1516918 -2621597 -3618127 -3699805
10692 -3699805 -4760769 -6065319 -4167329 200368 1678388 -870923 -1671740 2418221
10684 2418221 6118755 4131952 -278993 -690244 2877930 5668966 6236736 6688310 6944367
10675 6944367 4820960 1246258 72156 2181615 3973017 2717667 221230 -224596
10667 -224596 1613305 3016203 2120520 230525 -180518 857057 791097 -1139998 -1857143
10658 -1857143 981717 4378839 3654798 -475082 -2911979 -1902193 -788582 -1434020
10650 -1434020 -1187891 1648661 4144187 3420651 1207181 641328 1583911 2123748 2228005
10641 2228005 2964231 3927802 3885955 2606106 484245 -2008022 -3460193 -2270633 669719
10632 669719 2334933 1538814 66939 -858187 -2147858 -3824532 -3797728 -1352565 1108901
10623 1108901 1614328 1305370 1970065 3404617 4778308 6286291 7990916 9005315 8835826
10614 8835826 7772514 5769694 3091029 1660638 2933310 4944642 4745577 3042632
10606 3042632 2648865 3278671 2421721 555398 313246 1087335 147904 -1370183 -25229
10597 -25229 2561944 1162065 -3558578 -4694573 49078 4804854 5241608 4319183 5343205
10588 5343205 6534061 6101366 6007664 7025578 6454364 4182734 4381016 7621322 8308276
10579 8308276 4016741 384243 2130738 5957613 7205235 6965503 7490459 6989873 4386729
10570 4386729 3155150 5063627 6007392 3254242 747058 1918292 3560757 2503912
10562 2503912 1977148 5066476 7854272 5734337 1356885 -16421 1685573 3737144
10554 3737144 5793197 7545640 6621875 3719425 3964795 8443562 10935446 7859497
10546 7859497 4134589 4022187 4263764 2184279 1972886 6032506 8637424 5698700 2523107
10537 2523107 4177624 6564201 4993599 2994506 4426714 5758331 4517232 5859467
10529 5859467 11929419 14969893 10620117 7199458 11232665 15228083 11688923 7451863
10521 7451863 10670204 15098416 12045950 6976865 8712806 12723471 11183316 9050818
10513 9050818 13480318 17990843 14545563 10357114 14647245 20429623 18420852 16159336
10505 16159336 22739720 28706908 23874529 19708882 28531673 37338370 31329473 24994875
10497 24994875 35941080 47944809 40598885 34181154 54872585 77262209 66482408
10490 66482408 60038770 120618486 203848133 175347238 45 -177872213 -209651807
10483 -209651807 -125133624 -61405141 -68207647 -81606991 -59639766 -37865431 -44749749
10476 -44749749 -51902099 -35047251 -17616025 -22761148 -32858111 -26816827 -17098632 -21044580
10468 -21044580 -28428666 -24301900 -16982874 -18859426 -22259065 -16722535 -10387140 -13585829
10460 -13585829 -18570977 -14558336 -7506981 -7427800 -10097953 -7803665 -5241057 -8976130
10452 -8976130 -12943212 -9563283 -4586737 -6449616 -10724271 -9215447 -5640054 -8410386
10444 -8410386 -15267630 -18136058 -16936574 -16589183 -16062147 -11781658 -6924902 -6749304 -8991422
10435 -8991422 -8325358 -6033128 -6449081 -8189002 -7492196 -6140927 -7777533 -10222797 -9430773
10426 -9430773 -7416626 -8432664 -10578684 -8934933 -4383511 -2086521 -3324256 -5309292
10418 -5309292 -7015066 -9128483 -10193425 -8563846 -6510246 -7187019 -9184144 -8892977
10410 -8892977 -6576095 -5453071 -6249193 -6958379 -6759273 -6346276 -5549708 -3981577 -2909304
10401 -2909304 -3640452 -5217526 -5984991 -5986910 -5907108 -5398752 -4240171 -3395298 -3570563 -4504214
10391 -4504214 -6234613 -8599365 -9401851 -6608813 -2687066 -2511792 -6162097 -8370645
10383 -8370645 -6315741 -3120267 -2027733 -2187511 -2400759 -3991138 -7106151 -8688388
10375 -8688388 -7151542 -5132266 -4929480 -5131180 -4259212 -3681118 -4314020 -4487835 -3663135
10366 -3663135 -4185339 -6756819 -8334478 -7170018 -5673157 -5566796 -4747931 -2100967 -882829
10357 -882829 -3603790 -7512035 -8852648 -7991722 -6904481 -5361746 -3208204 -2699901 -4695531
10348 -4695531 -5847814 -3358958 571049 2552457 2978431 3559578 3230730 577417 -2492276
10339 -2492276 -3505438 -3412454 -4164855 -4771027 -3401409 -1143398 -184934 -386136 -727959
10330 -727959 -1721206 -3329105 -3319377 -1115747 -393050 -3860318 -7998751 -7362148 -2279008
10321 -2279008 2000923 2510984 846730 -855231 -2298089 -3507724 -4040966 -3956024 -3640392
10312 -3640392 -2919243 -1690207 -666351 -396814 -670033 -1567703 -3311218 -4438250 -2632486
10303 -2632486 1595666 4696848 4699552 3285112 2204364 846606 -1254005 -2833588 -3353296
10294 -3353296 -3742182 -3493432 -937220 2328732 2027829 -1870673 -4012933 -2065659 -693276
10285 -693276 -3531479 -6823535 -5871677 -2730231 -1765254 -1893882 388139 3627387 3754180
10276 3754180 1497010 936296 2170723 1689795 -824230 -2050010 -1111578 -638919 -1635074
10267 -1635074 -2218677 -1786839 -1971395 -3097147 -3741940 -4056905 -5607772 -7636969 -7301849
10258 -7301849 -4174536 -1145823 -376836 -1333055 -3003420 -5054443 -6584643 -6585218 -5796321
10249 -5796321 -5546901 -5045183 -2669938 408824 1131142 -900598 -2919590 -3279115 -3155541
10240 -3155541 -3542608 -3638801 -3098398 -3069647 -3735353 -3170234 -199545 3246206 4179059
10231 4179059 2094387 -658861 -1628510 -649321 434719 51243 -1449006 -2622225 -2820072
10222 -2820072 -2370423 -1461462 -324996 -85667 -1455165 -2821774 -1973965 394372 1605111
10213 1605111 1285632 1350483 1584387 -490329 -4357340 -5795998 -3396438 -1192259 -2144828
10204 -2144828 -3566443 -2428983 -808844 -1766490 -3648241 -3359462 -2207007 -3351300
10196 -3351300 -5842730 -6376988 -5234092 -5439380 -7242974 -8143421 -7475756 -6640098 -5665193
10187 -5665193 -3678190 -1874671 -2020653 -3016233 -2910806 -3055105 -5857380 -9509864 -9745541
10178 -9745541 -6383814 -3504479 -3197777 -3503799 -2695252 -1484226 -586399 277224 629501
10169 629501 -361640 -1785772 -2136253 -1879879 -1996998 -1369173 871242 2144018 -109711
10160 -109711 -3423916 -3731440 -2297817 -3530793 -6901891 -7508585 -4578853 -2661654 -3526201
10151 -3526201 -3651461 -1450161 -306566 -1851036 -2553938 -396190 896953 -1637006
10143 -1637006 -4587344 -3666679 -544922 623203 -55006 77638 602390 -742959 -3083034
10134 -3083034 -3534005 -2163609 -1410996 -1384967 -5010 2551051 3676133 2830889 2455962
10125 2455962 3707097 4645414 3801634 2605883 2688375 3092701 2050304 -147712 -2036441
10116 -2036441 -3578701 -5672823 -7502394 -6763205 -3197977 -2530 -266939 -3104368
10108 -3104368 -4921994 -3901861 -1457096 443414 1318823 1318240 471089 -424326 -86823
10099 -86823 1101255 1071424 -790183 -2514764 -2804368 -3066891 -4393353 -4968808 -3165269
10090 -3165269 -1219694 -2584981 -6787075 -10094123 -10598229 -9579607 -8237627 -6164117
10082 -6164117 -3279177 -709537 725564 1097943 454261 -1042388 -2422988 -3000823 -3502615
10073 -3502615 -4460774 -4543818 -2533634 167642 1336869 1140333 1101323 1104589 222825 -682329
10063 -682329 -306185 244033 -712415 -1827905 -774870 992307 -67735 -3362943 -4352484
10054 -4352484 -1571554 1135833 824156 -361062 591495 2572342 2300427 -868692 -4366663
10045 -4366663 -5425318 -3331766 215277 2277166 1317278 -1119356 -2486623 -2454370 -2406877
10036 -2406877 -2696947 -2783723 -3216996 -4616514 -5387670 -3643773 -884427 -386962 -2365216
10027 -2365216 -4259623 -5275773 -6534186 -7092625 -4617880 -381449 1337971 -236225
10019 -236225 -1351861 -414199 -460127 -2942632 -4322139 -1969559 1107263 1133601 -604899
10010 -604899 -754080 290205 -343136 -2879662 -4716784 -4179205 -1756141 1209854 2998292
10001 2998292 2180105 -370250 -1801576 -1071887 -213883 -400394 336732 3308775 6043279
9992 6043279 5807601 3817797 2864584 2769355 1426902 -1122392 -2832892 -2979319 -2655808
9983 -2655808 -2555857 -2374125 -1819409 -663893 1273020 2948670 2405344 -346701 -2539036
9974 -2539036 -2399473 -1809785 -3210241 -5582422 -5846844 -3154244 225583 1593318 166981
9965 166981 -2322935 -2780962 -11444 2972839 2331379 -772753 -1321441 1776375 3595801
9956 3595801 949126 -2605500 -2908251 -1751957 -2649561 -3998860 -2225124 1060737 1436981
9947 1436981 -307505 842068 5235158 7130368 3574353 -883404 -857055 2749743 5167943
9938 5167943 4300689 1981785 579110 799547 1960236 2814009 2584729 1878288 1901848
9929 1901848 2640299 2916828 2359053 1932985 2223232 2524134 2167455 1718402 2247068 3898315
9919 3898315 5417014 4962086 1835574 -2291586 -4670784 -4461327 -3384936 -2889286 -2258826
9910 -2258826 -630687 877591 829302 -110099 -351368 111942 289614 237857 497193 437541
9900 437541 -724673 -2050150 -2091245 -1221172 -704783 -327654 769777 1698268 780174
9891 780174 -1574319 -3329750 -3685045 -3128705 -1342388 2152145 5694848 6865518 6048433
9882 6048433 5608598 5727462 4756049 4001303 7543676 15180402 19618856 14395499 2355554
9873 2355554 -7390495 -9759124 -7526420 -5568038 -5191897 -5174088 -5160926 -5637615 -6094171
9864 -6094171 -5660273 -5069772 -5825275 -7321410 -6958519 -3949119 -1058700 -1034693 -2859429
9855 -2859429 -3582548 -2698732 -2152824 -2631431 -2807279 -2338283 -2538750 -3374324 -2868639 -767960
9845 -767960 202593 -1424564 -3134315 -2244598 5029 868654 490473 809633 1627810
9836 1627810 1033409 -1106625 -3045232 -3985303 -4378981 -4015218 -2453004 -837512 -653307
9827 -653307 -1152705 -716137 -264605 -2240214 -6246988 -8893057 -8516401 -7172615 -7025916
9818 -7025916 -7358959 -6440590 -4340313 -2510074 -1886154 -2396475 -3392368 -4036298 -4065450
9809 -4065450 -4161477 -4618454 -4153292 -1546225 1962354 3662035 2496331 -417065 -3754318
9800 -3754318 -6459251 -7030284 -5022925 -2919111 -3603615 -6070778 -6762918 -5219495 -4646633
9791 -4646633 -6133680 -6497131 -3811582 -1140369 -1745355 -3809150 -3683217 -2027141 -2364725
9782 -2364725 -4753041 -5534971 -3585292 -2438690 -4641621 -7488402 -6941901 -3532283 -1318957
9773 -1318957 -1953509 -2873516 -1736498 78257 -45785 -1744776 -2211981 -427011 1417706
9764 1417706 1151533 -625452 -2041966 -2649453 -3123172 -3320301 -2419472 -640695 718445
9755 718445 896228 63393 -1713496 -4457593 -7117794 -7872315 -6171634 -3535056 -1850303
9746 -1850303 -1629099 -2242574 -3022531 -3594232 -3713591 -3373110 -2897317 -2655881 -2740691 -2923051
9736 -2923051 -2836686 -2342754 -1767358 -1470434 -1207471 -543794 65028 -399642 -1788689 -2572149
9726 -2572149 -2013428 -1269583 -1302555 -1028888 873767 3306566 3823547 1985080 -144644
9717 -144644 -804498 -269074 342602 547888 399870 -23332 -565565 -1019171 -1378654 -1683476
9707 -1683476 -1727447 -1249895 -121031 1770525 4050657 5158338 3494020 -72147 -2364704
9698 -2364704 -1698056 -98777 -413664 -2608672 -4520475 -4926883 -4048170 -2254725 -314811
9689 -314811 151372 -1397243 -2947375 -2456251 -876821 -531210 -1595479 -2604580 -3244991
9680 -3244991 -3811930 -2999180 405863 4242069 4906109 2381485 -63998 -1043472 -2209035
9671 -2209035 -4134099 -5111079 -4832151 -5245765 -6500344 -6023062 -3392759 -2214185 -4682857
9662 -4682857 -7708590 -7326110 -4151368 -1516243 -643890 -739966 -1733250 -3628948 -4683271
9653 -4683271 -3374300 -1063635 69033 466180 1661622 2627248 1138733 -1850220 -2840557
9644 -2840557 -980085 691871 -71841 -1730274 -1875376 -765270 -321002 -1172774 -2302629
9635 -2302629 -2822190 -2948256 -3576369 -5359988 -7686354 -8484944 -6127335 -1952014 244871
9626 244871 -1849161 -6288545 -8886038 -7567849 -3933712 -880894 215149 -197032 -1239614
9617 -1239614 -2332506 -2866279 -2279963 -935349 -218688 -999718 -2249303 -1988920 282848
9608 282848 2712337 2918974 451741 -2689805 -3879859 -2355366 -47720 365277 -1567980
9599 -1567980 -3576377 -3484132 -1718523 -240333 191020 425734 1108887 1913565 2435183
9590 2435183 2472729 1501159 -641437 -2465635 -1885525 996612 3683569 4413501 3895369
9581 3895369 3094264 1067226 -3293726 -8419778 -10994323 -9679774 -6412776 -3737011
9573 -3737011 -2152070 -795489 256049 -269877 -2751620 -5495730 -6447257 -5449031 -3780076
9564 -3780076 -1905873 755964 3742840 5139175 4212931 2788008 2533693 2295920 8123
9555 8123 -3768967 -6397662 -6758339 -6157363 -5794293 -5394059 -4553794 -3600797 -2704908 -1635490
9545 -1635490 -720009 -723989 -1594637 -2537083 -3286365 -4002252 -4129059 -2911842 -909629 569334
9535 569334 1339779 2044289 2421590 1842747 1191832 1892043 3201768 2961024 1055332
9526 1055332 -510454 -1145166 -2301248 -4016325 -3983632 -1265273 1907541 3422113 3714111
9517 3714111 3523670 2078494 -608350 -2300610 -1686799 -750699 -1690213 -3465008 -3764333
9508 -3764333 -2556709 -1233536 36785 1469171 1754979 -98622 -2167203 -1809967 236725
9499 236725 817819 -991843 -2972441 -3438402 -3178580 -3314438 -3504850 -3077658 -2342152
9490 -2342152 -2019874 -2361075 -3174114 -3975738 -4130321 -3538626 -2905680 -2701012 -2525835 -2257617
9480 -2257617 -2719320 -3965124 -4082099 -1550938 1948625 3127903 1199211 -1453585 -2510714
9471 -2510714 -1735388 150695 2455190 3862325 2735739 -834862 -4497648 -6113182
9463 -6113182 -5889620 -5262314 -4583001 -3122544 -951349 559920 526763 -105223 133205
9454 133205 1064702 1183538 122726 -722459 -685930 -1224699 -3271888 -4712450 -2953982
9445 -2953982 768887 2486520 796052 -1769529 -2898525 -2906210 -2250154 -84899 2988342
9436 2988342 3862185 1102031 -2169381 -2151555 704679 3031760 2988935 873899 -2846978
9427 -2846978 -7094513 -9092524 -6929188 -2600541 194361 666316 773330 1239323 743137
9418 743137 -1123061 -2947638 -3827785 -4308664 -4804509 -5089181 -5369939 -5954475 -5998632 -4516167
9408 -4516167 -2391143 -1434529 -1806662 -2406745 -3247101 -5017297 -6712112 -6384760 -4208450
9399 -4208450 -2258257 -1344238 -651974 -290081 -1160238 -2289427 -1663961 -110196 -698261
9390 -698261 -3359636 -3988707 -727208 2508145 1472075 -2321393 -4055190 -2104974 1035525
9381 1035525 2933045 3270567 2397349 484625 -1900879 -4038851 -5529983 -5536108 -2974381
9372 -2974381 912202 2043356 -1705807 -6501945 -6677941 -2305053 1024472 226268 -1485911
9363 -1485911 -412062 1815207 1379374 -1240024 -1968405 422517 2529194 1723236 3109
9354 3109 526547 2608925 2806971 19038 -3040117 -3512998 -1540530 790390 2058523
9345 2058523 2194499 1617575 720423 -139111 -720907 -862462 -368912 579659 1068138 349192
9335 349192 -899038 -1248590 -608407 -479609 -1744959 -3356723 -3828949 -3055641 -2025729
9326 -2025729 -1581575 -1967359 -2766943 -2921033 -1732686 -73342 513897 -55068 -638719
9317 -638719 -1144428 -2450443 -3874419 -3482644 -1794897 -2106782 -5405668 -7946503 -6314650
9308 -6314650 -2263292 325717 894318 1379966 2094699 2128679 2156847 2934069 2465464 -1036017
9298 -1036017 -4559277 -3550927 690169 2074371 -1376965 -4859431 -4280953 -1490174
9290 -1490174 11565 99728 152357 -24275 -531626 148064 2226319 3055258 1175133
9281 1175133 -960243 -1043153 -669600 -1852382 -2778127 -977227 1700386 1676046 -461471
9272 -461471 -1164336 639 67513 -1879567 -3447887 -3413605 -3198890 -3090126 -1151592
9263 -1151592 2522530 4210037 1549853 -2630438 -3915474 -1733383 1041360 2218870
9255 2218870 1686224 -111065 -2605084 -4401017 -4173177 -2461177 -1334057 -2155727 -4444392
9246 -4444392 -6699874 -7549095 -6368249 -3724008 -1243083 -394188 -1220775 -2408967 -2419012
9237 -2419012 -582521 2271123 4091276 3352022 960524 -467290 162087 945998 -267505
9228 -267505 -2635659 -3325811 -1299813 1499179 2744064 2084680 688927 -270592 -244051
9219 -244051 454852 512453 -1302327 -4349983 -6273229 -5532265 -3086802 -1092755 -658275
9210 -658275 -1266468 -1566149 -375378 2095907 3695292 2315574 -1103095 -3232791 -2789656
9201 -2789656 -2234896 -3668594 -5353625 -4681212 -2581741 -1872083 -2655462 -2905804 -2620919
9192 -2620919 -3329201 -3912530 -1625157 2167215 2281429 -2456569 -6481124 -5442313 -2482853
9183 -2482853 -2649879 -4804994 -4181104 -585385 1585154 715252 -51492 1250102 2248812
9174 2248812 658633 -1786092 -2027182 -34253 1508424 583350 -2373719 -5196100 -5842153
9165 -5842153 -4264488 -2482786 -1994824 -1761994 -220211 1575100 1156180 -1295623 -2758007
9156 -2758007 -1675197 17722 127871 -641961 -173465 1750671 2978543 1468391 -2262003
9147 -2262003 -5057626 -4068717 -448639 983296 -2768658 -8795170 -11647416 -9770954
9139 -9770954 -6133622 -3371058 -1534510 -439391 -646638 -1314935 -264023 2525315 4074618
9130 4074618 2369046 -1079510 -3713045 -4734090 -4410641 -2948274 -1299694 -875098 -1189431
9121 -1189431 31151 3189938 5562945 5034208 2751867 604778 -1493071 -4029009
9113 -4029009 -5988947 -6593472 -6827895 -7183004 -6010485 -2444774 1060061 1740881 445153
9104 445153 -43175 890930 1903610 2607168 3383610 3330890 1373199 -1198602 -2122284
9095 -2122284 -1685643 -2081238 -3452264 -3453178 -1100211 1532960 2290476 1619425 1348211 2194294
9085 2194294 3334798 3587606 2495756 737297 -480911 -783156 -939534 -1408636 -1475807
9076 -1475807 -601410 466107 994463 1547012 2651843 3360465 2735453 1731366 1800953
9067 1800953 2509384 2429763 1674253 1562350 2311860 2937902 2938691 2315631 668396 -1702537
9057 -1702537 -2610891 -378699 3063315 4094871 2242059 403401 231548 250747 -847294
9048 -847294 -1982420 -1993147 -1657900 -1834826 -1587007 99776 2166027 2658155 1114885
9039 1114885 -1335377 -3256243 -3432478 -1438404 1267297 2155960 766639 -309598 956255
9030 956255 2801278 2083650 -1001607 -3082132 -2362623 -756496 -595836 -1409988 -1432434
9021 -1432434 -727150 -790732 -1734481 -2020252 -1144620 -571051 -1169075 -1511990 -218206 1355908
9011 1355908 810105 -1592366 -3213031 -2990478 -2657446 -3339096 -3384166 -1218361 1451068
9002 1451068 1490647 -1384644 -4191814 -4401639 -2551895 -1012544 -1248094 -2589570 -3185506
8993 -3185506 -2082656 -413059 -19784 -907769 -1163515 223918 1863895 2135134 1475944
8984 1475944 1271830 1643354 1796124 1622449 1425742 816999 -555787 -1734194 -1357774
8975 -1357774 525975 2619792 3695915 2896142 9757 -3198418 -3479808 32478 3693388
8966 3693388 3437390 -14531 -2643445 -2917956 -2889592 -3762789 -3896109 -2053916 294191
8957 294191 1202444 527839 -1103904 -3435752 -5487865 -5433140 -3089081 -852662 -618733
8948 -618733 -1169459 -132819 2664866 5306924 6262937 5303846 2774176 -494237 -2950257
8939 -2950257 -3388042 -2255402 -1090981 -808387 -1169800 -1666596 -2189304 -2864356 -3691486
8930 -3691486 -4375415 -4430250 -3685667 -2740130 -2548572 -3447997 -4848175 -5813548 -5653036 -4236258
8920 -4236258 -2295176 -1150595 -1412478 -2059012 -1478930 624523 2887809 3668609 2360913
8911 2360913 -245929 -2435598 -2950823 -2376207 -2320897 -2804407 -1928155 861943 3003999
8902 3003999 2161903 -245406 -1291286 -1065436 -1990145 -4305377 -5506418 -4353130 -2378912
8893 -2378912 -975283 163553 1123069 1152310 726533 1389344 2614598 1776814 -1486655
8884 -1486655 -3866777 -3042760 -953408 -386328 -968118 -1047329 -1240133 -3095206 -5743490
8875 -5743490 -6793797 -5696652 -3812851 -1982729 -283793 646827 389669 213252 1498512
8866 1498512 3153076 2804233 282320 -2231650 -3425742 -4117281 -5106562 -5722633 -5137311
8857 -5137311 -3780293 -2801955 -2862418 -3703030 -4432571 -4339549 -3749517 -3589960 -3889113 -3780510
8847 -3780510 -3421805 -4257893 -6341571 -7257177 -5443340 -2860285 -2073935 -2199649 -641552
8838 -641552 2114752 2825512 537796 -1939892 -2265301 -1409112 -1231683 -1690280 -1818305
8829 -1818305 -1492622 -791861 803300 3170936 4798832 4558664 3203003 2103121 1612113
8820 1612113 1607007 2335945 3501409 3690446 2148285 206115 -468574 -219984 -500447
8811 -500447 -1352234 -1547470 -860817 -330871 -184831 677845 2576751 3962477 3352006
8802 3352006 1303866 -441418 -1001472 -698585 -132087 102242 -616470 -2083760 -2784066
8793 -2784066 -1519907 656208 1512321 649223 -139984 164216 385524 -306898 -398717
8784 -398717 1465467 3371324 2172252 -1776369 -4619621 -4116700 -2259302 -1825625 -2588206
8775 -2588206 -2576276 -1457173 -699141 -1231432 -2677100 -4433818 -6008311 -6543373 -5376528
8766 -5376528 -3071357 -892603 685660 2090275 3396938 3870229 2874282 676071 -1738146
8757 -1738146 -3393007 -4049882 -4373937 -5053523 -5778381 -5769461 -5248549 -5222957 -5628332 -5179785
8747 -5179785 -3654445 -2686886 -3285905 -4158853 -3826043 -2847410 -2344612 -1867332 -754959
8738 -754959 -213691 -1547366 -3312039 -2970047 -859846 223953 -814300 -2376957 -3259157
8729 -3259157 -3770575 -3496590 -1159769 2269090 3342727 684916 -2620774 -2930625 -326743
8720 -326743 2614285 4291962 4442505 2960172 639711 -339217 1037123 2698885 2313124
8711 2313124 878839 985549 2373542 2255789 19467 -1443094 -48283 2277412 2319946
8702 2319946 11065 -1631875 -519602 1959442 2706011 596916 -2213125 -2929183 -1577226
8693 -1577226 -759871 -1841634 -3004179 -2262327 -912458 -1794471 -4783270 -6620479 -5604504
8684 -5604504 -4009885 -4602303 -6615586 -7025603 -4848872 -2252433 -1463222 -2102252 -2164027
8675 -2164027 -845449 392104 -347292 -2871659 -4746498 -3988503 -1490248 12467 -721071
8666 -721071 -2133574 -2195494 -954328 130705 697704 1962558 4480914 6519224 5662824
8657 5662824 1964271 -1409547 -1363558 1566834 3696627 2395013 -1085138 -3507045 -3437063
8648 -3437063 -2067633 -923189 -264364 227054 594289 885318 1281006 1547031 1201118
8639 1201118 450565 5712 -214344 -993863 -2120665 -2175514 -673447 941256 1280660
8630 1280660 671013 -85835 -1064416 -2037212 -1608951 530134 1873740 112945 -2971384
8621 -2971384 -3443112 -805330 1304280 459155 -1467510 -1783537 -915877 -906736 -1874012
8612 -1874012 -2292787 -1782307 -1413202 -1609243 -1603452 -1026808 -597346 -968459 -1861299 -2542456
8602 -2542456 -2508806 -1673995 -416998 611439 1116764 1362035 1458427 1028652 102828 -332875
8592 -332875 461196 1716271 2064971 1414916 891481 968521 662568 -1061612 -3634476
8583 -3634476 -5028533 -3615524 -59877 2700829 2044056 -1407223 -4094854 -3284219 97332
8574 97332 2876011 3043361 974442 -1819873 -3838075 -3986326 -2302640 -378912 -46450
8565 -46450 -1503716 -3371297 -4369211 -4219360 -3299840 -2369581 -2304396 -3063334 -3201082 -1507806
8555 -1507806 1136758 2752854 2880188 2837180 3394380 3666574 2677011 814176 -753532
8546 -753532 -1285172 -855202 -263936 -523996 -1662839 -2360074 -1740842 -876708 -1031577 -1206764
8536 -1206764 286551 2208487 1338955 -2428815 -5083814 -4044753 -1827278 -1976644 -3849809
8527 -3849809 -4395518 -3325429 -3008914 -4003422 -4277971 -3106008 -2456839 -3507767 -4516196
8518 -4516196 -3690091 -2018969 -1420183 -1718192 -1570713 -1275664 -2219510 -3829370 -3560036
8509 -3560036 -611195 2343792 2514933 773898 352772 2377715 4604034 4777135 3470211
8500 3470211 2660423 2791599 2640164 1488871 34911 -830450 -1082104 -1217188 -1554102
8491 -1554102 -2009196 -2121318 -1387445 22484 1201680 1635596 1858509 2297532 2175757
8482 2175757 655681 -1526053 -2916383 -3410521 -3973250 -4636189 -4483634 -3494532 -2539856
8473 -2539856 -1536233 293276 2048995 1479647 -1423470 -3524397 -2704994 -873221 -963743
8464 -963743 -2668116 -3408772 -2398520 -1278618 -1156964 -1273037 -787426 -153402 -239428
8455 -239428 -1207895 -2595320 -3714302 -3827518 -2609911 -643850 883380 1053647 -136566
8446 -136566 -1619256 -1882886 -501688 1067613 1163837 99883 -769101 -1705542 -3900734
8437 -3900734 -6037795 -4838354 -379999 2553364 1021388 -1200150 1006843 6047656
8429 6047656 7525254 3422943 -1338280 -2109835 -73509 986558 50547 -1258309 -1858437
8420 -1858437 -1959317 -1919483 -2141426 -3220426 -4888226 -5659688 -4686590 -3202666 -3013192
8411 -3013192 -4073252 -4553859 -3099015 -352488 1752704 2011117 1215983 1117558 2020801
8402 2020801 2323674 1056677 -380154 -345199 427123 292263 -316268 11798 290042
8393 290042 -1800409 -5313959 -6118809 -2750713 1181976 2354630 2373025 4307085 7110242
8384 7110242 7156816 4154583 1786665 2336817 3787499 3198318 658765 -1494332 -1932497
8375 -1932497 -1289322 -480983 486923 1728829 2406544 1472248 -469103 -1203265 233944
8366 233944 1643881 290515 -2951065 -4308363 -2410702 -478076 -1805813 -5040864
8358 -5040864 -6081074 -3545564 -110450 1246115 390458 -717617 -508588 813302 1638056
8349 1638056 676630 -1330762 -2207936 -1103121 387779 713740 670081 1686284 2926758
8340 2926758 2205491 -632275 -3299835 -4028877 -3104277 -1381900 766586 2552158 2628647
8331 2628647 807624 -1247560 -1818206 -830365 556836 1122750 227224 -1496503 -1946060
8322 -1946060 443271 4133528 5627722 3849743 1560821 1350674 2154414 1493829 -483935
8313 -483935 -1584335 -1175041 -576863 -181714 1079159 2996550 3437044 1556275 -537549
8304 -537549 -916200 -832847 -2546498 -5387021 -6440800 -4792090 -2705982 -2254140 -2849486
8295 -2849486 -2964111 -2529884 -2351475 -2393462 -2128179 -1837230 -2148219 -2721423 -2731366 -2354931
8285 -2354931 -2407589 -2648446 -1986999 -587142 -177197 -1568975 -3229878 -3356545 -2300196
8276 -2300196 -1653679 -1690039 -1261337 -20050 842554 446188 -465333 -777400 -619655 -726449
8266 -726449 -747060 493322 2848932 4114976 2369888 -1347179 -3754431 -2953247 -500998
8257 -500998 708014 -63212 -1054242 -926661 -685381 -2051246 -4763341 -6503462 -5404801
8248 -5404801 -2037936 1087944 1660535 -600546 -3768914 -5433011 -4938661 -3775615 -3466495
8239 -3466495 -3575727 -2567836 -245606 1907837 2931084 3521037 4270131 4152246 2227969
8230 2227969 -21845 -61238 2057034 3443998 2387070 663540 562174 1342610 784420
8221 784420 -775693 -631884 2005115 4431273 4071398 1696605 -249425 -955509 -1331592
8212 -1331592 -1953833 -2595222 -3083641 -3086734 -1684336 1191054 3413549 2712978 -25792
8203 -25792 -1514080 -403597 1175735 1208928 854374 2267042 4822619 5754317 4179679
8194 4179679 2352097 2368607 3301633 2825251 781459 -470181 647718 2652835 2880943
8185 2880943 829333 -1579141 -2724884 -2781526 -2250793 -717738 1812320 3647431 3194120
8176 3194120 1411287 726334 1652783 2241617 1147581 -504406 -1109726 -1039672 -1892801
8167 -1892801 -3989949 -5715376 -5239290 -2387307 1033698 2576895 1200596 -1841143
8159 -1841143 -4413356 -5531348 -5330065 -3632711 -251999 3167727 3753205 1097535 -1279102
8150 -1279102 36664 3876596 6055983 4866223 2720225 2111084 2258403 1046501 -1310220
8141 -1310220 -2432831 -1141955 1002602 1792771 850406 -549085 -1381904 -1831806 -2549315
8132 -2549315 -3554939 -4013320 -2957362 -341733 2513523 3824227 2967733 968414 -830158
8123 -830158 -2051317 -2855466 -3079352 -2829352 -3217908 -4922166 -6317695 -5021767 -1534296
8114 -1534296 824494 427734 -437497 657866 2401659 1900813 -752169 -2732416 -2603267
8105 -2603267 -1657951 -1418874 -2143036 -3745619 -5895214 -6987718 -5236944 -1283702 2119070
8096 2119070 3367720 3176842 2388011 833100 -1099748 -2004175 -1511434 -974099 -1218574
8087 -1218574 -1356901 -690669 -56787 -336460 -1209407 -2186225 -3239658 -3752579 -2761176
8078 -2761176 -1016724 -652782 -1793864 -1822901 612353 3249046 3666530 2866371 3180451
8069 3180451 4425046 4540851 2779780 150517 -2133891 -2886920 -1218416 1409530 1203757
8060 1203757 -3288687 -8054036 -8110759 -4056726 -1042847 -1892365 -4437814 -5591852 -4967073
8051 -4967073 -3852502 -3021741 -2435539 -1662821 -264445 1257167 1451590 114803 -660756
8042 -660756 509715 1604876 92006 -2620867 -2851614 -240377 1749574 1027331 -752137
8033 -752137 -1560589 -1621007 -1717166 -1601920 -1191606 -1097856 -1075972 3747 2008191 3403570
8023 3403570 3615707 3337063 2410682 86074 -2460256 -2941855 -1702005 -1348483 -2210131
8014 -2210131 -1997812 -739289 -1406370 -3903809 -3536782 1364042 5121292 2548633 -2833554
8005 -2833554 -3928839 -595920 1170968 -803774 -2314813 -567750 1532708 846546
7997 846546 -1067795 -1220877 93078 729369 407130 218455 841 -1262827 -3181240
7988 -3181240 -4058759 -2978143 -551340 2025386 3701389 3772779 2306029 343159 -748644
7979 -748644 -167789 1869923 4072545 4705323 3118222 652229 -671391 -242199 1023479
7970 1023479 2185288 2840686 2682939 1965264 2136539 4293363 6950484 7172532 4298511
7961 4298511 796679 -1068268 -1560637 -1770604 -1637707 -936494 -413277 -338271 510925
7952 510925 2605667 3847897 2202419 -972473 -2751250 -2990023 -3831862 -5073971 -3640046
7943 -3640046 1160114 5142133 4343198 268649 -2636729 -2949731 -2505472 -1891217 316185
7934 316185 3629528 4905976 2976451 731099 507273 339218 -2345229 -5721070 -5959923
7925 -5959923 -3203351 -1102571 -895558 -189043 1895148 2711825 928490 -487318 1163687
7916 1163687 3685244 3153766 -247004 -2881174 -2993753 -2185662 -2061493 -2376321 -2655147
7907 -2655147 -3245215 -4322728 -5497011 -6471111 -6794326 -5538937 -2837719 -828561 -915421
7898 -915421 -1068698 1293015 4432992 3972882 -304361 -3241645 -1300091 2717281 4064367
7889 4064367 2241894 136706 -712355 -892078 -573194 702258 2218864 2680464 2450984
7880 2450984 3036587 4408362 4857092 3644620 1981315 1030252 503308 -238062 -885155
7871 -885155 -585660 1005578 3290839 4868773 4368993 1929029 -405387 -642390 943449
7862 943449 2351894 2326502 1361940 500522 177701 245608 279775 -110856 -627126 -283214
7852 -283214 1092130 1854379 280886 -2891504 -4963523 -4370493 -2108166 68698 1636296
7843 1636296 2981200 3997366 3798257 1792036 -1118940 -2693122 -1443515 1306395
7835 1306395 2670216 2038994 1995527 4126937 5875388 3976610 -405151 -3130814 -2952514
7826 -2952514 -2365965 -2639965 -2018626 40886 850857 -992682 -2439452 -447821 2839157
7817 2839157 2925104 -539172 -3732627 -4532429 -4858382 -6772096 -9193082 -9634785 -7365548
7808 -7365548 -3855160 -1225530 -768442 -1994717 -2856379 -1776354 484016 1754352 947125
7799 947125 -1335548 -4116811 -6521763 -7305356 -5666717 -2711958 -641895 -252281 -515974
7790 -515974 -646073 -940739 -1262116 -443562 1839861 3846748 3511593 813515 -2284848
7781 -2284848 -3792024 -3161621 -1323177 343439 1256900 1815085 2146408 1400737 -804106
7772 -804106 -2900861 -2824199 -755650 1101129 1521411 1448559 1894024 2266815 1527107 -191303
7762 -191303 -1851291 -2589139 -2149832 -1125769 -927401 -2421594 -4418159 -4743691 -3066841
7753 -3066841 -1345118 -1181107 -2159323 -3157143 -3720137 -3605284 -2655823 -1929604 -3233840
7744 -3233840 -6353157 -8182249 -6023091 -816627 4003978 6028622 5411989 3976682
7736 3976682 3739200 5375058 7270581 6991099 4332298 1800601 1471777 2742466 3869599
7727 3869599 4098748 3330325 1454461 -663030 -1127432 640290 2925556 4255500 5118670
7718 5118670 5816170 4870068 1735795 -902143 -253504 2528038 4038981 3217236 1663742
7709 1663742 490834 -407795 -836611 -794722 -1702272 -4416477 -6884675 -6622295 -4544418
7700 -4544418 -3157845 -2097065 539508 3171223 1918624 -2787282 -5635719 -3824850
7692 -3824850 -557820 625563 575237 1081393 942562 -1010191 -2335622 -443833 2706276
7683 2706276 3301424 1371605 11378 227620 447781 402905 1543966 3528806 3872368
7674 3872368 1777607 -589100 -1422129 -1355500 -1419504 -1295119 -680564 -381538 -826101 -1106874
7664 -1106874 -630480 -258485 -641725 -792343 289204 1663181 1734511 825367 774592 2117180
7654 2117180 3282564 2980608 1997990 1758921 2095814 1695174 299516 -961196 -1510273
7645 -1510273 -2112413 -3102227 -3276142 -1824775 -253106 -584245 -2215674 -2602282 -1090870
7636 -1090870 -7049 -1302602 -3882352 -5209169 -4224116 -1806866 422893 947628 -686943
7627 -686943 -2822216 -2898212 -693190 1077737 596010 -231013 1416969 4859281 6520654
7618 6520654 4453528 288427 -3157072 -4478380 -3869371 -2250851 -562265 917592
7610 917592 2499593 3880496 3925636 2613658 1910128 3015466 3958024 2302381 -589729
7601 -589729 -1032642 1263484 2226221 -759597 -4970994 -6215770 -4492006 -3423639 -5110268
7592 -5110268 -7748155 -8196057 -5367854 -951409 2333140 3066938 2118874 1290877 1235871
7583 1235871 1447733 1897296 3018479 3937904 2905736 446951 -186531 2501737 5324060
7574 5324060 4445782 787652 -1712756 -2255366 -3748834 -7025129 -8586857 -5936854 -1852104
7565 -1852104 -602383 -2161076 -3242828 -2630511 -2070747 -2335067 -1766679 629458 3333447
7556 3333447 4570240 4328742 3123753 806881 -1967631 -2896121 -614744 2832204 3937462
7547 3937462 1762408 -1269536 -2208404 -182640 3200788 4975328 3086649 -1176928
7539 -1176928 -3748904 -2186856 1226322 2382746 540799 -1469439 -1669408 -942146 -443604
7530 -443604 318049 1821319 3074887 3067260 2102191 724071 -1063872 -2559411 -2183033
7521 -2183033 125203 1998352 1617028 26399 -1067814 -2054579 -3863396 -5193938 -3959232
7512 -3959232 -677131 2119849 3275591 3263432 1673823 -2313563 -6728512 -7491734 -3651211
7503 -3651211 758960 1806900 378990 -149642 1015377 1923260 1655956 1511237 2464939
7494 2464939 3621005 3619658 2158753 -114709 -1997553 -2016130 209723 2708980 2886729
7485 2886729 1021359 347557 2671247 5541075 5424134 2504876 185508 288608 1081491
7476 1081491 383803 -1535314 -3134201 -3873781 -3912217 -2901156 -814902 859795 566215
7467 566215 -1038378 -1833170 -1045884 229467 1114218 1763576 2034991 1270860 -83863
7458 -83863 -473771 400264 982107 590341 817905 2667013 4114235 2856581 304953
7449 304953 -7982 2176994 2937647 -411810 -5327930 -7205420 -5134623 -2414343 -1755283
7440 -1755283 -2150117 -1307921 401879 289631 -2582048 -5544873 -5564821 -3149361 -1437714
7431 -1437714 -1902676 -2851135 -2448950 -1328564 -1122018 -1782278 -1788022 -296422 2084107
7422 2084107 4082281 4309252 1798746 -2636248 -6129862 -6378461 -4350450 -2996853 -3450567
7413 -3450567 -4128399 -3661621 -2770027 -2431731 -1934398 -239703 1771948 2179536 865659
7404 865659 -112735 697388 2229206 2400712 692359 -1578547 -3048794 -3485447 -3334913
7395 -3334913 -2928075 -2269727 -1112334 678750 2245395 1605908 -2295578 -7303667 -9412231
7386 -9412231 -7160676 -3237894 -748787 423589 1927432 3361034 3035629 1423290
7378 1423290 823340 1597568 1614020 -54648 -1615632 -1643123 -1125051 -1209244 -1295591 -878224
7368 -878224 -1072761 -2497112 -3536394 -2672538 -933193 -94069 21107 412138 568271
7359 568271 -398560 -1446552 -918206 551223 812300 -517314 -1728381 -1751477 -1206295
7350 -1206295 -779073 -348563 134572 273026 -161501 -1066867 -2117313 -2497048 -1584995
7341 -1584995 -573309 -1666153 -4489137 -5486550 -2807019 523605 927656 -534800 -730337
7332 -730337 -110131 -1363256 -3694363 -3575377 -1138233 -631199 -3509965 -5986522 -5294153
7323 -5294153 -3850650 -4528834 -5720931 -4531538 -1999957 -1459044 -3391244 -5188753 -5091650
7314 -5091650 -3743800 -2475390 -2082109 -2715581 -3468642 -2917252 -1287415 -744338 -2131867
7305 -2131867 -3051928 -1049976 2754703 5326271 5730972 5201952 4240364 2285904 -112970
7296 -112970 -1281325 -730333 407783 1325016 2161451 2640308 1932474 295394 -718887
7287 -718887 -254913 885008 1740966 2434416 3258251 3631282 2964399 1972923 2057020 3397185
7277 3397185 4488340 3928906 2177253 939186 1009968 1529109 1541858 1338129 1578548
7268 1578548 1952162 1747829 1144240 751665 403914 -232907 -353221 972481 2703352
7259 2703352 2678853 732112 -919579 -776543 242112 636964 32871 -1449853 -3517955
7250 -3517955 -4695441 -3181664 156251 1772664 -90042 -2869413 -3360660 -2087615
7242 -2087615 -1771108 -2793934 -2792477 -350972 3115853 5324357 5407114 3979821 2014315
7233 2014315 52875 -1782477 -3133380 -3215101 -2063568 -1371563 -2397576 -3400839 -1667868
7224 -1667868 1683227 2123369 -1802634 -5735725 -5524928 -2907112 -1996380 -2750968 -2093290
7215 -2093290 108406 904740 -219787 -322818 1660019 2669747 409870 -2768532 -3205391
7206 -3205391 -918230 1145123 1381145 715162 262858 41265 115645 1284892 3780956
7197 3780956 6067615 5886592 2603202 -1962929 -5280448 -6237041 -5152159 -2504935 993173
7188 993173 3440839 2939554 395726 -747402 1263718 4143649 4736538 2820339 53661
7179 53661 -3039709 -6445222 -8256151 -6150663 -1320981 1897286 1136911 -1280893 -1625493
7170 -1625493 799330 3457632 3812058 1883503 -22704 198017 2139316 3397669 2598207
7161 2598207 958520 183718 92052 -381717 -1049866 -1129575 -1105708 -1868701 -2564141 -1490233
7151 -1490233 1021209 2681669 2318964 1101664 556720 937664 1652644 1937273 1219829
7142 1219829 69508 191708 1917210 2633303 324 -3992078 -5057153 -2559137 -323245
7133 -323245 -1015387 -2884813 -3386904 -3165301 -4262408 -6216562 -6323358 -3233541 1249528
7124 1249528 3893916 2994263 -91655 -2260717 -1958598 -714654 -591022 -1116883 -501818
7115 -501818 942892 1049319 -765204 -2824457 -4035249 -4824490 -5008417 -3560973 -1210265
7106 -1210265 -536925 -2479804 -5159368 -6938340 -7926416 -7627171 -4435127 872371 4386662
7097 4386662 4094730 2787012 3377934 4132170 1854510 -2393841 -4655821 -3996254 -3283497
7088 -3283497 -4364436 -5863683 -6163093 -5726164 -5579816 -5550532 -5059700 -4427451 -4456298 -5121972
7078 -5121972 -5080205 -2735723 1626461 5101774 5046859 2739522 2013264 3714565 4340597
7069 4340597 1675950 -1291342 -789984 1951716 2848509 1132621 -493554 -912510 -1749483
7060 -1749483 -3537181 -4499511 -3802588 -2846855 -2507674 -1887848 -666606 -30256 -219175
7051 -219175 410763 2607278 4523506 4070342 1406667 -1808802 -4104852 -4469725 -2662142
7042 -2662142 -52991 1350140 1253637 917760 591299 -615091 -1976695 -1148888 2001317
7033 2001317 4385800 4091072 3028515 3210362 3245656 1416522 -213100 1481873 5260731
7024 5260731 6775786 4860368 2790643 2930877 3658333 2741302 788864 -318339 -198743
7015 -198743 542723 1849221 3523081 4376915 3751099 2801637 2686112 2451830 465015
7006 465015 -2791026 -5178869 -5744570 -5284850 -4337955 -2606800 -559970 406155 73502
6997 73502 -90152 589354 705651 -812976 -2603989 -2890352 -2344493 -2862351 -4258782
6988 -4258782 -4478111 -2869762 -988343 22363 613035 971210 308362 -1104799 -1439077
6979 -1439077 -146171 795984 72083 -634726 407213 1714179 1127123 61984 1605100
6970 1605100 4908694 5414308 1400849 -3170885 -3963615 -1699777 -294898 -1546651 -3838089
6961 -3838089 -4907609 -3991920 -1904334 -384197 -765107 -2348774 -2974994 -1928859 -905831
6952 -905831 -1169444 -1594509 -1074107 -885682 -2266807 -3226535 -875780 3781017 6585092
6943 6585092 5732997 3493893 2032137 649117 -1668759 -3743438 -3979371 -2564186 -248555
6934 -248555 3120356 6988729 8855169 7020269 3424621 1406991 1404231 1181797 -209657
6925 -209657 -1262858 -901738 -161318 -254380 -756598 -619816 263622 1254094 1762610 1413004
6915 1413004 393032 -113234 900713 2327631 1730294 -1204788 -3585385 -2910018 -384241
6906 -384241 965522 428547 -178625 74872 13111 -971638 -1206033 837357 3703690
6897 3703690 4385957 2258449 -73230 -158640 1416261 2308540 1590833 483136 352943
6888 352943 1236571 2396907 3190557 2997955 1342476 -1191606 -2888979 -2566129 -889969
6879 -889969 569142 1133765 1289519 1694223 2553118 3490922 3571451 2200825 475186
6870 475186 407902 2013558 2759062 1261058 -385375 -153004 85470 -2240227 -4751543
6861 -4751543 -2370496 4621315 9644389 8465597 4271733 1715688 294075 -2604767
6853 -2604767 -5604048 -5147419 -1571884 1214771 1300048 76570 -1280822 -2715441 -3139263
6844 -3139263 -1422653 524127 -338128 -3005109 -3364119 -875415 209432 -2297588 -4976092
6835 -4976092 -4426436 -2280488 -1479998 -1202210 593616 2350490 1116039 -2047482 -3266002
6826 -3266002 -1781601 -574046 -1181899 -1892343 -1635896 -1862775 -3203396 -3631260 -1983279
6817 -1983279 -607392 -1966563 -4498872 -4659510 -2032001 421606 886138 656321 1088249
6808 1088249 1231549 -42533 -1543462 -1493513 -614244 -1134029 -3123697 -4290693 -3715045
6799 -3715045 -3281953 -4347076 -5356244 -4642163 -3626075 -4651156 -6827232 -6961591 -4264659
6790 -4264659 -1276383 66015 487481 861708 436585 -1051692 -1860189 -746852 652115
6781 652115 -54797 -2529717 -4107155 -3069479 -168890 2542423 3311869 1840868 -94603
6772 -94603 40799 2569698 4864407 4707186 3263742 3156776 4588057 5398191 4470267
6763 4470267 2879381 1603230 258136 -1201881 -1413820 450191 2858651 3593906 2741090
6754 2741090 2388199 3181233 2876999 -408466 -4617889 -5604187 -2657068 216463 -256874
6745 -256874 -2172834 -1771688 613668 1323605 -670906 -2466839 -2264132 -1771491 -2213069
6736 -2213069 -1702074 1014934 3336091 2326353 -876770 -3179923 -3953399 -4079630 -2582675
6727 -2582675 1718537 6253169 6730622 3197846 247651 679238 2498200 3076473 2785413
6718 2785413 2897271 2863261 1834487 773780 866483 1236665 231835 -1909479 -3389204
6709 -3389204 -3383718 -2901199 -3215219 -4247847 -4566349 -2895713 105878 1940179 939835
6700 939835 -1565438 -2952139 -2766674 -2819828 -3971325 -4885991 -4436986 -3359111 -2667149
6691 -2667149 -2165785 -1528568 -1301297 -1730808 -1962198 -1504750 -1246364 -1934461 -2843984 -2973958
6681 -2973958 -2317707 -996517 1254085 3414113 2861702 -1097513 -4757586 -3797662 972535
6672 972535 4356660 3373026 507328 -364107 1117371 2490638 2355135 1540734 1128256
6663 1128256 1199587 1611215 2518229 3583841 3657719 2050551 -283189 -1571808 -1207906
6654 -1207906 -356447 -419510 -1326165 -1773074 -1046241 -70807 -268501 -1595826 -2440876 -1882414
6644 -1882414 -1371809 -2976285 -6000145 -7039914 -4425789 -1097394 -1039443 -3659821 -4379371
6635 -4379371 -1043133 3033848 3662744 1043835 -1451253 -1875790 -762482 1074951 3155447
6626 3155447 4363113 3880619 2937427 3382227 4560706 3905667 879316 -1952645 -2434480
6617 -2434480 -1393601 -807133 -1120071 -1521009 -1675359 -2085353 -3307193 -5277978 -6921942
6608 -6921942 -6643245 -4189754 -1586331 -776641 -880383 170484 1683328 720619 -2998943
6599 -2998943 -5678252 -4264843 -278661 2729423 3371391 2352777 309037 -2064353
6591 -2064353 -3221133 -2384873 -1070754 -1164461 -2348387 -3022901 -2723233 -1943364 -703741
6582 -703741 794982 1137629 -559756 -2653355 -2886004 -1706555 -1456946 -2620365 -3190203
6573 -3190203 -1828676 424568 1879309 1901439 695818 -980131 -1674906 -355020 2099320
6564 2099320 3827992 4368676 4601435 4493721 2877761 -193196 -2779721 -3466532 -2891418
6555 -2891418 -2152243 -1127334 745710 3146680 5150227 6037910 5428098 3519996 1464500
6546 1464500 421222 63697 -771601 -1940094 -2162238 -1522659 -1654068 -2681170 -2311242
6537 -2311242 532286 3268866 2977509 596084 -631942 129088 807583 204094 -486670
6528 -486670 -258237 74882 -270053 -540250 -926 514344 -35797 -1048499 -1204931 -655433
6518 -655433 -902916 -2548820 -4145922 -3605602 -448901 3398940 5135639 3822249 1541487
6509 1541487 1073910 2437784 3004331 1455678 -82536 785868 2871749 2885765 132101
6500 132101 -2666638 -3276661 -2341227 -1347414 -589215 -300383 -1572413 -4282165 -5805243
6491 -5805243 -4041592 -648188 1011316 381915 -228444 338370 753925 138185 -340482
6482 -340482 241389 901149 656320 223421 363596 171656 -1260202 -2744546 -2448633
6473 -2448633 -585017 1198034 2464571 4018744 5566455 5538376 3686756 1968680 1858855
6464 1858855 2146634 694986 -2355805 -4516192 -4027587 -1914469 -506863 -595484 -855002
6455 -855002 24043 1529551 2141665 1315936 -167160 -1490785 -2440985 -2840112 -2457626
6446 -2457626 -1708376 -1385567 -1347632 -533441 1256548 2726131 2870377 2270613 1833350
6437 1833350 1428081 785782 541048 1022540 999697 -822888 -3768382 -6086114 -7133861
6428 -7133861 -7144032 -5740465 -2717421 319080 1372008 867885 761132 1056369 20940
6419 20940 -1857419 -1380634 2507159 6235307 6089457 3010567 601021 146269 296131
6410 296131 398836 1086278 1913514 1265875 -1028464 -3182300 -3935797 -3715171 -3110544
6401 -3110544 -2182388 -1605600 -2362612 -3673286 -3433129 -1669648 -1256547 -3663173 -6199405
6392 -6199405 -5708106 -3238713 -2261981 -3315893 -3602412 -1759551 118765 -14239 -1309073
6383 -1309073 -1946983 -1765232 -1442061 -813670 295722 922515 380235 -266050 111230
6374 111230 524920 -668793 -2881743 -3993035 -3510527 -2792679 -2246001 -768488 1571065
6365 1571065 2755192 1822316 583968 849022 1600635 782886 -1192051 -1727325 485958
6356 485958 3878359 5913662 5433948 3042695 137415 -2148219 -3529637 -4282343 -4398353
6347 -4398353 -3523697 -1928551 -756810 -745318 -1340313 -1647455 -1542889 -1229955 -578270
6338 -578270 211942 124379 -1396252 -3331254 -4335289 -4440077 -4373883 -3968426 -2745030
6329 -2745030 -1492275 -1512402 -2534643 -3053800 -2580387 -1817148 -786084 1076115 2762863
6320 2762863 2062626 -1032914 -3496334 -3153690 -1438839 -659195 -417409 988340 2980765
6311 2980765 3262099 1493355 -162465 -300054 197153 262991 87081 -276800 -1605904
6302 -1605904 -3620298 -4322987 -2878892 -1560904 -2733886 -5014839 -4888087 -1658685 1826961
6293 1826961 3558733 4723550 6670221 7993321 6558207 2845143 -744528 -2875486
6285 -2875486 -3669830 -3082183 -1135319 713536 778407 -301390 -333073 1101925 2370040
6276 2370040 2928886 4010883 5522462 5259140 2651528 430914 500770 829075 -881722
6267 -881722 -2943512 -2611599 -1267460 -2274715 -4625948 -3735777 905992 3793652 1128285
6258 1128285 -3581608 -4571101 -1465838 1481432 1796053 849658 363261 89193 -805227
6249 -805227 -2217791 -3285205 -2849589 -228420 3181604 4089422 1041349 -2928171 -3773629
6240 -3773629 -1926760 -1436255 -3777829 -5900029 -5267812 -3435609 -2674924 -2035658 267294
6231 267294 2579494 1565873 -2406732 -5172661 -4492253 -2791217 -2985332 -4253815 -4065628
6222 -4065628 -2571158 -2209842 -3465303 -3716964 -1060508 2663304 4047285 2316908 -129781
6213 -129781 -1052559 -780711 -925660 -1835299 -2334040 -1639470 -542313 -380731 -1358090 -2307489
6203 -2307489 -1993002 -355899 1529790 2517502 2232204 930766 -1043356 -3128764 -3996112
6194 -3996112 -2161542 2075693 5978528 6875113 5142635 3395581 2709339 1439839 -1483534
6185 -1483534 -4053084 -3780627 -1541781 -513227 -1689805 -2770863 -1690792 904629
6177 904629 3276737 4643305 4670335 2820748 -367441 -2751068 -2817200 -1483403 -526995
6168 -526995 -403834 -899639 -2548918 -5535139 -8140977 -8330467 -6396916 -4266128 -2665417
6159 -2665417 -820808 1445125 3250196 4081691 3913664 2274593 -784498 -3151062 -2499885
6150 -2499885 255081 1780520 855578 -423509 -393416 33768 -31277 502541 2446317
6141 2446317 4402634 4842606 4155619 3033521 977648 -1627192 -2176693 723880 4096437
6132 4096437 3830031 217073 -2573733 -2132356 -192826 677781 267151 -82916 327985
6123 327985 1009652 1003390 -189207 -1841741 -2471829 -1797119 -1574577 -3412267 -6319121
6114 -6319121 -7607175 -5812765 -1809409 2269303 4256971 3109394 94252 -2067696
6106 -2067696 -2360024 -2535748 -3852934 -4624760 -3013320 -376830 906781 1377087 2934551
6097 2934551 4495636 3140966 -609900 -2646869 -1038687 1565090 2278583 1488443 790936
6088 790936 452173 473410 1548198 3308783 3873773 2613960 1218333 771769 240658
6079 240658 -717557 -247126 2308644 4084159 2408008 -1162276 -3261362 -3501103 -3916274
6070 -3916274 -4904960 -4907315 -3672871 -2943289 -3677710 -4755773 -4664330 -2892465 152078
6061 152078 3029912 3521103 881027 -2418252 -3174422 -1577240 -740104 -1952233 -2759151
6052 -2759151 -738244 2836215 4783736 4301887 3517539 3957829 4328612 2726025 -70520
6043 -70520 -1205081 298001 1920178 1082220 -1187006 -1868132 -393419 953866 953209
6034 953209 1025598 2209808 3269332 3262546 3593235 5459523 7153215 6271265 3350545
6025 3350545 1008816 378041 526793 633543 589155 43122 -1086120 -1669745 -914697
6016 -914697 -235902 -1410877 -3384904 -3350076 -858037 1574566 2103983 1450344 794496
6007 794496 96846 -756615 -1121816 -803932 -545107 -625825 -393645 365858 1099028 1855324
5997 1855324 3224359 4420641 3386451 -280146 -4183001 -5889886 -5367021 -3889525
5989 -3889525 -2288917 -1360304 -2193494 -4521762 -6107486 -5352993 -3401406 -2192213 -1700548
5980 -1700548 -906108 -367100 -1502049 -3713510 -4534808 -2947983 -724931 79158 -560181
5971 -560181 -1553257 -2564109 -3766836 -4510336 -3692893 -1608794 -268529 -1058518 -2656174
5962 -2656174 -2502754 -434370 672346 -1110543 -3500034 -2710646 1216496 4296500 4058722
5953 4058722 2494831 2444231 3497677 3441672 1875961 -7888 -1921673 -4114549 -5336410
5944 -5336410 -3992871 -1117723 563216 689582 1564391 3810185 4760530 2702871 58888
5935 58888 19035 1884369 2436365 870913 -445792 33557 850279 -28829 -2411124
5926 -2411124 -4390649 -4561968 -3067344 -1206714 -394592 -817152 -947237 793224 3680220
5917 3680220 4864677 2307999 -3007880 -7923672 -9562559 -7156212 -2571215 770426
5909 770426 628426 -1925072 -3928648 -4149258 -3949870 -4317544 -3998121 -1832132 737730
5900 737730 1483609 828562 1346955 3995807 6725034 7189450 5433104 3374102 2624001
5891 2624001 3297218 4301997 4404526 3270587 1480300 -467159 -2413527 -3488462 -2128064
5882 -2128064 1695065 5443813 6812507 6499454 6320220 5841009 3722208 1551688 2511040
5873 2511040 5849161 6711019 3059571 -921852 -814364 1865054 2702149 986494 -638496
5864 -638496 -1347696 -2507975 -3538434 -1989886 1648827 3375016 1374692 -1184985 -971376
5855 -971376 980987 1960560 2125459 3219535 4543913 3801691 1338531 88813 994989
5846 994989 1585167 112622 -1650060 -1474562 -314511 -499256 -1703238 -1525478 334966
5837 334966 1354440 149423 -1473884 -1716050 -1683288 -2993008 -4269472 -2905803 428056
5828 428056 2139894 829117 -870437 -561516 471501 -150418 -1992443 -2813307 -2190436
5819 -2190436 -1743967 -2347814 -3279520 -3914546 -4350681 -4417704 -3817900 -3215158 -3441393 -3642262
5809 -3642262 -2176431 382648 1285315 -550420 -2697409 -2484127 -520982 558307 -266900
5800 -266900 -1644143 -2025595 -1119861 394882 1294640 334233 -2299135 -4271620 -3211766
5791 -3211766 410616 3678820 4538099 3520790 2124989 956061 15865 -503460 -626036
5782 -626036 -853663 -1204999 -942386 -154630 -473239 -2763236 -4990803 -4340152 -1149685
5773 -1149685 1382261 1651959 1551355 2938706 4341417 3114823 -370159 -2954278 -2813708
5764 -2813708 -1399695 -971331 -1730751 -2094907 -897895 1346582 2985509 2705048 706140
5755 706140 -1502580 -2566593 -2316487 -1328950 -146891 790451 1355613 2370228 4887473
5746 4887473 8042481 9022984 6535939 2964003 1299653 1209660 410157 -1167457 -1519138
5737 -1519138 -403763 139136 -665088 -1283776 -977552 -1028147 -1984615 -2514509 -2125116 -2255062
5727 -2255062 -3331705 -3559555 -2270324 -1631901 -2936205 -3881376 -2110795 821788 1793574
5718 1793574 547488 -983607 -2126066 -3351790 -4047820 -3268811 -1760634 -772956 -7994
5709 -7994 900864 518625 -1884267 -3677466 -2343368 -263225 -1781684 -6047573 -7356709
5700 -7356709 -3179128 2351183 4229994 2284435 -496992 -2196946 -2541418 -1621520 -121666
5691 -121666 610899 166027 -357162 -98682 580518 1293614 2172435 2782690 2234164 835510
5681 835510 -71386 -226658 -535843 -868577 -2691 1844781 2784967 2147433 1282085 903206
5671 903206 154589 -991705 -1195792 -596569 -1240674 -3309469 -4006827 -2084985 -400635
5662 -400635 -1486577 -3468351 -3497227 -2697314 -3803119 -5604932 -4255949 216818 3020008
5653 3020008 1161549 -2522227 -3528271 -1367562 858485 961997 -282920 -1002931 -541010
5644 -541010 164997 -307515 -2388336 -4656436 -4730684 -1780627 1956491 3231744 1745401
$$ [...]
##END NTUPLES=NMR SPECTRUM
##END=
