##TITLE=31Pdec_SR52_oil
 D2O, 124 sc
 9.04.2021
##JCAMPDX= 6.0         $$ Bruker NMR JCAMP-DX V2.0
##DATA TYPE= NMR SPECTRUM
##DATA CLASS= NTUPLES
##ORIGIN= UXNMR, Bruker Analytische Messtechnik GmbH
##OWNER= root
$$ XWIN-NMR		Version 3.5
$$ Fri Apr  9 13:42:40 2021 Russian Standard Time (UT+4h)  she@DPX200
##.OBSERVE FREQUENCY= 81.013821
##.OBSERVE NUCLEUS= ^31P
##.ACQUISITION MODE= SIMULTANEOUS
##.ACQUISITION SCHEME= undefined
##.AVERAGES= 24
##.DIGITISER RES= 16
##SPECTROMETER/DATA SYSTEM= spect
##.PULSE SEQUENCE= zgpg30
##.SOLVENT NAME= D2O
##.SHIFT REFERENCE= (INTERNAL, D2O, 0, 248.564)
##AUDIT TRAIL= $$ (NUMBER, WHEN, WHO, WHERE, WHAT)
$$ ##TITLE= Audit trail, XWIN-NMR		Version 3.5
$$ ##JCAMPDX= 5.01
$$ ##ORIGIN= Bruker BioSpin GmbH
$$ ##OWNER= she
$$ F:/spectra/data/she/nmr/P31/1/pdata/1/auditp.txt
$$ ##AUDIT TRAIL=  $$ (NUMBER, WHEN, WHO, WHERE, WHAT)
(   1,<2021-04-09 13:40:25.76 +0400>,<she>,<DPX200>,
      <created by zg, POWCHK disabled, PULCHK disabled
       configuration hash MD5:
       00 E9 B6 7A A2 85 ED C7 34 08 36 98 17 FE 4E 26
       data hash MD5: 32K
       A1 D0 37 74 AD CC 0F 11 B4 D2 6B BB 63 59 14 FD>)
(   2,<2021-04-09 13:40:40.12 +0400>,<she>,<DPX200>,
      <Start of raw data processing
       efp BC_mod = 2 LB = 1 FT_mod = 6 PKNL = 1 PHC0 = -5476.107 PHC1 = 840.0017 SI = 64K 
       data hash MD5: 64K
       A6 00 5F 01 D3 8A F4 C1 23 6D 83 6D 3A 86 7C A1>)
(   3,<2021-04-09 13:41:16.07 +0400>,<she>,<DPX200>,
      <pk PHC0 = 168.4016 PHC1 = -409 
       data hash MD5: 64K
       BB F7 6B BF 34 65 AD 98 9B CF C8 C0 E0 23 ED D4>)
(   4,<2021-04-09 13:41:19.31 +0400>,<she>,<DPX200>,
      <abs ABSG = 5 
       data hash MD5: 64K
       09 9C C4 E8 75 D5 CF 48 58 BC 66 66 14 8F B0 02>)
(   5,<2021-04-09 13:42:03.20 +0400>,<she>,<DPX200>,
      <pk PHC0 = 9.388165 PHC1 = -22.00001 
       data hash MD5: 64K
       7F 95 87 9A 97 C1 32 E1 54 9E F0 FF B1 89 93 4F>)
(   6,<2021-04-09 13:42:09.20 +0400>,<she>,<DPX200>,
      <abs ABSG = 5 
       data hash MD5: 64K
       46 EC 88 8C B2 97 A4 B6 7F 64 53 3F 35 E8 B3 F0>)
$$ ##END=
$$ 
$$ hash MD5
$$ F0 CC 4D 8B 1D 31 58 DB 23 32 E0 47 05 17 BB 35
##$RELAX= 
##$RELAX= 
##$RELAX= 
##$RELAX= 
##$RELAX= 
##$RELAX= 
##$RELAX= 
##$RELAX= 
$$ Bruker specific parameters
$$ --------------------------
##$DU= <F:/spectra>
##$EXPNO= 1
##$NAME= <P31>
##$PROCNO= 1
##$TYPE= <nmr>
##$USER= <she>
##$AMP= (0..31)
100 100 100 100 100 100 100 100 100 100 100 100 100 100 100 100 100 100 
100 100 100 100 100 100 100 100 100 100 100 100 100 100 
##$AQSEQ= 0
##$AQ_mod= 1
##$AUNM= <au_zg>
##$AUTOPOS= <>
##$BF1= 81.014009
##$BF2= 200.13
##$BF3= 200.13
##$BF4= 200.13
##$BF5= 200.13
##$BF6= 200.13
##$BF7= 200.13
##$BF8= 200.13
##$BYTORDA= 1
##$CFDGTYP= 0
##$CFRGTYP= 5
##$CHEMSTR= <none>
##$CNST= (0..31)
1 1 145 1 1 1 1 1 1 1 1 1 1 1 1 1 1 1 1 1 1 1 1 1 1 1 1 1 1 1 1 1 
##$CPDPRG= <waltz16>
##$CPDPRG1= <>
##$CPDPRG2= <waltz16>
##$CPDPRG3= <>
##$CPDPRG4= <mlev>
##$CPDPRG5= <mlev>
##$CPDPRG6= <mlev>
$$ [...]
##$SUBNAM3= <"">
##$SUBNAM4= <"">
##$SUBNAM5= <"">
##$SUBNAM6= <"">
##$SUBNAM7= <"">
##$SUBNAM8= <"">
##$SUBNAM9= <"">
##$SW= 501.771253377433
##$SWIBOX= (0..15)
0 1 3 0 0 0 0 0 0 0 0 0 0 0 0 0 
##$SW_h= 40650.406504065
##$TD= 32768
##$TD0= 1
##$TE= 0
##$TE2= 300
##$TE3= 300
##$TEG= 300
##$TL= (0..7)
0 120 53 12 22 120 120 120 
##$TP= (0..7)
150 150 150 150 150 150 150 150 
##$TP07= 0
##$TPNAME0= <>
##$TPNAME1= <>
##$TPNAME2= <>
##$TPNAME3= <>
##$TPNAME4= <>
##$TPNAME5= <>
##$TPNAME6= <>
##$TPNAME7= <>
##$TPOAL= (0..7)
0.5 0.5 0.5 0.5 0.5 0.5 0.5 0.5 
##$TPOFFS= (0..7)
0 0 0 0 0 0 0 0 
##$TUNHIN= 0
##$TUNHOUT= 0
##$TUNXOUT= 0
##$USERA1= <user>
##$USERA2= <user>
##$USERA3= <user>
##$USERA4= <user>
##$USERA5= <user>
##$V9= 5
##$VALIST= <valist>
##$VCLIST= <CCCCCCCCCCCCCCC>
##$VD= 0
##$VDLIST= <DDDDDDDDDDDDDDD>
##$VPLIST= <PPPPPPPPPPPPPPP>
##$VTLIST= <TTTTTTTTTTTTTTT>
##$WBST= 1024
##$WBSW= 4
##$XGAIN= (0..3)
0 0 0 0 
##$XL= 0
##$YL= 0
##$YMAX_a= 13114
##$YMIN_a= -14190
##$ZGOPTNS= <>
##$ZL1= 120
##$ZL2= 120
##$ZL3= 120
##$ZL4= 120
##$ABSF1= 248.5645
##$ABSF2= -253.2056
##$ABSG= 5
##$ABSL= 3
##$ALPHA= 0
##$AQORDER= 0
##$ASSFAC= 0
##$ASSFACI= 0
##$ASSFACX= 0
##$ASSWID= 0
##$AUNMP= <proc_1d>
##$AZFE= 0.1
##$AZFW= 0.5
##$BCFW= 0
##$BC_mod= 2
##$BYTORDP= 0
##$COROFFS= 0
##$CY= -3
##$DATMOD= 1
##$DC= 0
##$DFILT= <>
##$DTYPP= 0
##$F1P= 0
##$F2P= 0
##$FCOR= 1
##$FTSIZE= 65536
##$FT_mod= 6
##$GAMMA= 0
##$GB= 0
##$INTBC= 1
##$INTSCL= 5.30512e-09
##$ISEN= 30
##$LB= 1
##$LEV0= 0
##$LPBIN= 0
##$MAXI= 10000
##$MC2= 0
##$MEAN= 0
##$ME_mod= 0
##$MI= 50
##$NCOEF= 0
##$NC_proc= -4
##$NLEV= 6
##$NOISF1= 182.463
##$NOISF2= 159.3651
##$NSP= 0
##$NTH_PI= 0
##$NZP= 0
##$OFFSET= 248.5645
##$PC= 4
##$PHC0= -5298.318
##$PHC1= 409.0017
##$PH_mod= 1
##$PKNL= yes
##$PPARMOD= 0
##$PSCAL= 0
##$PSIGN= 0
##$REVERSE= no
##$SF= 81.014009
##$SI= 65536
##$SIGF1= 159.3651
##$SIGF2= -187.1042
##$SINO= 113.3802
##$SIOLD= 16384
##$SREGLST= <1H.CDCl3>
##$SSB= 0
##$STSI= 65536
##$STSR= 0
##$SW_p= 40650.406504065
##$SYMM= 0
##$S_DEV= 0
##$TDeff= 32768
##$TDoff= 0
##$TI= <>
##$TILT= no
##$TM1= 0
##$TM2= 0
##$TOPLEV= 0
##$USERP1= <user>
##$USERP2= <user>
##$USERP3= <user>
##$USERP4= <user>
##$USERP5= <user>
##$WDW= 1
##$XDIM= 65536
##$YMAX_p= 305051792
##$YMIN_p= -4225088
$$ End of Bruker specific parameters
$$ ---------------------------------
##NTUPLES= NMR SPECTRUM
##VAR_NAME=  FREQUENCY,     SPECTRUM/REAL,   SPECTRUM/IMAG
##SYMBOL=    X,             R,               I
##VAR_TYPE=  INDEPENDENT,   DEPENDENT,       DEPENDENT
##VAR_FORM=  AFFN,          ASDF,            ASDF
##VAR_DIM=   65536,         65536,           65536
##UNITS=     HZ,            ARBITRARY UNITS, ARBITRARY UNITS
##FACTOR=    0.620285442955139, 1,           1
##FIRST=     20137.2065510759, 0,            0
##LAST=      -20513.1999529892, 0,           0
##MIN=       -20513.1999529892, -4225088,    0
##MAX=       20137.2065510759, 305051792,    0
$$ Real data points
##PAGE= N=1
##DATA TABLE= (X++(R..R)), XYDATA
$$ [...]
42824 309519 314926 68446 -203602 -421994 -519594 -296942 241367 613009 357741 -290464
42814 -290464 -655225 -474622 -94800 112630 73389 -185260 -557441 -712727 -434651 -77997
42804 -77997 -143007 -444383 -368243 54863 153283 -176971 -195435 398186 853827 636163
42794 636163 396030 832555 1351382 961930 34973 -78271 924266 1832917 1681433
42785 1681433 920796 431544 245369 -116197 -618059 -758382 -416892 -60395 -94947 -390264
42775 -390264 -516787 -245746 239211 518795 310153 -268889 -799085 -954102 -801928 -713597
42765 -713597 -960963 -1381672 -1500462 -1094447 -567814 -514461 -894813 -1008777 -473359 141023
42755 141023 25890 -752314 -1318482 -1099846 -433340 -11161 -88515 -379160 -478380 -224412
42745 -224412 227030 566285 594251 336691 -76828 -496567 -688288 -470970 -88237 -115693
42735 -115693 -684327 -1113835 -783781 -118381 -83752 -785269 -1253152 -759931 273456 965195
42725 965195 1034490 793354 492853 151713 -182256 -430138 -656991 -934714 -1106643 -972007
42715 -972007 -651433 -488342 -568797 -573492 -197483 414838 763066 508151 -149408 -646946
42705 -646946 -610673 -150882 404811 877781 1180136 1109881 561282 -122833 -398891 -180918
42695 -180918 90139 104651 32298 76039 86831 -113897 -361251 -406787 -285091 -110921
42685 -110921 227264 803472 1304138 1366181 1123077 973195 895614 498899 -213690 -642511
42675 -642511 -378773 172562 248585 -386259 -1238661 -1646632 -1373471 -745973 -338422 -442303
42665 -442303 -767274 -767838 -315746 124089 93100 -278784 -490548 -339464 -111209 -111626 -254202
42654 -254202 -226175 73371 417139 553426 493430 409145 314598 34349 -434245 -726989
42644 -726989 -528946 -88475 30681 -252859 -386434 -21500 404042 308622 -134873 -314053
42634 -314053 -233381 -545781 -1408774 -2016374 -1680860 -842779 -438941 -618781 -735027 -431162
42624 -431162 -36055 155091 314457 565404 611273 269375 -47152 137925 594044 648470
42614 648470 148232 -310502 -202408 249116 419657 80267 -414958 -662096 -658590 -624664
42604 -624664 -577385 -347874 3298 116702 -142979 -371718 -158221 249894 233557 -309790
42594 -309790 -839582 -982825 -973447 -1118149 -1326815 -1462849 -1682613 -2007137 -1966577 -1221115
42584 -1221115 -276649 9894 -459996 -940073 -823547 -225893 398659 721848 578059
42575 578059 33892 -451189 -367873 188702 588181 500046 229718 77051 -131853 -568767
42565 -568767 -917069 -802328 -400559 -153451 -81138 146955 567963 844508 843753 833654
42555 833654 954766 897091 397590 -188781 -205425 431358 1015778 888062 271847 -23711
42545 -23711 319900 735896 611310 152241 16881 294898 394287 -20669 -515531 -550595
42535 -550595 -224569 17890 109225 318705 627869 642631 200632 -307774 -384989 44070
42525 44070 675601 1177854 1330337 1009199 297430 -445297 -858415 -949731 -1000340 -1074083
42515 -1074083 -877378 -267058 342684 406298 -15119 -321755 -215789 -69717 -278081 -624560
42505 -624560 -621682 -211211 248330 506918 560150 429771 227861 296670 789862 1199208
42495 1199208 869117 -6074 -519780 -304444 22115 -83128 -285920 -105212 183452
42486 183452 56841 -281166 -214540 226032 411512 153545 -90665 -130548 -367280 -922686
42476 -922686 -1161649 -591770 264724 493219 -11045 -547296 -657309 -559427 -519177 -395423
42466 -395423 -75575 98505 -223654 -748621 -800343 -235322 310007 248603 -187267 -285153
42456 -285153 208585 832127 1080805 997729 937749 991124 925323 633917 356847 342357
42446 342357 462838 368440 -4518 -294622 -202359 50578 -8642 -441868 -839611 -985615
42436 -985615 -1183471 -1661499 -2023253 -1750410 -1022562 -478097 -265767 16074 396490 304894
42426 304894 -418391 -980392 -665246 93875 333106 -77429 -386151 -102983 505811 1003827
42416 1003827 1181233 855144 1748 -768646 -611491 366276 1009325 639706 23777
42407 23777 205115 951625 1208154 748151 392475 616463 910131 784215 569221 739693
42397 739693 1095733 1195552 1121656 1193560 1274960 1042555 719091 815940 1204636 1154839 395236
42386 395236 -493167 -913757 -906638 -752062 -504191 -238018 -224543 -451611 -431635 63497
42376 63497 499750 320784 -196954 -418991 -357936 -516937 -928449 -1089085 -816928 -478671
42366 -478671 -306133 -136185 56072 -5030 -338684 -559427 -494819 -409498 -401577 -157904
42356 -157904 389253 733546 525944 141100 64447 148880 -19904 -376746 -526541 -381533
42346 -381533 -153031 77843 310214 350953 71037 -256180 -361868 -516639 -1074553 -1643204
42336 -1643204 -1427633 -433704 399434 476784 266510 361243 465896 -18965 -801789 -933042
42326 -933042 -235303 289765 -178838 -1122536 -1449980 -1026680 -674348 -747348 -609949 156108
42316 156108 846039 621662 -135841 -323672 291176 879503 904774 747866 784859 700657
42306 700657 150672 -524605 -713014 -248105 572995 1254317 1221880 296501 -715379 -623536
42296 -623536 583514 1514001 1153494 68273 -719016 -1125981 -1452015 -1336228 -449011
42287 -449011 429533 344179 -229363 -71750 744182 978273 361307 48122 612337 1084734
42277 1084734 646326 -20111 26472 414565 184593 -608785 -1080965 -914231 -607428 -490043
42267 -490043 -303184 208808 869828 1314565 1318936 916236 436704 316834 633570 970386
42257 970386 938814 631499 371636 275107 287899 374083 386852 24521 -739756 -1371011
42247 -1371011 -1265825 -465646 363288 615341 272481 -163735 -164708 320213 841258 1029748
42237 1029748 1042336 1136531 1027983 254709 -860033 -1332360 -817799 -119471 -52525 -417623
42227 -417623 -564978 -426195 -389246 -532474 -600647 -525949 -450351 -392372 -335368 -481028 -990740
42216 -990740 -1605272 -1883804 -1691344 -1175461 -494580 127223 375047 253785 233210 569507
42206 569507 793785 373678 -397818 -755042 -505102 -114784 120302 348007 611470 667910
42196 667910 497399 468511 771545 1054241 854347 207009 -300538 -16883 1125841 2320588
42186 2320588 2490425 1462618 269870 -80558 190785 184367 -263780 -497169 -250662
42177 -250662 -51083 -223392 -308054 131978 757927 1000594 895479 857219 944712 881631
42167 881631 647797 563112 780467 1043587 1024202 701168 333568 144032 77949 -95652
42157 -95652 -424139 -636999 -529356 -343517 -470547 -841102 -1002574 -825617 -679933 -758311
42147 -758311 -712440 -288801 102513 -30940 -358310 -16504 1164773 2275439 2409734
42138 2409734 1766670 1302597 1461554 1684556 1276368 406056 -104158 101652 413763
42129 413763 70690 -807921 -1359290 -1070794 -362438 12718 -156345 -455624 -429270 -6700
42119 -6700 548615 884221 776669 309025 -126521 -147025 235339 629131 694418 453434
42109 453434 130044 -166392 -438709 -575145 -374403 133365 585424 654446 403205 127595
42099 127595 -39792 -165725 -225524 -46943 383157 753128 709137 245651 -253755 -353758
42089 -353758 31980 543381 745180 623925 544767 630926 493140 -130585 -755045 -668738
42079 -668738 40609 529965 286925 -363517 -906472 -1202752 -1223199 -825562 -148551 267236
42069 267236 152224 -103370 -102753 -50631 -267840 -516432 -358623 109627 434878 485884
42059 485884 420197 181887 -373451 -958590 -1053778 -652118 -317322 -431030 -777227 -942088
42049 -942088 -797180 -500999 -236989 -4989 383975 992430 1451810 1327503 844671 693847
42039 693847 913021 705572 -175229 -712310 -105503 808723 748952 23051 -12441 767657
42029 767657 1082826 440284 -93847 192959 448961 -188224 -1019555 -848355 194428
42020 194428 970052 942745 479965 -67674 -629142 -980973 -931515 -847219 -1240224 -1878791
42010 -1878791 -2006619 -1452420 -854088 -687923 -696478 -491968 -204439 -189537 -416861 -525980
42000 -525980 -384755 -269150 -403283 -535354 -234937 395849 654707 120556 -692449 -971176
41990 -971176 -675480 -425043 -439751 -297010 173562 485949 262544 -232208 -639991 -967958
41980 -967958 -1144825 -805813 -37987 318428 -202929 -813321 -510284 414320 799094 320567
41970 320567 -149260 98124 730567 1063454 972537 807789 801108 836569 636525 91133
41960 91133 -504661 -674554 -371143 -82328 -77990 33214 539895 867042 297271 -816947
41950 -816947 -1383559 -1028115 -409616 -78628 115856 328194 309158 55764 87037 571893
41940 571893 824014 250287 -690739 -1096801 -834314 -522449 -533422 -626096 -506997 -217391
41930 -217391 87004 333188 432686 304654 76036 3059 115149 155264 -29513 -222660
41920 -222660 -115226 235192 393031 60978 -472830 -570575 1325 716527 879277 456209
41910 456209 30609 -32727 6522 -193675 -502128 -594944 -517179 -577822 -807624 -921109
41900 -921109 -832401 -837676 -1129614 -1400109 -1180660 -481003 146145 212670 -181820 -525764
41890 -525764 -513810 -338133 -319730 -400043 -218226 280636 568767 122385 -795961 -1282793
41880 -1282793 -865216 -152839 -109657 -811364 -1344901 -1007365 -179636 255253 22656 -430340
41870 -430340 -733401 -977562 -1262346 -1335793 -928473 -188283 429864 577234 239304 -260830
41860 -260830 -434069 -42290 573509 831421 650941 551116 884389 1328276 1382617 1076125
41850 1076125 865547 1000794 1244678 1132207 415188 -567934 -977163 -325636 696577
41841 696577 838124 -51364 -686802 -151424 724761 622299 -234217 -450556 360594 1032460
41831 1032460 660198 -168025 -456156 -231987 -213833 -608774 -914891 -643716 226988 1289296
41821 1289296 1874560 1504257 501363 -185370 -114798 56272 -465840 -1431020 -1891930
41812 -1891930 -1508899 -897287 -712989 -934699 -1133451 -1013898 -548678 88531 568558
41803 568558 630984 400015 295301 531079 875454 1000366 891251 754187 638398 373902
41793 373902 -88191 -471496 -498725 -346850 -478193 -898838 -930002 -106227 923726 1012551
41783 1012551 88485 -569479 -10090 1009829 972179 -382219 -1730737 -1845105 -882611
41774 -882611 189350 815392 1059708 1025926 675685 154629 -187244 -233733 -282128 -636360
41764 -636360 -1183786 -1511833 -1355440 -829597 -288139 -35077 -96702 -172638 111885 757220
41754 757220 1254306 1116721 542318 247083 522308 794115 419251 -366877 -774550 -588793
41744 -588793 -362536 -405720 -258869 442299 1135261 980782 39112 -856880 -1245549 -1352852
41734 -1352852 -1295661 -783847 122451 713231 595012 372471 728181 1278880 1139055 358644
41724 358644 -110722 118771 363502 83826 -246449 14894 645471 999858 971553 829372
41714 829372 505214 -170848 -792559 -801203 -505067 -778852 -1631339 -1964573 -1110168 170845
41704 170845 745121 552759 360248 488827 513661 111228 -406648 -509333 -55206 604324
41694 604324 957226 766635 273376 -86748 -164542 -120301 -19330 226465 473342 384914
41684 384914 34211 -46630 292957 467398 66425 -390742 -190735 479798 827260 571497
41674 571497 110338 -267553 -664198 -1100192 -1346457 -1280041 -992099 -570707 -125396 122258
41664 122258 155929 342479 845112 1148223 725606 -94279 -553162 -475740 -189248 216051
41654 216051 697030 663615 -347926 -1564515 -1717918 -905037 -474679 -931409 -1314182
41645 -1314182 -1017804 -780376 -1149945 -1323164 -527902 542472 828404 553862 575417
41636 575417 821462 673656 343686 492317 809305 376186 -637382 -987356 -216649
41627 -216649 692990 812905 345798 -157413 -664495 -1201401 -1332544 -777925 -53333 106496
41617 106496 -319252 -724335 -691400 -383154 -244655 -522257 -990636 -1112201 -613285 153389
41607 153389 637253 734737 667998 419831 -164285 -792891 -900833 -496338 -210698 -323682
41597 -323682 -358626 68987 587282 651336 314798 -9821 -164665 -186514 4189 373415
41587 373415 526909 209175 -166591 -28998 445825 525832 28081 -357451 -49913 602745
41577 602745 847978 572638 371143 625630 948279 742593 63362 -430739 -356579 -68478
41567 -68478 -52147 -176396 33979 506687 552766 -139972 -916851 -953021 -356130 17546
41557 17546 -242001 -610555 -457860 104585 521670 612548 635216 665823 435788 -94688
41547 -94688 -446861 -208030 368104 678035 514690 172977 -46695 -70217 115754 431591
41537 431591 530431 126667 -444369 -507466 -47967 124381 -458411 -1117140 -913159 22441
41527 22441 679307 523628 17960 -241267 -293110 -460947 -665933 -510749 63022 555644
41517 555644 491044 66691 -41770 406915 815236 577536 57015 146650 907199 1383805
41507 1383805 997046 351457 195112 292318 30789 -434836 -529004 -358488 -493845 -822180
41497 -822180 -625753 135536 553304 23908 -979502 -1644377 -1678073 -1217801 -544951 -140388
41487 -140388 -379706 -888863 -821226 -51857 574423 518050 323287 617224 1040934 888377
41477 888377 284675 -69168 -12149 -7184 -251453 -408031 -238836 41376 101627 -195785
41467 -195785 -789296 -1362890 -1384626 -619085 403859 795667 228029 -783926 -1453660
41458 -1453660 -1342957 -546151 413389 915990 747690 254677 -123614 -268485 -162186
41449 -162186 351772 1164822 1600861 1136112 264231 -16090 443283 771029 378022 -245609
41439 -245609 -333585 125393 592362 808401 922689 1000364 877534 499644 86819 -112284
41429 -112284 -103241 -155263 -519396 -1041097 -1128651 -399417 622870 872974 15115 -1046434
41419 -1046434 -1264493 -693942 -171982 -71705 -47713 92039 59312 -189053 -157142 321347
41409 321347 550938 -47982 -874129 -847003 35196 692580 542988 204195 316763 487662
41399 487662 32602 -779746 -1005051 -335448 568036 1041067 1104814 1059290 891535 379674
41389 379674 -456147 -1244832 -1551503 -1225783 -534254 74613 389452 513423 500027 216031
41379 216031 -250246 -430042 -115850 165599 -150686 -748285 -846867 -403933 -175113 -553718
41369 -553718 -1079101 -1247671 -1109815 -826833 -335533 196448 243685 -280466 -659806 -322706
41359 -322706 329727 587216 477929 519378 746530 671461 81457 -697229 -1277290 -1505535
41349 -1505535 -1370985 -1023255 -774639 -719577 -515269 88937 736085 927357 768707 716983
41339 716983 786925 649288 406025 541279 1029504 1187428 647596 -91327 -378735 -203531
41329 -203531 53180 250467 463312 574035 319187 -277253 -798696 -849579 -483072 -143316
41319 -143316 -150382 -302750 -160502 281121 520369 295589 5977 54014 165698 -105168
41309 -105168 -512226 -454339 -18406 109670 -205311 -326209 22041 243477 -68940 -327676
41299 -327676 139110 934893 1131913 639936 246168 397673 690372 642526 319790 -19452
41289 -19452 -353430 -661210 -693411 -375873 -134353 -349485 -659308 -346879 554701 1116089
41279 1116089 734895 -3450 -191410 47138 -181871 -1029305 -1559985 -1215004 -745256
41270 -745256 -1016161 -1541347 -1154920 170520 1205091 1174552 643380 450119 603574
41261 603574 658419 509282 286746 -46977 -481730 -700921 -504574 -192541 -113966 -133330
41251 -133330 43440 313080 395010 335008 309989 173345 -271322 -714962 -635325 -93745
41241 -93745 286291 156339 -198921 -369722 -256631 46701 394856 549964 380737 159521
41231 159521 285424 671161 822377 587862 356736 376501 386105 174279 4871 117389
41221 117389 240287 80773 -35087 415377 1258499 1733926 1482928 915051 538592 421375
41211 421375 443907 585356 695259 431055 -180879 -469682 86003 986743 1212043 561703
41201 561703 -112204 -166788 -29045 -366120 -903694 -774870 127402 889367 792418 165992
41191 165992 -250750 -251468 -35679 409971 1181020 1908276 1994948 1432999 842188 593809
41181 593809 412508 33869 -274081 -206439 -13261 -118690 -414808 -440134 -122105 157209
41171 157209 190066 153586 169641 140796 126752 392919 875374 1059052 703166 289216
41161 289216 343495 625259 463212 -287389 -1100313 -1496885 -1462585 -1193768 -874695 -720640
41151 -720640 -817722 -862658 -459438 256464 689366 560476 194290 -75100 -306808 -569016
41141 -569016 -644707 -438241 -260760 -354364 -496856 -444278 -391161 -560051 -694486 -481016
41131 -481016 -176963 -232300 -508670 -500531 -174474 88501 291094 786797 1397770 1400987
41121 1400987 682576 137117 420189 922099 642728 -304693 -804834 -256779 679786
41112 679786 1000796 558986 74613 169288 681543 964286 682608 134722 -217857 -293653
41102 -293653 -268713 -121593 309380 843986 964332 448539 -326370 -888779 -1185573 -1382382
41092 -1382382 -1426908 -1116428 -476900 177244 534337 513015 256120 -20689 -213655 -354490
41082 -354490 -400136 -172971 269564 436059 13214 -473855 -221475 640794 1112108 752495
41072 752495 277608 376808 734050 788639 716595 863813 826173 80387 -871107 -1053273
41062 -1053273 -523630 -253852 -561580 -773223 -555983 -413124 -518595 -243621 538359
41053 538359 777690 -207184 -1394057 -1379543 -409009 162200 51268 273052 1171191 1679710
41043 1679710 1059620 157251 90363 570435 556075 -2670 -221759 147680 384878 163458
41033 163458 149020 761184 1256199 809402 -108278 -359936 163742 487074 207928 186402
41023 186402 1106724 2139964 1869906 266176 -1091120 -893150 387112 1225748 940067
41014 940067 320477 358200 889400 992237 514588 439005 1391956 2441790 2155631 580410
41004 580410 -734778 -738718 14682 540447 750060 974955 982682 419886 -244112 -236041
40994 -236041 279025 455091 169677 135578 512873 479619 -428918 -1477825 -1774582 -1400725
40984 -1400725 -909815 -382860 289791 725471 477157 -158656 -510923 -498056 -526983 -626837
40974 -626837 -440478 -2027 228721 141291 87119 142041 -45809 -514773 -772560 -561162
40964 -561162 -233512 -128602 -188930 -443648 -1136365 -1967166 -1989372 -908119 195941 241395
40954 241395 -337101 -414375 -43305 -258156 -1146502 -1484083 -625258 437560 526768 -155637
40944 -155637 -667236 -757689 -780236 -738190 -404592 -93514 -339930 -878101 -819217 58939
40934 58939 955870 1154482 825345 505232 374539 360429 464504 629890 627684 374438
40924 374438 82106 -134293 -495736 -1161741 -1856962 -2129123 -1781252 -930549 63176 610785
40914 610785 267949 -617542 -1015901 -364557 663083 940864 240921 -614544 -828171
40905 -828171 -422851 46646 213829 182541 237744 403318 365163 -73585 -564220 -533096
40895 -533096 57341 627247 747632 585137 435145 299104 199056 390956 828513 883719
40885 883719 164463 -757901 -1059217 -802413 -677982 -821707 -679789 -31298 614394 790022
40875 790022 627068 464646 412075 449389 509846 375936 -42796 -307420 108198 927720
40865 927720 1297218 1035859 896390 1272493 1456129 756045 -311309 -704653 -307608
40856 -307608 89248 33682 -128123 -15438 235747 335091 270860 184855 111981 -5854
40846 -5854 -203388 -419656 -445371 -80865 476316 638091 158700 -347786 -106392 689798
40836 689798 1015668 372059 -539805 -759944 -229178 365251 556782 438237 214498 -67387
40826 -67387 -313398 -334230 -140507 29976 127850 422849 995446 1395902 1173394 567456
40816 567456 237040 334331 296524 -329535 -1249973 -1817325 -1759124 -1298760 -822946 -662570
40806 -662570 -939267 -1349865 -1327037 -700183 10671 230965 7329 -260505 -435100 -531994
40796 -531994 -302605 436810 1194893 1205122 470711 -198469 -270533 -17433 148602 210742
40786 210742 186614 -124471 -641660 -772626 -157741 709511 1038287 660901 52156 -315181
40776 -315181 -310951 -90454 -3927 -330281 -834576 -865918 -179828 640233 907599 665581
40766 665581 411680 295904 90864 -224426 -379391 -283738 -155988 -148531 -173498 -135017
40756 -135017 -68718 -15220 53377 178090 411637 794638 1193773 1278209 829971 143
40746 143 -855035 -1472122 -1733262 -1613093 -1199053 -612135 126615 918134 1324816 952614
40736 952614 178522 -84877 373309 647881 -20826 -1116399 -1578506 -1243871 -856444
40727 -856444 -899556 -1142180 -1255903 -1217319 -1063143 -790525 -574164 -652896 -947539 -1128161
40717 -1128161 -1038737 -751228 -314591 187297 453846 246810 -228933 -571548 -691898 -762477
40707 -762477 -861028 -1011997 -1306103 -1566428 -1245771 -207854 722603 659900 -145514 -710021
40697 -710021 -677540 -499441 -459912 -411500 -396743 -606137 -698282 -98009 924286 1401947
40687 1401947 1060553 616991 491287 245039 -340946 -670269 -372067 -29943 -220408
40678 -220408 -594024 -571137 -259416 -29324 161804 367496 238629 -292323 -577518 -264208
40668 -264208 -63495 -618263 -1247397 -915076 11513 208634 -584232 -1220639 -909780 -208551
40658 -208551 49802 -102317 -129627 172677 634439 1030332 1122152 766509 221015 -6075
40648 -6075 204043 426120 314715 19201 -188350 -341118 -600442 -908182 -1047335 -918659
40638 -918659 -632944 -430804 -541368 -980143 -1461037 -1616189 -1294135 -604229 174833 633591
40628 633591 439711 -260544 -862759 -956358 -716310 -439079 -88202 330243 392574 -149923
40618 -149923 -737357 -648279 -60093 249527 71738 -169127 -388691 -911511 -1493818 -1316701
40608 -1316701 -304811 494478 378237 -3709 213937 692202 490022 -358982 -817023
40599 -817023 -282298 713055 1287625 1096007 353648 -510424 -1065191 -1092040 -747678 -353108
40589 -353108 -46232 166846 156759 -184744 -590539 -584569 -77092 492506 689402 513811
40579 513811 214298 -85096 -414213 -759576 -997711 -995895 -727402 -327942 -44714 -49848
40569 -49848 -266939 -432313 -368026 -182674 -171534 -480041 -870955 -935399 -616406 -372066
40559 -372066 -607949 -1075320 -1179336 -848735 -642040 -864950 -1078415 -805190 -303855 -179521
40549 -179521 -510559 -856675 -931595 -753493 -293556 433425 999685 918888 401979 126149
40539 126149 180442 -24603 -600368 -792007 -234026 219356 -294987 -1220853 -1344022 -617264
40529 -617264 -127887 -320686 -387211 325215 1317148 1834544 1920824 1952328 1802752 1198827
40519 1198827 428126 -42853 -309621 -682013 -913570 -576413 -7140 2711 -538387 -747006
40509 -747006 -232348 269984 8702 -695718 -975648 -591072 -86655 -27700 -466985 -1010808
40499 -1010808 -1162039 -767049 -266066 -240211 -603902 -645656 -65734 502838 360848 -299560
40489 -299560 -760387 -753459 -557038 -391292 -288749 -394654 -787614 -1042192 -565465 527777
40479 527777 1366117 1307407 592784 -113195 -447402 -423047 -144339 233586 440014 283570
40469 283570 -104821 -380404 -330723 -33172 304694 575562 811072 1023318 1092094 886509
40459 886509 448598 -62480 -554755 -944770 -971058 -392066 541645 1136751 973886 344545
40449 344545 -172445 -290110 -10372 580302 1191918 1313432 723539 -131046 -585540 -450536
40439 -450536 -27102 335898 424564 163313 -243510 -420458 -363328 -542274 -1118914 -1477108
40429 -1477108 -1028174 -99340 559078 789248 890759 838752 459846 138153 417465 976164
40419 976164 926053 176568 -406632 -342529 -152032 -399420 -918737 -1267731 -1243851 -756055
40409 -756055 73070 552428 68431 -733382 -473383 907391 1786245 1144232 17667
40400 17667 -214978 131899 -54927 -639326 -559674 246349 713889 371327 -107488 -185205
40390 -185205 -141843 -212770 -73824 374924 520704 -123010 -1105145 -1550868 -1194837 -552317
40380 -552317 -228785 -301801 -370450 -164833 1476 -315449 -786358 -480091 717270 1563667
40370 1563667 1057839 -15415 -128667 770593 1260502 596521 -343772 -504835 37091
40361 37091 622245 934340 871981 300589 -482517 -686568 -14546 801676 934913 410995
40351 410995 -304209 -1029313 -1612127 -1575680 -758927 140046 395644 249285 335275 500370
40341 500370 95716 -767899 -1232910 -997720 -715619 -900110 -1222876 -1221158 -1034170 -1008995
40331 -1008995 -1061225 -864119 -358986 255652 770080 946151 582914 -102476 -476927 -226964
40321 -226964 177623 137072 -211032 -248420 158933 505926 471591 344036 417402 424522 -57811
40310 -57811 -897607 -1496533 -1494670 -1052388 -469267 124118 616988 792873 583384 269493
40300 269493 189831 326330 385195 236116 46802 -18370 -365 18508 64301 138075 126495
40289 126495 17487 39999 354155 711864 717988 412105 277890 581557 977449 943665
40279 943665 398357 -313898 -860465 -1100442 -988962 -632114 -389698 -596556 -1136775 -1552220
40269 -1552220 -1602235 -1446638 -1256950 -998183 -695638 -529573 -457860 -125522 538705 985663
40259 985663 736822 160237 46456 526746 935273 753404 195534 -261131 -503453 -728622
40249 -728622 -1042337 -1312320 -1308817 -958398 -562328 -614270 -1153742 -1514523 -1129126 -384592
40239 -384592 -115750 -402287 -605271 -549719 -729600 -1132300 -916891 160813 969044 537820
40229 537820 -359911 -256972 841628 1550210 1205178 637315 652194 869290 589055 -37746
40219 -37746 -379373 -325144 -261264 -340383 -347906 -176494 15164 107393 181901 351478 587626
40208 587626 716000 524604 -37339 -715392 -1124918 -1133873 -965213 -895869 -991960 -1146674
40198 -1146674 -1192529 -947448 -365780 276709 541796 278443 -226544 -606113 -746608 -688321
40188 -688321 -404658 124985 703046 956251 647430 -78980 -782811 -1094904 -1015254 -808254
40178 -808254 -637919 -462210 -293864 -293590 -455313 -474666 -196345 40564 -141770 -519404
40168 -519404 -498450 62279 672720 892583 805628 693956 571556 267497 -183920 -431872
40158 -431872 -107061 766625 1662832 1983640 1661858 1159977 817119 522961 199688 139763
40148 139763 444861 541150 -122793 -1135310 -1564901 -1238284 -859613 -836358 -737650 -144594
40138 -144594 602772 866377 493210 -157659 -652958 -753483 -539807 -389220 -537435 -664542
40128 -664542 -321572 269366 411773 -5104 -295760 -36406 319382 227990 -133303 -301304
40118 -301304 -301524 -470721 -808986 -981840 -814905 -471234 -259488 -406384 -799989 -916463
40108 -916463 -373983 401604 580033 95423 -222459 102882 536803 500067 245745 197363
40098 197363 90411 -469902 -1098755 -1110537 -593877 -212370 -138692 29805 385856 505343
40088 505343 190694 -207179 -348542 -311631 -307436 -341209 -264333 50997 576297 1017877
40078 1017877 1020674 684163 600042 1071837 1588179 1458593 719056 -1178 -277313 -147904
40068 -147904 171554 401854 263961 -151056 -333424 -71067 147328 -75412 -288049 114401
40058 114401 817825 1008522 626775 363132 515526 681978 592951 473157 497820 558166
40048 558166 612030 655905 416743 -227848 -635715 -73667 1012246 1373863 739843 192857
40038 192857 466165 903146 650688 -37059 -396631 -318634 -138955 152223 663469 964423
40028 964423 547377 -240363 -479548 100299 780255 826893 358336 74302 389656 1005895
40018 1005895 1277711 931794 350717 75757 169812 303819 345282 494492 879430 1411757
40008 1411757 2036797 2721303 3231123 3399048 3567575 4198404 5111376 5864396 6870934
39999 6870934 9060586 12022190 13562489 11990298 8194151 4594744 2521557 1504279
39991 1504279 759843 278525 347625 831002 1246212 1180486 531792 -365918 -887766 -697171
39981 -697171 -125548 279128 421266 572357 824488 1026187 1132602 1234897 1311611 1250184
39971 1250184 1027329 666168 225619 21877 479304 1435315 2038170 1817463 1416171
39962 1416171 1629293 2129962 2004732 1342287 1310508 2533272 4227359 5246782 5347865
39953 5347865 5091776 4981677 5027828 4864751 4116816 2894114 1913135 1749797 2041871
39944 2041871 1954806 1393371 1069859 1286013 1443441 1083585 646200 646835 723633 217610
39934 217610 -681630 -1123245 -792803 -262455 -113522 -242291 -192560 176355 549046 537910
39924 537910 116619 -302222 -288156 74208 249237 -63102 -549048 -757776 -669095 -492693
39914 -492693 -158481 559253 1499988 2124601 2112396 1646150 1075405 596889 320524 334929
39904 334929 547550 661964 464717 21901 -465273 -840718 -976131 -789344 -425029 -250626
39894 -250626 -473892 -837781 -873352 -439562 128355 413841 341523 170722 158563 291979
39884 291979 319666 12068 -586117 -1139043 -1297772 -1050838 -771888 -838086 -1195273 -1398083
39874 -1398083 -1130089 -589292 -267288 -426526 -915638 -1417027 -1686169 -1587747 -1154246 -673377
39864 -673377 -481218 -565324 -611773 -561673 -777424 -1371364 -1720107 -1173039 -80332 516283
39854 516283 261877 -91367 132115 579869 565219 159965 -84162 -157001 -523484 -1125560
39844 -1125560 -1276754 -721385 -81185 69314 -40078 48456 227461 144308 -84667 -93910
39834 -93910 25262 -149406 -617645 -884910 -669541 -217797 138254 321524 343750 194986
39824 194986 6015 -13758 104185 129000 38345 46219 167438 132185 -154953 -430973 -464880
39813 -464880 -266638 189033 983013 1798544 1948193 1211641 254963 -168773 -91162 -8268
39803 -8268 -63297 -68992 -58372 -205241 -340575 -155916 158796 88835 -342894 -487081 -14576
39792 -14576 591096 760113 587678 490895 468606 165916 -450495 -884002 -659994 59703
39782 59703 483128 -104045 -1474540 -2391966 -1776756 -22893 1251540 981032 -208464
39773 -208464 -938627 -737746 -251564 -93262 -166770 -126539 105146 432546 714729 647434
39763 647434 -6415 -880342 -1211640 -871627 -653994 -1097956 -1546165 -1041723 189330
39754 189330 968682 779606 324077 346176 674749 769178 588591 458537 493144 575575
39744 575575 611930 480515 55796 -415309 -357163 330830 906398 691179 7955 -304668
39734 -304668 -23042 370400 482944 318846 -7568 -279953 -101932 565723 1009685 626994
39724 626994 -26626 75109 817506 1063436 450586 -81966 104227 382623 115821 -202413
39714 -202413 50589 365150 -55819 -791080 -745209 94737 639134 413930 183837 613384
39704 613384 1252160 1321458 848247 475260 512923 658441 524708 131278 -140053 20044
39694 20044 470305 744046 603002 292820 127266 86375 64684 207433 617682 993363
39684 993363 1024251 942394 1153379 1485609 1406046 902931 515608 482398 526361 581387 1017567
39673 1017567 1871438 2480127 2273828 1469943 635125 1380 -425038 -522618 -269502 45646
39663 45646 249508 588570 1180275 1542842 1250604 756530 850040 1423671 1547798 844775
39653 844775 33525 -159357 63903 171972 232317 561677 839491 430154 -431548 -604431
39643 -604431 496070 2004808 2631703 2165016 1436717 1072762 898437 542699 44336
39634 44336 -321389 -419751 -260493 85844 411614 474774 338738 364073 696083 999878
39624 999878 897763 465981 98588 41199 230609 443661 456567 207756 -76123 -79704
39614 -79704 184063 350834 170116 -241631 -658257 -933547 -870617 -328028 376514 620809
39604 620809 296109 41594 369776 1003296 1415064 1534252 1491392 1188399 685465 519806
39594 519806 940903 1241079 649834 -409122 -829797 -409169 7676 -71767 -200895 33550
39584 33550 332276 288880 -34384 -451098 -946287 -1322108 -1144114 -396422 310936 523767
39574 523767 492555 655234 1011824 1299300 1374653 1161927 631825 77922 -24166 308238
39564 308238 471441 119099 -361750 -500375 -369218 -208436 74800 574988 978959 993520
39554 993520 859426 947674 1115734 962780 515643 163485 37044 -87945 -327612 -528405
39544 -528405 -563667 -488872 -402327 -366767 -424553 -509493 -419870 -54310 387006 564024 307122
39533 307122 -263540 -804885 -957425 -693132 -424076 -498253 -670531 -472957 -32124 56238
39523 56238 -286227 -436891 -94109 211788 18927 -300666 -215086 59801 -40213 -493756
39513 -493756 -795061 -757710 -655593 -708903 -873015 -988669 -815849 -182417 587359 785810
39503 785810 268044 -166227 148635 764213 879351 628567 756599 1288930 1474662 1008240
39493 1008240 426111 187132 133087 32056 -24321 24830 31556 -5637 85793 219333 118316
39482 118316 -105676 -34365 285399 289856 -184141 -560878 -389899 17221 127519 -143871
39472 -143871 -598707 -1077285 -1314078 -1018097 -455155 -383653 -963710 -1299745 -650673 408472
39462 408472 741182 190591 -414174 -554105 -478330 -423861 -236833 63430 103601 -149524
39452 -149524 -151260 367893 847962 680258 125729 -87568 206929 556769 673120 664222
39442 664222 556328 229405 -72802 192243 1009267 1555621 1212428 399871 -59153 -45243
39432 -45243 -49337 -242292 -322111 -217377 -237070 -399142 -261567 306585 747070 586852
39422 586852 145785 25096 227035 289347 93436 -6826 143207 177078 -257864 -917822
39412 -917822 -1158297 -668480 145519 600389 509396 337507 518030 883681 1031805 976424
39402 976424 974367 899764 438080 -132994 -126444 417958 598705 52426 -319016 318978
39392 318978 1350718 1540376 815244 239434 359895 548834 128379 -657475 -1111626
39383 -1111626 -972629 -514847 -121999 -13122 -158876 -319720 -324322 -310617 -490974 -761494
39373 -761494 -833649 -683815 -549395 -528380 -509911 -458094 -434139 -377621 -196373 -32308 -110635
39362 -110635 -375286 -596496 -753585 -948479 -1036031 -763829 -227845 242453 609623 1061034
39352 1061034 1412196 1117698 55160 -1121724 -1657330 -1480452 -1159974 -1236822 -1671505
39343 -1671505 -1866981 -1317796 -323275 210759 -104040 -589448 -464374 66613 294826
39334 294826 196262 297468 555331 375305 -166423 -130169 877821 1943549 2033667 1318725
39324 1318725 730593 663078 721351 510913 136036 -42661 156112 513811 541194 -3883
39314 -3883 -702042 -869501 -423962 4078 -75620 -437027 -572724 -335682 50111 306037
39304 306037 244755 -118704 -449480 -343137 194521 744819 970113 840198 423657 -175187
39294 -175187 -711334 -1025850 -1304916 -1685745 -1773755 -1149037 -214808 195292 4107 -127384
39284 -127384 -669 -107801 -509919 -528163 63174 501947 211489 -349188 -548513 -469815
39274 -469815 -369445 -93852 307070 221513 -507310 -985955 -524004 248830 402575 121934
39264 121934 116251 312872 286740 408481 1264828 2312283 2464180 1859040 1711945 2381990
39254 2381990 2863845 2398460 1428890 646435 123638 -228963 -266905 -95566 -164441 -481972
39244 -481972 -441006 209160 883451 1004844 703071 353702 58462 -75382 226057 885595
39234 885595 1347179 1324724 1149720 1081039 902857 575108 582982 1103688 1458901 1049496
39224 1049496 309194 7302 46734 -201789 -641571 -473182 482767 1342562 1356676 923905
39214 923905 936544 1469931 1672296 942558 -222903 -809914 -506881 20500 89184 -201922
39204 -201922 -410732 -576716 -1013289 -1453741 -1171103 -120287 734782 637338 44612 -91366
39194 -91366 358842 713986 568713 193839 -126803 -508330 -999332 -1212576 -822445 -187093
39184 -187093 -47958 -608580 -1243233 -1266447 -752554 -318691 -228937 -146041 131435 184098
39174 184098 -355106 -975878 -765410 337336 1363949 1513145 986908 437242 125292
39165 125292 -25728 -9689 176754 357552 514024 972271 1764788 2129157 1313809 -246368
39155 -246368 -1265730 -1173924 -688538 -651164 -941171 -919511 -447132 26408 97872 -282056
39145 -282056 -897840 -1291812 -970856 -46643 569478 160085 -777261 -1139241 -756499 -536120
39135 -536120 -958014 -1335863 -1030597 -572327 -803253 -1485994 -1693150 -1246475 -773472 -465140
39125 -465140 146331 1030960 1349251 745938 75435 226728 911332 1283689 1187360 1025486
39115 1025486 826883 291713 -424354 -757218 -552485 -220099 -70903 -30431 -477 -2631
39105 -2631 36192 189533 267796 95916 -57205 140566 387987 90192 -616759 -903800
39095 -903800 -447506 114946 184638 -8949 18728 234799 351011 381746 432107 289282
39085 289282 -247288 -858622 -1015516 -662861 -197553 109566 284348 334824 158782 -212250
39075 -212250 -550586 -651721 -474731 -134971 104618 -14447 -401602 -588562 -303776 85547
39065 85547 52573 -265016 -159477 652311 1543928 1736450 1247485 732586 529661 311147
39055 311147 -219944 -719669 -656100 -144294 170310 63287 30074 409696 719491 339677
39045 339677 -469313 -840346 -488050 -37195 -114959 -637330 -1126786 -1270452 -992783 -419666
39035 -419666 12750 -159453 -765655 -1014219 -476502 321367 647376 514666 400195 341903
39025 341903 -31068 -668727 -965926 -587593 88869 545733 690713 617108 259068 -300290
39015 -300290 -517172 43670 925721 1156818 527020 -55291 207218 891554 994922 373058
39005 373058 -155624 -92551 111433 -42997 -250488 41343 668401 943017 593106 -16442
38995 -16442 -459393 -561328 -263507 309410 701195 560543 233329 413017 1136861 1624760
38985 1624760 1252862 253703 -698405 -1183247 -1143967 -711980 -190671 58523 -52764 -283980
38975 -283980 -437300 -586250 -875706 -1300945 -1710247 -1848770 -1490468 -765429 -181073 -2105
38965 -2105 113151 412418 401279 -342080 -1076734 -745560 201672 204486 -918808 -1369943
38955 -1369943 -31464 1626329 1518596 -159291 -1441315 -1382061 -817943 -580155 -464849
38946 -464849 -159553 98153 208587 557724 1208451 1541793 1168564 532644 167801 -28995
38936 -28995 -304890 -398735 22448 646208 828729 447072 -42261 -280613 -315825 -285808
38926 -285808 -195739 -81972 -103678 -324453 -550284 -518346 -194496 220480 574269 928266
38916 928266 1344701 1615339 1435837 883353 468781 558423 929047 1085432 877459 603342
38906 603342 608877 979838 1552641 2047774 2230558 2060757 1659027 1127396 544050 103284
38896 103284 -18596 31783 -47886 -182037 25221 576300 938505 850015 700630 751618
38886 751618 586855 -120760 -863223 -1012733 -821337 -913852 -1142580 -841845 -35310 517119
38876 517119 455469 193217 130694 238527 451756 762809 906721 657221 393794 603293
38866 603293 902502 490303 -434081 -774878 -209415 373015 394289 366837 671662 762833
38856 762833 317392 64796 537652 948431 375671 -704364 -1193452 -1044197 -990403 -1119413
38846 -1119413 -952584 -607455 -617427 -765199 -340228 469147 662536 27567 -508099 -372383
38836 -372383 -104239 -251114 -521755 -514761 -401864 -350463 -56657 562052 907952 575239
38826 575239 107250 236157 825199 1188749 1086053 800149 544042 365297 393431 642900
38816 642900 757049 418452 -151267 -482779 -426071 -85938 461978 953985 835482 -24769
38806 -24769 -827461 -721134 38794 509911 429922 325947 351435 12086 -736308 -1076021
38796 -1076021 -517686 230884 204555 -526473 -1122909 -1152582 -874791 -606679 -425879 -383174
38786 -383174 -455437 -334874 234169 921154 1096673 691359 289251 259148 279083 -37781
38776 -37781 -470224 -519936 -153348 208476 336038 406929 532542 474178 73448 -312149
38766 -312149 -200437 251095 317101 -286783 -858254 -559720 413261 1021660 709258 16336
38756 16336 -262043 -33310 250130 280581 48389 -381628 -831698 -956942 -615373 -135462
38746 -135462 100861 116712 44234 -298424 -1011675 -1567428 -1327378 -500934 85456 133437
38736 133437 71991 93699 -168169 -750665 -954267 -294008 740912 1344820 1302996 818917
38726 818917 1065 -934816 -1464884 -1401090 -1323987 -1700154 -1955031 -1242870 90849 734259
38716 734259 132804 -845232 -1177000 -885610 -601434 -514408 -317717 81100 343302 240156
38706 240156 65698 277595 798658 954427 309588 -634648 -996892 -703021 -518618 -760661
38696 -760661 -726396 124035 1124184 1307010 838600 636170 903612 1069712 999093 1121472
38686 1121472 1308816 829222 -244413 -727365 -23039 857652 751875 104 -280195
38677 -280195 41568 134473 -318466 -735476 -724131 -630321 -775708 -850662 -417533 409594
38667 409594 1093631 1246323 902325 413467 169857 269954 432681 374509 212152 265917
38657 265917 515718 561710 193169 -268834 -347720 18926 425055 444308 36373 -464855
38647 -464855 -691789 -552848 -257186 -115060 -312521 -747871 -1026001 -799133 -261567 -69545
38637 -69545 -491508 -904133 -607544 65368 150569 -441524 -661189 127416 1119601 1179840
38627 1179840 368382 -355790 -514559 -390418 -196202 170386 575127 635302 371753 210374
38617 210374 204693 -72557 -641275 -805651 -159636 653764 761164 288635 138788 662888
38607 662888 1192936 1040175 444824 163260 389253 568548 287589 -124297 -137555 188981
38597 188981 403259 439466 619778 884246 685812 -100624 -778664 -760473 -378951 -263948
38587 -263948 -398042 -441742 -562095 -1088850 -1593862 -1275090 -256083 436197 356209 196836
38577 196836 556296 1039206 1089649 920668 931498 844096 245977 -430404 -354572 446128
38567 446128 1082718 1042653 714504 585546 577710 421046 165138 -4848 -112439 -241116
38557 -241116 -276817 -84700 199152 317816 300532 505992 1167963 1969222 2219542 1600577
38547 1600577 690603 488129 1285888 2267387 2458180 1843461 1184326 919813 791878
38538 791878 562946 475614 693071 797274 385838 -100239 212706 1372639 2347129 2281317
38528 2281317 1542051 1085165 1116375 988584 345925 -329523 -548253 -569889 -836839 -1100269
38518 -1100269 -778848 33635 641727 779404 824188 906670 630770 -28501 -382776 -111512
38508 -111512 70743 -454229 -1072966 -856416 -97715 179206 -44538 188728 1029907 1400601
38498 1400601 748200 16852 190016 861556 1096438 905296 897274 1070259 999791 863197
38488 863197 1213230 1867744 1995989 1329764 461182 -98191 -366140 -352340 103062 787542
38478 787542 1168823 1197628 1351386 1686683 1629390 1005107 473234 495509 637714 451453
38468 451453 308599 625820 893698 398146 -485789 -700119 -60795 519973 425053 105150
38458 105150 220313 693082 988366 882022 592207 432137 613652 1187524 1937233 2446698
38448 2446698 2433786 1968696 1340707 818743 527918 392896 177963 -268525 -768086 -907076
38438 -907076 -413682 561729 1479459 1759578 1301352 676799 537429 786970 730648 154797
38428 154797 -286932 -80967 333515 308076 43613 172696 622591 730688 347416 -2462
38418 -2462 -34571 13548 52863 292936 599700 496456 13995 -220005 -1073 88208 -345581
38407 -345581 -890178 -1061409 -954583 -752343 -293721 363381 625445 195251 -363787 -464792
38397 -464792 -307521 -261599 -103314 379422 638069 131638 -631693 -797977 -546315 -714496
38387 -714496 -1282948 -1372193 -749737 -232220 -368929 -682723 -545791 -14609 534541 903870
38377 903870 919796 464048 -57561 19034 561834 598206 -247092 -1014769 -703642 340368
38367 340368 1030192 1027287 851879 852525 873207 792151 655935 323516 -362950 -1049106 -1138524
38356 -1138524 -658284 -270488 -321952 -468264 -397044 -305511 -374336 -362007 -146241 -137499 -586841
38345 -586841 -905611 -387340 623354 1057474 580801 -51247 -222702 -237162 -513027 -744362
38335 -744362 -475195 22209 158994 -14849 2434 228101 212354 -61715 -56576 436905
38325 436905 968355 1154235 1138047 1135792 1090355 980899 920481 755118 173784 -559410
38315 -559410 -670436 -5085 611200 575597 347808 530472 840379 749035 521285 703950
38305 703950 1021333 753893 -25075 -521383 -417295 -153872 -80257 -116594 -235069 -512567
38295 -512567 -701141 -458965 7842 223672 265844 523423 747609 304656 -586452 -907632
38285 -907632 -360579 175897 73283 -137399 192294 762305 969303 893100 901136 834837
38275 834837 366921 -211892 -309745 68831 374176 347642 271006 401096 565574 395897
38265 395897 -208285 -855962 -937142 -306369 389926 425019 -57727 -332978 -288182 -586676
38255 -586676 -1448350 -2059254 -1658536 -604786 157839 229303 -119369 -513319 -696260 -553426
38245 -553426 -330840 -492474 -1031660 -1333918 -1025047 -450289 22976 571124 1331405 1882727
38235 1882727 1889228 1695807 1653581 1405911 569410 -365001 -621196 -276363 -35591 -153380
38225 -153380 -314459 -334020 -274192 -104757 105738 -29863 -585802 -864980 -327572 449230
38215 449230 620625 450806 777359 1443682 1520673 973044 776740 1251791 1583914 1340252
38205 1340252 1215208 1726675 2300499 2383812 2514824 3382058 4485978 4681973 3714822
38196 3714822 2424717 1605914 1305807 1184617 1043398 920668 929328 1040585 993638 566937
38186 566937 -47974 -388766 -261552 129849 555296 895277 956781 633932 281545 415437
38176 415437 956141 1284889 1141047 891574 763925 442823 -278920 -998245 -1204942 -875263
38166 -875263 -295549 302308 714340 809398 803956 1052457 1422166 1401852 956315 609678
38156 609678 481387 33314 -849917 -1365228 -968587 -302814 -206961 -423816 -156489 551677
38146 551677 939772 790869 657590 868097 1100819 1037537 804703 633054 559399 565148
38136 565148 631278 616864 405433 146906 64089 125865 219073 454894 900213 1198356
38126 1198356 981604 576247 731090 1573760 2326249 2228963 1397574 594046 402351 781949
38116 781949 1265234 1461228 1404584 1418949 1647754 1866211 1807573 1457019 918210 265601
38106 265601 -289283 -384193 64555 649405 951567 1011783 1080220 1171499 1170003 1118904 1072459
38095 1072459 887176 482154 92646 -27814 78038 307496 723459 1250031 1522904
38086 1522904 1394340 1182988 1059779 708110 76775 -152165 429378 1047570 768781
38077 768781 -6197 -140837 418902 626040 97788 -338970 -98642 324455 405092 446737
38067 446737 794711 1041181 716750 151623 -29546 188175 400868 487598 581903 674688
38057 674688 721280 832863 946918 666992 -119495 -819181 -827456 -345503 -870 58763
38047 58763 119464 165606 -142612 -753182 -1072945 -718915 -40060 312903 120254 -264690
38037 -264690 -395104 -221446 -66570 -119496 -97201 373678 1119441 1540278 1440734 1314426
38027 1314426 1579375 1943785 1905565 1558867 1419129 1607761 1708825 1432672 989026 689953
38017 689953 511388 236333 -150339 -403132 -321391 -13211 189042 82456 -182566 -296445
38007 -296445 -154632 96761 320849 484306 499790 245200 -168932 -392593 -228891 160655
37997 160655 542195 860918 1071908 998884 601221 164755 -50601 -181360 -462921 -693322
37987 -693322 -409803 359357 933895 819116 419893 522452 1158056 1489425 1021077 421726
37977 421726 606777 1304385 1333410 355065 -532537 -360823 338923 433254 -150561 -554944
37967 -554944 -405615 -93066 220431 853246 1761850 2366110 2460259 2524761 2876112 3206806
37957 3206806 3194703 2868050 2170240 949411 -357612 -873728 -483514 -69284 -152017
37948 -152017 -185430 295926 794044 832222 905738 1526100 2085872 1733568 801131 265512
37938 265512 223029 21745 -383443 -366686 163429 555867 473353 261020 195692 174114
37928 174114 193504 365808 413109 -77941 -830957 -1062282 -586791 -33741 127065 61733
37918 61733 -28923 -263579 -655427 -970065 -1164397 -1382081 -1434890 -940852 -79124 473307
37908 473307 496820 445488 562647 496043 24910 -506668 -761674 -818364 -769361 -506477
37898 -506477 -135648 -25904 -238947 -476389 -694910 -1064990 -1215392 -443261 993748
37889 993748 1747576 1105437 26617 -205706 351876 736643 570553 269198 145376
37880 145376 109920 80418 63815 -16999 -120546 37778 484605 710055 372247 -86531
37870 -86531 -71421 269319 382765 234115 224031 397356 413288 204764 51603 47657 49695
37859 49695 105308 381938 691308 638580 295756 204852 576036 925672 723284 99722
37849 99722 -308077 -84676 529419 921173 809411 575492 701159 975573 713663 -140074
37839 -140074 -695329 -264820 656635 1080044 839549 630155 917559 1392750 1501856 1100472
37829 1100472 562917 472125 1074184 1856384 1958762 1253187 598260 650590 931857 665202
37819 665202 55445 -89910 279330 417244 45132 -275517 -175831 -31801 -172866 -255183
37809 -255183 140158 786688 1111462 884675 303634 -326531 -753651 -881667 -907374 -1115306
37799 -1115306 -1421024 -1422049 -1031270 -711065 -866252 -1295931 -1487510 -1234441 -734605 -241691
37789 -241691 162667 526240 892190 1175135 1160793 730186 71202 -462719 -680674 -619461
37779 -619461 -375359 -71783 82631 -48045 -317754 -427929 -230104 226375 791552 1164776
37769 1164776 975376 245761 -397390 -359642 187259 586763 581765 470377 475541 488952
37759 488952 467257 564630 744635 709719 393976 165186 365010 924545 1520268 1812472
37749 1812472 1503719 578657 -383622 -562738 176321 1016750 1126683 630440 339797
37740 339797 652419 1076933 951440 386486 171768 691191 1287433 1081255 208214 -347952
37730 -347952 -125625 343610 605556 956992 1566382 1783343 1128066 286125 158305 454420
37720 454420 295563 -221451 -281471 90715 62521 -445363 -582890 -139364 34707 -444626
37710 -444626 -784983 -379285 226754 353765 190695 121271 -39824 -433734 -602947 -272837
37700 -272837 46137 -74450 -229733 17649 315301 238638 132606 449512 877049 903674
37690 903674 652921 421972 63780 -391525 -260567 714955 1561689 1414498 945268 1230178
37680 1230178 1862953 1659422 759285 369871 605422 338282 -624765 -953144 44813
37671 44813 1166573 1069976 115988 -483618 -456248 -390963 -477168 -341419 101385 461529
37661 461529 526950 559285 889066 1512870 2102902 2295482 2046620 1720785 1685465 1910843
37651 1910843 2219976 2732148 3588449 4398127 4614515 4459330 4745955 5618450 6183294
37642 6183294 5710642 4568640 3567542 2930041 2379206 1800568 1306267 933379 724097
37633 724097 901354 1596006 2535108 3243513 3415318 2992132 2167722 1434593 1253683 1498850
37623 1498850 1599742 1388121 1330850 1702585 2086185 2078973 1967452 2178745 2491384 2396911
37613 2396911 1947948 1634457 1618349 1683461 1793316 2086315 2390889 2364231 2136731 2235048
37603 2235048 2771119 3251110 3326677 3200798 3090376 2841423 2425690 2340643 3022468 4140195
37593 4140195 4941143 5120735 4930981 4620034 4285467 4188081 4602912 5264084 5530318 5320224
37583 5320224 5346344 6096123 7101648 7690691 7998769 8613457 9574511 10498062 11512759
37574 11512759 13232356 15788535 18708887 21870294 25746120 30498638 35708361 41399046
37566 41399046 48527851 58000285 69976692 84659599 103027070 126389669 156074466
37559 156074466 193374240 237112221 279225072 305051792 302497641 272470045 228547790
37552 228547790 185660459 150454739 122232215 99345533 81717352 68828741 58778460
37545 58778460 50033428 42500254 36468035 31655783 27630505 24269685 21498321 19165393
37537 19165393 17296683 15959637 14900790 13808143 12796155 12103988 11543376 10883202
37529 10883202 10536438 11087576 12276241 13256110 13785867 14327087 15009923 15471197 15868274
37520 15868274 17109906 19792984 23776100 29073188 36059637 44051928 50556982 53023002
37512 53023002 51122773 46656785 41543528 36627786 32157369 28416160 25559903 23312552
37504 23312552 21146325 18696924 16065869 13840618 12602767 12211802 11886800 11301624
37496 11301624 11193324 12377346 14531125 16647062 18430328 20413086 22828229 25418526
37488 25418526 28510157 33074062 38995416 44103399 45851933 43630682 38821361 33126954
37480 33126954 27700724 23433323 20807639 19263987 17629068 15510390 13622892 12538290
37472 12538290 11860402 11005310 10102752 9572398 9297380 8811143 8019081 7231810 6669906
37463 6669906 6325131 6118777 5858903 5265971 4382558 3716755 3608017 3679054 3319986 2527171
37453 2527171 1845872 1623477 1734723 1964401 2273963 2683111 3132595 3439919 3305730
37444 3305730 2596435 1740755 1459771 1862330 2248988 2132811 1916501 2069402 2209277
37435 2209277 1735662 944318 656737 988901 1327671 1367950 1340290 1323225 1185349 1156374
37425 1156374 1584033 2118518 2023522 1364521 999585 1270882 1601776 1565228 1439963 1457380
37415 1457380 1394841 1235643 1381354 1863776 2151761 2048334 1940755 1879660 1375204 491007
37405 491007 112495 598739 1155164 1120205 853340 702178 218707 -720198 -1112729 -270853
37395 -270853 862036 1051965 647096 796013 1448503 1588143 1069330 770529 1040102
37386 1040102 1291193 1161075 954860 897859 916744 1130785 1650071 2015660 1777706 1421748
37376 1421748 1694053 2272719 2321072 2142549 2839074 4307871 5131881 4777357 4376308
37367 4376308 4731636 4966550 4055603 2565267 1804319 1978848 2187316 1817412 1139528
37358 1139528 736532 867525 1235673 1203531 567324 75741 532888 1438068 1481581 519886
37348 519886 -116209 312087 826696 398561 -432344 -606848 -241602 -97290 -102533 305695
37338 305695 857392 765529 136512 -128645 233078 590671 592073 569565 678354 590195
37328 590195 256160 138951 427027 736383 838589 1006372 1366819 1560857 1381625 1180984
37318 1180984 1265968 1374158 1144119 712071 444266 388397 367736 364396 437912 458931 289121
37307 289121 98165 161297 422100 586631 616080 775761 1139190 1398329 1359893 1330841
37297 1330841 1669910 2125413 2072909 1438658 906078 976630 1260788 1101817 556472 207172
37287 207172 214761 222296 169734 493066 1319784 2079213 2225220 1873529 1434630 1073556
37277 1073556 835719 829855 905300 586544 -237141 -934432 -882883 -255377 361178 748281
37267 748281 977637 955149 654323 504125 884982 1426433 1439430 903557 395900 160073
37257 160073 -78876 -411139 -544814 -400938 -311901 -497717 -826311 -1144576 -1355028 -1171576
37247 -1171576 -398745 484614 672348 145318 -163982 430833 1545588 2349716 2476474
37238 2476474 2008524 1091752 -1704 -794468 -1002100 -803283 -507482 -260921 -231842
37229 -231842 -629234 -1268184 -1568069 -1310486 -969856 -949670 -956820 -556667 107836 645644
37219 645644 1025631 1290300 1104341 309905 -403063 -227875 499398 628859 -195277 -1085875
37209 -1085875 -1228738 -856186 -600687 -578769 -562500 -529129 -556196 -535096 -404719 -370531
37199 -370531 -543944 -678960 -609638 -594545 -804050 -806378 -115715 948611 1533136 1329800
37189 1329800 858862 648319 635170 521058 289240 117525 50358 13971 31875 230090
37179 230090 632985 1020084 1039172 580409 56061 60484 596242 936195 557517 -83784
37169 -83784 -167003 333679 684280 468596 -27063 -498954 -958422 -1231770 -908117 -143178
37159 -143178 198108 -288921 -843381 -605489 123685 384769 -56389 -566483 -649473 -372395
37149 -372395 84836 628778 1044482 1162124 1164841 1220686 1012253 281852 -378785 -144904
37139 -144904 685479 896239 71083 -807977 -789756 -116264 489460 895932 1314163 1612434
37129 1612434 1576906 1451039 1595902 1889922 1960162 1755557 1495529 1336980 1405192 1755736
37119 1755736 1996620 1504789 459172 10475 766024 1727689 1613923 736740 486867
37110 486867 1229520 1918453 1841647 1561324 1749933 2086450 1891577 1166142 415620 -73616
37100 -73616 -284686 -191971 120711 376188 491558 725858 1133209 1272925 870293 387845
37090 387845 429987 844307 954013 532095 16668 -184601 -101003 118159 457618 838395
37080 838395 1032442 948765 745462 530508 217707 -165749 -302351 29584 559765 786773
37070 786773 566700 215830 70715 169221 352744 446453 307024 -58344 -329033 -80730
37060 -80730 663081 1286713 1204093 483205 -338367 -866686 -1016781 -785485 -286788 73231
37050 73231 -67437 -471517 -523115 -92359 273535 173597 -107856 -133559 71569 274219
37040 274219 481936 715198 687518 216362 -296619 -321100 19050 124038 -212274 -596574
37030 -596574 -648927 -344027 245594 1052341 1783365 2039013 1810657 1504908 1335507 1027162
37020 1027162 308681 -559970 -970617 -577957 355543 1153760 1302457 952183 758516
37011 758516 1080592 1526115 1541856 1221798 1102668 1290777 1317476 903884 387256 223109
37001 223109 417228 621659 543580 151554 -314387 -502235 -320734 -102053 -143710 -224119
36991 -224119 41926 486901 551799 168899 -70231 235948 780067 1075943 1074128 1011644
36981 1011644 992837 943550 743365 307886 -218348 -408839 -84171 209858 -169797 -892091
36971 -892091 -942947 -108832 648152 610786 274969 381317 734602 697798 283343 -43847
36961 -43847 -250584 -606064 -900476 -585207 343894 1233240 1562227 1389916 1069907 931865
36951 931865 1146217 1530584 1641866 1380076 1193815 1299282 1176707 487532 977 633664
36941 633664 1816723 1975906 742244 -447891 -363207 416620 561662 -125337 -734448
36932 -734448 -707920 -404508 -309036 -375274 -268706 155179 726823 1100292 1034920 718375
36922 718375 684435 1163197 1654408 1487551 741196 205134 349007 709295 546383 -148123
36912 -148123 -659896 -502308 12302 277651 165306 6173 -20875 -76267 -211511 -138498
36902 -138498 336485 922935 1160492 953314 545361 122251 -281493 -598631 -766055 -893601
36892 -893601 -1103444 -1231873 -994431 -454269 -7555 168774 344172 755741 1164676 1145252
36882 1145252 701793 338016 464523 895313 1068393 736153 269530 172164 443512 667422
36872 667422 662793 692686 948649 1200113 1180203 1013265 961435 980238 855925 617191 473773
36861 473773 446847 368006 194204 84373 208804 622281 1184219 1490681 1156727 355757
36851 355757 -241886 -298450 -183814 -237144 -184591 215783 496306 168190 -348337 -347193
36841 -347193 -77931 -378466 -1213445 -1638213 -1273061 -772087 -628612 -531585 -239547 -120332
36831 -120332 -360847 -515931 -357625 -358146 -776300 -1058555 -773734 -385160 -390034 -404303 97587
36820 97587 759219 930612 775882 912269 1351074 1658134 1805997 2003286 2010290 1518180
36810 1518180 919994 789413 860376 497438 -60328 -14768 562222 784273 450856 268833
36800 268833 399062 81639 -827581 -1195289 -267781 999861 1209629 413612 -212956
36791 -212956 -101068 275801 437925 453524 460706 374498 221640 265887 631426 1107185
36781 1107185 1423720 1522215 1512191 1497367 1441862 1174786 638801 123338 -2662 173187
36771 173187 184831 -76008 -92354 574611 1652258 2490355 2740422 2485574 2032224 1800902
36761 1800902 2022258 2268824 1779727 643999 91003 953398 2310642 2537610 1472653
36752 1472653 556854 757732 1355360 1210899 422979 2885 338744 778207 718773 474954
36742 474954 769474 1675010 2448599 2440592 1882510 1535956 1684374 1840166 1534873 1002911
36732 1002911 775503 888912 937976 783539 731310 989805 1375045 1650482 1784685 1728006
36722 1728006 1292383 497851 -218047 -424429 -210899 -48473 -204232 -494282 -605132
36713 -605132 -476196 -273171 -71352 263735 787963 1203751 1137079 708092 492093 730789
36703 730789 933179 630737 233280 538620 1453218 1886502 1175823 58282 -260285
36694 -260285 309515 664604 2322 -1129028 -1544474 -907426 -87853 -17433 -595926 -1049243
36684 -1049243 -1083045 -1082738 -1173031 -841325 91697 795168 451817 -484544 -946265 -894396
36674 -894396 -1214979 -1979990 -2081917 -1057541 -84361 -294646 -1029663 -904550 10810
36665 10810 384063 -252183 -908752 -816188 -462773 -510654 -712561 -579586 -329562 -372053
36655 -372053 -421387 1104 540263 421196 -225353 -411561 163039 516968 -175900 -1251251
36645 -1251251 -1391629 -427777 514919 607832 241653 124371 199422 18769 -303521 -251651
36635 -251651 170217 424829 368145 459033 866479 1103339 916052 823243 1190307 1424861
36625 1424861 923339 315276 678070 1707175 1886618 672676 -650121 -781895 -55555
36616 -55555 425701 400239 267159 -8541 -679506 -1286750 -1104198 -389140 -105519 -415553
36606 -415553 -558729 -334427 -465998 -1100032 -1206631 -236473 714654 431917 -571804
36597 -571804 -943257 -612824 -640345 -1217508 -1320724 -514707 275327 277956 1247 167205
36587 167205 483526 322572 -91327 -98679 257892 418186 331897 405825 547280 148249
36577 148249 -853458 -1630485 -1469380 -638589 16536 42344 -258662 -258206 282336 848927
36567 848927 677443 -210068 -790281 -263544 813657 1228496 739387 226683 237145 286963
36557 286963 -83624 -415929 -110449 488657 538161 -48191 -489643 -243299 354136 662517
36547 662517 548892 411369 580528 905230 992002 804110 797417 1226199 1522701 905072
36537 905072 -366920 -1020624 -410849 477084 288030 -851107 -1528537 -954415 155665
36528 155665 738623 671213 508513 502269 460970 331129 333957 501962 515947 168114 -276053
36517 -276053 -369433 4924 571071 997267 1127489 977927 737775 739119 1150138 1653584
36507 1653584 1718964 1297071 927714 986938 1187941 1115508 883427 829650 873691 715893
36497 715893 437940 303222 158381 -266811 -608707 -254497 535631 814614 391239 100809
36487 100809 352768 487548 109212 -43502 597710 1218507 815027 -116941 -316985 283356
36477 283356 629074 344424 172295 566236 1020745 1041059 794726 523530 177850 -86480
36467 -86480 130544 700188 898890 429241 -176600 -429992 -430219 -268496 285218 1078473
36457 1078473 1354407 790228 81843 -86216 -11855 -273112 -673593 -684455 -469825 -578792
36447 -578792 -873547 -674527 48601 461004 31780 -722568 -978801 -659137 -373823 -518858
36437 -518858 -794692 -681305 -170885 230815 255283 284762 713099 1173136 958425 144716
36427 144716 -362691 -44254 589043 819158 599204 275872 14383 -74039 221706 740666
36417 740666 843569 335457 -40874 283874 637835 65764 -1026993 -1304896 -499262
36408 -499262 190570 -61618 -566013 -376199 226258 355003 37896 102310 703752 945806
36398 945806 226671 -767560 -932608 -196208 512068 607528 514354 809048 1283682 1338731
36388 1338731 955812 655570 589396 325589 -337217 -928658 -955142 -531891 -56745 342415
36378 342415 682584 814672 653761 447159 411893 348022 17344 -330681 -268398 152582
36368 152582 526507 751494 1067026 1473518 1601937 1241661 629556 130127 -88130 -26346
36358 -26346 206318 372529 260934 -78130 -384630 -437030 -140027 461611 1051854 1142354
36348 1142354 620288 27717 -64761 183872 166668 -235567 -486493 -194809 364303 666816
36338 666816 549436 259104 136107 353323 771593 981539 659122 -73795 -767423 -1091864
36328 -1091864 -1031807 -738067 -413815 -292089 -473416 -753507 -768503 -340989 346859 824847
36318 824847 589481 -433517 -1581232 -1947046 -1378805 -646757 -405903 -424248 -172186
36309 -172186 293202 527026 403648 106932 -235586 -385467 110246 1180439 1793053
36300 1793053 1100571 -240175 -789225 -201334 551565 737041 596593 445271 121018
36291 121018 -344636 -460140 -123882 52230 -282974 -641750 -553235 -321339 -415022 -682301
36281 -682301 -696731 -419942 -58874 318874 637429 691187 498417 355845 299621 31846
36271 31846 -388033 -428302 17790 313283 62283 -293319 -326061 -314348 -503165 -457363
36261 -457363 92498 470110 17963 -730000 -802632 -271099 21387 -134726 -227582 -148852
36251 -148852 -344500 -830107 -1002267 -574651 47094 421811 447548 80266 -615175 -1112628
36241 -1112628 -857142 -146952 90146 -491824 -1295174 -1697245 -1680855 -1461397 -1153324 -952384
36231 -952384 -1035959 -1153233 -898095 -440113 -311294 -419457 -84628 766321 1298482 992784
36221 992784 369954 86232 91927 197144 695382 1715481 2550741 2427655 1591969 952741
36211 952741 923448 1208750 1454856 1499736 1204704 638935 277131 480728 933871 1082669
36201 1082669 932680 878901 953544 859449 620100 550036 621803 495259 188514 84981
36191 84981 195196 45002 -538032 -1118214 -1339638 -1351257 -1295630 -964695 -335615 97353
36181 97353 21323 -98895 318020 1032626 1302794 927816 371551 -22135 -289071 -348193
36171 -348193 47364 689048 888691 401333 -163280 -240262 -114641 -308393 -611536 -443961
36161 -443961 66383 209791 -85515 -15897 826914 1707140 1772509 1230805 859333 792430
36151 792430 572269 152792 -12804 115305 8486 -458044 -648264 -185631 316243 104889
36141 104889 -586367 -886642 -482987 135937 472188 475345 276085 15102 -54130 199978
36131 199978 414457 101343 -545603 -766072 -304090 224168 310780 297691 647102 968557
36121 968557 478391 -767036 -1776902 -1796516 -1051574 -245293 222420 375669 382774 395115
36111 395115 478558 565137 565521 488364 279252 -294502 -1228046 -1867374 -1463542 -217436
36101 -217436 778814 845854 438065 295437 451528 531349 504000 503899 289790 -362198 -930827
36090 -930827 -638194 311530 767498 130431 -845747 -1085166 -477244 282611 707977 868400
36080 868400 949149 955620 848513 671507 510799 454961 532481 603287 455178 123508 -49795
36069 -49795 176994 626515 934771 964165 848912 767943 806040 912620 896745 615394
36059 615394 241764 126419 285598 301490 -89034 -588484 -773355 -677731 -629501 -714799
36049 -714799 -768223 -755265 -780727 -775926 -537740 -81374 343464 583462 657103 543981 228733
36038 228733 -52764 7775 274449 193682 -473252 -1234559 -1426980 -987560 -415240 -110404
36028 -110404 -42929 -24958 1190 53193 251945 646434 968910 812539 136788 -569338
36018 -569338 -763406 -384931 205644 669059 848493 635519 46579 -556748 -700874 -371653
36008 -371653 -28294 75722 207011 574097 831246 522171 -257271 -1007921 -1406414 -1375470
35998 -1375470 -850903 29894 682927 574216 -64102 -485483 -370760 -43974 213078
35989 213078 477462 726393 669357 291039 43226 170960 301313 87272 -151870 63006
35979 63006 498836 416936 -409716 -1376825 -1801411 -1597576 -1096216 -562020 -134066 -7630
35969 -7630 -323641 -866801 -1142058 -912372 -519214 -447003 -633952 -540552 10144 444560
35959 444560 199227 -429838 -658450 -268540 240806 493666 610830 654116 368045 -219105
35949 -219105 -535419 -261514 94890 -54320 -458838 -459486 -25012 316666 395337 534096
35939 534096 825918 976843 914422 877339 805156 345605 -344949 -548756 -56762 426742
35929 426742 377498 210729 345272 250096 -667913 -1756834 -1817239 -899106 -257706 -464190
35919 -464190 -701757 -259997 361815 451442 268539 410179 658832 406196 -166891 -286676
35909 -286676 192337 635737 688488 673950 819236 837032 541760 257178 272197 373943
35899 373943 255148 -12808 -223188 -376696 -452754 -186471 527807 1251390 1428079 1082966
35889 1082966 766600 865040 1225615 1431928 1252646 829247 516826 494991 543147 361631
35879 361631 70178 66467 366508 528479 381999 313962 507504 442452 -285963 -1080442
35869 -1080442 -1021548 -222403 312577 173979 37706 439202 890052 744017 291419 245155
35859 245155 519855 380545 -274624 -649582 -288857 197637 135339 -115497 208192 930345
35849 930345 1147060 717874 551258 1103185 1535930 1022927 129588 -27420 497306 680383
35839 680383 249645 27497 423004 717681 305075 -321666 -458574 -282757 -299292 -319531
35829 -319531 125623 737869 737374 82726 -399475 -157625 460571 845143 852560 721148
35819 721148 655588 696735 772965 739121 472560 -24509 -630777 -1117838 -1191851 -798656
35809 -798656 -391428 -467892 -765150 -503362 348320 783838 215763 -533159 -443003 158965
35799 158965 253765 -158836 -200959 235455 267794 -404394 -897658 -530551 176224 426377
35789 426377 270076 190569 207446 51044 -201028 -273243 -206490 -224706 -287119 -182850 82243
35778 82243 320376 452187 517053 530816 522067 570174 684323 809893 1005080 1353830 1644060
35767 1644060 1465379 771568 51757 -216295 -34930 291932 511862 475828 137409 -338376
35757 -338376 -696067 -910375 -1139354 -1335013 -1255938 -942556 -769137 -854215 -822766 -422494
35747 -422494 -36569 -215057 -865427 -1268665 -922972 -146395 299869 142898 -53048 340746
35737 340746 1080486 1344201 928745 476916 311538 -109852 -1030863 -1563486 -957162 -8884
35727 -8884 -19496 -809966 -1116157 -691977 -525013 -951095 -1120573 -660652 -362730 -653161
35717 -653161 -773821 -222031 268356 56852 -236930 136516 773627 982154 994705 1228370
35707 1228370 1201736 422260 -358298 -111018 738990 890536 180635 -299959 -18603 322160
35697 322160 67308 -477150 -705343 -525007 -232775 -87942 -164985 -301026 -237041 -52731
35687 -52731 -148474 -481262 -357277 479152 1151097 801075 -96583 -469538 -237893 -158326
35677 -158326 -420402 -511843 -330934 -327127 -523795 -431286 -46072 5513 -485681 -929082
35667 -929082 -807563 -279534 207170 325845 -83854 -778671 -1037789 -491111 170194 73078
35657 73078 -493649 -532519 89795 607014 767320 1050638 1407921 1098077 119895 -418951
35647 -418951 104415 901541 1005968 512611 10585 -362947 -676725 -758878 -617148 -671577
35637 -671577 -1022508 -1095365 -519268 240652 600068 598918 494102 272625 39672 197811
35627 197811 709268 869474 393154 29023 431652 1089569 1130457 601463 134060 -148517
35617 -148517 -498048 -704356 -331200 386255 714701 437479 10767 -230001 -369638 -429834
35607 -429834 -187032 423123 1121835 1564937 1559097 1106911 499334 198790 356932 622538
35597 622538 630389 390055 -15004 -666091 -1399863 -1649582 -1197322 -658690 -646585 -853380
35587 -853380 -640908 -193700 -244362 -792085 -988472 -439784 140423 -80487 -934564 -1513453
35577 -1513453 -1259298 -455498 243882 486167 371990 113298 -221732 -546410 -619702 -412631
35567 -412631 -426573 -1135924 -2166025 -2632713 -2354118 -2021157 -1985879 -1699430 -765527 247885
35557 247885 664099 686467 839626 1032841 949292 813223 913603 856832 238035 -374611
35547 -374611 -196874 335355 70529 -1016500 -1699694 -1334935 -646655 -376253 -248534
35538 -248534 185255 597152 469462 11115 -172940 57946 366482 497020 445042 276451
35528 276451 51329 -218822 -591548 -933160 -775077 65660 839461 585522 -433938
35519 -433938 -876821 -173209 649425 504365 -195254 -252420 617737 1619890 2056714 1908510
35509 1908510 1430035 864137 496013 440568 409654 106250 -282529 -417456 -456886 -856544
35499 -856544 -1599752 -2123089 -2007588 -1351087 -503025 187430 440859 276402 104661 211513
35489 211513 292299 -45567 -515936 -531717 -247279 -428575 -1171255 -1588087 -1135500 -487433
35479 -487433 -515911 -1015487 -1172185 -889240 -813648 -1194528 -1531456 -1446510 -1200117 -1089744
35469 -1089744 -913721 -416696 131916 251994 -51024 -305943 -230282 -23767 31968 -19153
35459 -19153 25123 87153 -206695 -986057 -1712783 -1574245 -415055 936600 1505739 1200639
35449 1200639 724732 574352 556815 366446 156783 224661 438035 380531 -56125 -564039
35439 -564039 -849013 -868631 -667450 -294716 42944 38430 -308965 -502617 -19442 997817
35429 997817 1708678 1410071 356192 -474416 -481657 -32192 236459 326048 609107 909763
35419 909763 614840 -220489 -672014 -223299 431535 398383 -161349 -442559 -227915 50176
35409 50176 201346 426909 675865 604911 202049 -200987 -548834 -1036402 -1433999 -1165717
35399 -1165717 -244668 520248 521541 46114 -248518 -83747 383308 779102 656777 -67118
35389 -67118 -702173 -409626 580548 1034360 296103 -834739 -1223913 -823327 -442741 -523985
35379 -523985 -721182 -532469 58832 536372 334181 -475095 -1047858 -697302 156805 525452
35369 525452 230842 -25312 43164 -53936 -416970 -315413 556620 1349625 1254298 600349
35359 600349 89244 -246018 -583920 -651576 -356226 -297382 -771818 -1068752 -709753 -506855
35349 -506855 -1201680 -1900920 -1330727 -2276 505228 5958 -280947 6750 -58227 -707336
35339 -707336 -871303 -89532 559855 187942 -549517 -641047 -191027 117816 148427 108498
35329 108498 -52107 -333801 -374299 -21168 341063 479682 706710 1186243 1546203 1594468
35319 1594468 1677458 1883438 1695934 973232 453600 643626 972537 761995 314269 252648
35309 252648 434194 375375 219280 391590 693247 581041 73291 -341262 -423428 -201575
35299 -201575 356178 1047995 1231801 621823 -90262 -130568 233491 233157 -142003 -306653
35289 -306653 -177544 -146390 -156991 195241 707716 703016 194365 -7083 451848 928666
35279 928666 788862 251619 -97047 -89808 35901 35017 -185089 -491899 -527310 -83808 545330
35268 545330 931082 1084573 1219844 1146265 538419 -294544 -648669 -469349 -422332 -801213
35258 -801213 -1102970 -924879 -586237 -514905 -599036 -521332 -270962 -2424 199191 169982
35248 169982 -260963 -828329 -972083 -683664 -649957 -1201214 -1685385 -1376211 -519163 100212
35238 100212 263990 374849 614202 670793 313512 -215027 -465267 -215023 358576 813859
35228 813859 848982 641665 582135 636109 356243 -335772 -869709 -847153 -675642 -924982
35218 -924982 -1430870 -1589432 -1281578 -920258 -720077 -491521 -141006 113474 80997 -180921
35208 -180921 -470163 -524325 -174215 291667 215165 -526059 -1035549 -479989 594202 861417
35198 861417 59118 -713766 -676674 -331731 -323040 -309288 247464 881256 692890 -216120
35188 -216120 -825564 -640327 -217190 -150006 -265494 -112441 292062 572492 532221 267011
35178 267011 -76659 -420713 -730645 -1013100 -1266421 -1370780 -1124657 -455918 441011 1171315
35168 1171315 1346138 884982 213376 -51586 202007 441777 302501 193050 611772
35159 611772 1161164 994926 185920 -215170 287697 884322 717653 158323 110137 578041
35149 578041 795434 516886 289050 429257 539040 234342 -284418 -668587 -909631 -1079808
35139 -1079808 -1007586 -564544 16423 418543 605215 656542 508589 168375 -33042 221082
35129 221082 742394 1027716 908074 700105 692689 771120 652729 290283 -92299 -257112
35119 -257112 -148917 95247 268413 274115 210060 210509 213807 24633 -339138 -538729 -331927
35108 -331927 17832 26240 -313526 -443486 -23008 495853 417981 -222881 -664694 -398763
35098 -398763 271554 790480 1052164 1233061 1228929 726059 -193634 -897140 -811036 -50782
35088 -50782 675961 785786 398446 126471 257782 358259 -53382 -645030 -626829 29473
35078 29473 413830 8188 -495406 -267193 359115 465219 48315 -40205 418708 606430
35068 606430 6514 -733861 -782349 -302979 -35848 -116579 2685 588925 1188801 1268378
35058 1268378 897590 555777 414751 98901 -725911 -1701731 -2044966 -1517714 -768690
35049 -768690 -484677 -563139 -484834 -160664 99593 195627 220812 32070 -511440 -1014864
35039 -1014864 -967166 -614612 -637256 -990213 -959512 -437475 -136277 -302118 -297924 101005
35029 101005 109322 -690569 -1421627 -1265644 -809892 -937689 -1172756 -498917 648214 719906
35019 719906 -649042 -2048375 -2249793 -1605181 -1086452 -911366 -702970 -328734 21918
35010 21918 225974 286513 252451 275575 477511 693133 684732 596611 746559 989509 857787
34999 857787 378150 105405 198943 146039 -328156 -745156 -663412 -382534 -360291 -428855
34989 -428855 -166228 322743 595332 599939 643068 767825 703582 393013 104628 12900
34979 12900 54567 194969 439875 555274 207604 -457514 -739279 -153392 931789 1701799
34969 1701799 1823385 1688615 1751130 1915014 1745322 1109007 354080 -126870 -272676 -222867
34959 -222867 -35656 286220 624380 806177 793947 677385 549988 518494 697979 987031
34949 987031 974176 374114 -471361 -847809 -488837 128798 407716 288769 126229 114588
34939 114588 79488 -220540 -771323 -1315411 -1607377 -1616862 -1483014 -1293735 -969310 -392145
34929 -392145 400855 1174034 1576564 1319118 483091 -306064 -318989 459163 1202886 1208633
34919 1208633 743596 570439 832390 926491 462269 -192617 -503200 -484176 -542155 -858107
34909 -858107 -1217626 -1347029 -1200838 -938164 -724880 -556659 -277133 164949 518260 434713
34899 434713 -112204 -743521 -1034228 -858661 -392554 84726 348010 295949 -35594 -483619
34889 -483619 -775742 -659626 -192866 163073 14159 -405749 -488914 -106047 238594 229219
34879 229219 171429 324491 382601 69944 -299745 -425356 -632859 -1169643 -1407140 -680977
34869 -680977 438455 766641 188334 -393302 -676970 -1245792 -2089824 -2221823 -1284220
34860 -1284220 -330699 -289115 -673661 -634505 -357434 -464119 -780285 -747805 -506850 -531661
34850 -531661 -623359 -309222 92417 -93805 -580774 -360979 687818 1486719 1279146 585017
34840 585017 303462 590010 1005326 1211343 1134977 837976 518627 354549 214244 -142870
34830 -142870 -538421 -492423 42291 529529 555355 221564 -267716 -856817 -1283012 -1079956
34820 -1079956 -305258 252314 43701 -487091 -605476 -350838 -292802 -483232 -365294 263686
34810 263686 829257 726440 58823 -605364 -911462 -914181 -808407 -708555 -608720 -415909
34800 -415909 -92743 181619 166375 -35283 13182 427217 609316 -57765 -1223487 -1818919
34790 -1818919 -1418941 -805885 -836504 -1256405 -1230515 -710659 -481878 -890543 -1351290 -1355495
34780 -1355495 -1225742 -1414216 -1652617 -1406985 -778609 -323613 -243606 -363783 -673514 -1187840
34770 -1187840 -1420697 -821164 191800 455474 -388006 -1314361 -1342766 -873058 -929472 -1540952
34760 -1540952 -1730427 -1004973 -38270 334045 175914 126096 396115 559332 253752 -271865
34750 -271865 -440622 -46642 461973 457426 -129082 -671322 -563215 46444 464981 363476
34740 363476 153702 337961 785163 933843 555622 10909 -212949 30904 519145 861889
34730 861889 754747 269256 -119736 -51156 210199 109623 -363494 -634794 -447313 -265487
34720 -265487 -472024 -689148 -417539 59201 80869 -314669 -473412 -228862 -141347 -488719
34710 -488719 -770596 -558282 -185107 -108325 -125584 154034 440459 101097 -756875 -1259520
34700 -1259520 -921739 -225386 185161 347719 625690 923502 852637 529336 535752 938228
34690 938228 980015 186977 -729780 -765761 -115898 120769 -298826 -368756 417879 1016589
34680 1016589 384220 -763061 -928719 -74799 463958 155075 -68277 432829 924773
34671 924773 597212 -144867 -473706 -405795 -442710 -561099 -403457 -60150 98551 73498
34661 73498 86656 80046 -57897 -91005 162701 362067 164419 -124014 -31319 295315 443674
34650 443674 519415 837162 1152239 1033747 769145 995804 1547424 1602049 1000702 494833
34640 494833 520485 602343 285841 -94540 827 510397 939575 964215 612126 160642
34630 160642 -13303 201246 421446 288343 105959 393178 871368 659298 -385825
34621 -385825 -1277847 -1148914 -244544 637148 1062744 945097 253634 -700365 -1145041 -605926
34611 -605926 447176 1132876 1118687 713425 275674 -63952 -249977 -233295 -33027 276031
34601 276031 545286 519476 85884 -422115 -531241 -307872 -319735 -799826 -1294326 -1329726
34591 -1329726 -1003173 -698512 -623214 -826803 -1252838 -1566394 -1367448 -771032 -314325 -150633
34581 -150633 56236 258849 -133975 -1109536 -1588249 -837679 320164 585956 -21689
34572 -21689 -389347 -6624 553712 747541 691465 587807 357781 78671 102384 450612
34562 450612 634683 373964 55678 170105 609207 834747 573640 115360 -36907 275155
34552 275155 655490 570310 1753 -500412 -503786 -151718 216032 525582 764265 720993
34542 720993 372852 179588 460615 778840 558369 71690 95311 693987 1096643 820247
34532 820247 227364 -149226 -207109 -43803 297527 656393 798645 757858 706870 516247
34522 516247 17219 -346492 84291 1030844 1396902 829763 264085 441632 788937 483133
34512 483133 -146237 -221494 203485 303199 -109543 -319095 123118 776000 1011453 743746
34502 743746 325953 183074 594369 1403094 1951232 1744464 1120722 774660 744027 507509
34492 507509 24041 -127274 212581 423604 140396 -97083 260773 843407 951652 623620
34482 623620 443872 598434 780157 836904 873784 823791 534710 236627 321588 644917
34472 644917 633861 159349 -280291 -359959 -318733 -368934 -336187 -195940 -359349 -957833
34462 -957833 -1359193 -990850 -272328 -58538 -369712 -394948 243615 906654 831144 124550
34452 124550 -431043 -305417 280119 646064 331129 -434049 -918109 -649915 89643 658374
34442 658374 740352 407563 -228824 -966493 -1289020 -812974 17190 294421 -146234 -499946
34432 -499946 -228257 107036 -277474 -1154617 -1534471 -899947 336693 1453635 1993385
34423 1993385 1811511 1074209 287989 -33622 157147 506223 767676 997430 1271004
34414 1271004 1509312 1635638 1661605 1545539 1164092 523987 -111121 -390433 -177240 272270
34404 272270 438637 15694 -665012 -888190 -378502 336330 580032 323532 45794 -14898
34394 -14898 -88412 -381190 -697961 -663855 -181509 373309 390588 -394542 -1466124 -1888107
34384 -1888107 -1291734 -311558 152762 -126902 -723811 -1186003 -1294120 -982705 -466302
34375 -466302 -250444 -553993 -889128 -695870 -214284 -158716 -648112 -1093687 -1117954 -932042
34365 -932042 -758186 -551730 -428189 -694498 -1225193 -1423244 -1073822 -665223 -589044 -621213
34355 -621213 -525644 -544988 -844098 -1042987 -837101 -583809 -693776 -872847 -587978 72151
34345 72151 626636 966342 1238671 1279917 906885 557835 829717 1449435 1514944 802665
34335 802665 47226 -209316 -247319 -387137 -364352 43982 398531 188842 -373378 -717429
34325 -717429 -764247 -844887 -963578 -735699 -60320 631018 910605 806317 599652 425339
34315 425339 217272 -88117 -415988 -585156 -457891 -91993 287708 502886 533740 394536
34305 394536 68721 -311299 -412790 -81989 323164 271267 -269763 -767860 -786347 -439302
34295 -439302 -77024 192188 406032 375064 -193792 -1157418 -1863004 -1839478 -1383268 -1179452
34285 -1179452 -1397711 -1490096 -1001473 -270953 2345 -255444 -399712 -48893 316880 100854
34275 100854 -416729 -420983 186499 550757 87060 -667655 -871389 -566093 -414576 -533959
34265 -533959 -368359 272972 805724 729213 259270 -225922 -777534 -1437611 -1721063 -1188392
34255 -1188392 -250330 258633 185538 127845 441654 783207 713219 229423 -431247 -1057511
34245 -1057511 -1385722 -1192063 -656187 -289129 -345622 -605730 -787056 -774994 -397591 495564
34235 495564 1533820 1922250 1352618 422912 -117649 -144833 43816 210621 148679 -294645
34225 -294645 -766874 -537479 420892 1049715 563531 -335148 -430189 231275 521373 -26566
34215 -26566 -730412 -1033272 -1191798 -1420107 -1313384 -611740 190313 502430 342867 -29456
34205 -29456 -599490 -1244893 -1476529 -1112826 -753584 -964514 -1367494 -1210301 -567303 -246061
34195 -246061 -592948 -1081281 -1153830 -883961 -614738 -396584 -52934 440807 856537 908211
34185 908211 515048 -29226 -228970 70662 381480 77851 -791906 -1459407 -1280051 -441806
34175 -441806 254566 214082 -405759 -901615 -763075 -218010 39354 -303435 -765484 -640023
34165 -640023 161192 996721 1144992 445094 -595497 -1211766 -1037894 -480838 -290936
34156 -290936 -682998 -1155988 -1315199 -1446129 -1905336 -2340213 -2118543 -1348010 -801412 -811427
34146 -811427 -870381 -493947 78083 330297 180477 -99617 -342188 -494287 -390534 96906
34136 96906 731050 1021775 724118 114200 -253709 -53960 500200 873095 798212 550647
34126 550647 481962 455481 70386 -639611 -1150079 -1123962 -737273 -248937 300722 785591
34116 785591 853462 409813 -102954 -230273 -20857 254310 531732 737289 525833 -219844
34106 -219844 -882694 -723925 82226 623973 480439 176596 257830 479745 265003 -420592
34096 -420592 -1053544 -1217595 -936901 -441713 98296 604787 1054102 1435811 1650175 1504198
34086 1504198 958665 341200 112748 357286 660757 613779 308903 155580 279701 385147
34076 385147 262419 119934 197044 314064 146661 -226221 -458193 -520038 -672973 -880125
34066 -880125 -811039 -547569 -659526 -1272717 -1665176 -1280855 -633393 -562654 -969344 -1041204
34056 -1041204 -539495 -54812 21933 3460 195007 369345 286365 190452 373560 628654
34046 628654 567367 234657 8800 33628 111729 110164 145313 289378 321200 -34054 -646223
34035 -646223 -975483 -716011 -320964 -516128 -1246406 -1596563 -1041762 -278867 -294248 -998997
34025 -998997 -1477595 -1346520 -1078469 -1062182 -1165185 -1284388 -1501320 -1529551 -854838 286560
34015 286560 896088 570298 72932 83870 201414 -173789 -738161 -884787 -776529 -908128
34005 -908128 -1061086 -648149 196383 776269 867233 739543 388796 -306968 -830812 -497948
33995 -497948 286384 315832 -650397 -1431157 -1119739 -298709 -1360 -245220 -307451 68092
33985 68092 462037 517607 320132 153503 226172 504459 625989 238896 -403966 -565247
33975 -565247 9506 635773 535867 -200495 -862985 -1021287 -781516 -386035 16350 307431
33965 307431 422873 374261 101047 -490504 -1190153 -1502460 -1238482 -757710 -352139 203965
33955 203965 1083485 1786706 1685917 971259 433174 372571 320393 -116546 -688289 -952544
33945 -952544 -856591 -642311 -479034 -409202 -444962 -532076 -559937 -530362 -579289 -724266 -729106
33934 -729106 -370833 211404 569953 402043 -89832 -375388 -184048 174840 208258 -134478
33924 -134478 -463153 -527942 -472746 -456178 -387692 -200821 -37049 65182 320051 751980
33914 751980 946080 609013 96054 -27285 280940 648154 891337 1051060 1033836 749051
33904 749051 468562 511964 663697 453904 -44710 -295412 -165265 -88729 -300576 -547991
33894 -547991 -697366 -951249 -1226912 -1013897 -240607 339919 127529 -484282 -789095 -804442
33884 -804442 -959651 -1125464 -777795 -17517 385384 104602 -262715 -116459 283756 289263
33874 289263 -164407 -556599 -622985 -685647 -1018766 -1306663 -1101264 -613570 -539303 -1025957
33864 -1025957 -1341567 -905197 -183182 20123 -156852 130227 965814 1368738 748236
33855 748236 -173073 -433150 -133542 37992 41348 364887 957754 1180903 793409 220628
33845 220628 -207387 -579087 -868603 -780407 -334684 7051 45989 110927 360889 402747
33835 402747 -34197 -556243 -660170 -402076 -96340 221484 537070 462804 -273341 -1185940
33825 -1185940 -1530512 -1348946 -1389122 -1954261 -2429597 -2138731 -1210150 -340209 5120 -62546
33815 -62546 -98492 233173 810174 1091529 689714 -97649 -586280 -543991 -400082 -547804
33805 -547804 -824922 -883478 -722856 -562235 -453907 -353391 -363335 -543115 -626061 -330832
33795 -330832 109426 149968 -301164 -728557 -733212 -508837 -368117 -168232 385525 1059545
33785 1059545 1193531 528206 -427007 -983694 -964181 -651947 -317601 -63890 15644 -131495
33775 -131495 -316857 -240023 84946 284035 157827 18388 230518 605344 647389 368706
33765 368706 376886 952203 1467112 1153484 206757 -408856 -219749 247638 354857 182083
33755 182083 103792 24547 -348307 -734231 -526854 173359 512688 119396 -294063 -24259
33745 -24259 507040 406659 -300711 -763706 -666111 -614124 -984468 -1207038 -665418 281425
33735 281425 770814 569353 151548 -122383 -299752 -376575 -132678 447141 996944 1172772
33725 1172772 970566 574073 151923 -138328 -217755 -237124 -425804 -742118 -914405 -843132
33715 -843132 -664706 -395210 106624 710535 955897 644183 142134 -155966 -315404 -494025
33705 -494025 -458165 49769 695548 874484 595170 490726 858629 1198552 946158 269766
33695 269766 -208703 -246927 -151665 -181776 -148984 239513 835412 1089615 682635 -37834
33685 -37834 -414268 -238080 61669 56193 -107521 -5817 352294 473208 64026 -539363
33675 -539363 -773522 -476439 42250 417526 539533 521068 528598 655334 848333 925022
33665 925022 733761 351673 82396 171197 505791 704288 589062 461024 697267 1122966
33655 1122966 1103468 394443 -393712 -466658 174554 739488 601519 -19873 -370963 13360
33645 13360 840503 1341461 1059802 380187 92758 382309 602494 278582 -111163 134511
33635 134511 763441 850373 165111 -509286 -544551 -222125 -61158 -82790 -139028 -351118
33625 -351118 -701958 -709347 -105267 555317 590720 191520 77772 390484 609607 451263
33615 451263 157172 -87460 -362763 -590115 -527436 -287442 -252799 -351781 -76048 556790
33605 556790 755169 84821 -753670 -843009 -305700 -11196 -307981 -720686 -821271 -747442
33595 -747442 -731337 -639841 -265803 227524 450327 272437 -28820 -94148 142177 415543
33585 415543 423443 105476 -367649 -763303 -831073 -342721 586595 1256021 923358 -207970
33575 -207970 -970491 -565700 416853 786655 314219 -106770 184711 765732 869259 454626
33565 454626 135059 317084 803436 1139687 1049926 570530 -6196 -316215 -235159 -47409
33555 -47409 -191112 -778789 -1413549 -1538123 -1013062 -330809 -125514 -416351 -556021 -124815
33545 -124815 398618 290972 -270661 -371247 263885 790156 500642 -121983 -209647 191343
33535 191343 411103 352842 453840 633167 341233 -255200 -236916 554961 1028961 496520
33525 496520 -158307 121673 797997 569824 -501068 -1065575 -601180 -70342 -183676
33516 -183676 -310073 224274 841675 678052 90822 93912 679962 844000 229887 -320996
33506 -320996 -142410 228251 -58157 -824791 -1092956 -421504 567031 1025192 809399 399329
33496 399329 172295 51539 -171284 -450288 -595557 -626258 -743356 -935803 -892967 -458811
33486 -458811 43988 163416 -145763 -555917 -823383 -957852 -995129 -870581 -550170 -99142
33476 -99142 398414 836695 1026743 822508 330991 -133551 -309340 -132796 272104 631478
33466 631478 697694 554380 558170 767905 714948 117577 -456005 -215787 694695 1343660
33456 1343660 1321974 1173014 1339550 1465261 1164378 796820 869817 1176547 1203465 1035577
33446 1035577 1156268 1560516 1735474 1416001 781898 34457 -629600 -770057 -131030
33437 -131030 719274 897104 407785 125454 453354 768023 456075 -228066 -714338 -868622
33427 -868622 -763569 -322402 293707 494510 26670 -531239 -580896 -325255 -203572 -78730
33417 -78730 241700 214816 -687877 -1771033 -1806340 -864139 -299058 -772042 -1438651 -1455024
33407 -1455024 -1163109 -1166211 -1220830 -894824 -576864 -859251 -1381546 -1247984 -366493 478474
33397 478474 769109 691795 478896 76617 -421747 -654139 -504657 -287788 -279260 -435649
33387 -435649 -635833 -814367 -828390 -606697 -453216 -741344 -1246897 -1287375 -674906 -48708
33377 -48708 -27223 -446297 -715927 -588665 -276086 -63032 -86779 -319617 -563327 -612284
33367 -612284 -529786 -545545 -610877 -391567 136533 444227 78804 -718074 -1286669 -1240658
33357 -1240658 -679713 33862 470315 362915 -71257 -257648 27517 335603 239185 31369
33347 31369 252260 731021 717654 -1872 -695868 -617148 72104 603332 545494 104722
33337 104722 -362512 -747250 -1054683 -1190295 -1082201 -853605 -641730 -344828 147659 505623
33327 505623 180967 -743454 -1391766 -1173771 -622227 -587133 -931520 -822649 -174442 172434
33317 172434 -129753 -326608 169620 784119 736563 283917 175716 379220 255748 -286578
33307 -286578 -699509 -712823 -533994 -200742 469973 1250727 1555601 1246132 786989 534492
33297 534492 446944 493744 678965 634859 -42724 -930275 -1055776 -275405 460682 568872
33287 568872 667734 1360718 2012876 1641229 505760 -177312 94350 647198 844531 905979
33277 905979 1267134 1784910 1982070 1687415 1067722 286773 -517810 -1080016 -1189066 -1013013
33267 -1013013 -940529 -1031301 -890617 -260951 483174 724622 384205 -32377 -156480 -133158
33257 -133158 -191918 -275461 -296295 -325300 -252401 242689 976401 1076973 156176 -824108
33247 -824108 -711409 151268 414048 -251478 -751375 -322230 450452 740484 578102 319594
33237 319594 -37961 -369339 -114014 753230 1170894 316755 -1034546 -1393635 -460577
33228 -460577 678235 998857 429508 -472831 -994280 -593721 540571 1401902 1230736
33219 1230736 448443 -61642 -233925 -587691 -1044036 -980243 -385897 28299 -22306 -36086
33209 -36086 307115 638148 603539 357673 104369 -203750 -503025 -594563 -647900 -1047348
33199 -1047348 -1569066 -1464350 -596249 288368 697861 953300 1239219 1069209 343195
33190 343195 27190 843947 1927085 1821752 473651 -774221 -1003500 -597540 -289241
33181 -289241 -201655 -77604 148230 306979 208615 -218192 -763961 -976559 -659908 -212271
33171 -212271 -110770 -215527 -22543 536673 1056334 1310541 1378527 1171156 485471 -386522
33161 -386522 -764609 -517020 -293385 -527241 -779997 -498664 64677 228079 -155927 -663926
33151 -663926 -1014439 -1244672 -1262500 -810999 561 579946 483088 -94774 -593919 -626992
33141 -626992 -146657 641104 1341241 1562130 1272740 850769 615768 472638 203164 -104702
33131 -104702 -249314 -389197 -861049 -1495826 -1618935 -970301 -202103 -83684 -524026 -841522
33121 -841522 -765747 -587367 -406039 71675 816588 1216333 925856 475245 521180 863411
33111 863411 805384 268457 -124626 -44143 133382 52377 -79448 27500 205181 162410
33101 162410 1166 -39441 -97417 -450342 -880283 -787282 3150 955545 1469880 1468182
33091 1468182 1182934 710802 83501 -428143 -466877 -61559 321729 301555 2905 -142705
33081 -142705 78241 454921 641744 535765 312926 169636 155052 262577 521379 863376
33071 863376 1003629 668552 -33329 -635080 -765147 -467257 -59173 168448 95329 -167798
33061 -167798 -283703 14163 505483 617749 162472 -338007 -343270 -55667 -87283 -540135
33051 -540135 -898993 -791471 -369038 97699 498074 636519 235650 -534686 -950479 -507976
33041 -507976 469150 1273321 1578919 1495076 1188263 830418 667881 745500 760028 553052
33031 553052 501165 951428 1483665 1328253 470014 -257050 -264868 138535 380165 421717
33021 421717 616437 1084320 1561982 1740155 1537970 1118441 729333 447447 91289 -453747
33011 -453747 -893010 -803403 -262654 149046 62195 -316148 -679682 -1068347 -1557613 -1832720
33001 -1832720 -1497001 -700318 -95302 -121874 -544431 -752130 -406690 237369 612820 444420
32991 444420 54830 -19535 301426 510688 94186 -895451 -1893850 -2335254 -2084923 -1494625
32981 -1494625 -1055606 -905563 -739583 -333674 23450 -78704 -509550 -782812 -836185 -1036282
32971 -1036282 -1327245 -1086328 -185964 468018 86652 -777339 -920878 -176441 413556
32962 413556 128328 -516440 -670901 -340137 -191180 -525062 -950018 -988479 -620490 -173365
32952 -173365 90265 186493 329264 689465 1166295 1380304 988525 88944 -729344 -858013
32942 -858013 -245346 564606 1016070 1065640 1021632 996129 784340 316656 -40207 162518
32932 162518 871714 1446010 1194888 30858 -1383371 -2212206 -2251421 -2044793 -2095381 -2199984
32922 -2199984 -1861643 -1132284 -542087 -262721 69158 590831 860968 523098 -163669
32913 -163669 -735983 -1025674 -998505 -612350 -163273 -216567 -768186 -1047159 -666826 -339443
32903 -339443 -739903 -1283701 -997651 -139255 198455 -152761 -331472 -88574 -184829 -828336
32893 -828336 -1014321 -81891 1135885 1527285 1202676 893228 593950 -126706 -931206
32884 -931206 -958138 -142254 669827 952930 1034089 1279946 1481855 1285997 703955 -18715
32874 -18715 -639034 -896177 -654528 -193150 5093 -144841 -272501 -152824 11034 -6728
32864 -6728 -151381 -328238 -593079 -927337 -1111929 -989362 -628678 -157496 300728 496954
32854 496954 245351 -166660 -191852 169771 228131 -438063 -1294012 -1511422 -981223 -233377
32844 -233377 340951 644567 480820 -301431 -1237395 -1476238 -838572 -152872 -192397 -652925
32834 -652925 -631259 96060 790419 780426 331768 237671 772491 1377954 1384370 780119 123022
32823 123022 -160654 -166920 -218150 -398689 -508923 -363923 11926 449625 766557 834838
32813 834838 639459 330789 164482 299033 599334 666700 180747 -694298 -1323597 -1184656
32803 -1184656 -427092 304581 586959 543512 459752 398919 338386 358481 425758 256228
32793 256228 -255504 -676803 -532932 -47373 99682 -233815 -400047 121191 973987 1382372
32783 1382372 1078321 475346 78742 -3445 -19056 -230068 -606794 -811742 -575587 -116633
32773 -116633 -28870 -669844 -1771227 -2690602 -2925311 -2408769 -1523026 -838783 -622669 -599659
32763 -599659 -428598 -302265 -658286 -1352251 -1710629 -1522033 -1323917 -1429233 -1362536 -744053
32753 -744053 -74950 47004 -43272 321473 887366 797252 20389 -523363 -346987 15356
32743 15356 32670 -56426 122621 395491 444991 339706 227080 15859 -200184 67012
32733 67012 927689 1568527 1142962 -31610 -799627 -582698 110433 562437 651909 632389
32723 632389 596953 490378 404878 506830 683297 532327 -140794 -944906 -1249670 -906363
32713 -906363 -361512 1874 255119 449664 248033 -455005 -943954 -478760 497858 796381
32703 796381 121625 -608384 -707394 -507743 -376621 24744 872008 1463349 1197466 576068
32693 576068 369273 386101 28909 -444117 -313485 248085 358764 -118537 -394705 -102880
32683 -102880 191759 41503 -247980 -338357 -395505 -529287 -406831 144217 708518 858507
32673 858507 703196 546067 428010 293059 211129 206496 227510 379119 716847 799069
32663 799069 144389 -736146 -630836 662208 1769959 1503319 437580 -42066 333883
32654 333883 689777 527944 250008 185056 4703 -637186 -1461575 -1837105 -1412743 -410529
32644 -410529 478936 580751 -82496 -710373 -635315 -120839 125728 -26366 -144910 -70350
32634 -70350 -53873 -98498 112469 497578 480522 -110474 -647328 -569699 -134476 122992
32624 122992 223386 516910 943846 1102234 912952 683550 542747 310690 5157 13068
32614 13068 524771 1095931 1057421 257568 -783966 -1397254 -1305116 -706886 13339 591549
32604 591549 940340 999194 672745 27350 -530423 -504986 136710 796205 815967 216156
32594 216156 -299877 -143933 471175 778932 361055 -356691 -595435 -114487 534737 641558
32584 641558 74766 -673275 -1039056 -845672 -312995 172367 302657 88597 -71723 236634
32574 236634 882155 1178201 625616 -460547 -1263711 -1310267 -806372 -244985 47684 11250
32564 11250 -202665 -307648 -104437 311410 682475 881081 906679 723262 379632 164955
32554 164955 267204 383409 149106 -130507 170556 871917 1001161 227325 -517542 -359883
32544 -359883 310541 645842 679872 958948 1328549 1151199 502253 85275 10990 -294635
32534 -294635 -891052 -1091775 -682316 -361823 -566240 -771992 -486204 -96137 -129322 -410354
32524 -410354 -608208 -920515 -1461060 -1616560 -924069 -97855 -171936 -911325 -1123364 -462166
32514 -462166 124783 -100352 -665095 -747626 -294455 173730 336787 207061 -138332 -556893
32504 -556893 -816066 -848189 -802383 -664195 -158240 723338 1455436 1604219 1429323 1437146
32494 1437146 1547669 1221398 360470 -444318 -684350 -504690 -291229 -82411 261041
32485 261041 580826 564557 263077 33435 -26531 -149800 -342598 -262404 100047 111213
32475 111213 -658655 -1602675 -1675742 -716866 373634 775416 543239 186335 -18476 -80051
32465 -80051 -90447 -235777 -677932 -1184943 -1208332 -615070 -44745 -173788 -804372 -1058089
32455 -1058089 -440912 563627 1014731 501943 -418507 -766680 -149290 843039 1343286
32446 1343286 1143577 688060 343442 110972 -55438 -193478 -576138 -1385772 -2068882
32437 -2068882 -1741026 -494180 423137 150314 -718543 -1114298 -892920 -610730 -480224
32428 -480224 -358660 -380611 -743676 -1082795 -871808 -323965 -113395 -268955 -141693 483549
32418 483549 1015526 960940 527932 103425 -272438 -618501 -694456 -331276 205434 457022
32408 457022 245710 -176061 -327543 79809 752295 1032591 752802 553984 952964 1473537
32398 1473537 1334265 683451 344469 515760 639151 523972 605272 937054 943524 505236
32388 505236 322078 706676 915008 306866 -605477 -965518 -745392 -372114 166259 961232
32378 961232 1447544 1017937 92464 -366358 -250110 -311867 -838728 -1225198 -981830 -367100
32368 -367100 187907 597159 837445 767829 483251 308168 212115 -233665 -1086882 -1777686
32358 -1777686 -1895454 -1669324 -1357110 -799919 -50003 226162 -315332 -883512 -556032
32349 -556032 257459 370423 -311039 -635086 -94290 340448 -142432 -794099 -493617 418556
32339 418556 660740 -13281 -557347 -300755 256210 503992 560956 676538 668795 425958
32329 425958 242439 203679 -53038 -507020 -484184 179575 551858 17134 -516161 78436
32319 78436 1251415 1517511 760465 348453 934439 1587730 1472031 1062105 1041154 1093317
32309 1093317 657713 84008 90587 540648 624394 42953 -676449 -948180 -696921 -212828
32299 -212828 198981 454652 739497 1181909 1462867 1128736 380204 22391 370604 726116
32289 726116 327808 -603638 -1196000 -973857 -206513 511039 733878 505849 401400 859566
$$ [...]
##END NTUPLES=NMR SPECTRUM
##END=
