##TITLE=31Pdec_SR52+5xTFAA
 CDCl3, 24 sc
 31.05.2021
##JCAMPDX= 6.0         $$ Bruker NMR JCAMP-DX V2.0
##DATA TYPE= NMR SPECTRUM
##DATA CLASS= NTUPLES
##ORIGIN= UXNMR, Bruker Analytische Messtechnik GmbH
##OWNER= root
$$ XWIN-NMR		Version 3.5
$$ Mon May 31 11:47:43 2021 Russian Standard Time (UT+4h)  she@DPX200
##.OBSERVE FREQUENCY= 81.013821
##.OBSERVE NUCLEUS= ^31P
##.ACQUISITION MODE= SIMULTANEOUS
##.ACQUISITION SCHEME= undefined
##.AVERAGES= 24
##.DIGITISER RES= 16
##SPECTROMETER/DATA SYSTEM= spect
##.PULSE SEQUENCE= zgpg30
##.SOLVENT NAME= CDCl3
##.SHIFT REFERENCE= (INTERNAL, CDCl3, 0, 248.564)
##AUDIT TRAIL= $$ (NUMBER, WHEN, WHO, WHERE, WHAT)
$$ ##TITLE= Audit trail, XWIN-NMR		Version 3.5
$$ ##JCAMPDX= 5.01
$$ ##ORIGIN= Bruker BioSpin GmbH
$$ ##OWNER= she
$$ F:/spectra/data/she/nmr/P31/1/pdata/1/auditp.txt
$$ ##AUDIT TRAIL=  $$ (NUMBER, WHEN, WHO, WHERE, WHAT)
(   1,<2021-05-31 11:45:42.79 +0400>,<she>,<DPX200>,
      <created by zg, POWCHK disabled, PULCHK disabled
       configuration hash MD5:
       00 E9 B6 7A A2 85 ED C7 34 08 36 98 17 FE 4E 26
       data hash MD5: 32K
       62 47 96 EA C0 48 6F F0 89 7B AE 04 1E AE E8 EB>)
(   2,<2021-05-31 11:45:55.75 +0400>,<she>,<DPX200>,
      <Start of raw data processing
       efp BC_mod = 2 LB = 1 FT_mod = 6 PKNL = 1 PHC0 = -6666.998 PHC1 = 307.4008 SI = 64K 
       data hash MD5: 64K
       2F 6D D3 C6 18 C3 09 CE EB FF E2 85 63 73 0B FA>)
(   3,<2021-05-31 11:46:18.51 +0400>,<she>,<DPX200>,
      <pk PHC0 = -119.4311 PHC1 = 311.6002 
       data hash MD5: 64K
       8C FD B0 8E A2 94 94 95 18 B8 89 B4 6A 09 37 82>)
(   4,<2021-05-31 11:47:09.89 +0400>,<she>,<DPX200>,
      <pk PHC0 = 173.6321 PHC1 = -447.1999 
       data hash MD5: 64K
       50 0B FE AB 6C B0 5F 74 5F 40 F1 E0 C9 17 85 72>)
(   5,<2021-05-31 11:47:13.35 +0400>,<she>,<DPX200>,
      <abs ABSG = 5 
       data hash MD5: 64K
       8E 99 A8 CF B9 2F E9 C8 EB 12 39 83 10 EB 72 7F>)
$$ ##END=
$$ 
$$ hash MD5
$$ 04 E8 07 71 8A AA A7 55 01 64 3E 5F B9 96 43 8F
##$RELAX= 
##$RELAX= 
##$RELAX= 
##$RELAX= 
##$RELAX= 
##$RELAX= 
##$RELAX= 
##$RELAX= 
$$ Bruker specific parameters
$$ --------------------------
##$DU= <F:/spectra>
##$EXPNO= 1
##$NAME= <P31>
##$PROCNO= 1
##$TYPE= <nmr>
##$USER= <she>
##$AMP= (0..31)
100 100 100 100 100 100 100 100 100 100 100 100 100 100 100 100 100 100 
100 100 100 100 100 100 100 100 100 100 100 100 100 100 
##$AQSEQ= 0
##$AQ_mod= 1
##$AUNM= <au_zg>
##$AUTOPOS= <>
##$BF1= 81.014009
##$BF2= 200.13
##$BF3= 200.13
##$BF4= 200.13
##$BF5= 200.13
##$BF6= 200.13
##$BF7= 200.13
##$BF8= 200.13
##$BYTORDA= 1
##$CFDGTYP= 0
##$CFRGTYP= 5
##$CHEMSTR= <none>
##$CNST= (0..31)
1 1 145 1 1 1 1 1 1 1 1 1 1 1 1 1 1 1 1 1 1 1 1 1 1 1 1 1 1 1 1 1 
##$CPDPRG= <waltz16>
##$CPDPRG1= <>
##$CPDPRG2= <waltz16>
##$CPDPRG3= <>
##$CPDPRG4= <mlev>
##$CPDPRG5= <mlev>
##$CPDPRG6= <mlev>
##$CPDPRG7= <mlev>
##$CPDPRG8= <mlev>
##$CPDPRGB= <>
##$CPDPRGT= <>
##$D= (0..31)
$$ [...]
##$SUBNAM3= <"">
##$SUBNAM4= <"">
##$SUBNAM5= <"">
##$SUBNAM6= <"">
##$SUBNAM7= <"">
##$SUBNAM8= <"">
##$SUBNAM9= <"">
##$SW= 501.771253377433
##$SWIBOX= (0..15)
0 1 3 0 0 0 0 0 0 0 0 0 0 0 0 0 
##$SW_h= 40650.406504065
##$TD= 32768
##$TD0= 1
##$TE= 0
##$TE2= 300
##$TE3= 300
##$TEG= 300
##$TL= (0..7)
0 120 53 12 22 120 120 120 
##$TP= (0..7)
150 150 150 150 150 150 150 150 
##$TP07= 0
##$TPNAME0= <>
##$TPNAME1= <>
##$TPNAME2= <>
##$TPNAME3= <>
##$TPNAME4= <>
##$TPNAME5= <>
##$TPNAME6= <>
##$TPNAME7= <>
##$TPOAL= (0..7)
0.5 0.5 0.5 0.5 0.5 0.5 0.5 0.5 
##$TPOFFS= (0..7)
0 0 0 0 0 0 0 0 
##$TUNHIN= 0
##$TUNHOUT= 0
##$TUNXOUT= 0
##$USERA1= <user>
##$USERA2= <user>
##$USERA3= <user>
##$USERA4= <user>
##$USERA5= <user>
##$V9= 5
##$VALIST= <valist>
##$VCLIST= <CCCCCCCCCCCCCCC>
##$VD= 0
##$VDLIST= <DDDDDDDDDDDDDDD>
##$VPLIST= <PPPPPPPPPPPPPPP>
##$VTLIST= <TTTTTTTTTTTTTTT>
##$WBST= 1024
##$WBSW= 4
##$XGAIN= (0..3)
0 0 0 0 
##$XL= 0
##$YL= 0
##$YMAX_a= 5457
##$YMIN_a= -9213
##$ZGOPTNS= <>
##$ZL1= 120
##$ZL2= 120
##$ZL3= 120
##$ZL4= 120
##$ABSF1= 248.5645
##$ABSF2= -253.2056
##$ABSG= 5
##$ABSL= 3
##$ALPHA= 0
##$AQORDER= 0
##$ASSFAC= 0
##$ASSFACI= 0
##$ASSFACX= 0
##$ASSWID= 0
##$AUNMP= <proc_1d>
##$AZFE= 0.1
##$AZFW= 0.5
##$BCFW= 0
##$BC_mod= 2
##$BYTORDP= 0
##$COROFFS= 0
##$CY= -3
##$DATMOD= 1
##$DC= 0
##$DFILT= <>
##$DTYPP= 0
##$F1P= 0
##$F2P= 0
##$FCOR= 1
##$FTSIZE= 65536
##$FT_mod= 6
##$GAMMA= 0
##$GB= 0
##$INTBC= 1
##$INTSCL= 5.30512e-09
##$ISEN= 30
##$LB= 1
##$LEV0= 0
##$LPBIN= 0
##$MAXI= 10000
##$MC2= 0
##$MEAN= 0
##$ME_mod= 0
##$MI= 50
##$NCOEF= 0
##$NC_proc= -7
##$NLEV= 6
##$NOISF1= 182.463
##$NOISF2= 159.3651
##$NSP= 0
##$NTH_PI= 0
##$NZP= 0
##$OFFSET= 248.5645
##$PC= 4
##$PHC0= -6612.797
##$PHC1= 171.8011
##$PH_mod= 1
##$PKNL= yes
##$PPARMOD= 0
##$PSCAL= 0
##$PSIGN= 0
##$REVERSE= no
##$SF= 81.014009
##$SI= 65536
##$SIGF1= 159.3651
##$SIGF2= -187.1042
##$SINO= 113.3802
##$SIOLD= 16384
##$SREGLST= <1H.CDCl3>
##$SSB= 0
##$STSI= 65536
##$STSR= 0
##$SW_p= 40650.406504065
##$SYMM= 0
##$S_DEV= 0
##$TDeff= 32768
##$TDoff= 0
##$TI= <>
##$TILT= no
##$TM1= 0
##$TM2= 0
##$TOPLEV= 0
##$USERP1= <user>
##$USERP2= <user>
##$USERP3= <user>
##$USERP4= <user>
##$USERP5= <user>
##$WDW= 1
##$XDIM= 65536
##$YMAX_p= 112373400
##$YMIN_p= -419519247
$$ End of Bruker specific parameters
$$ ---------------------------------
##NTUPLES= NMR SPECTRUM
##VAR_NAME=  FREQUENCY,     SPECTRUM/REAL,   SPECTRUM/IMAG
##SYMBOL=    X,             R,               I
##VAR_TYPE=  INDEPENDENT,   DEPENDENT,       DEPENDENT
##VAR_FORM=  AFFN,          ASDF,            ASDF
##VAR_DIM=   65536,         65536,           65536
##UNITS=     HZ,            ARBITRARY UNITS, ARBITRARY UNITS
##FACTOR=    0.620285442955139, 1,           1
##FIRST=     20137.2065510759, 0,            0
##LAST=      -20513.1999529892, 0,           0
##MIN=       -20513.1999529892, -419519247,  0
##MAX=       20137.2065510759, 112373400,    0
$$ Real data points
##PAGE= N=1
##DATA TABLE= (X++(R..R)), XYDATA
$$ [...]
$$ plain form
13019 -1064873 303675 -948626 -2884337 -2845327 -1475888 -1766628 -4616083 -7150075 -6075547
13010 -6075547 -2089923 118469 -2853458 -8491755 -10991202 -8526734 -4867445 -2693998
13002 -2693998 430010 6018316 8736595 2699201 -8102517 -12782292 -7769229 -1641392
12994 -1641392 -3404130 -11357329 -17101026 -16420092 -11966154 -7692858 -4915864 -3277000
12986 -3277000 -2639277 -3554364 -6595999 -10823173 -13284892 -11950895 -9019461 -8703546 -11458341
12977 -11458341 -13380318 -11918067 -8845824 -6495460 -4561841 -2420698 -1377051 -2309426
12969 -2309426 -3550423 -3159064 -1273748 1126937 3394968 4096672 1746530 -2093230
12961 -2093230 -3832315 -3391767 -4747971 -8890058 -10650769 -5845782 2259315 7392845
$$ packed form
13019a064873J368548j252301j935711L9010J369439k90740k849455k533992J074528
13010f075547L985624K208392k971927n638297k499447K464468L659289K173447
13002b693998L124008N588306K718279o037394j0801718m679775N013063O127837
12994a641392j762738p953199n743697O80934M453938M273296K776994J638864
12986c277000O37723r15087l041635m227174k461719J333997K931434L15915k754795
12977a1458341j921977J462251L072243K350364J933619K141143J043647r32375
12969b309426j240997L91359J885316K400685K268031P01704k350142l839760
12961b093230j739085M40548j356204m142087j760711M804987Q105097N133530
$$ plain form
12953 7392845 7828086 5500546 961222 -5669863 -10895237 -10473374 -5362532 -714977
12945 -714977 791169 918569 1526908 1956224 1029967 -1241364 -4293914 -7204837 -8366340
12936 -8366340 -6870506 -3946171 -1583431 -539198 -937153 -3258780 -7000989 -9949090
12928 -9949090 -10550993 -9358629 -6835036 -2536624 1618504 1016418 -5159084 -10351884
12920 -10351884 -8203107 -1524451 1167755 -3285995 -9951198 -13338263 -12748613 -9967932
12912 -9967932 -6180866 -2364550 336598 1643579 1852028 959584 -165589 675613 3757800
12903 3757800 5664806 3994735 1640715 2356712 4341832 3445722 1017850 2183751
12895 2183751 6665333 8162502 4247114 489361 1833765 4974928 3099489 -5004682
$$ packed form
12953G392845M35241k327540m539324o631085n225374M21863N110842M647555
12945g14977J506146J27400O08339M29316r26257k271331l052550k910923j161503
12936h366340J495834K924335K362740J044233l97955k321627l742209k948101
12928i949090o01903J192364K523593M298412M155128o02086o175502n192800
12920a0351884K148777O678656K692206m453750o665203l387065N89650K780681
12912i967932L787066L816316K701148J306981K08449q92444j125173Q41202L082187
12903C757800J907006j670071k354020P15997J985120q96110k427872J165901
12895B183751M481582J497169l915388l757753J344404L141163j875439q104171
$$ plain form
12887 -5004682 -13836090 -17070781 -12368671 -2441103 6586621 9523836 6537047 2281423
12879 2281423 298626 42402 -494167 -1779157 -3038327 -3344648 -1956212 394675 752776
12870 752776 -2829735 -7550412 -8623165 -5792531 -3305756 -2992294 -1831391 2029163
12862 2029163 5266790 4385205 1483910 1425450 4914417 7731072 6580248 3288212 2343224
12853 2343224 5010017 7037610 3557216 -3891575 -8039721 -5181116 -420876 -174897
12845 -174897 -2700986 -1694897 2710640 3798183 -525691 -3743496 -669996 4627665
12837 4627665 4785192 -1162379 -7867102 -10551978 -8621088 -4544156 -1505305 -561374
12829 -561374 639838 3929641 5909182 1801200 -5715542 -7671127 -862357 7478710
$$ packed form
12887e004682q831408l234691M702110R927568R027724K937215k986789m255624
12879B281423j982797k56224n36569j284990j259170l06321J388436K350887L58101
12870G52776l582511m720677j072753K830634K486775L13462J160903L860554
12862B029163L237627q81585k901295n8460L488967K816655j150824l292036r44988
12853B343224K666793K027593l480394p448791m148146K858605M760240K45979
12845a74897k526089J006089M405537J087543m323874l217805L073500N297661
12837D627665J57527n947571o704723k684876J930890M076932L038851R43931
12829e61374J201212L289803J979541m107982p516742j955585O808770Q341067
$$ plain form
12821 7478710 10296739 9681909 10590273 11581512 8246313 1634858 -3511679 -6108089 -7909519
12812 -7909519 -7734389 -3239939 2788453 4410717 594978 -4164638 -6948710 -8692699
12804 -8692699 -9462400 -7101318 -1630084 3559155 5936054 5600819 2696937 -2773803
12796 -2773803 -8214311 -9743751 -6980186 -2981371 476766 3487769 4453523 1391698
12788 1391698 -2794168 -2296110 2917201 6367713 5110694 4085276 6974266 9258934
12780 9258934 5948467 918284 1427906 6646549 9298478 7289369 5838159 7429845
12772 7429845 7222005 1561857 -4746331 -4413153 2217101 7600819 6460515 1134404
12764 1134404 -2643741 -2473094 -522196 567355 1044329 2428996 3542678 774155
$$ packed form
12821G478710K818029o14830R08364R91239l335199o611455n146537k596410j801430
12812g909519J75130M494450O028392J622264l815739m759616k784072j743989
12804h692699p69701K361082N471234N189239K376899l35235k903882n470740
12796b773803n440508j529440K763565L998815L458137L011003R65754l061825
12788A391698m185866M98058N213311L450512j257019j025418K888990K284668
12780I258934l310467n030183N09622N218643K651929k009109j451210J591686
12772G429845k07840n660148o308188L33178O630254N383718j140304n326111
12764A134404l778145J70647J950898J089551M76974J384667J113682k768523
$$ plain form
12756 774155 -6299774 -11948430 -10276488 -3251195 1256864 -239019 -2914482 -1687886
12748 -1687886 1319609 1018919 -2308093 -3795047 -1623589 980768 1229756 -79037
12740 -79037 -1469964 -2947815 -4067989 -3172347 -85352 3025882 4752792 5969188 7207048
12731 7207048 7195169 5367650 3282909 2086488 931996 -808144 -2331600 -3587364
12723 -3587364 -5665179 -7655971 -6672952 -2916929 -842829 -2677445 -4790677 -3760058
12715 -3760058 -1773682 -1789579 -1687767 1199029 3656140 1636091 -1172560 2008480 9056514
12706 9056514 10354968 2989222 -4848947 -6035389 -3404651 -2767757 -3819484 -3059349
12698 -3059349 -757508 424304 536540 1280074 2099529 1438453 241738 752980 2987667
$$ packed form
12756G74155p073929n648656J671942P025293M508059j495883k675463J226596
12748a687886L007495l00690l327012j486954K171458K604357K48988j308793
12740g9037j390927j477851j120174Q95642L086995L111234J726910J216396J237860
12731G207048j1879j827519k084741j196421j154492j740140j523456j255764
12723c587364k077815j990792R83019L756023K074100j834616k113232J030619
12715c760058J986376j5897J01812K886796K457111k020049k808651L181040P048034
12706I056514J298454p365746p838169j186442K630738O36894j051727P60135
12698c059349K301841J181812J12236P43534Q19455o61076j196715N11242K234687
$$ plain form
12689 2987667 4949533 5211798 3646252 1233631 178144 1704068 2912897 -447535
12681 -447535 -6584053 -7652792 -130817 9182678 11608842 7368469 3248236 2493173
12673 2493173 2380156 215872 -3343380 -6356782 -6917803 -3202004 3925376 9168370
12665 9168370 7634189 1003265 -4598989 -6144601 -5477654 -4529516 -3257465 -2307579 -3216964
12656 -3216964 -5055509 -4710499 -1729837 435411 -692118 -3547491 -5844028 -8153590
12648 -8153590 -11994147 -16080735 -16731455 -11796895 -3327701 3583574 4831263 846417
12640 846417 -4161140 -6909840 -7834151 -8446123 -8159815 -6014277 -3668954 -3443981 -4431283
12631 -4431283 -3986620 -2481108 -2868941 -5565530 -7493709 -6653828 -4032122 -557253 3578033
$$ packed form
12689B987667J961866K62265j565546k412621j055487J525924J208829l360432
12681d47535o136518j068739P521975R313495K426164m240373m120233p55063
12673B493173j13017k164284l559252l013402n61021L715799P127380N242994
12665I168370j534181o630924n602254j545612O66947R48138J272051R49886r09385
12656c216964j838545L45010K980662K165248j127529k855373k296537k309562
12648h153590l840557m086588o50720M934560Q469194O911275J247689l984846
12640H46417n007557k748700r24311o11972K86308K145538K345323K24973r87302
12631d431283M44663J505512l87833k696589j928179Q39881K621706L474869M135286
$$ plain form
12622 3578033 5531229 906545 -8766798 -14292310 -9408903 -220091 1648936 -5809980
12614 -5809980 -12651867 -10534903 -2808602 1885207 1387650 500796 2238443 4427951
12606 4427951 5066282 5591200 6750038 5666529 500500 -5069175 -6155760 -3575536
12598 -3575536 -2153000 -3281287 -3895829 -2672528 -2240967 -4085204 -5660197 -4363443
12590 -4363443 -711025 3882792 8503116 10447481 6479235 -1012311 -4269284 -450801
12582 -450801 3350199 460570 -4787177 -3652550 3399749 7873884 6330759 3505516
12574 3505516 2090358 -1507076 -8333075 -11820958 -6619054 2952812 8397062 7127228
12566 7127228 2496332 -2653693 -7223562 -9081640 -6669454 -2768830 -2053357 -4699321
$$ packed form
12622C578033J953196m624684r673343n525512M883407R188812J869027p458916
12614e809980o841887K116964P726301M693809m97557q86854J737647K189508
12606D427951O38331N24918J158838j083509n166029n569675j086585K580224
12598c575536J422536j128287o14542J223301M31561j844237j574993J296754
12590d363443L652418M593817M620324J944365l968246p491546l256973L818483
12582d50801L801000k889629n247747J134627P052299M474135j543125k825243
12574C505516j415158l597434o825999l487883N201904R571866N444250j269834
12566G127228m630896n150025m569869j858078K412186L900624P15473k645964
$$ plain form
12558 -4699321 -6087799 -3266256 1401107 3718020 2328102 -890561 -3306293 -3679874
12550 -3679874 -2834717 -2316342 -1949659 28563 3239775 3687791 -1173956 -7501566 -9149123
12541 -9149123 -6136140 -4418807 -6592307 -7976565 -4437492 634863 1416075 -1571698
12533 -1571698 -2804559 -116959 3268724 4191959 2179539 -2777682 -9638165 -13427285
12525 -13427285 -9252524 -812402 1615460 -5069516 -11297550 -7920683 885027 4382201
12517 4382201 529120 -3549479 -3895925 -3796019 -5669494 -7167309 -6963559 -7194646 -7723784
12508 -7723784 -4617125 2452854 7259678 5395430 482213 -2189294 -3513060 -7004381
12500 -7004381 -11110517 -10977700 -6266086 -2037170 -2028126 -4704111 -6173118 -4621560 -1737235
$$ packed form
12558d699321j388478K821543M667363K316913j389918l218663k415732l73581
12550c679874Q45157N18375L66683J978222L211212M48016m861747o327610j647557
12541i149123L012983J717333k173500j384258L539073N072355P81212k987773
12533a571698j232861K687600L385683R23235k012420m957221o860483l789120
12525a3427285M174761Q440122K427862o684976o228034L376867Q805710L497174
12517D382201l853081m078599l46446R9906j873475j497815K03750k31087n29138
12508g723784L106659P069979M806824j864248m913217k671507j323766l491321
12500g004381m106136J32817M711614M228916R044k675985j469007J551558K884325
$$ plain form
12491 -1737235 -873725 -3286269 -6063519 -5544282 -2558266 -1118657 -1822487 -1044211 2140953
12482 2140953 3469862 565220 -2520207 -1545434 1487524 2315346 1001623 149371 -85031
12473 -85031 -757841 -987887 -259973 -701053 -2957789 -3560538 -992917 -88849 -4628548
12464 -4628548 -9744606 -8690000 -3683362 -2089024 -4357874 -4581410 -1951644 -2386340
12456 -2386340 -7765715 -12022696 -10440350 -5913582 -3002836 -1390129 1619105 6201970
12448 6201970 10120255 10878395 6986499 109648 -4393379 -2913772 1177829 2126446
12440 2126446 282953 440726 2948910 3409294 1067308 81478 1525540 1554025 -753949
12431 -753949 -1078469 2123800 4341706 2929125 1753104 4244722 7662842 8124917 6229890
$$ packed form
12491a737235Q63510k412544k777250N19237K986016J439609p03830P78276L185164
12482B140953J328909k904642l085427R74773L032958Q27822j313723q52252k34402
12473h5031o72810k30046P27914m41080k256736o02749K567621R04068m539699
12464d628548n116058J054606N006638J594338k268850k23536K629766m34696
12456b386340n379375m256981J582346M526768K910746J612707L009234M582865
12448F201970L918285P58140l891896o876851m503027J479607M091601R48617
12440B126446j843493J57773K508184M60384k341986r85830J444062K8485k307974
12431g53949l24520L202269K217906j412581j176021K491618L418120M62075j895027
$$ plain form
12422 6229890 4268821 2827795 3065589 6798290 11291536 10233693 3686764 449540
12414 449540 5568172 11942006 10592213 3648066 -193509 1136353 2359277 970155
12406 970155 527966 4169484 10417978 15496376 16195738 11618597 5239511 3034119 6148631
12397 6148631 8238552 3932227 -3367860 -6760897 -5493290 -3669353 -2265385 919186
12389 919186 5039922 6791220 6746922 8725695 12557038 13432648 9390152 4175508 1519934
12380 1519934 1343989 2745357 5895298 9275107 9592566 6822461 5518820 8448168
12372 8448168 12081095 11401671 6855152 3308646 3386121 4889526 4581845 1870179 -1955554
12363 -1955554 -5982223 -9332544 -9671574 -4971546 2307362 5596506 1600133 -4357470
$$ packed form
12422F229890j961069j441026K37794L732701M493246j057843o546929l237224
12414D49540N118632O373834j349793o944147l841575J329862J222924j389122
12406I70155m42189L641518O248494N078398O99362m577141o379086k205392L114512
12397F148631K089921m306325p300087l393037J267607J823937J403968L184571
12389I19186M120736J751298m4298J978773L831343Q75610m042496n214644k655574
12380A519934j75945J401368L149941L379809L17459k770105j303641K929348
12372H448168L632927o79424m546519l546506P7475J503405l07681k711666l825733
12363a955554m026669l350321l39030M700028P278908L289144l996373n957603
$$ plain form
12355 -4357470 -4173528 2300484 6679963 2959061 -5374206 -10953321 -11054349 -7634055
12347 -7634055 -2564141 3126734 7337836 8084390 5944262 3005060 380151 -1593737
12339 -1593737 -2365453 -2101380 -1889163 -1702039 -368379 1395782 1004946 -1646049 -3579237
12330 -3579237 -4053279 -5823925 -8702135 -7451505 -309324 5718317 3830139 -2465151
12322 -2465151 -4541305 -735126 3347273 4197933 3400424 2792852 2891367 4982692 9127386
12313 9127386 11604238 9871336 7668126 8809311 9045236 2523649 -6175346 -7030488
12305 -7030488 -1093195 -181981 -7785343 -12255815 -4549878 7754886 11979691 7682024
12297 7682024 3535839 2862294 1940943 -553513 -1679286 -831061 -642984 -1463288 -1234141
$$ packed form
12355d357470J83942O474012M379479l720902q333267n579115j01028L420294
12347g634055N069914N690875M211102P46554k140128k939202k624909j973888
12339a593737p71716K64073K12217J87124J333660J764161l90836k650995j933188
12330c579237m74042j770646k878210J250630P142181O027641j888178o295290
12322b465151k076154L806179M082399Q50660p97509o07572R8515K091325M144694
12313I127386K476852j732902k203210J141185K35925o521587q698995q55142
12305g030488N937293R11214p603362m470472P705937J2304764M224805m297667
12297G682024m146185o73545r21351k494456j125773Q48225J88077q20304K29147
$$ plain form
12288 -1234141 -659928 -2383499 -4841681 -3094574 3102265 7766322 7105031 4253017
12280 4253017 3044408 2023137 -1421274 -4883466 -4135877 -584102 -49719 -3943914
12272 -3943914 -6516757 -2725227 4793915 9277849 7913417 3407210 -806866 -3447321
12264 -3447321 -4046502 -2277874 669558 2617479 3049771 3165525 3042979 1306423 -1971707
12255 -1971707 -4927150 -7105858 -9786496 -12174013 -10980264 -5445399 853626 4965765
12247 4965765 7281411 7389358 2567954 -5995644 -10920773 -7799407 -1971356 -229376
12239 -229376 -494294 2757320 7004375 5243286 -1049799 -2939340 1775320 5474703
12231 5474703 3550441 569740 590352 776180 -850058 -182004 4485460 6590002 1067832
$$ packed form
12288a234141N74213j723571k458182J747107O196839M664057o61291k852014
12280D253017j208609j021271l444411l462192P47589L551775N34383l894195
12272c943914k572843L791530P519142M483934j364432m506207m214076k640455
12264c447321n99181J768628K947432J947921M32292J15754j22546j736556l278130
12255a971707k955443k178708k680638k387517J193749N534865O299025M112139
12247D965765K315646J07947m821404q563598m925129L121366N828051J741980
12239b29376k64918L251614M247055j761089o293085j889541M714660L699383
12231E474703j924262k980701K0612J85828j626238O68054M667464K104542n522170
$$ plain form
12222 1067832 -6416759 -7677654 -4143984 -2632186 -3352094 -1219619 3521767 5444937
12214 5444937 3935737 3894715 5661845 3195358 -4839236 -10158377 -5982991 2771802
12206 2771802 6314836 3238135 653367 2737703 5572835 4292512 -59401 -3744519
12198 -3744519 -6615496 -10796747 -14708988 -13483212 -6298427 867013 2113040 -1928000
12190 -1928000 -7110320 -11850935 -16173345 -17565322 -13483275 -7013507 -4312341 -6224050
12182 -6224050 -7807483 -6602727 -5523577 -6444262 -7226987 -7170774 -8776745 -10980612 -7716216
12173 -7716216 1841244 8314678 4254369 -4120506 -5323342 1180153 6126320 5540360
12165 5540360 4676953 6433554 5643715 -1363288 -8928300 -9093606 -2261221 3797930 3284852
$$ packed form
12222A067832p484591j260895L533670J511798p19908K132475M741386J923170
12214E444937j509200m1022J767130k466487q034594n319141M175386Q754793
12206B771802L543034l076701k584768K084336K835132j280323m351913l685118
12198c744519k870977m181251l912241J225776P184785P165440J246027m041040
12190a928000n182320m740615m322410j391977M082047O469768K701166j911709
12182f224050j583433J204756J079150r20685p82725N6213j605971k203867L264396
12173g716216R557460O473434m060309q374875j202836O503495M946167n85960
12165E540360q63407J756601p89839p007003p565012j65306O832385O059151n13078
$$ plain form
12156 3284852 -2631379 -8550795 -9979996 -6636936 -2242408 -598757 -1751352 -3050349
12148 -3050349 -3145101 -2634295 -1484909 1077753 4226760 6225246 7421418 9234395 10336953
12139 10336953 7946885 3246006 836074 1647769 1358440 -2039722 -4244228 -1658493
12131 -1658493 2244052 2315319 -12066 516474 3900694 4477971 -423251 -6433604 -7914834
12122 -7914834 -4226283 888487 3342218 1264547 -3768220 -7015502 -4470350 2414660
12114 2414660 7938872 8848108 7329014 6282047 4834579 1192117 -2628860 -2895476
12106 -2895476 -84213 1387157 -230569 -1631731 -274568 1205412 -392440 -2626328
12098 -2626328 -452032 5446162 8356566 4560773 -1754412 -4773344 -4378982 -3891232
$$ packed form
12156C284852n916231n919416j429201L343060M394528J643651j152595j298997
12148c050349r4752N10806J149386K562662L149007J998486J196172J812977J102558
12139A0336953k390068m700879k409932Q11695k89329l398162k204506K585735
12131a658493L902545P1267k327385N28540L384220N77277m901222o010353j481230
12122g914834L688551N114770K453731k077671n032767l247282K545152O885010
12114B414660N524212R09236j519094j046967j447468l642462l820977k66616
12106b895476K811263J471370j617726j401162J357163J479980j597852k233888
12098b626328K174296N898194K910404l795793o315185l018932L94362M87750
$$ plain form
12090 -3891232 -3512102 -549583 4962369 9147041 9020978 5303382 486837 -3081411
12082 -3081411 -3471300 -823111 1129690 -1405972 -6734538 -9092393 -6301481 -2256558
12074 -2256558 -579139 183134 2872837 6830020 9339817 9092390 5959124 586602
12066 586602 -3391345 -804594 7732107 13836005 11379860 5064679 3492164 6879197
12058 6879197 8618488 6949457 6714763 9422642 10109263 6375967 2941696 3632484 5420310
12049 5420310 4662026 3300847 3841366 3444582 -1057074 -6387034 -7257749 -4416895 -2190283
12040 -2190283 -897193 1622585 3248462 -75074 -6081019 -7858682 -4193695 -1038076
12032 -1038076 -1567084 -2030981 309973 2242312 1086821 -225641 1024307 1910824 -752316
$$ packed form
12090c891232L79130K962519N511952M184672j26063l717596m816545l568248
12082c081411l89889K648189J952801k535662n328566k357855K790912M044923
12074b256558J677419P62273K689703L957183K509797k47427l133266n372522
12066E86602l977947K586751Q536701O103898k456145o315181j572515L387033
12058F879197J739291j669031k34694K707879O86621l733296l434271O90788J787826
12049E420310p58284j361179N40519l96784m501656n329960q70715K840854K226612
12040b190283J293090K519778J625877l323536o005945j777663L664987L155619
12032a038076n29008m63897K340954J932339j155491j312462J249948Q86517k663140
$$ plain form
12023 -752316 -4298301 -5044586 -5298672 -9254145 -14628476 -15004362 -9217559 -2337420 1924055
12014 1924055 3764231 2746026 -2419484 -8358510 -8072566 -617985 5673191 3678942
12006 3678942 -2973174 -5387071 -1324255 3476660 4298764 2478575 1260771 1153957
11998 1153957 946377 239513 -806521 -2123060 -2558053 59588 5764014 10650817 10351413
11989 10351413 4920003 -1252270 -3971484 -2353971 1731574 5144988 4653708 -688287
11981 -688287 -7456711 -10322625 -7860940 -4092552 -3000028 -3674295 -2943011 -797591 -117285
11972 -117285 -1840866 -3502015 -2713784 204566 3271461 4685715 3732122 1518998 400943
11963 400943 1144600 1753020 837193 66713 521973 -471754 -4183194 -5018894 2568635
$$ packed form
12023g52316l545985p46285k54086l955473n374331l75886N786803O880139M261475
12014A924055J840176j018205n165510n939026K85944P454581O291176j994249
12006C678942o652116k413897M062816M800915Q22104j820189j217804j06814
11998A153957k07580p06864j046034j316539m34993K617641N704426M886803k99404
11989A0351413n431410o172273k719214J617513M085545L413414m91280n341995
11981f88287o768424k865914K461685L768388J092524o74267P31284K145420O80306
11972a17285j723581j661149P88231K918350L066895J414254r53593k213124j118055
11963D00943P43657O08420r15827p70480M55260r93727l711440q35700P587529
$$ plain form
11954 2568635 12891370 13727165 3788701 -3800109 357244 9113171 10572726 4990005
11946 4990005 1152333 1487866 934334 -2094158 -3629320 -2538249 -2094298 -2574591 -275001
11937 -275001 4898089 8139263 7457381 5753494 3794673 -1509028 -9550435 -14187422
11929 -14187422 -12801405 -10244948 -9851090 -7602676 -582554 5407544 3797078 -2096188
11921 -2096188 -4253459 -2522250 -3485916 -8041464 -8901630 -2106309 6248332 8228530
11913 8228530 3956209 -583635 -2067293 -1789198 -975908 1098101 3758960 3505114 -1554203
11904 -1554203 -7671292 -9045349 -5323234 -2286885 -3810009 -6427366 -4889017 -487124
11896 -487124 795836 -2449287 -4801249 -1916851 3903814 8011382 9412253 9947290
$$ packed form
11954B568635J0322735Q35795r938464p588810M157353Q755927J459555n582721
11946D990005l837672L35533n53532l028492j535162J091071M43951m80293K299590
11937b75001N173090L241174o81882j703887j958821n303701q041407m636987
11929a4187422J386017K556457L93858K248414P020122N990098j610466n893266
11921b096188k157271J731209r63666m555548q60166O795321Q354641J980198
11913H228530m272321m539844j483658K78095Q13290K074009K660859k53846n059317
11904a554203o117089j374057L722115L036349j523124k617357J538349M401893
11896d87124J282960l245123k351962K884398N820665M107568J400871N35037
$$ plain form
11888 9947290 10489624 10632307 10015892 7996695 4298456 1533491 3783556 10185819 13297095
11879 13297095 7458908 -3639344 -11467599 -12727059 -11016799 -10102558 -10037043 -9523787
11871 -9523787 -7906785 -4339118 1542967 7330419 9181746 6523527 3085207 2136338
11863 2136338 2600473 1205916 -2819285 -6687035 -7368889 -4891368 -1792044 240708
11855 240708 1746599 2784904 979636 -4765890 -9799358 -7611026 921403 6921932
11847 6921932 4575757 -1573748 -3924753 -2290968 -1935160 -4017308 -4371208 -1229839
11839 -1229839 1775465 1466941 -640460 -1640369 -1277781 -936480 -1224921 -2125972 -3524270
11830 -3524270 -4409609 -3367165 -892359 346172 -1451893 -4911153 -6708240 -4472993
$$ packed form
11888I947290N42334J42683o16415k019197l698239k764965K250065O402263L111276
11879A3297095n838187j1098252p828255j259460J710260R14241O5515N13256
11871i523787J617002L567667N882085N787452J851327k658219l438320r48869
11863B136338M64135j394557m025201l867750o81854K477521L099324K032752
11855B40708J505891J038305j805268n745526n033468K188332Q532429O000529
11847F921932k346175o149505k351005J633785L55808k082148l53900L141369
11839a229839L005304l08524k107401r99909L62588L41301k88441r01051j398298
11830c524270q85339J042444K474806J238531j798065l459260j797087K235247
$$ plain form
11822 -4472993 1147294 6342042 6953994 3020969 -382660 1308992 6710786 10688920
11814 10688920 10898871 9427061 8696428 8829454 8977432 8492929 6731986 4075959 2765641
11805 2765641 4142011 5770250 4429992 1224029 -86495 661511 65993 -2238801
11797 -2238801 -2238513 1445572 4143792 1860042 -2439679 -3028199 651954 4053143 4132343
11788 4132343 2472166 2047644 3316013 4042340 2254925 -743934 -1004331 3077191 7360585
11779 7360585 6377637 815981 -2994291 -1500048 2092860 3276734 1459198 -1952847
11771 -1952847 -6231002 -9555854 -8897521 -4892114 -2796583 -4957166 -6445567 -2622884
11763 -2622884 2942702 3636831 -301057 -3159457 -2731956 -1502337 -453064 1584199
$$ packed form
11822d472993N620287N194748O11952l933025l403629J691652N401794L978134
11814A0688920K09951j471810p30633J33026J47978m84503j760943k656027j310318
11805B765641J376370J628239j340258l205963j310524P48006n95518k304794
11797b238801K88L684085K698220k283750m299721n88520L680153L401189P9200
11788D132343j660177m24522J268369P26327j787415k998859k60397M081522M283394
11779G360585r82948n561656l810272J494243L592908J183874j817536l412045
11771a952847m278155l324852O58333M005407K095531k160583j488401L822683
11763b622884N565586O94129l937888k858400M27501J229619J049273K037263
$$ plain form
11755 1584199 3144042 1459749 -1528892 -1254494 1168457 -55133 -5166179 -7460589
11747 -7460589 -4337498 -1657141 -3281200 -4130458 734890 6954920 7757962 4691483
11739 4691483 3886198 5628675 5724519 4520836 6080435 9477045 9226165 4737621 1693999
11730 1693999 2778376 4165417 3232415 2942152 5437964 7194970 4482730 -842778
11722 -842778 -4662914 -5847413 -4904687 -1391234 3547391 5693800 3126207 228028
11714 228028 2053033 7051633 9661088 7986855 4352325 -5151 -5608707 -10776684
11706 -10776684 -12076493 -9310543 -5971974 -4035857 -1964683 1294446 3941239 4365955
11698 4365955 3574985 2945361 1978657 29744 -1605060 -1160722 1124410 3467758 4882478
$$ packed form
11755A584199J559843j684293k988641K74398K422951j223590n111046k294410
11747g460589L123091K680357j624059q49258M865348O220030Q03042l066479
11739D691483q05285J742477R5844j203683J559599L396610k50880m488544l043622
11730A693999J084377J387041r33002k90263K495812J757006k712240n325508
11722h42778l820136j184499R42726L513453M938625K146409k567593k898179
11714B28028J825005M998600K609455j674233l634530m357476n603556n167977
11706a0776684j299809K765950L338569J936117K071174L259129K646793M24716
11698D365955p90970o29624r66704j948913j634804M44338K285132K343348J414720
$$ plain form
11689 4882478 5993099 7633076 9163036 8605930 5042939 637821 -1234777 -105721
11681 -105721 1606103 3387683 7775903 14253604 16134567 8690183 -2126084 -5488310
11673 -5488310 357168 6482532 6193797 2522584 474245 -1019255 -4467549 -6820599
11665 -6820599 -3868432 1439955 2059047 -2646295 -5790567 -3043278 1634969 2243582
11657 2243582 -1504641 -5339212 -6456941 -5472127 -3871702 -2193098 -440795 1416745
11649 1416745 3463812 5457983 6559605 6087334 4355882 2350924 1004627 1187149
11641 1187149 3528791 7171879 9379758 8063526 4633314 2485743 2415703 2033885 802039
11632 802039 2227396 7768126 11462183 6297641 -4679849 -10144871 -5201691 1908173
$$ packed form
11689D882478J110621J639977J529960n57106l562991m405118j872598J129056
11681a05721J711824J781580M388220O477701J880963p444384j0816267l362226
11673e488310N845478O125364k88735l671213k048339j493500l448294k353050
11665f820599K952167N308387O19092m705342l144272K747289M678247O08613
11657B243582l748223l834571j117729R84814J600425J678604J752303J857540
11649A416745K047067J994171J101622m72271j731452k004958j346297J82522
11641A187149K341642L643088K207879j316232l430212k147571p0040l81818j231846
11632H02039J425357N540730L694057n164542j0977490n465022M943180P109864
$$ plain form
11624 1908173 1571158 -4357607 -7266423 -5140407 -3711832 -5881561 -7668256 -5614865
11616 -5614865 -1793629 852496 3232563 7314224 11909089 13884187 11830998 7243279
11608 7243279 3401041 2992510 5043394 5283088 2078807 -144006 2422798 5343669
11600 5343669 1498830 -6895903 -9920124 -4541634 996136 401444 -1552538 1474621
11592 1474621 6088725 4759368 -2071112 -7151565 -7039827 -4663404 -2828800 -1452898
11584 -1452898 -638518 -1035828 -1140967 1324679 5378935 7910219 8509807 9438552 10933731
11575 10933731 10241877 5930065 482600 -2079332 229505 5818779 10349941 10038569
11567 10038569 5287367 -44845 -3273321 -4437279 -3159408 1740847 7919858 9724909
$$ packed form
11624A908173l37015n928765k908816K126016J428575k169729j786695K053391
11616e614865L821236K646125K380067M081661M594865J975098k053189m587719
11608G243279l842238m08531K050884K39694l204281k222813K566804K920871
11600E343669l844839q394733l024221N378490N537770n94692j953982L027159
11592A474621M614104j329357o830480n080453J11738K376423J834604J375902
11584a452898Q14380l97310j05139K465646M054256K531284N99588R28745J495179
11575A0933731o91854m311812n447465k561932K308837N589274M531162l11372
11567A0038569m751202n332212l228476j163958J277871M900255O179011J805051
$$ plain form
11559 9724909 5906578 2600315 4705185 8687515 8695660 5559997 3795730 3158089 101248
11550 101248 -4362447 -5254128 -1540368 2564766 4068101 3664879 1968022 -1520702 -5437542
11541 -5437542 -7038198 -5819426 -3100258 976843 6031630 8769796 6763140 3487953
11533 3487953 4098163 7390999 8023242 5879050 6458879 11598808 16265558 15684768 10073625
11524 10073625 1690293 -6881628 -10860697 -6388684 2595961 6710573 2617437 -3393664
11516 -3393664 -5269409 -4414736 -4041491 -2480868 3072167 10337302 14335472 13730287 11265262
11507 11265262 9527123 8690182 7156568 3359638 -1519942 -3143755 578031 4614117
11499 4614117 2228005 -4949037 -8288371 -4536330 -149536 -915128 -4023988 -4537175
$$ packed form
11559I724909l818331l306263K104870L982330Q145l135663j764267o37641l056841
11550A01248m463695q91681L713760M105134J503335m03222j696857l488724l916840
11541e437542j600656J218772K719168M077101N054787K738166k006656l275187
11533C487953O10210L292836O32243k144192N79829N139929M666750n80790n611143
11524A0073625q383332q571921l979069M472013Q984645M114612m093136o011101
11516c393664j875745Q54673L73245J560623N553035P265135L998170o05185k465025
11507A1265262j738139q36941j533614l796930m879580j623813L721786M036086
11499D614117k386112p177042l339334L752041M386794p65592l108860n13187
$$ plain form
11491 -4537175 -3726918 -5457937 -8540903 -8579813 -5020826 -1275016 739751 2016030 3467146
11482 3467146 5014230 7002101 9793337 12342229 13013909 11478682 8964455 7263176
11474 7263176 7315541 7527362 4610791 -1610315 -6074814 -4881567 -1677080 -2213900 -4445978
11465 -4445978 -1552811 5755888 9014818 5523470 2441114 3901491 3882854 -2194285
11457 -2194285 -7817078 -5391341 1221197 3150972 139404 -1577469 -1040808 -2583582
11449 -2583582 -6163491 -6756527 -2871956 1885031 5212388 7180773 5897425 -435058
11441 -435058 -7397258 -7876886 -2510665 384141 -3337257 -8390943 -8581425 -4615710 -876293
11432 -876293 591194 150348 -1241666 -1335716 2492589 9216298 13773477 12680687 7809774
$$ packed form
11491d537175Q10257j731019l082966l8910L558987L745810K014767J276279J451116
11482C467146J547084J987871K791236K548892O71680j535227k514227j701279
11474G263176N2365K11821k916571o221106m464499J193247L204487n36820k232078
11465d445978K893167P308699L258930l491348l082356J460377j8637o077139
11457b194285n622793K425737O612538J929775l011568j716873N36661j542774
11449b583582l579909n93036L884571M756987L327357J968385j283348o332483
11441d35058o962200m79628N366221K894806l721398n053686j90482L965715L739417
11432h76293J467487m40846j392014r4050L828305O723709M557179j092790m870913
$$ plain form
11423 7809774 3307994 1167546 1046548 2038702 3014568 2769617 1048855 -1251243 -2825957
11414 -2825957 -2134947 1920013 7839091 11619493 11261304 9416669 8915716 8101058 4513204
11405 4513204 751712 1144336 3902864 2961505 -2286413 -5646292 -3853891 -1168731
11397 -1168731 -1609943 -2753942 -1407934 -316681 -3765093 -9777051 -12324865 -9647662
11389 -9647662 -5263606 -1640050 1867020 4398658 2188057 -5660490 -13414057 -14169454
11381 -14169454 -7777218 -524446 2537851 2182798 1621607 1459927 52163 -2721299
11373 -2721299 -4589863 -3635287 -143529 4114480 6955266 6748315 4306670 3160727
11365 3160727 5422036 8065287 6701547 2603778 1454279 4598295 6930571 5392555
$$ packed form
11423G809774m501780k140448j20998R92154R75866k44951j720762k300098j574714
11414b825957O91010M054960N919078L780402l58189j844635n00953q14658l587854
11405D513204l761492L92624K758528r41359n247918l359879J792401K685160
11397a168731m41212j143999J346008J091253l448412o011958k547814K677203
11389i647662M384056L623556L507070K531638k210601p848547p753567p55397
11381a4169454O392236P252772L062297l55053n61191j61680j407764k773462
11373b721299j868564R54576L491758M258009K840786k06951k441645j145943
11365C160727K261309K643251j363740m097769j149499L144016K332276j538016
$$ plain form
11357 5392555 3760552 5340602 6490628 2841037 -2593194 -4145730 -3013289 -4569937
11349 -4569937 -8184864 -7953711 -3408413 -1173725 -4250361 -7350292 -6021902 -3429952
11341 -3429952 -3533954 -3501015 1037834 7208033 8161682 3536877 399125 3381352 8845348
11332 8845348 10298413 6033128 -409983 -4773829 -5090808 -2046989 1297347 967053
11324 967053 -4417674 -11335648 -14261964 -11396903 -6040184 -1752565 1600704 5162007
11316 5162007 6700724 2713270 -5413872 -11259081 -10585081 -5705409 -1394572 454367
11308 454367 397763 -1002199 -2489090 -1715844 1306024 2506981 -1168017 -6708324 -8550971
11299 -8550971 -5950045 -3393355 -4378927 -7938010 -10900843 -10862095 -7454855 -3225782 -2375891
$$ packed form
11357E392555j632003J580050J150026l649591n434231j552536J132441j556648
11349d569937l614927K31153M545298K234688l076636l099931J328390K591950
11341c429952j04002L2939M538849O170199R53649m624805l137752K982227N463996
11332H845348J453065m265285o443111m363846l16979L043819L344336l30294
11324I67053n384727o917974k926316K865061N356719M287619L353269L561303
11316E162007J538717l987454q127142n845209O74000M879672M310837J848939
11308D54367n6604j399962j486891P73246L021868J200957l674998n540307j842647
11299h550971K600926K556690r85572l559083k962833L8748L407240M229073Q49891
$$ plain form
11290 -2375891 -5939020 -9256599 -7252869 -1184700 3243303 3626542 2845692 3514598 4501957
11281 4501957 3916231 2362030 1802882 3015313 4948861 5605863 3984195 2133575 3604530
11272 3604530 8111791 10293229 6877846 2444438 3478710 8597392 10358057 6306295
11264 6306295 2234860 3321347 7325054 8854177 6418959 2758071 805609 1245727
11256 1245727 2338059 1423618 -1758187 -3717065 -1579349 2221215 3002419 572215
11248 572215 -1228976 -854607 -10104 1156186 3980285 6115000 2948957 -4203495 -7789336
11239 -7789336 -4577688 -411752 -898039 -3246390 -2098860 1572889 3133354 2318688
11231 2318688 2732353 5309039 7444527 7462990 5681075 2160658 -2648601 -6073372 -5872340
$$ packed form
11290b375891l563129l317579K003730O068169M428003L83239p80850O68906R87359
11281D501957n85726j554201n59148J212431J933548O57002j621668j850620J470955
11272C604530M507261K181438l415383m433408J034272N118682J760665m051762
11264F306295m071435J086487M003707J529123k435218l660888j952462M40118
11256A245727J092332r14441l181805j958878K137716L800564P81204k430204
11248E72215j801191L74369Q44503J166290K824099K134715l166043p152452l585841
11239g789336L211648M165936m86287k348351J147530L671749J560465q14666
11231B318688M13665K576686K135488J8463j781915l520417m809259l424771K01032
$$ plain form
11222 -5872340 -3989427 -4067193 -5794118 -5284389 -969671 4178270 6708610 6308161 4704786
11213 4704786 2953288 739289 -2363533 -5255610 -5215760 -747541 5332917 7878018
11205 7878018 5458366 2030197 1100669 971544 -1772771 -6434627 -9079190 -7883843
11197 -7883843 -4655311 -1927166 -1187308 -3125443 -6921882 -9720599 -9184486 -6334961
11189 -6334961 -4034456 -3323912 -3174168 -3009564 -3218909 -3638393 -3580777 -3033220 -2181429
11180 -2181429 -481891 2022552 3408971 2000814 -949014 -2764132 -2779651 -2217966 -1602837
11171 -1602837 -698800 -127250 -366663 11283 2047591 3106226 -305228 -6458822 -9384731
11162 -9384731 -6879069 -3288913 -2456463 -2199912 883686 4715027 4442601 -141342 -4726607
$$ packed form
11222e872340J882913p7766j726925N09729M314718N147941K530340m00449j603375
11213D704786j751498k213999l102822k892077L9850M468219O080458K545101
11205G878018k419652l428169r29528j29125k744315m661856k644563J195347
11197g883843L228532K728145P39858j938135l796439k798717N36113K849525
11189f334961K300505P10544J49744J64604k09345m19484N7616N47557Q51791
11180b181429J699538K504443J386419j408157k949828j815118j5519N61685O15129
11171a602837R04037N71550k39413L77946K036308J058635l411454o153594k925909
11162i384731K505662L590156Q32450K56551L083598L831341k72426m583943m585265
$$ plain form
11153 -4726607 -7185308 -9209760 -11104511 -10202929 -6238496 -3522889 -4755082 -6642075
11145 -6642075 -5467348 -3449683 -4574437 -6840598 -5023708 -125151 973542 -3736512
11137 -3736512 -7816890 -6205885 -2400485 -1801891 -3242141 -2350764 646086 2143242
11129 2143242 1413419 313131 -952274 -2619472 -2388161 671961 1678820 -3890506
11121 -3890506 -11386582 -12026534 -6050162 -2412839 -4577279 -5597434 -307173 6078358
11113 6078358 6545542 2604599 7722 -699977 -2910331 -6631209 -8618551 -8070475 -7183591
11104 -7183591 -7127502 -7279588 -7236287 -6490562 -3780735 368981 2541466 846942 -1771586
11095 -1771586 -1696025 365881 1835470 2977474 5091959 6358310 4165842 159285
$$ packed form
11153d726607k458701k024452j894751R01582L964433K715607j232193j886993
11145f642075J174727K017665j124754k266161J816890M898557J098693m710054
11137c736512m080378J611005L805400N98594j440250Q91377K996850J497156
11129B143242p29823j100288j265405j667198K31311L060122J006859n569326
11121c890506p496076o39952N976372L637323k164440j020155N290261O385531
11113F078358M67184l940943k596877p07699k210354l720878j987342N48076Q86884
11104g183591N6089j52086M3301P45725K709827M149716K172485j694524k618528
11095a771586P5561K061906J469589J142004K114485J266351k192468m006557
$$ plain form
11087 159285 -1567542 -468215 408629 -304159 -987965 -664598 -180084 161227 867257
11078 867257 1296169 394229 -858301 -438484 1750174 4255999 6263837 6866077 4131376
11069 4131376 -1525057 -5049849 -2481396 2404130 2471446 -2382121 -5020006 -1626066
11061 -1626066 3550846 5585472 5231800 5194555 5213769 4502591 4828483 6953057 7388329
11052 7388329 3419935 -1037530 183829 6230094 9472224 5570319 -1217269 -4462697
11044 -4462697 -3477334 -1836390 -656901 2303590 6986724 8712456 3943616 -3976185
11036 -3976185 -8121880 -6334573 -3024011 -2450400 -3849012 -4778975 -5638532 -7492364 -7982510
11027 -7982510 -3990768 2389777 5249313 3050356 1224124 4499020 9983601 11069285
$$ packed form
11087A59285j726827J099327Q76844p12788o83806L23367M84514L41311P06030
11078H67257M28912r01940j252530M19817K188658K505825K007838O02240k734701
11069D131376n656433l524792K568453M885526O7316m853567k637885L393940
11061a626066N176912K034626l53672l7245J9214p11178L25892K124574M35272
11052G388329l968394m457465J221359O046265L242130l901905o787588l245428
11044d462697R85363J640944J179489K960491M683134J725732m768840p919801
11036c976185m145695J787307L310562N73611j398612r29963q59557j853832m90146
11027g982510L991742O380545K859536k198957j826232L274896N484581J085684
$$ plain form
11019 11069285 6343180 1085568 166894 2563843 3982164 2711688 810979 248148
11011 248148 240209 -692155 -1740899 -870558 1729491 3617980 3930708 4758900 7234385
11002 7234385 8462810 5038146 -1431251 -5327015 -3779359 94531 1588723 -31978
10994 -31978 -1910692 -2186241 -2020341 -2873789 -3569828 -1748904 1984402 3423561 -177875
10985 -177875 -5646628 -7129482 -3737469 -765445 -1929048 -3675918 -463208 6416402
10977 6416402 9784154 6343058 1175148 684053 4331438 6396604 4168557 841876
10969 841876 277068 2086362 3455210 3662843 4259712 5516193 5497167 3302105 891359
10960 891359 314319 1072896 2111514 4508226 9220073 13271600 11962805 5222500 -1639904
$$ packed form
11019A1069285m726105n257612r18674K396949J418321j270476j900709n62831
11011B48148p939r32364j048744Q70341K600049J888489L12728Q28192K475485
11002G234385J228425l424664o469397l895764J547656L873890J494192j620701
10994c1978j878714k75549J65900q53448o96039J820924L733306J439159l601436
10985a77875n468753j482854L392013K972024j163603j746870L212710O879610
10977F416402L367752l441096n167910m91095L647385K065166k228047l326681
10969H41876n64808J809294J368848K07633N96869J256481j9026k195062k410746
10960H91359n77040P58577J038618K396712M711847M051527j308795o740305o862404
$$ plain form
10951 -1639904 -4538986 -4843044 -5559169 -6483691 -5680246 -3481438 -2070980 -2279116 -3221766
10942 -3221766 -4180632 -4704204 -3829560 -1433206 491073 216531 -764468 299822 2963091
10933 2963091 4061570 3025559 3552164 8143184 13224381 12669673 5778834 -1136346
10925 -1136346 -2300348 625297 1725349 -232475 71352 6322003 14249102 16595220
10917 16595220 11979804 5109135 -20043 -2565999 -1602211 3751328 9964635 10338064
10909 10338064 3214854 -5149470 -8566540 -7972775 -7574594 -7722548 -5715987 -1229368
10901 -1229368 3248455 6165512 7730478 7861312 6096943 2970401 -428248 -3347581
10893 -3347581 -4678947 -3281468 -336487 1102157 444058 369209 1424877 -197510 -6272476
$$ packed form
10951a639904k899082l04058p16125r24522Q03445K198808J410458k08136r42650
10942c221766r58866n23572Q74644K396354J924279k74542r80999J064290K663269
10933B963091J098479j036011N26605M591020N081197n54708o890839o915180
10925a136346j164002K925645J100052j957824L03827O250651P927099K346118
10917A6595220m615416o870669n129178k545956R63788N353539O213307L73429
10909A0338064p123210q364324l417070N93765L98181j47954K006561M486619
10901a229368M477823K917057J564966J30834j764369l126542l398649k919333
10893c347581j331366J397479K944981J438644o58099p4849J055668j622387o074966
$$ plain form
10884 -6272476 -11836479 -11339069 -6483832 -3038598 -2176312 -262463 4172644 8405804
10876 8405804 9856181 8172146 3856829 -1129246 -2644453 1396935 7283119 10276654
10868 10276654 11212179 13159185 13802691 8304785 -1055363 -6112016 -4704346 -3482654
10860 -3482654 -6406773 -8150464 -3345625 4028080 6222093 2327580 -2395663 -4807412
10852 -4807412 -5898591 -6175645 -4326491 -448347 3194850 4920505 4570494 2049357
10844 2049357 -2416941 -6634014 -7690569 -5556672 -3560793 -4340440 -6599723 -7111311
10836 -7111311 -5275123 -3908873 -4809705 -5305134 -1747672 4097268 5851835 1068019
10828 1068019 -4778813 -5799260 -3841214 -4640995 -8166537 -8603408 -3648253 1885806
$$ packed form
10884f272476n564003M97410M855237L445234Q62286J913849M435107M233160
10876H405804J450377j684035m315317m986075j515207M041388N886184K993535
10868A0276654R35525J947006O43506n497906r360148n056653J407670J221692
10860c482654k924119j743691M804839P373705K194013l894513m723243k411749
10852d807412j091179k77054J849154L878144L643197J725655l50011k521137
10844B049357m466298m217073j056555K133897J995879p79647k259283n11588
10836g111311J836188J366250r00832m95429L557462N844940J754567m783816
10828A068019n846832j020447J958046p99781l525542m36871M955155N534059
$$ plain form
10820 1885806 3081471 890666 -898281 -996983 -608804 -610569 -792908 -567320 384848
10811 384848 1103876 -339701 -3723531 -5522850 -3874583 -2456515 -4828696 -7189992
10803 -7189992 -3430045 3753482 5106286 -944879 -5297375 -2425906 1419691 -463234
10795 -463234 -4138479 -2865827 683034 -694429 -5868949 -7091370 -2707892 933971
10787 933971 28603 -2552298 -4456863 -7397917 -11426698 -12432265 -8481434 -3494920
10779 -3494920 -1471379 -1157222 577245 3502849 5176252 4840110 3622402 2561589
10771 2561589 2146554 2250163 1521764 -1327760 -5019121 -6608927 -5281633 -2816230 -245022
10762 -245022 2694966 4527298 2598094 -2087438 -4777621 -3593007 -2037971 -2615169
$$ packed form
10820A885806J195665k190805j788947r8702L88179j765j82339K25588R52168
10811C84848P19028j443577l383830j799319J648267J418068k372181k361296
10803g189992L759947P183527J352804o051165m352496K871469L845597j882925
10795d63234l675245J272652L548861j377463n174520j222421M383478L641863
10787I33971r05368k580901j904565k941054m028781j005567L950831M986514
10779c494920K023541L14157J734467K925604J673403l36142j217708j060813
10771B561589m15035J03609p28399k849524l691361j589806J327294K465403K571208
10762b45022K939988J832332j929204m685532k690183J184614J555036n77198
$$ plain form
10754 -2615169 -2658765 -86468 1411666 -1849838 -6299472 -6020496 -2578676 -2762352 -7188160
10745 -7188160 -8792572 -4116672 1121767 1147536 -1178598 306512 5263385 8048925
10737 8048925 6522106 4167909 3974521 4917170 5047118 4225062 2663233 -183507 -3720485
10728 -3720485 -5418199 -3637958 9546 2484720 2657526 1732498 993915 373967 -634412
10719 -634412 -1496189 -839050 1740003 4726196 6265783 6273098 5877322 5165602 3307786
10710 3307786 1077852 871827 3086332 4732163 3495383 1271395 1277103 3015999 2845456
10701 2845456 -936750 -5900467 -8319595 -6599458 -2143970 2012442 3997141 5106831
10693 5106831 7483767 9420395 6389433 -1274301 -5826501 -1372354 7481581 11316731
$$ packed form
10754b615169m3596K572297J498134l261504m449634K78976L441820j83676m425808
10745g188160j604412M675900N238439K5769k326134J485110M956873K785540
10737H048925j526819k354197j93388R42649J29948q22056j561829k846740l536978
10728c720485j697714J780241L647504K475174J72806r25028p38583o19948j008379
10719f34412q61777O57139K579053K986193J539587P315l95776p11720j857816
10710C307786k229934k06025K214505J645831j236780k223988N708J738896j70543
10701B845456l782206m963717k419128J720137M455488M156412J984699J109690
10693E106831K376936J936628l030962p663734m552200M454147Q853935L835150
$$ plain form
10685 11316731 7888237 2720857 -396206 -2621296 -4199450 -2781399 910628 2243778
10677 2243778 -210837 -2374724 -1766482 -1232537 -2729432 -2986403 807826 5773268 7977267
10668 7977267 8322426 9640331 11413804 11655012 11108107 11362583 11113672 8225953 3643351
10659 3643351 -152690 -2702555 -4426879 -3897134 305246 6141652 9355169 7712679
10651 7712679 2844847 -919576 556533 6807690 11241270 7998246 582876 -1711614
10643 -1711614 2982462 6258765 2629331 -1896166 154148 5551668 5678414 -197930
10635 -197930 -4901048 -4599313 -2680124 -2603690 -3118158 -1840784 482641 835616 -2544606
10626 -2544606 -7634398 -9409298 -5024112 1614867 3671935 107473 -3817997 -5252083
$$ packed form
10685A1316731l428494n167380l117063k225090j578154J418051L692027J333150
10677B243778k454615k163887O08242N33945j496895k56971L794229M965442K203999
10668G977267L45159J317905J773473K41208n46905K54476k48911k887719m582602
10659C643351l796041k549865j724324N29745M202380N836406L213517j642490
10651G712679m867832l764423J476109O251157M433580l243024p415370k294490
10643a711614M694076L276303l629434m525497K050314N397520J26746n876344
10635a97930m703118L01735J919189P6434n14468J277374K323425L52975l380222
10626b544606n089792j774900M385186O638979K057068l564462l925470j434086
$$ plain form
10618 -5252083 -6868678 -9514821 -8845157 -3040431 2598012 3256710 968471 -896639
10610 -896639 -3184753 -6284530 -6531639 -2706405 303919 -282847 -258154 2658232 3176779
10601 3176779 -1404314 -4227173 -696782 1551231 -4993582 -13540513 -13319488 -7155403
10593 -7155403 -5454460 -8224452 -7327360 -2819299 -2383448 -6248751 -6615079 -1692493 2348367
10584 2348367 3157570 3938661 3938472 -636854 -6377523 -5522529 570024 2658116 -1064828
10575 -1064828 -2632463 1609459 5936433 5885951 3641126 1477786 -679813 -829367 2646041
10566 2646041 4801322 74425 -7293946 -9136279 -6936457 -7823819 -10349819 -8041960
10558 -8041960 -4315258 -8218957 -16656731 -17206166 -8655844 -2359123 -2632210 -2687623 -1203765
$$ packed form
10618e252083j616595k646143O69664N804726N638443O58698k288239j865110
10610h96639k288114l099777k47109L825234L010324n86766K4693K916386N18547
10601C176779m581093k822859L530391K248013o544813q546931K21025O164085
10593g155403J700943k769992Q97092M508061M35851l865303l66328M922586M040860
10584B348367Q09203P81091j89m575326n740669Q54994O092553K088092l722944
10575a064828j567635M241922M326974n0482k244825k163340k157599j49554L475408
10566B646041K155281m726897p368371j842333K199822q87362k526000K307859
10558h041960L726702l903699q437774n49435Q550322O296721k73087n5413J483858
$$ plain form
10549 -1203765 -5239227 -14051979 -17353791 -12926269 -9194356 -7617017 -439052 10787903
10541 10787903 13439868 5296899 -939771 171149 -884475 -8185140 -11718274 -6368812
10533 -6368812 -896570 -511555 1253088 6353377 6823894 2337174 3388129 10115284
10525 10115284 9049497 -1653529 -6316546 584083 4714588 -588616 -2339260 5131572
10517 5131572 7279218 -3139446 -11587106 -9160147 -8132420 -15235186 -17257821 -9348012
10509 -9348012 -7969391 -17880730 -18073297 -912257 8620775 -3910326 -15707013 -9518900
10501 -9518900 -4942127 -16637585 -22279042 -7974426 -2150856 -22258260 -34691100 -17778353
10493 -17778353 -12510880 -47475844 -71548704 -48835384 -64703002 -212732640 -401286695
$$ packed form
10549a203765m035462q812752l301812M427522L731913J577339P177965J1226955
10541A0787903K651965q142969o236670J110920j055624p300665l533134N349462
10533f368812N472242L85015J764643N100289M70517m486720J050955O727155
10525A0115284j065787j0703026m663017O900629M130505n303204j750644P470832
10517E131572K147646j0418664q447660K426959J027727p102766k022635P909809
10509i348012J378621r911339j92567J7161040R533032j2531101j1796687O188113
10501i518900M576773j1695458n641457J4304616N823570k0107404j2432840J6912747
10493a7778353N267473l4964964k4072860K2713320j5867618j48029638j88554055
$$ plain form
10486 -401286695 -419519247 -219253046 4882128 69646752 15491538 -11333490 21272537
10479 21272537 39305642 18177745 6976758 23713797 31818128 18735261 14366489
10472 14366489 26369443 26418401 8483843 1143975 13016374 18676976 8357197 3571750
10464 3571750 12674067 15152259 2550838 -5063985 3110685 10498528 6444898 4460173
10456 4460173 12817107 17189572 8018737 -1385245 753534 5665326 3674756 1367437
10448 1367437 5262802 7891225 3749851 1555018 7530208 12461724 8071795 1891253
10440 1891253 3481385 8450468 7981950 3689238 2433660 5170557 9421078 14633022
10432 14633022 18485476 16240992 9112224 4650019 4746410 2858670 -3252984 -6855546
$$ packed form
10486d01286695j8232552K00266201K24135174O4764624n4155214k6825028L2606027
10479B1272537J8033105k1127897j1200987J6737039Q104331j3082867m368772
10472A4366489J2002954M8958j7934558p339868J1872399N660602j0319779m785447
10464C571750R102317K478192j2601421p614823Q174670P387843m053630j984725
10456D460173Q356934M372465r170835r403982K138779M911792j990570k307319
10448A367437L895365K628423m141374k194833N975190M931516m389929o180542
10440A891253J590132M969083m68518m292712j255578K736897M250521N211944
10432A4633022L852454k244484p128768m462205R6391j887740o111654l602562
$$ plain form
10424 -6855546 -4561636 -2320157 -4222166 -5882036 -3942284 -1939114 -1892156 -259501
10416 -259501 3013208 1840817 -4615555 -8288474 -5163851 -1647255 -2630257 -3627824 -728627
10407 -728627 1952255 1322007 1895545 6381204 9218388 6824821 4975995 8028668 9819243
10398 9819243 4313104 -2725123 -2560907 2556026 4367592 2487628 3130839 7154498
10390 7154498 8962945 6177737 2629138 1968118 3969435 6581782 7326353 4028492
10382 4028492 -2041639 -5581212 -3218950 2085670 5553521 6591083 7069807 6849172
10374 6849172 4935329 2565279 1412411 728525 -732233 -2158633 -2714660 -3612417 -5502843
10365 -5502843 -6420186 -5050805 -3461875 -3781906 -4607264 -3531105 -1008625 1145112 3168075
$$ packed form
10424f855546K293910K241479j902009j659870J939752K003170M6958J632655
10416b59501L272709j172391o456372l672919L124623L516596r83002r97567K899197
10407g28627K680882o30248N73538M485659K837184k393567j848826L052673J790575
10398I819243n506139p038227J64216N116933J811566j879964O43211M023659
10390G154498J808447k785208l548599o61020K001317K612347P44571l297861
10382D028492o070131l539573K362262N304620L467851J037562M78724k20635
10374F849172j913843k370050j152868o83886j460758j426400n56027q97757j890426
10365e502843r17343J369381J588930l20031q25358J076159K522480K153737K022963
$$ plain form
10356 3168075 6283804 9351830 9201557 4318992 -2829745 -7166981 -5291235 542499
10348 542499 3984228 2048165 -818674 902383 5631730 7468950 5460166 4277813
10340 4277813 6055176 7660411 6878083 5575010 5276342 4644267 2811181 695801 -1877482
10331 -1877482 -5631613 -7938399 -4912511 1826527 6183761 6221875 5630836 5676964 2886441
10322 2886441 -3107613 -6703881 -4644954 -718661 1208649 2417016 4014283 3194218
10314 3194218 -605359 -2179218 1570959 5994278 6322572 5250570 6847522 8404120
10306 8404120 5554656 1092896 805529 3608378 3862949 1616288 2296127 6419854 7454535
10297 7454535 1730091 -5654421 -7635847 -3836599 359790 1019104 -447964 13075
$$ packed form
10356C168075L115729L068026j50273m882565p148737m337236J875746N833734
10348E42499L441729j936063k866839J721057M729347J837220k008784j182353
10340D277813J777363J605235p82328j303073k98668o32075j833086k115380k573283
10331a877482l754131k306786L025888O739038M357234L8114n91039M6128k790523
10322B886441n994054l596268K058927L926293J927310J208367J597267q20065
10314C194218l799577j573859L750177M423319L28294j072002J596952J556598
10306H404120k849464m461760k87367K802849K54571k246661O79839M123727J034681
10297G454535n724444p384512j981426L799248M196389O59314j467068M61039
$$ plain form
10289 13075 3696764 7110958 6171514 1752230 -1462644 -1730591 -2164877 -4713598 -6613797
10280 -6613797 -5504048 -3726632 -3563947 -2076805 3997128 10826936 11020214 3785237
10272 3785237 -3883224 -6361535 -4943651 -3494992 -3060444 -2671354 -2264539 -2408864 -2644687
10263 -2644687 -1742953 881498 4386936 6560954 5146498 409220 -3940627 -3939320 309249
10254 309249 4522734 4622227 689695 -3292271 -3362148 291564 3094038 958476 -4633281
10245 -4633281 -8027940 -6125751 -1606344 1313560 1816123 1404949 118347 -3350150
10237 -3350150 -8510065 -12513729 -12971621 -10067646 -5929853 -2715499 -933781 1048960
10229 1048960 5246811 10998320 14291721 11290409 2717016 -5788141 -8274762 -4117920
$$ packed form
10289A3075L683689L414194r39444m419284l214874k67947m34286k548721j900199
10280f613797J109749J777416J62685J487142O073933O829808J93278p234977
10272C785237p668461k478311J417884J448659M34548L89090M06815j44325k35823
10263b644687R01734K624451L505438K174018j414456m737278m349847J307M248569
10254C09249M213485R9493l932532l981966o9877L653712K802474k135562n591757
10245d633281l394659J902189M519407K919904N02563m11174j286602l468497
10237c350150n159915m003664m57892K903975M137793L214354J781718J982741
10229A048960M197851N751509L293401l001312q573393q505157k486621M156842
$$ plain form
10221 -4117920 940798 512419 -5307102 -10193482 -9711220 -6451028 -4950188 -4658914 -2144217
10212 -2144217 1871286 3160295 1098497 -566364 -538881 -1688885 -4365964 -4083351 885005
10203 885005 4943840 2750492 -2669381 -4509233 -2169282 -1185923 -4258900 -7478827
10195 -7478827 -6168113 -900883 3571655 3531707 -324347 -3843302 -3746613 -1237485 -207380
10186 -207380 -1630402 -2048566 1097584 5267113 6492981 5276255 5384258 7411813 7100110
10177 7100110 1217471 -7097379 -10844534 -6779279 819620 4902472 3578220 1366472
10169 1366472 2012608 3080095 699473 -2693101 -678648 7011776 12376580 9649200
10161 9649200 3323139 1742850 5771384 8605355 5774935 758018 -274001 3758438
$$ packed form
10221d117920N058718m28379n819521m886380M82262L260192J500840K91274K514697
10212b144217M015503J289009k061798j664861K7483j150004k677079K82613M968356
10203H85005M058835k193348n419873j839852K339951R83359l072977l219927
10195g478827J310714N267230M472538l9948l856054l518955R6689K509128J030105
10186b07380j423022m18164L146150M169529J225868j216726J08003K027555l11703
10177G100110n882639q314850l747155M065255P598899M082852j324252k211748
10169A366472O46136J067487k380622l392574K014453P690424N364804k727380
10161I649200o326061j580289M028534K833971k830420n016917j032019M032439
$$ plain form
10153 3758438 8126845 8134392 4042043 -21134 -1119839 -286429 -78625 -898958 -1032247
10144 -1032247 677588 3643912 6136022 5858225 1593967 -3972552 -5346567 -890262
10136 -890262 3992163 3930787 1148001 979476 2537875 887150 -2797205 -1791390 4548477
10127 4548477 8475886 5937496 2468156 2783737 2925772 -978964 -3831120 166501
10119 166501 6141349 5131240 -1478201 -4141343 -350566 2375335 -613815 -4656672
10111 -4656672 -4895350 -3584272 -4126618 -4621214 -2687896 -1591182 -5392332 -11098008 -11878595
10102 -11878595 -6889657 -2164668 -1670746 -2947370 -3201195 -4590963 -9632829 -14668600
10094 -14668600 -13135467 -4743110 3366889 5549286 3509801 1366061 -763216 -4326010
$$ packed form
10153C758438M368407P547m092349m063177j098705Q33410K07804q20333j33289
10144a032247J709835K966324K492110k77797m264258n566519j374015M456305
10136h90262M882425o1376k782786j68525J558399j650725l684355J005815O339867
10127D548477L927409k538390l469340L15581J42035l904736k852156L997621
10119A66501N974848j010109o609441k663142L790777K725901k989150m042857
10111d656672k38678J311078n42346m94596J933318J096714l801150n705676p80587
10102a1878595M988938M724989M93922j276624k53825j389768n041866n035771
10094a4668600J533133Q392357Q109999K182397k039485k143740k129277l562794
$$ plain form
10086 -4326010 -6675663 -3386264 4373466 9802948 8710615 3956819 588768 27779
10078 27779 619852 996032 944706 860418 1692581 3914414 5929390 5335177 2163017 -1118513
10068 -1118513 -2903449 -3428718 -2636670 -93566 2743483 3495024 2746915 3689385 6983328
10059 6983328 9240251 7801570 4070233 909822 -576073 -746576 -503533 -1246607 -3216595
10050 -3216595 -3980790 -1527296 1828457 2427738 1181874 1719872 3674067 3830735 3237064
10041 3237064 5699702 8974122 6169181 -2251118 -7205613 -5140315 -3699704 -7958852
10033 -7958852 -10837862 -5165653 3275563 4715874 978282 1217261 6373835 9079783
10025 9079783 6934358 5065973 5746631 5297953 2316478 307210 491894 -341170 -2876049
$$ packed form
10086d326010k349653L289399P759730N429482j092333m753796l368051n60989
10078B7779N92073L76180n1326q4288Q32163K221833K014976n94213l172160l281530
10068a118513j784936n25269P92048K543104K837049P51541p48109R42470L293943
10059F983328K256923j438681l731337l160411j485895j70503K43043p43074j969988
10050c216595p64195K453494L355753N99281j245864N37998J954195J56668n93671
10041C237064K462638L274420k804941q420299m954495K065298J440611m259148
10033g958852k879010N672209Q441216J440311l737592K38979N156574K705948
10025I079783k145425j868385O80658m48678k981475k009268J84684q33064k534879
$$ plain form
10016 -2876049 -3161984 139810 2571565 685850 -3077453 -4913680 -4674642 -4023082 -3434729
10007 -3434729 -3219171 -4230793 -5766806 -5673843 -3770731 -2178685 -1436067 202029 2559746
9998 2559746 2653164 55236 -556381 4521560 11677170 13425898 7842901 1634838 2740921
9989 2740921 11397269 20128207 22106655 17425517 10583514 4829413 1703931 3221735
9981 3221735 9205933 13536685 9455138 -494113 -6098165 -2891904 2534901 3277913
9973 3277913 984335 -280442 -1750248 -5280259 -7154112 -3993449 -6319 -654608
9965 -654608 -3210764 -1608641 2912192 4474649 2828202 1967927 893435 -4532306 -11677779
9956 -11677779 -13115606 -8652166 -5584034 -5856088 -2959126 5569336 11967578 9317703
$$ packed form
10016b876049k85935L301794K431755j885715l763303j836227K39038O51560N88353
10007c434729K15558j011622j536013R2963J903112J592046P42618J638096K357717
9998B559746R3418k597928o11617N077941P155610J748728n582997o208063J106083
9989B740921Q656348Q730938J978448m681138o842003n754101l125482J517804
9981C221735N984198M330752m081547r949251n604052L206261N426805P43012
9973C277913k293578j264777j469806l530011j873853L160663L987130o48289
9965f54608k556156J602123M520833J562457j646447q60275j074492n425741p145473
9956a1677779j437827M463440L068132k72054K896962Q528462O398242k649875
$$ plain form
9948 9317703 1506626 -3051194 -2288962 -291203 -156843 -1330108 -1775677 -160161 2595893
9939 2595893 3407297 919161 -1498818 -156625 2918553 3145792 1248143 1891839 5130457
9930 5130457 6066818 3464013 1757043 3226052 4815977 4533932 4752912 6979122 8864786
9921 8864786 8354945 5859078 1359587 -5196381 -10181255 -9219303 -4344404 -1567624 -1212800
9912 -1212800 1385587 5293756 3915212 -2470383 -4615912 1239408 6997640 6171652
9904 6171652 3912668 6728427 11215657 11231857 8601325 7852160 6876943 2196510 -1911930
9895 -1911930 614621 6452098 7367338 3246014 1382734 4274305 6899294 5949783 4163408
9886 4163408 4770319 7331142 9449406 8615718 3587933 -2493781 -3376254 1713190 5218530
$$ packed form
9948I317703p811077m557820P62232J997759J34360j173265m45569J615516K756054
9939B595893Q11404k488136k417979J342193L075178K27239j897649O43696L238618
9930E130457R36361k602805j706970J469009J589925k82045K18980K226210J885664
9921H864786n09841k495867m499491o555968m984874R61952M874899K776780L54824
9912a212800K598387L908169j378544o385595k145529N855320N758232q25988
9904F171652k258984K815759M487230J6200k630532p49165r75217m680433m108440
9895a911930K526551N837477R15240m121324j863280K891571K624989r49511j786375
9886D163408O06911K560823K118264q33688n027785o081714q82473N089444L505340
$$ plain form
9877 5218530 2632835 926807 6894396 12344510 3374060 -17089840 -29524343 -23306258
9869 -23306258 -10005389 -5882289 -11340200 -15521018 -13794918 -11173297 -11710595 -13267174
9861 -13267174 -12901872 -11385902 -10952432 -11987119 -12970565 -11778347 -6898731 959175 8421659
9852 8421659 11917265 10701571 6903704 3228982 1372043 1754859 3404822 4298257 3006823
9843 3006823 207403 -2084756 -2703650 -1916240 85263 3665980 7709175 8808158 5123326
9834 5123326 396788 505142 5278059 7886705 4551325 323928 1119395 4324292 3665152
9825 3665152 372638 1346468 7056930 10167475 7682705 5816244 9310842 13618662
9817 13618662 12495586 7023890 2017009 -929066 -1707469 1336041 6904711 8410277
$$ packed form
9877E218530k585695j706028N967589N450114q970450k0463900j2434503O218085
9869b3306258J3300869M123100n457911m180818J726100K621621n37298j556579
9861a3267174L65302J515970M33470j034687r83446J192218M879616P857906P462484
9852H421659L495606j215694l797867l674722j856939L82816J649963Q93435j291434
9843C006823k799420k292159o18894P87410K001503L580717M043195J098983l684832
9834E123326m726538J08354M772917K608646l335380m227397P95467L204897o59140
9825C665152l292514R73830N710462L110545k484770j866461L494598M307820
9817A3618662j123076n471696n006881k946075p78403L043510N568670J505566
$$ plain form
9809 8410277 2547606 -4390133 -5453414 -3696523 -6097366 -10771904 -9556738 -1564660
9801 -1564660 5113411 5368627 2500390 695592 -419071 -1800166 -1941018 -321783 737325
9792 737325 -464130 -3191495 -6298868 -8424314 -7035303 -2099784 460289 -4765904
9784 -4765904 -13231540 -14665785 -7417739 -845719 -1436771 -4642847 -4379950 -2905720 -5096700
9775 -5096700 -8735716 -7940710 -3087042 -190625 -1610770 -3548511 -2784194 -522096 1500538
9766 1500538 4166330 8009227 10198312 7494395 1180564 -3486297 -3075856 431599
9758 431599 2722484 2373456 1166235 120806 -1677838 -3740834 -3176445 803267 4367919
9749 4367919 4146807 2350743 3079109 5603195 5971689 4094499 3965699 6783386 9046608
$$ packed form
9809H410277n862671o937739j063281J756891k400843m674538J215166P992078
9801a564660O678071K55216k868237j804798j114663j381095j40852J619235J059108
9792G37325j201455k727365l107373k125446J389011M935519K560073n226193
9784d765904q465636j434245P248046O572020n91052l206076K62897J474230k190980
9775e096700l639016P95006M853668K896417j420145j937741P64317K262098K022634
9766A500538K665792L842897K189085k703917o313831m666861M10441L507455
9758D31599K290885l49028j207221j045429j798644k062996N64389L979712L564652
9749D367919k21112j796064P28366K524086L68494j877190j28800K817687K263222
$$ plain form
9740 9046608 8591755 7691589 8225420 8087070 5132462 1335065 -80894 631184 791301
9731 791301 -357764 -909823 693246 3688939 5902850 5854351 4159255 2806285 2588030
9722 2588030 2090955 300233 -1253773 -965366 -144410 -584970 -693416 1957192 5293075
9713 5293075 5002800 2049173 2184641 6683873 9510697 6602844 2489245 3303351 7586669
9704 7586669 9398768 7641925 6460317 7686597 8600553 7433109 6157361 6462154 6760933
9695 6760933 5023815 1864877 -872443 -2397746 -2292057 225573 4230392 6127983
9687 6127983 3646242 -72 881174 6868840 11826192 10336552 4243110 -417016
9679 -417016 -873038 1074290 3708767 7207166 10700102 11572278 9035117 5322453 2211245
$$ packed form
9740I046608m54853r00166N33831j38350k954608l797397j415959P12078J60117
9731G91301j149065n52059J603069K995693K213911m8499j695096j352970k18255
9722B588030m97075j790722j554006K88407Q20956m40560j08446K650608L335883
9713E293075k90275k953627J35468M499232K826824k907853m113599Q14106M283318
9704G586669J812099j756843j181608J226280R13956j167444j275748L04793K98779
9695F760933j737118l158938k737320j525303J05689K517630M004819J897591
9687F127983k481741l646314Q81246N987666M957352j489640o093442m660126
9679d17016m56022J947328K634477L498399L492936Q72176k537161l712664l111208
$$ plain form
9670 2211245 -429005 -1583274 1192155 6722769 9137575 5351953 75125 -646443
9662 -646443 2364402 4259325 4221700 5058178 6712472 6408271 4750176 5747381 10125126
9653 10125126 13633248 12965484 9141368 4384356 -163386 -2938084 -2340031 357936
9645 357936 1985351 1858762 1781534 1892167 730989 -684077 270109 2533189 2159113
9636 2159113 -759544 -1432159 1856649 4721858 3502730 -22726 -3051086 -5711590
9628 -5711590 -7848963 -6986660 -2973620 -62123 -634272 -1136783 1786235 5263615 4879069
9619 4879069 1890797 820380 2383871 3652697 3430415 2911549 2206255 392178 -1605872
9610 -1605872 -1723693 -64819 1149374 538922 -1397709 -3253117 -3162104 165831 5169643
$$ packed form
9670B211245k640250j154269K775429N530614K414806l785622n276828p21568
9662f46443L010845J894923l7625Q36478J654294l04201j658095R97205M377745
9653A0125126L508122o67764l824116m757012m547742k774698N98053K697967
9645C57936J627415j26589p7228J10633j161178j415066R54186K263080l74076
9636B159113k918657o72615L288808K865209j219128l525456l028360k660504
9628e711590k137373Q62303M013040K911497n72149n02511K923018L477380l84546
9619D879069k988272j070417J563491J268826k22282n18866p05294j814077j998050
9610a605872j17821J658874J214193o10452j936631j855408R1013L327935N003812
$$ plain form
9601 5169643 7944252 6796001 4520518 4517456 6587034 8116094 7320169 3962529 -697210
9592 -697210 -3450265 -1549055 3153488 5703006 4745868 3706755 4130577 3135505 -228865
9583 -228865 -1889337 470271 3141847 2989713 2433262 2944151 94244 -8038944 -13567067
9574 -13567067 -8779310 869672 3535234 -1914903 -5837604 -3805879 -1943420 -4929538
9566 -4929538 -8569535 -7754757 -4011097 -1205532 196852 1133022 1336636 1538110 3478819
9557 3478819 5561058 3634230 -1763067 -4629896 -2608522 -809637 -2890003 -4424700
9549 -4424700 -519183 4940482 4312382 -2269727 -6982459 -5214894 -773662 490038
9541 490038 -2022303 -4327955 -3246551 617966 4262240 5404088 4125902 2023345
$$ packed form
9601E169643K774609j148251k275483l062K069578J529060p95925l357640m659739
9592f97210k753055J901210M702543K549518r57138j039113M23822r95072l364370
9583b28865j660472K359608K671576j52134n56451N10889k849907q133188n528123
9574a3567067M787757R648982K665562n450137l922701K031725J862459k986118
9566d929538l639997Q14778L743660K805565J402384R36170K03614K01474J940709
9557C478819K082239j926828n397297k866829K021374J798885k080366j534697
9549d424700L905517N459665o28100o582109m712732J767565M441232J263700
9541D90038k512341k305652J081404L864517L644274J141848j278186k102557
$$ plain form
9533 2023345 726159 1459001 4304890 6604790 4281029 -2605950 -7675569 -5448409
9525 -5448409 744940 2808410 -1064025 -5038991 -5391398 -5050260 -6676489 -7759509 -6098809
9516 -6098809 -4631820 -6411036 -9094203 -8863378 -6170415 -3329534 -113250 3448964
9508 3448964 3424562 -2961364 -10823302 -12277107 -6851358 -1854454 -2425168 -6012697 -7256548
9499 -7256548 -4355555 203381 2400353 80091 -4019166 -3699074 3166862 10088408
9491 10088408 9177727 1810782 -2997024 -646977 4166455 5525838 3495356 875408
9483 875408 -2041041 -5609077 -7396589 -4961543 -104904 3318763 4519798 5535092
9475 5535092 7091032 8094585 8691625 10367285 12566366 12258272 8232324 3708991 2839215
$$ packed form
9533B023345j297186P32842K845889K299900k323761o886979n069619K227160
9525e448409O193349K063470l872435l974966l52407L41138j626229j083020J660700
9516f098809J466989j779216k683167K30825K692963K840881L216284L562214
9508C448964k4402o385926p861938j453805N425749M996904n70714l587529j243851
9499g256548K900993M558936K196972k320262m099257L20092O865936O921546
9491A0088408r10681p366945m807806K350047M813432J359383k030482k619948
9483H75408k916449l568036j787512K435046M856639L423667J201035J015294
9475E535092J555940J003553N97040J675660K199081l08094m025948m523333q69776
$$ plain form
9466 2839215 5645981 8234012 7779051 5574125 4428700 4427922 3094191 -348856 -2961744
9457 -2961744 -1695211 2179695 4143452 1754176 -2731469 -5384739 -4982335 -3738202
9449 -3738202 -4362862 -6948192 -8751729 -7238122 -3225450 13185 1009478 1580906 2951173
9440 2951173 2976439 81611 -2218187 760615 7083928 9446512 5065316 -709438 -2539690
9431 -2539690 -1631457 -895768 1151496 6304907 10448336 8264002 2271550 22121 2527283
9422 2527283 2735635 -3011596 -8963179 -8569422 -3211088 1906080 5620797 9292970 11050800
9413 11050800 7692732 844403 -4134268 -4865729 -3166441 -302956 4086916 8276994
9405 8276994 8586680 4497240 -224101 -2678601 -3488565 -3237145 -476909 4398591 6895701
$$ packed form
9466B839215K806766K588031m54961k204926j145425p78j333731l443047k612888
9457b961744J266533L874906J963757k389276m485645k653270M02404J244133
9449c738202o24660k585330j803537J513607M012672L238635R96293N71428J370267
9440B951173K5266k894828k299798K978802O323313K362584m381196n774754j830252
9431b539690R08233P35689K047264N153411M143429k184334n992452k249429K505162
9422B527283K08352n747231n951583L93757N358334N117168L714717L672173J757830
9413A1050800l358068o848329m978671p31461J699288K863485M389872M190078
9405H276994L09686m089440m721341k454500q09964K51420K760236M875500K497110
$$ plain form
9396 6895701 3342824 -3847602 -8528427 -7326113 -2261145 1601377 1977 -6725223
9388 -6725223 -12261575 -9461139 911533 9336242 8270288 1149270 -2923636 -1205373
9380 -1205373 774377 -1493638 -5541290 -6559223 -3966032 -969906 129052 -88942
9372 -88942 47181 1052584 1730252 646755 -1504309 -1720643 1809133 6504786 7448040
9363 7448040 2722552 -4668252 -10099892 -11113067 -8192273 -3645716 -53358 1512759
9355 1512759 1988412 2332466 1881254 98449 -1323873 -719997 -45336 -2805853 -8104698
9346 -8104698 -10368321 -6552576 -647751 1233674 -1873563 -5840679 -7232133 -6373262
9338 -6373262 -5245905 -4811418 -4770588 -4297595 -2359295 1697354 7149490 11826833 13550330
$$ packed form
9396F895701l552877p190426m680825J202314N064968L862522j599400o727200
9388f725223n536352K800436J0372672Q424709j065954p121018m072906J718263
9380a205373J979750k268015m047652j017933K593191K996126J098958k17994
9372h8942J36123J005403O77668j083497k151064k16334L529776M695653R43254
9363G448040m725488p390804n431640j013175K920794M546557L592358J566117
9355A512759M75653L44054m51212j782805j422322O03876O74661k760517n298845
9346h104698k263623L815745N904825J881425l107237l967116j391454Q58871
9338f373262J127357M34487M0830M72993J938300M056649N452136M677343J723497
$$ plain form
9329 13550330 11798034 7939292 3851899 512639 -1821642 -2503396 -743167 2616441
9321 2616441 4741581 3407360 -348952 -2962394 -1707976 2652344 5998578 4023158
9313 4023158 -3228132 -10195699 -11384876 -8116693 -6661419 -9249616 -11330413 -9604384
9305 -9604384 -7556488 -8910356 -10304185 -6465931 622393 4512755 4052141 3119837 2154362
9296 2154362 -1729508 -6318880 -5181935 1093801 3551752 -1503960 -5973115 -2472948
9288 -2472948 4091530 4507194 -972195 -4857288 -4777299 -5403980 -9351963 -13299614 -13540281
9279 -13540281 -10225420 -5523078 -1189265 1938800 4582702 8364829 12603914 13879031
9271 13879031 10999479 7406152 5851306 4440971 1678463 1142645 5777894 11085713
$$ packed form
9329A3550330j752296l858742m087393l339260k334281o81754J760229L359608
9321B616441K125140j334221l756312k613442J254418M360320L346234j975420
9313D023158p251290o967567j189177L268183J455274k588197k080797J726029
9305i604384K047896j353868j393829L838254P088324L890362m60614r32304r65475
9296B154362l883870m589372J136945O275736K457951n055712m469155L500167
9288b472948O564478M15664n479389l885093P9989o26681l947983l947651k40667
9279a3540281L314861M702342M333813L128065K643902L782127M239085J275117
9271A3879031k879552l593327j554846j410335k762508n35818M635249N307819
$$ plain form
9263 11085713 10310774 4027673 -1606064 -4030021 -5243537 -5411962 -2639170 1548161
9255 1548161 3294400 2906028 3960287 6028310 4566685 -1728533 -9236094 -14729757
9247 -14729757 -16532448 -11762953 -47135 10723891 11086655 3090187 -2001634 101018
9239 101018 2597957 1432877 1948717 7128369 10023626 4977312 -2601573 -5542438 -6131239
9230 -6131239 -9437970 -12333535 -8873855 -1642362 2001285 1522316 1980825 4113388 4656858
9221 4656858 4386932 6821569 10131423 8904428 3367545 -1051331 -2580989 -3520390 -2755833
9212 -2755833 3022376 10342291 10657972 3022115 -3513333 -2755708 1440307 3791827 5130594
9203 5130594 7065196 6813072 3023962 542547 3294857 7428420 7570699 5476816 5910143
$$ packed form
9263A1085713p74939o283101n633737k423957j213516j68425K772792M187331
9255A548161J746239l88372J054259K068023j461625o295218p507561n493663
9247a4729757j802691M769495J1715818J0771026L62764p996468n091821K102652
9239A01018K496939j165080N15840N179652K895257n046314p578885k940865n88801
9230f131239l306731k895565L459680P231493L643647m78969M58509K132563N43470
9221D656858k69926K434637L309854j226995n536883m418876j529658r39401P64557
9212b755833N778209P319915L15681p635857o535448P57625M196015K351520J338767
9203E130594J934602k52124l789110k481415K752310M133563J42279k093883M33327
$$ plain form
9194 5910143 7550119 5372489 146783 -1938953 858550 3095923 836233 -2484261
9186 -2484261 -1713849 2408069 4788514 3093833 12009 -1111911 -173441 884922 1281716
9177 1281716 1755646 2398346 2042539 172640 -2218662 -4460039 -7198304 -10397042 -12200805
9168 -12200805 -11584600 -10333644 -10113478 -9426663 -6466441 -3264688 -3069544 -4581545 -3277598
9159 -3277598 1488848 5127429 4409926 1503107 172164 1360185 3800584 6023670
9151 6023670 6766071 6202637 7140406 11616264 16136400 14588953 6739794 -663249 -2575881
9142 -2575881 -923782 323949 455395 212455 -548160 -866083 1043128 3108700 237368
9133 237368 -7176813 -11302084 -7507717 -1368917 -231057 -3388691 -6384465 -9280373
$$ packed form
9194E910143J639976k177630n225706k085736K797503K237373k259690l320494
9186b484261P70412M121918K380445j694681l081824j123920R38470J058363L96794
9177A281716M73930O42700l55807j869899k391302k241377k738265l198738j803763
9168a2200805O16205J250956K20166O86815K960222L201753J95144j512001J303947
9159c277598M766446L638581p17503k906819j330943J188021K440399K223086
9151F023670P42401n63434R37769M475858M520136j547447p849159p403043j912632
9142b575881J652099J247731J31446k42940p60615l17923J909211K065572k871332
9133B37368p414181m125271L794367O138800J137860l157634k995774k895908
$$ plain form
9125 -9280373 -13169778 -13469254 -5926689 3658544 5360006 -445241 -3926933 -898651
9117 -898651 2490929 1451836 -576304 21045 630128 -1147447 -1586088 2894835 8578440
9108 8578440 9401513 5760492 3085706 3768200 5229277 4896604 3076747 1037929 -840929
9099 -840929 -2500461 -3212941 -1789399 1852516 5077872 4340298 652110 909591 9564821
9090 9564821 20586359 23536118 17409221 11585756 11622610 11694995 5057496 -4912082 -10163517
9081 -10163517 -9366144 -6915677 -4009412 1685568 8799544 12063735 10063650 7292246
9073 7292246 7068031 7371184 5655793 3555159 4055126 6791962 8828508 8434484 6011045
9064 6011045 2612156 -348598 -696538 2942821 8735849 12264821 10690231 5905254
$$ packed form
9125i280373l889405k99476P542565R585233J701462n805247l481692L028282
9117h98651L389580j039093k028140N97349O09083j777575m38641M480923N683605
9108H578440Q23073l641021k674786O82494J461077l32673j819857k038818j878858
9099h40929j659532p12480J423542L641915L225356p37574l688188K57481Q655230
9090I564821J1021538K949759o126897n823465L6854P2385o637499r969578n251435
9081a0163517P97373K450467K906265N694980P113976L264191k000085k771404
9073G292246k24215L03153j715391k100634M99967K736836K036546l94024k423439
9064F011045l398889k960754l47940L639359N793028L528972j574590m784977
$$ plain form
9056 5905254 2573251 3102765 5770949 8034228 9715110 11411118 11657673 8555350 3461913
9047 3461913 4806 -547129 -118496 -115590 -5183 272971 -110248 -548707 53979 -255879
9037 -255879 -4499971 -10440041 -11736626 -7409355 -4164751 -5948551 -7401848 -2923291
9029 -2923291 3399105 3942388 -427998 -2485415 -541940 78795 -2927253 -5245802 -3639551
9020 -3639551 -533357 1109009 1945185 3160119 3997432 4485678 6376025 9335387 10111566
9011 10111566 7520488 4758443 4835189 6818532 8163724 7764495 5531801 2119680 -16778
9002 -16778 1265862 3927354 3853563 1361231 871962 3200516 3769136 424756 -2834927
8993 -2834927 -2801165 -1812211 -1908094 -337866 4132770 6278075 2178453 -3018276 -2538451
$$ packed form
9056E905254l332003N29514K668184K263279J680882J696008K46555l102323n093437
9047C461913l457107n51935M28633K906J10407K78154l83219m38459O02686l09858
9037b55879m244092n940070j296585M327271L244604j783800j453297M478557
9029b923291O322396N43283m370386k057417J943475O20735l006048k318549J606251
9020c639551L106194J642366Q36176J214934Q37313M88246J890347K959362P76179
9011A0111566k591078k762045P6746J983343J345192l99229k232694l412121k136458
9002a6778J282640K661492p3791k492332m89269K328554N68620l344380l259683
8993b834927L3762R88954r5883J570228M470636K145305m099622n196729M79825
$$ plain form
8984 -2538451 777422 -851918 -6848876 -9078082 -5421759 -3052589 -6492616 -11029278
8976 -11029278 -11251842 -8726222 -6994096 -5254513 -1990909 177086 -1333868 -3769921
8968 -3769921 -3100566 -400604 897037 1453770 4102155 7295511 6650204 2643589 692248
8959 692248 2581082 3509088 21556 -4037762 -3221076 1256865 3339219 656441 -2948721
8950 -2948721 -3343246 -1045526 776698 789166 317160 749795 1439414 148949 -4546823
8941 -4546823 -10917995 -14537960 -12359987 -6446291 -2139577 -1970615 -3039315 -1612764
8933 -1612764 1427520 2073201 -671948 -3087352 -1899404 1258845 2242956 -214818 -3575946
8924 -3575946 -5446144 -6377733 -8132471 -10483551 -10943279 -7583380 -1510730 3750603 5309908
$$ packed form
8984b538451L315873j629340n996958k229206L656323K369170l440027m536662
8976a1029278k22564K525620J732126J739583L263604K167995j510954k436053
8968c769921O69355K699962J297641N56733K648385L193356o45307m006615j951341
8959F92248J888834R28006l487532m059318Q16686M477941K082354k682778l605162
8950b948721l94525K297720J822224J2468m72006M32635O89619j290465m695772
8941d546823o371172l619965K177973N913696M306714J68962j068700J426551
8933a612764L040284O45681k745149k415404J187948L158249R84111k457774l361128
8924c575946j870198r31589j754738k351080m59728L359899O072650N261333J559305
$$ plain form
8915 5309908 3278955 222845 -1366378 -856167 693364 1665256 971587 -1098411 -2899590
8906 -2899590 -3015277 -1976756 -1561354 -2206806 -2360085 -1091667 -42491 -1267933 -3824707
8897 -3824707 -4398690 -1629458 1788996 2359321 202668 -1213461 268716 2559020 1969145
8888 1969145 -2095604 -6626355 -8947912 -9175432 -8189680 -5633974 -1948427 -289289 -2933377
8879 -2933377 -6561419 -5255443 1095946 5449190 2658323 -3656109 -6244787 -3441467
8871 -3441467 348879 1344041 -474365 -3719717 -6805377 -7093837 -3086822 2118232 3605149
8862 3605149 1641698 1650010 5792505 9299966 8013513 5101374 5745495 8460983 7553852
8853 7553852 2809699 368590 3141556 6221504 4554122 505834 -283524 2544777
$$ packed form
8915E309908k030953l056110j589223N10211J549531R71892o93669k069998j801179
8906b899590j15687J038521M15402o45452j53279J268418J049176j225442k556774
8897c824707n73983K769232L418454N70325k156653j416129J482177K290304n89875
8888A969145m064749m530751k321557k27520R85752K555706L685547J659138k644088
8879b933377l628042J305976O351389M353244k790867o314432k588678K803320
8871c441467L790346R95162j818406l245352l085660k88460M007015N205054J486917
8862C605149j963451Q312M142495L507461j286453k912139O44121K715488r07131
8853G553852m744153k441109K772966L079948j667382m048288p89358K828301
$$ plain form
8845 2544777 4591895 4431106 5511652 9510747 12439786 10108812 4445677 844121
8837 844121 681507 231964 -2972755 -6265921 -5791526 -1788618 2188847 3835894 3707886
8828 3707886 3145578 2835400 3216770 4239547 4467748 2292162 -1354305 -3116198 -1028985
8819 -1028985 2885933 4766407 2865381 -1353702 -5228604 -7051790 -6641336 -4625905
8811 -4625905 -1434582 2689324 6373404 6961606 3565789 -200850 584953 5422983 7869353
8802 7869353 3771092 -2689650 -4349290 -557273 2700909 1441726 -2041539 -4254297
8794 -4254297 -5377324 -6598680 -6043059 -1297428 5303215 7768064 3493368 -3215462
8786 -3215462 -5905678 -3011012 1149714 1973021 -241732 -1532147 142842 2580088
$$ packed form
8845B544777K047118j60789J080546L999095K929039k330974n663135l601556
8837H44121j62614m49543l204719l293166M74395M002908L977465J647047j28008
8828C707886n62308l10178L81370J022777K28201k175586l646467j761893K087213
8819a028985L914918J880474j901026m219083l874902j823186M10454K015431
8811d625905L191323M123906L684080N88202l395817l766639P85803M838030K446370
8802G869353m098261o460742j659640L792017L258182j259183l483265k212758
8794d254297j123027j221356N55621M745631O600643K464849m274696o708830
8786c215462k690216K894666M160726Q23307k214753j290415J674989K437246
$$ plain form
8778 2580088 3204711 2882681 3536627 3763477 626914 -4548189 -6462260 -2922630 2417340
8769 2417340 5950663 8217792 9473769 6321401 -2166950 -9048373 -7110113 177623
8761 177623 2704123 -1823958 -5390922 -2796867 1178597 1474012 1735867 7075371 13448403
8752 13448403 12388090 3753835 -4087774 -6244719 -6192133 -7681881 -8495519 -5340116 -137025
8743 -137025 2588055 2044579 1386251 2665201 4284839 3501266 57646 -3011269 -2153424
8734 -2153424 2894940 8651766 11863619 12600969 11939450 8698204 1993955 -4203830 -4116027
8725 -4116027 1380961 4302939 151673 -5239530 -3345384 5446635 12415904 11331630
8717 11331630 4297298 -2845649 -6540857 -6030319 -1866247 3579210 6427592 4848110
$$ packed form
8778B580088O24623l22030O53946K26850l136563n175103j914071L539630N339970
8769B417340L533323K267129J255977l152368q488351o881423J938260P287736
8761A77623K526500m528081l566964K594055L975464K95415K61855N339504O373032
8752A3448403j060313q634255p841609k156945N2586j489748q13638L155403N203091
8743a37025K725080n43476o58328J278950J619638p83573l443620l068915Q57845
8734b153424N048364N756826L211853P37350o61519l241246o704249o197785Q7803
8725d116027N496988K921978m151266n391203J894146Q792019O969269j084274
8717A1331630p034332p142947l695208N10538M164072N445457K848382j579482
$$ plain form
8709 4848110 1414615 -147237 151742 -698308 -3173487 -3457513 984117 6370724 6539949
8700 6539949 1355589 -2738109 -1687281 663792 -964252 -4720119 -4446848 541434
8692 541434 4300423 3260967 704207 289435 451360 -1256433 -2690262 -706249 2853436
8683 2853436 3906782 2859681 3154768 4223314 1973118 -3145734 -4584414 1362645
8675 1362645 9833765 13876436 12885560 10792095 8970917 5932460 2612318 2443597 5381679
8666 5381679 6607721 3491792 129850 1398120 4918945 3722460 -3257236 -8237390
8658 -8237390 -4474224 4376207 8613852 4710460 -1043841 -1475329 2741329 5419234
8650 5419234 3503873 347901 641161 4320400 6619200 3765429 -2197007 -5192044
$$ packed form
8709D848110l433495j561852K98979q50050k475179k84026M441630N386607J69225
8700F539949n184360m093698J050828K351073j628044l755867K73271M988282
8692E41434L758989j039456k556760m14772J61925j707793j433829J984013L559685
8683B853436J053346j047101K95087J068546k250196n118852j438680N947059
8675A362645Q471120M042671r90876k093465j821178l038457l320142j68721K938082
8666E381679J226042l115929l361942J268270L520825j196485o979696m980154
8658h237390L763166Q850431M237645l903392n754301m31488M216658K677905
8650E419234j915361l155972K93260L679239K298800k853771n962436k995037
$$ plain form
8642 -5192044 -2088258 3255235 4299358 -673117 -7326606 -10896075 -10362375 -7142978
8634 -7142978 -3034653 -524571 -1839518 -5637687 -7252265 -4435803 -532059 345503
8626 345503 -1187072 -1948299 -1512023 -1729782 -2509566 -2065121 -791739 -1144380 -3515627
8617 -3515627 -5374080 -4859517 -2680026 -337214 1105703 611332 -1849634 -3850250 -2567294
8608 -2567294 1554595 5383884 7052441 6941097 5426083 2853368 1489052 3824416
8600 3824416 8375384 10501755 8241472 4351002 1902356 1047973 1008255 1947285 3542460
8591 3542460 4533453 4783078 5021049 3980367 -616375 -7282044 -11087225 -10354347 -8801179
8582 -8801179 -8978265 -8305406 -4803105 -2024974 -3628647 -6744414 -6131428 -2334510 -76954
$$ packed form
8642e192044L103786N343493J044123m972475o653489l569469N33700L219397
8634g142978M108325K510082j314947l798169j614578K816462L903744Q77562
8626C45503j532575p61227M36276k17759p79784M44445J273382l52641k371247
8617c515627j858453N14563K179491K342812J442917m94371k460966k000616J282956
8608b567294M121889L829289J668557j11344j515014k572715j364316K335364
8600C824416M550968K126371k260283l890470k448646q54383l9718R39030J595175
8591C542460R90993K49625K37971j040682m596742o665669l805181P32878J553168
8582h801179j77086O72859L502301K778131j603673l115767O12986L796918K257556
$$ plain form
8573 -76954 -304287 222159 2183019 2711062 1582192 2377476 5699670 6741169 2758386
8564 2758386 -1459094 155178 5970012 8601305 4915447 -263116 -1170621 1708462
8556 1708462 3660939 2881836 2416212 4777652 7362685 5383679 -1501285 -7865388 -8481719
8547 -8481719 -4160364 -554942 -1709081 -5606909 -6309068 -684585 7109988 9242382
8539 9242382 3277916 -4178375 -5273653 -707316 2077135 -219653 -2782936 -849283
8531 -849283 3271979 4466234 2152686 -549477 -2180164 -3380086 -3875656 -2922107 -1521115
8522 -1521115 -894209 -110237 1640868 2261783 -30027 -2531772 -1623708 821933 -213004
8513 -213004 -4538982 -6262797 -2474389 2708510 4456144 2953220 518369 -2756899
$$ packed form
8573g6954k27333N26446J960860N28043j128870P95284L322194J041499l982783
8564B758386m217480J614272N814834K631293l685858n178563r07505K879083
8556A708462J952477p79103m65624K361440K585033j979006o884964o364103o16331
8547h481719M321355L605422j154139l897828p02159N624483P794573K132394
8539I242382n964466p456291j095278M566337K784451k296788k563283J933653
8531h49283M121262J194255k313548k702163j630687j199922m95570R53549J400992
8522a521115O26906P83972J751105O20915k291810k501745R08064K445641j034937
8513b13004m325978j723815L788408N182899J747634j502924k434851l275268
$$ plain form
8505 -2756899 -7205753 -10463332 -9793139 -6066591 -2652896 -1371864 -1709147 -2928514 -4559259
8496 -4559259 -5200179 -3051963 1778442 6569031 8216680 6050038 2210059 -878698
8488 -878698 -3066370 -5714290 -8681976 -9936843 -8695888 -6619877 -4624572 -1346434
8480 -1346434 2961349 4282298 482567 -3673478 -2469882 1508938 482542 -6304098
8472 -6304098 -10433890 -6313064 1082136 3945039 1847320 -280441 -373310 -210005 -365030
8463 -365030 743857 3128667 4318930 2691901 -365692 -1898055 -143684 3556070
8455 3556070 5316467 2660973 -1891656 -3453019 -1242130 691771 -91892 -1290346
8447 -1290346 -897076 -970302 -3280042 -5186481 -3947872 -1924817 -2896877 -5721481 -6629454
$$ packed form
8505b756899m448854l257579O70193L726548L413695J281032l37283j219367j630745
8496d559259o40920K148216M830405M790589J647649k166642l839979l088757
8488h78698k187672k647920k967686j254867J240955K076011J995305L278138
8480a346434M307783J320949l799731m156045J203596L978820j026396o786640
8472f304098m129792M120826P395200K862903k097719k127761r2869J63305j55025
8463c65030J108887K384810J190263j627029l057593j532363J754371L699754
8455C556070J760397k655494m552629j561363K210889J933901p83663j198454
8447a290346L93270p3226k309740j906439J238609K023055r72060k824604r07973
$$ plain form
8438 -6629454 -5960381 -7209160 -10271005 -11177467 -8827177 -6892758 -7918822 -9910056 -10278464
8429 -10278464 -9243694 -7417026 -3610039 2279558 6852329 6770689 3394576 1061765
8421 1061765 1155586 366532 -4455122 -11335539 -14580183 -11025507 -3661362 1684387 2339212
8412 2339212 229864 -1779809 -2790089 -3178602 -3493875 -4633272 -6814281 -7800838 -4949685
8403 -4949685 70163 1970134 -1044090 -4357155 -3536908 -230508 1718578 2383465 3660452
8394 3660452 4247722 2122003 -81434 1880613 6324363 7093123 2613187 -2224925 -3996096
8385 -3996096 -4856646 -6974535 -8196200 -6256626 -3140214 -1710932 -860225 2402294 7554219
8376 7554219 10394945 8093225 2653787 -882676 588600 4831967 6420971 3091452
$$ packed form
8438f629454O69073j248779l061845r06462K350290J934419j026064j991234l68408
8429a0278464J034770J826668L806987N889597M572771q1640l376113k332811
8421A061765R3821p89054m821654o880417l244644L554676P364145N345749O54825
8412B339212k109348k009673j010280l88513l15273j139397k181009r86557K851153
8403d949685N019848J899971l014224l313065Q20247L306400J949086O64887J276987
8394C660452N87270k125719k203437J962047M443750P68760m479936m838112j771171
8385c996096q60550k117889j221665J939574L116412J429282Q50707L262519N151925
8376G554219K840726k301720n439438l536463J471276M243367J589004l329519
$$ plain form
8368 3091452 -1306051 -1745100 1811367 5697425 8130545 9806504 10230803 8025993 4609722
8359 4609722 2942902 2309495 -996373 -6961847 -10523495 -8481939 -3651453 -509016
8351 -509016 -419551 -2470994 -5134401 -5763288 -2454647 2305344 3974927 2791173 3260340
8342 3260340 5902853 5951892 2440069 1183373 4518427 5421036 -1689110 -10307841 -10012362
8333 -10012362 -1363928 5566913 5312014 1631888 -979707 -2591071 -3988416 -4194397
8325 -4194397 -3384751 -3279769 -3520631 -2014942 524122 855468 -1262583 -2160105 184638
8316 184638 3582385 5431843 5356128 3465471 -117271 -3277707 -3325467 -1174194 -302641
8307 -302641 -966857 205654 3897316 6244295 5228476 4149555 5772991 7299332 5124288
$$ packed form
8368C091452m397503m39049L556467L886058K433120J675959M24299k204810l416271
8359D609722j666820o33407l305868n965474l561648K041556M830486L142437
8351e09016Q9465k051443k663407o28887L308641M759991J669583j183754M69167
8342C260340K642513M9039l511823j256696L335054R02609p110146q618731K95479
8333a0012362Q648434O930841k54899l680126k611595j611364j397345k05981
8325d194397Q09646J04982k40862J505689K539064L31346k118051q97522K344743
8316A84638L397747J849458p5715j890657l582742l160436m7760K151273Q71553
8307c02641o64216J172511L691662K346979j015819j078921J623436J526341k175044
$$ plain form
8298 5124288 1345375 826383 3512255 4460375 1475976 -1497306 -203919 3458691 3468937
8289 3468937 -2382092 -9054571 -10096444 -5521359 -1454166 -2196977 -5810247 -8556149
8281 -8556149 -9990851 -10902429 -9618432 -4709301 854971 3106240 3164082 4663193 6176264
8272 6176264 2646062 -5103166 -9124649 -5259333 438220 -52801 -6373809 -11746062
8264 -11746062 -12096888 -9199374 -6768151 -6955671 -9548358 -12164783 -12299315 -10512016 -9733146
8255 -9733146 -10447640 -9514923 -5277654 -444595 2197614 3314086 3639989 1109241 -4715043
8246 -4715043 -8828108 -6365493 180306 4252109 4284321 4509024 7427053 10477495 10687813
8237 10687813 8476426 5785394 3531884 1820230 358677 -1694801 -4291247 -5300178
$$ packed form
8298E124288l778913n18992K685872R48120k984399k973282J293387L662610J0246
8289C468937n851029o672479j041873M575085M067193p42811l613270k745902
8281h556149j434702r11578J283997M909131N564272K251269N7842J499111J513071
8272F176264l530202p749228m021483L865316N697553m91021o321008n372253
8264a1746062l50826K897514K431223j87520k592687k616425j34532J787299P78870
8255i733146p14494R32717M237269M833059K642209J116472L25903k530748n824284
8246d715043m113065K462615O545799M071803L2212K24703K918029L050442K10318
8237A0687813k211387k691032k253510j711654j461553k053478k596446j008931
$$ plain form
8229 -5300178 -3247086 -699423 -1849361 -6717944 -10762664 -10562343 -7149401 -3458426
8221 -3458426 -1365394 -1717027 -4265705 -6582088 -5722913 -2163507 348159 76504 -61756
8212 -61756 3045789 7676548 9147794 5823636 1007416 -1215589 -362028 929325 749352
8203 749352 -158433 -558371 -1111311 -2755689 -3735133 -1422920 2567027 2935219 -1703404
8194 -1703404 -5537792 -3297024 1873950 2887837 -1060562 -4151616 -2959556 -121696
8186 -121696 1359905 1866037 1792859 -197631 -3085115 -2430701 3202259 8525277 7892104
8177 7892104 2513003 -2153760 -3531675 -2774820 -1050562 643125 -208358 -4595698 -8089332
8168 -8089332 -5152984 2245504 5427279 223665 -7015871 -7656170 -1644719 3816020
$$ packed form
8229e300178K053092K547663j149938m868583m044720K00321L412942L690975
8221c458426K093032l51633k548678k316383Q59175L559406K511666k71655j38260
8212f1756L107545M630759J471246l324158m816220k223005Q53561J291353j79973
8203G49352r07785l99938n52940j644378r79444K312213L989947L68192m638623
8194a703404l834388K240768N170974J013887l948399l091054J192060K837860
8186a21696J481601N06132p3178j990490k887484O54414N632960N323018o33173
8177G892104n379101m666763j377915P56855J724258J693687q51483m387340l493634
8168h089332K936348P398488L181775n203614p239536o40299O011451N460739
$$ plain form
8160 3816020 4424889 2840127 2594356 2699479 710569 -2056675 -2172022 142416 800585
8151 800585 -1968175 -4658160 -3628922 -587900 -77849 -3005976 -5937219 -6396142 -5562527
8142 -5562527 -5062934 -4047800 -1122519 2696412 4801214 3944467 1154056 -1722411 -3535291
8133 -3535291 -4299685 -4603803 -4310629 -2235081 1906408 5759211 6360755 3957532 1774083
8124 1774083 1445946 781452 -2742999 -7911137 -10698864 -8445354 -2171693 4432377 7691918
8115 7691918 6553172 3131020 122705 -1927973 -3494721 -3236782 633607 6051937
8107 6051937 7892506 4590091 676981 549349 2768732 3346111 1825052 426170 -688680
8098 -688680 -2894935 -4806235 -2985539 2616241 7529496 8034302 4936722 1393664 -644261
$$ packed form
8160C816020O08869j584762k45771J05123j988910k767244j15347K314438O58169
8151H00585k768760k689985J029238L041022N10051k928127k931243m58923Q33615
8142e562527M99593J015134K925281L818931K104802q56747k790411k876467j812880
8133c535291p64394l04118K93174K075548M141489L852803O01544k403223k183449
8124A774083l28137o64494l524451n168138k787727K253510O273661O604070L259541
8115G691918j138746l422152l008315k050678j566748K57939L870389N418330
8107F051937J840569l302415l913110j27632K219383N77379j521059j398882j114850
8098f88680k206255j911300J820696N601780M913255N04806l097580l543058k037925
$$ plain form
8089 -644261 -1134290 -1245655 -2653179 -5704055 -7910679 -6155857 -683739 5005084 8270017
8080 8270017 9116882 8011718 5009562 1740867 986914 2704334 3311629 791620 -2229877
8071 -2229877 -2744920 -1948146 -2524727 -3716909 -2976763 -1047706 -977092 -2438380 -1576345
8062 -1576345 2761410 6929604 8132953 8035033 8384840 7173296 2908351 -731385 366143
8053 366143 3511892 2751741 -1021286 -324343 7045450 13228334 11258759 5036277 2656535
8044 2656535 4076790 2731928 -2545191 -5268740 -1824711 2883865 3177305 468298
8036 468298 -422974 1105343 1670325 -461901 -3518249 -4841473 -3069772 1040622 4410858
8027 4410858 4087604 1283277 562550 3471184 6031613 4750211 1730656 758769 1566756
$$ packed form
8089f44261m90029j11365j407524l050876k206624J754822N472118N688823L264933
8080H270017Q46865j105164l002156l268695p53953J717420O07295k520009l021497
8071b229877n15043P96774n76581j192182P40146J929057P0614j461288Q62035
8062a576345M337755M168194J203349r7920L49807j211544m264945l639736J097528
8053C66143L145749p60151l773027O96943P369793O182884j969575o222482k379742
8044B656535J420255j344862n277119k723549L444029M708576K93440k709007
8036D68298q91272J528317N64982k132226l056348j323224J771701M110394L370236
8027D410858l23254k804327p20727K908634K560429j281402l019555r71887Q07987
$$ plain form
8018 1566756 1805144 1748129 2491133 1940307 -2150591 -6738964 -6607590 -2212872 936951
8009 936951 460186 -849676 -1416868 -3494690 -7900249 -11366903 -11359726 -9274532 -6887987
8000 -6887987 -3838222 -739005 -437654 -3311321 -5097723 -2600163 1576552 3089055
7992 3089055 1823476 650011 677684 884979 425104 -1504864 -5951932 -11546043 -13798480
7983 -13798480 -10224196 -4243993 -833001 -217444 638974 2151097 1992473 42012 -845936
7974 -845936 585912 2043051 1110207 -1838021 -4873808 -6759240 -7300696 -6708691 -5048608
7965 -5048608 -2058436 1791831 4011747 2015070 -2664371 -4790030 -2051413 1470508
7957 1470508 1160471 -1710866 -3179810 -3557378 -6143690 -10378903 -11831518 -9085325 -5607528
$$ packed form
8018A566756K38388n7015P43004n50826m090898m588373J31374M394718L149823
8009I36951m76765j309862n67192k077822m405559l466654P177K085194K386545
8000f887987L049765L099217L01351k873667j786402K497560M176715J512503
7992C089055j265579j173465K7673K07295m59875j929968m447068n594111k252437
7983a3798480L574284N980203L410992O15557Q56418J512123j58624j950461q87948
7974h45936J431848J457139r32844k948228l035787j885432n41456N92005J660083
7965e048608K990172L850267K219916j996677m679441k125659K738617L521921
7957A470508l10037k871337j468944l77568k586312m235213j452615K746193L477797
$$ plain form
7948 -5607528 -4106794 -3721051 -3661642 -4678551 -5306472 -1819081 5163076 8638852 4015106
7939 4015106 -3294045 -3872353 3652799 11174362 11519838 6269392 2195615 3018259 6683141
7930 6683141 9235899 9154807 7772134 6901373 7076556 7660876 7467246 5173642 600820
7921 600820 -3749287 -4183574 -392735 3060105 2120851 -1138896 -1334283 2336206 4648755
7912 4648755 1625034 -4007846 -6509158 -4160816 -570921 384 -2977502 -6279114
7904 -6279114 -6544633 -4026907 -2426195 -4389462 -8028720 -9207463 -6375598 -1508875
7896 -1508875 2584354 3778399 938908 -4280257 -7188972 -5174099 -1974094 -2698681
7888 -2698681 -5711301 -4870782 533024 4613079 4662286 5053225 8701285 11540317 9780464
$$ packed form
7948e607528J500734L85743N9409j016909o27921L487391O982157L475776m623746
7939D015106p309151n78308P525152P521563L45476n250446m073777Q22644L664882
7930F683141K552758q1092j382673q70761J75183N84320j93630k293604m572822
7921F00820m350107m34287L790839L452840r39254l259747j95387L670489K312549
7912D648755l023721n632880k501312K348342L589895N71305k977886l301612
7904f279114k65519K517726J600712j963267l639258j178743K831865M866723
7896a508875M093229J194045k839491n219165k908715K014873L200005p24587
7888b698681l012620Q40519N403806M080055M9207L90939L648060K839032j759853
$$ plain form
7879 9780464 6594471 6330666 7242161 5697749 3037755 2072684 980627 -2468324 -4388287
$$ packed form
7879I780464l185993k63805R11495j544412k659994r65071j092057l448951j919963
$$ [...]
##END NTUPLES=NMR SPECTRUM
##END=
