##TITLE=31Pdec_SR52+5xTFAA'
 CDCl3, 24 sc
 31.05.2021
##JCAMPDX= 6.0         $$ Bruker NMR JCAMP-DX V2.0
##DATA TYPE= NMR SPECTRUM
##DATA CLASS= NTUPLES
##ORIGIN= UXNMR, Bruker Analytische Messtechnik GmbH
##OWNER= root
$$ XWIN-NMR		Version 3.5
$$ Mon May 31 12:46:35 2021 Russian Standard Time (UT+4h)  she@DPX200
##.OBSERVE FREQUENCY= 81.013821
##.OBSERVE NUCLEUS= ^31P
##.ACQUISITION MODE= SIMULTANEOUS
##.ACQUISITION SCHEME= undefined
##.AVERAGES= 24
##.DIGITISER RES= 16
##SPECTROMETER/DATA SYSTEM= spect
##.PULSE SEQUENCE= zgpg30
##.SOLVENT NAME= D2O
##.SHIFT REFERENCE= (INTERNAL, D2O, 0, 248.564)
##AUDIT TRAIL= $$ (NUMBER, WHEN, WHO, WHERE, WHAT)
$$ ##TITLE= Audit trail, XWIN-NMR		Version 3.5
$$ ##JCAMPDX= 5.01
$$ ##ORIGIN= Bruker BioSpin GmbH
$$ ##OWNER= she
$$ F:/spectra/data/she/nmr/P31/1/pdata/1/auditp.txt
$$ ##AUDIT TRAIL=  $$ (NUMBER, WHEN, WHO, WHERE, WHAT)
(   1,<2021-05-31 12:45:23.64 +0400>,<she>,<DPX200>,
      <created by zg, POWCHK disabled, PULCHK disabled
       configuration hash MD5:
       00 E9 B6 7A A2 85 ED C7 34 08 36 98 17 FE 4E 26
       data hash MD5: 32K
       E8 F4 F9 1A 8A 44 4E 1F 66 8B CB FB BB B7 DF DB>)
(   2,<2021-05-31 12:45:30.76 +0400>,<she>,<DPX200>,
      <Start of raw data processing
       efp BC_mod = 2 LB = 1 FT_mod = 6 PKNL = 1 PHC0 = -6359.562 PHC1 = 371.8012 SI = 64K 
       data hash MD5: 64K
       58 C8 71 E9 17 46 54 17 56 6C 38 78 E9 E7 D6 B0>)
(   3,<2021-05-31 12:45:55.70 +0400>,<she>,<DPX200>,
      <pk PHC0 = 86.83057 PHC1 = -113 
       data hash MD5: 64K
       ED 9A 67 44 BD 47 9F D2 F4 ED AF CE 99 BD 5B E0>)
(   4,<2021-05-31 12:45:59.84 +0400>,<she>,<DPX200>,
      <abs ABSG = 5 
       data hash MD5: 64K
       CD A2 79 AF 3A AD 0A 38 A8 71 24 F5 47 0A 22 F2>)
$$ ##END=
$$ 
$$ hash MD5
$$ 06 05 34 63 E8 5C 92 D0 8E 7F 84 FD A5 7B 1D 39
##$RELAX= 
##$RELAX= 
##$RELAX= 
##$RELAX= 
##$RELAX= 
##$RELAX= 
##$RELAX= 
##$RELAX= 
$$ Bruker specific parameters
$$ --------------------------
##$DU= <F:/spectra>
##$EXPNO= 1
##$NAME= <P31>
##$PROCNO= 1
##$TYPE= <nmr>
##$USER= <she>
##$AMP= (0..31)
100 100 100 100 100 100 100 100 100 100 100 100 100 100 100 100 100 100 
100 100 100 100 100 100 100 100 100 100 100 100 100 100 
##$AQSEQ= 0
##$AQ_mod= 1
##$AUNM= <au_zg>
##$AUTOPOS= <>
##$BF1= 81.014009
##$BF2= 200.13
##$BF3= 200.13
##$BF4= 200.13
##$BF5= 200.13
##$BF6= 200.13
##$BF7= 200.13
##$BF8= 200.13
##$BYTORDA= 1
##$CFDGTYP= 0
##$CFRGTYP= 5
##$CHEMSTR= <none>
##$CNST= (0..31)
1 1 145 1 1 1 1 1 1 1 1 1 1 1 1 1 1 1 1 1 1 1 1 1 1 1 1 1 1 1 1 1 
##$CPDPRG= <waltz16>
##$CPDPRG1= <>
##$CPDPRG2= <waltz16>
##$CPDPRG3= <>
##$CPDPRG4= <mlev>
##$CPDPRG5= <mlev>
##$CPDPRG6= <mlev>
##$CPDPRG7= <mlev>
##$CPDPRG8= <mlev>
##$CPDPRGB= <>
##$CPDPRGT= <>
##$D= (0..31)
0 1 0 0 0 0 0 0 0 0 0 0.03 2e-05 3e-06 0 0 0 0 0 0 0 0 0 0 0 0 0 0 0 0 
0 0 
##$DATE= 1622450723
##$DBL= (0..7)
120 120 120 11 120 120 24 19 
##$DBP= (0..7)
150 150 150 150 150 150 150 150 
##$DBP07= 0
##$DBPNAM0= <>
##$DBPNAM1= <>
##$DBPNAM2= <>
$$ [...]
##$SUBNAM3= <"">
##$SUBNAM4= <"">
##$SUBNAM5= <"">
##$SUBNAM6= <"">
##$SUBNAM7= <"">
##$SUBNAM8= <"">
##$SUBNAM9= <"">
##$SW= 501.771253377433
##$SWIBOX= (0..15)
0 1 3 0 0 0 0 0 0 0 0 0 0 0 0 0 
##$SW_h= 40650.406504065
##$TD= 32768
##$TD0= 1
##$TE= 0
##$TE2= 300
##$TE3= 300
##$TEG= 300
##$TL= (0..7)
0 120 53 12 22 120 120 120 
##$TP= (0..7)
150 150 150 150 150 150 150 150 
##$TP07= 0
##$TPNAME0= <>
##$TPNAME1= <>
##$TPNAME2= <>
##$TPNAME3= <>
##$TPNAME4= <>
##$TPNAME5= <>
##$TPNAME6= <>
##$TPNAME7= <>
##$TPOAL= (0..7)
0.5 0.5 0.5 0.5 0.5 0.5 0.5 0.5 
##$TPOFFS= (0..7)
0 0 0 0 0 0 0 0 
##$TUNHIN= 0
##$TUNHOUT= 0
##$TUNXOUT= 0
##$USERA1= <user>
##$USERA2= <user>
##$USERA3= <user>
##$USERA4= <user>
##$USERA5= <user>
##$V9= 5
##$VALIST= <valist>
##$VCLIST= <CCCCCCCCCCCCCCC>
##$VD= 0
##$VDLIST= <DDDDDDDDDDDDDDD>
##$VPLIST= <PPPPPPPPPPPPPPP>
##$VTLIST= <TTTTTTTTTTTTTTT>
##$WBST= 1024
##$WBSW= 4
##$XGAIN= (0..3)
0 0 0 0 
##$XL= 0
##$YL= 0
##$YMAX_a= 4355
##$YMIN_a= -7959
##$ZGOPTNS= <>
##$ZL1= 120
##$ZL2= 120
##$ZL3= 120
##$ZL4= 120
##$ABSF1= 248.5645
##$ABSF2= -253.2056
##$ABSG= 5
##$ABSL= 3
##$ALPHA= 0
##$AQORDER= 0
##$ASSFAC= 0
##$ASSFACI= 0
##$ASSFACX= 0
##$ASSWID= 0
##$AUNMP= <proc_1d>
##$AZFE= 0.1
##$AZFW= 0.5
##$BCFW= 0
##$BC_mod= 2
##$BYTORDP= 0
##$COROFFS= 0
##$CY= -3
##$DATMOD= 1
##$DC= 0
##$DFILT= <>
##$DTYPP= 0
##$F1P= 0
##$F2P= 0
##$FCOR= 1
##$FTSIZE= 65536
##$FT_mod= 6
##$GAMMA= 0
##$GB= 0
##$INTBC= 1
##$INTSCL= 5.30512e-09
##$ISEN= 30
##$LB= 1
##$LEV0= 0
##$LPBIN= 0
##$MAXI= 10000
##$MC2= 0
##$MEAN= 0
##$ME_mod= 0
##$MI= 50
##$NCOEF= 0
##$NC_proc= -7
##$NLEV= 6
##$NOISF1= 182.463
##$NOISF2= 159.3651
##$NSP= 0
##$NTH_PI= 0
##$NZP= 0
##$OFFSET= 248.5645
##$PC= 4
##$PHC0= -6272.731
##$PHC1= 258.8012
##$PH_mod= 1
##$PKNL= yes
##$PPARMOD= 0
##$PSCAL= 0
##$PSIGN= 0
##$REVERSE= no
##$SF= 81.014009
##$SI= 65536
##$SIGF1= 159.3651
##$SIGF2= -187.1042
##$SINO= 113.3802
##$SIOLD= 16384
##$SREGLST= <1H.CDCl3>
##$SSB= 0
##$STSI= 65536
##$STSR= 0
##$SW_p= 40650.406504065
##$SYMM= 0
##$S_DEV= 0
##$TDeff= 32768
##$TDoff= 0
##$TI= <>
##$TILT= no
##$TM1= 0
##$TM2= 0
##$TOPLEV= 0
##$USERP1= <user>
##$USERP2= <user>
##$USERP3= <user>
##$USERP4= <user>
##$USERP5= <user>
##$WDW= 1
##$XDIM= 65536
##$YMAX_p= 393713672
##$YMIN_p= -33754375
$$ End of Bruker specific parameters
$$ ---------------------------------
##NTUPLES= NMR SPECTRUM
##VAR_NAME=  FREQUENCY,     SPECTRUM/REAL,   SPECTRUM/IMAG
##SYMBOL=    X,             R,               I
##VAR_TYPE=  INDEPENDENT,   DEPENDENT,       DEPENDENT
##VAR_FORM=  AFFN,          ASDF,            ASDF
##VAR_DIM=   65536,         65536,           65536
##UNITS=     HZ,            ARBITRARY UNITS, ARBITRARY UNITS
##FACTOR=    0.620285442955139, 1,           1
##FIRST=     20137.2065510759, 0,            0
##LAST=      -20513.1999529892, 0,           0
##MIN=       -20513.1999529892, -33754375,   0
##MAX=       20137.2065510759, 393713672,    0
$$ Real data points
##PAGE= N=1
##DATA TABLE= (X++(R..R)), XYDATA
$$ [...]
13022f467540O85221L730796J062441j691983O413K573530J196626k037412k446472
13013c388380o73781m79376j815570j582502Q10412L146437L951864K910614k08608
13004B671110m078579n577079l596733o13691J387715L187548M853985M392854
12996B627130K068100J244643K440695J885580j248738k395103Q5379J029227
12988G736913k323039m450473j064186K551773L59084l662609k446094J856452
12980a442179K279185n62682r39889L97111j721702n154819k594847M617159O623544
12971A500881Q44913l510919k09393M908854M485693N32371j212547q26110j659211
12962D854532l246111k814888o18639J056459J643674J477278p469k154700k142797
$$ y = [-6467540, -5782319, -2051523, -989082, -2681065, -2674652, -101122, 1095504, -941908, -3388380, -4062161, -4541537, -6357107, -7939609, -7129197, -3982760, -30896, 2879718, 2671110, -1407469, -6984548, -10581281, -11194972, -9807257, -6619709, -1765724, 2627130, 4695230, 5939873, 8380568, 10266148, 9017410, 6622307, 6707686, 7736913, 5413874, 963401, -100785, 2450988, 2810072, -852537, -3298631, -1442179, 837006, 274324, -665565, -268454, -1990156, -7144975, -9739822, -5122663, 1500881, 2345794, -1165125, -1374518, 3534336, 8020029, 8552400, 7339853, 6513743, 4854532, 1608421, -1206467, -1825106, -768647, 875027, 2352305, 2344836, 190136, -1952661]
12953a952661P98858L149948K068505k56676k97941J413765J803276L9349k214095
12944D552328l674647m022187l101445j602892r62652r69847M90846L675870N415848
12935a98778L437306n0190j502631p95499l33917j093063k086479k539387k285969
12926g448607r58518J267478K958760K990510J920826P44665l41542r82207l86489
12917b35124Q06762O16378r29437j163386O97581J538804m77151k107619k90829
12908a544021J970074L27868k649239q01267M638817N278660j254642o205863
12900b39613k443432M334028M174879j956718m415832n01175J871609k172596
12892a348850o198535k820047M471420O676523K425537j518822j103838O92364
$$ y = [-1952661, -1153803, 1996145, 4064650, 3807974, 3510033, 4923798, 6727074, 6766423, 4552328, 877681, -3144506, -6245951, -7848843, -8811495, -9781342, -9290496, -5614626, -198778, 3238528, 3188338, 1685707, 890208, 556291, -536772, -2623251, -5162638, -7448607, -8407125, -7139647, -4180887, -1190377, 730449, 1475114, 1133572, 151365, -235124, 571638, 1188016, 258579, -904807, -207226, 1331578, 854427, -1253192, -1544021, 426053, 753921, -1895318, -2696585, 1942232, 7220892, 5966250, -239613, -2683045, 1650983, 5825862, 3869144, -546688, -1047863, 823746, -1348850, -7547385, -10367432, -5896012, 780511, 3206048, 1687226, 583388, 1275752]
12884A275752M97580p08772j035203r95850j294632q84880Q12668K415594K597047
12875B679304J361161r30988l066567k138776K619638N714052J008813p854010
12867f07373r805426j792459N664368L299823l621953m218552J418869L948235
12859e714468K54069k832481m60458L654076M756870L647337K556135O59616k418280
12850D102416l557777q38722K301421J695681j376409k482076o12023J276621
12842E09132J278477O30778P75090J046604J46335j527335k028179k24328K399648
12833C006222L007568R47995j003946l30153J291032J48309l651006n560563k875926
12824e020468J163818J727926j031758k575795n23085K339364K416375K71558
$$ y = [1275752, 1773332, 1064560, 29357, -966493, -2261125, -3146005, -2333337, 82257, 2679304, 4040465, 3109477, 42910, -2095866, 523772, 6237824, 7246637, -607373, -10412799, -12205258, -6540890, -3241067, -6863020, -11081572, -9662703, -5714468, -5460399, -8292880, -8753338, -5099262, -342392, 3304945, 5861080, 6520696, 4102416, 544639, -294083, 2007338, 3703019, 2326610, -155466, -767489, 509132, 1787609, 2418387, 3193477, 4240081, 4386416, 2859081, 830902, 606574, 3006222, 6013790, 6961785, 5957839, 5627686, 6918718, 7067027, 3416021, -2144542, -5020468, -3856650, -2128724, -3160482, -5736277, -6259362, -3919998, -1503623, -1232065]
12816a232065r15844n74295j185483k988880j909001M270982J0277840Q656400
12808A4399654J51259o341613n218579n20928J353762K36657k81258L90385N12552
12799D681891M88451J457419J486672j570255m882707l730416J016753L857755
12791B805563K691594M33444j270369l816880o157891l975825K852120P421068
12783I82824M434512k202759m666738j447664K023719J663761n13625l41107K690989
12774B623912N026255L506624r22129m357934m404066k448220j151618j010321
12766c137497n07886J340831L747955M661122K089221l430551p451896n632127
12758h320828M120K637082O9300k264550m23564J789283M44411p69929K478601
$$ y = [-1232065, -2147909, -2722204, -3907687, -6896567, -8805568, -4534586, 5743254, 14399654, 14550913, 8209300, 2990721, 2469793, 3823555, 4060212, 3778954, 4169339, 4681891, 5170342, 6627761, 8114433, 6544178, 1661471, -2068945, -1052192, 2805563, 5497157, 5930601, 4660232, 843352, -5314539, -9290364, -6438244, 982824, 5417336, 3214577, -1452161, -2899825, -876106, 787655, 274030, -67077, 2623912, 7650167, 11156791, 10234662, 5876728, 1472662, -975558, -2127176, -3137497, -3645383, -2304552, 1443403, 6104525, 8193746, 4763195, -2688701, -8320828, -8316708, -5679626, -5610326, -7874876, -8298440, -6509157, -6064746, -6834675, -4356074]
12749d356074N729866K336596m187613m654614R50019L812621Q67985j992133
12741a493347j810538k196086l258519J77989O877982P677088O76445l819030
12733B831984j5357L512387q38142n870099k226104M717431L764185l129790m837580
12724b091085P994K119546j661197l868606j2336M447899L501441j448560n525829
12715d530733n881651k027146L713328O119305K929414o21555P25156K981177
12707C407295o48097o685990n396724K828536O873836K381730j909755Q09075
12699A659906N106714L932038K2957o11588Q84956R3140j927278j314937R95604
12690H841512J037787j516124l838378m621950l861947q00276L738323N860425
$$ y = [-4356074, 1373792, 3710388, -477225, -5131839, -4181820, -369199, 498786, -1493347, -3303885, -5499971, -8758490, -8580501, -1702519, 5974569, 6651014, 2831984, 2816627, 6329014, 5490872, -379227, -2605331, 2112100, 5876285, 2746495, -2091085, -2083091, 36455, -1624742, -5493348, -5505684, -1057785, 2443656, 995096, -4530733, -10412384, -12439530, -8726202, -2606897, 322517, -299038, 426118, 3407295, 2759198, -3926792, -9323516, -6494980, 378856, 2760586, 850831, 1659906, 6766620, 10698658, 10721615, 10110027, 10994983, 11088123, 9160845, 7845908, 8841512, 9879299, 8363175, 4524797, -97153, -3959100, -4759376, -1021053, 4839372]
12682D839372L450048l07174j733501j718001k519390l288209k661519k029533
12674e967907k174825o67917L056172M409676N25615l890270l297056K67408J792061
12665e947043J974765L767066M230538r19784p122222n630362K084560N144989
12657b417493l0313m294138o69339N109688M873258P11531l13217J573935N94805
12648E138717l401050m084861Q03657N060252K504938m654903q895688o430386
12640a3959324m48285L815630M680329L895878K789648J020134r40858j171233
12632c18081K51515R7065k846944m187387J69938O506742P270769J939470k295484
12623F587603j420535L97726r80277k908761j549524J071362Q40552j362961j767456
$$ y = [4839372, 8289420, 7982246, 6248745, 4530744, 2011354, -1276855, -3938374, -5967907, -8142732, -8810649, -5754477, -1344801, -819186, -4709456, -8006512, -7739104, -5947043, -3972278, -205212, 4025326, 3105542, -4016680, -9647042, -7562482, -2417493, -2447806, -6741944, -7411283, -2301595, 2571663, 3283194, 2969977, 4543912, 5138717, 1737667, -2347194, -1543537, 3516715, 6021653, 1366750, -7528938, -13959324, -14407609, -10591979, -5911650, -2015772, 773876, 1794010, 853152, -318081, -66566, 30499, -2816445, -7003832, -6833894, -327152, 6943617, 8883087, 6587603, 5167068, 5564794, 4584517, 1675756, 126232, 1197594, 2038146, 675185, -1092271]
12614a092271k73295L21533j78111L18977J598171J646016R41519J654413L044974
12605G981926K186693p82648k489358j681345n66183k89767N77617J881828O07960
12596G426723l833008o570679k992017M227536P256001K437038m881734o311941
12588c242081m42270N238205L619571k881298n797852k312428J643022J113584
12580c061547r89973k70233J508947P27671p19310P59495K774879R14251k206902
12571e62722o29183L720828L183518k423224n112767k388353n15873j581884N64780
12562e744880O541791O454485l161133r725678l359658N647373K722211o277775
12554f903264m263070P733341J0783193j136855j0720296m565666O795198P239232
$$ y = [-1092271, -1365566, -1044033, -1222144, -903167, 695004, 2341020, 3282539, 4936952, 7981926, 10168619, 9385971, 6896613, 5215268, 4649085, 4359318, 4936935, 6818763, 7426723, 3593715, -2976964, -5968981, -1741445, 5514556, 7951594, 3069860, -3242081, -3684351, 1553854, 5173425, 2292127, -3505725, -5818153, -4175131, -3061547, -4051520, -4321753, -2812806, -2085135, -2804445, -2044950, 729929, 1644180, -562722, -1191905, 2528923, 5712441, 3289217, -1823550, -4211903, -4727776, -6309660, -5744880, 796911, 7251396, 4090263, -5635415, -8995073, -3347700, -625489, -6903264, -11166334, -3432993, 7350200, 6213345, -4506951, -9072617, -2277419, 4961813]
12546D961813n45484l023014J477495L451997M74225n21287K026557J347371m105357
12537E544316o519686k126150J943201r1080k656965J354301P779955P283136
12529A2511028Q1320m881975l765316j457795j065970P22543M762227M793177
12521A1699239k353293q623806m806387N169333Q649731J722247o169081o026639
12513g38656p0012M003425L148273m36479l960571n233302k822477J411361L053864
12504a644574J212725J26865J921472K637024l92068k483594R85663N580156L853010
12495A1796679k541894n265140k465810n24681k187004k221223K232229N336050
12487D159206J572837n093850o821761k621439J948801L173508K175083Q70061
$$ y = [4961813, 4416329, 1393315, 2870810, 6322807, 6797032, 6275745, 8302302, 9649673, 5544316, -975370, -3101520, -1158319, -1249399, -3906364, -2552063, 5227892, 12511028, 12592348, 7710373, 3945057, 2487262, 1421292, 2143835, 6906062, 11699239, 9345946, 722140, -4084247, 1085086, 9734817, 11457064, 5287983, -738656, -808668, 3194757, 6343030, 5906551, 1945980, -3287322, -6109799, -4698438, -1644574, -431849, -304984, 1616488, 4253512, 3861444, 1377850, 2363513, 7943669, 11796679, 9254785, 3989645, 1523835, 999154, -1187850, -3409073, -1176844, 4159206, 5732043, 638193, -6183568, -8805007, -6856206, -3682698, -1507615, -637554]
12479f37554n48826k038333k701645j994288n10445O28137P45540L91244R68128
12470e698042K647751L468710K224177R42745J675647K275678l60514l758952
12462C417200k268539L440869N616038N72972n367054m988166j03908K557578
12454B876990J305294m03493j035927j985961k639842m45852L555293M363004
12446E589506j8961m887773m505945O08818M458723K993281j334874l298682j880663
12437b276570j081561l172427m351658l46462N908868P264986K646307j298892
12429C292591j27154K479639J590791j269916j564224Q09413K138140O45108k358781
12420E635607n100752n713716k373664L231664N161205M08345n341490m233596
$$ y = [-637554, -1186380, -3224713, -5926358, -7920646, -8431091, -7802954, -7057414, -6666170, -5698042, -3050291, 418419, 2642596, 3585341, 5260988, 7536666, 7176152, 3417200, 1148661, 4589530, 10205568, 10778540, 5411486, 423320, 319412, 2876990, 4182284, 3778791, 2742864, 756903, -1882939, -2328791, 1226502, 5589506, 5570545, 682772, -3823173, -3214355, 1244368, 4237649, 2902775, -395907, -2276570, -3358131, -6530558, -10882216, -11228678, -5319810, 1945176, 4591483, 3292591, 3165437, 5645076, 7235867, 5965951, 4401727, 5211140, 7349280, 7994388, 5635607, 534855, -5178861, -7552525, -4320861, 840344, 1248689, -4092801, -8326397]
12412h326397K884090P609780N556474R93515j008632j456021l598059o299056
12404c644306n367350o8875N198240O119824L153140j66498k199047m133808n900605
12395g009285m507143R19201N203687K964211k841822m027898Q76596M391852
12387d030601J841733j638041q5457L600302L069451j082874l243965k006428
12379c575880o04293k09881N59621R08341q29571k204463M12440M537676M107999
12370C101989o27236k851924J07324K820960P34021l266362m401733k749470q76456
12361h008887Q47071K795416L381191J484846q33162j111951j1208M38211K04925
12352h13548N59205J603596K514806K920327K511949P62779j531820j947731O31746
$$ y = [-8326397, -5442307, 2167473, 7723947, 8717462, 7708830, 6252809, 2654750, -3644306, -9011656, -9080531, -3882291, 2237533, 5390673, 5224175, 3025128, -1108680, -7009285, -11516428, -10597227, -5393540, -2429329, -5271151, -9299049, -8422453, -4030601, -2188868, -3826909, -3912366, -312064, 2757387, 1674513, -1569452, -3575880, -4180173, -4390054, -3830433, -2922092, -3751663, -5956126, -5543686, -1006010, 3101989, 2474753, -377171, -269847, 2551113, 3285134, 18772, -4382961, -7132431, -8008887, -7161816, -4366400, -985209, 499637, -333525, -1445476, -1456684, -1018473, -813548, -254343, 1349253, 3864059, 6784386, 9296335, 10059114, 8527294, 6579563, 7211309]
12343G211309L699804L342030j216936n965248n609502M43845N965538M049503
12335A1920343m008039r293615o613240j117794O9145j568881J52951M861263
12327e597867O242707K950520N23112J412433J161566k853370o154637m492342
12319f807878m79184J289540Q16277L36185k16883j293853j133933J014962K523661
12310c951106J675912P41160J454633J435494j147416l384933k306489P7430Q01232
12301d604083J117126K793255L220582J3759k969619q55731L489604L024981k486049
12292B743825o178836m524437j215803R5131N53832J918626L063159K816446K021083
12283A293026J002974j117706l167411k058576K008134M327561J912313k246621
$$ y = [7211309, 10911113, 14253143, 13036207, 7070959, 1461457, 1905302, 7870840, 11920343, 7912304, -1381311, -7994551, -9112345, -9043200, -10612081, -10459130, -5597867, 644840, 3595360, 4118472, 5530905, 6692471, 3839101, -2315536, -6807878, -7287062, -5997522, -5181245, -4845060, -5061943, -6355796, -7489729, -6474767, -3951106, -2275194, -1534034, -79401, 1356093, 208677, -3176256, -5482745, -5405315, -4604083, -3486957, -693702, 2526880, 2540639, -428980, -1284711, 2204893, 5229874, 2743825, -3435011, -7959448, -9175251, -9080120, -8526288, -6607662, -3544503, -728057, 1293026, 2296000, 1178294, -1989117, -4047693, -2039559, 2288002, 4200315, 1953694]
12275A953694l351285o06014L068370M771554L392827j73105l131075l088060
12267B836906j155179n21105j563341j541309K54347J119113J28383J58872K212342
12258A929029K476028j072869l635701o00493L999075K878918k669509m218503
12250i14025M80885L910359J016578k803224r38008L606983L587260n28434k169973
12241E248401l94544j210711o209862q262033k342102N933092P914449L467245
12233D143935r07070k176238k453631k305636M64698M751275N303530L14015n040327
12224B094551n445930j920037J430034L378496M657678M155430O22269l435653
12216E536838m135691k027772j343682l236314l893450o37890L752721N054441
$$ y = [1953694, -1397591, -2003605, 1064765, 5836319, 9229146, 9056041, 5924966, 2836906, 1681727, 1160622, -402719, -1944028, -1689681, -570568, -442185, -283313, 1929029, 4405057, 3332188, -303513, -904006, 3095069, 5973987, 3304478, -914025, -433140, 3477219, 4493797, 1690573, 752565, 4359548, 7946808, 7418374, 5248401, 4853857, 3643146, -2566716, -10828749, -13170851, -7237759, 676690, 4143935, 3236865, 1060627, -1393004, -3698640, -3233942, 1517333, 6820863, 7134878, 2094551, -3351379, -5271416, -3841382, -462886, 4194792, 8350222, 8972491, 5536838, 1401147, -626625, -1970307, -5206621, -9100071, -9737961, -5985240, -930799]
12208i30799L223934J324115O66653R9360o68575k23595J647463K825253J773814
12199I737623k95512j456498j636700j603274r08652R63581K419123J399197j038410
12190G580478j567023N74861K333600J337481j074565k768040m041058n692379
12182c316645o151882l516402Q35699L591119L900500L867521M800666N210046
12174I220622K965221j712638n611755m935874M19650N177559L971487j227816
12166H266456k946390R49192L347604j462403q347347q463119k016542L228576
12158g443973L740892K764924K339205R85140n19813Q33541L414415J963980k951551
12149E126760m538662j031753J118479j379711k836257R47779M677899K537393
$$ y = [-930799, 2293135, 3617250, 4283903, 4383263, 3714688, 3491093, 5138556, 7963809, 9737623, 9442111, 7985613, 6348913, 4745639, 3836987, 4800568, 7219691, 8618888, 7580478, 6013455, 6588316, 8921916, 10259397, 9184832, 6416792, 2375734, -3316645, -9468527, -12984929, -12149230, -8558111, -4657611, -790090, 4010576, 9220622, 12185843, 10473205, 4861450, -74424, 345226, 5522785, 9494272, 8266456, 5320066, 6269258, 9616862, 8154459, -192888, -8656007, -10672549, -7443973, -3703081, -938157, 1401048, 2386188, 1866375, 2699916, 6114331, 8078311, 5126760, 588098, -443655, 674824, -704887, -3541144, -2593365, 2084534, 4621927]
12141D621927j865982j837231J720936L248329J497536j270884m500389o997665
12133e383423m349173L775634Q659196L514349m874861n022331K271593O215254
12125D806238K864072j502744k784619l240041k847745J651387O936056M105548
12117I988152o370590j1640906m253999O578109Q413488K119444k809313k816312
12109g91927j584031j256468p52663m72063j655903k536269q42461J361973N77922
12100g951890j812996j249728K794507N928569N014116J563134j054364j161364
12092B069984L36157J037932k80619j599871k45772K463320K801082J075125J168460
12083H825798K622222K88234n229497n203263L326355R551330L621279p364533
$$ y = [4621927, 2755945, 918714, 2639650, 5887979, 7385515, 6114631, 1614242, -5383423, -9732596, -5956962, 2702234, 6216583, 1341722, -3680609, -1409016, 4806238, 7670310, 6167566, 3382947, 142906, -2704839, -1053452, 5882604, 9988152, 3617562, -8023344, -12277343, -5699234, 2714254, 4833698, 2024385, -791927, -2375958, -3632426, -4385089, -4857152, -6513055, -9049324, -9891785, -8529812, -7951890, -9764886, -11014614, -8220107, -2291538, 2722578, 4285712, 3231348, 2069984, 2406141, 3444073, 3163454, 1563583, 1317811, 3781131, 6582213, 7657338, 8825798, 11448020, 11736254, 6506757, 1303494, 4629849, 14181179, 17802458, 10437925]
12075A0437925r194404j821618K000011k359153n609789j567434L154946J738854
12067c220662j530847M7461L871658L357637n79906j679605J138912K736105o4294
12058D076459m907475p817485o528313j003739N703324Q329090M619223j239775
12050A231309l200782k19655L801796N208683L150454j216726n165715n424233
12042a834869j485530L030342M152418J452185k773089n732545m633570J221945
12034f602713P005108N624812k558337q054322m299510L399691N946959K691073
12026C152761n42594j165580k63995K786310P733382Q550734N86101r310952r987361
12017A538806k483149J579903j625441l519831O41481L672390J38660l569451
$$ y = [10437925, 1243521, -578097, 1421914, -937239, -6547028, -8114462, -4959516, -3220662, -4751509, -4704048, -832390, 2525247, 1945341, 265736, 1404648, 4140753, 4076459, -831016, -8648501, -15176814, -16180553, -10477229, -2148139, 2471084, 1231309, -1969473, -2189128, 1612668, 6821351, 9971805, 8755079, 3589364, -1834869, -3320399, -290057, 3862361, 5314546, 2541457, -3191088, -7824658, -6602713, 402395, 6027207, 3468870, -4585452, -8884962, -5485271, 461688, 3152761, 2610167, 1444587, 1180592, 3966902, 11700284, 20251018, 20837119, 11526167, 1538806, -944343, 635560, -989881, -4509712, -3868231, -195841, -57181, -3626632]
12009c626632p73042L665844K284230k041520j938547J700390K685202P37346
12001B693271K15675J111726K45074j496975j376582j050408k551619k192980
11993d402818K471572M555090j926801q282452j905126J1570717J3553919J124668
11985A6758769p440915j255062O676113J850021q176327p326752K736147O798242
11977A0620236Q74809m018466j681383J090262j401442m423523k550050J088047
11969d01510J249347p53698p65592P87235P31982r11827j714472j330812j031802
11960d141149m07663J590939L446190K702740L98975J45150K263808K441249j945591
11951F494648o977368o664333q76953M544216N370253L162561J125493l63522
$$ y = [-3626632, -4399674, -733830, 1550400, -491120, -2429667, -729277, 1955925, 2693271, 2908946, 4020672, 4265746, 2768771, 1392189, 341781, -2209838, -4402818, -1931246, 2623844, 697043, -7585409, -9490535, 2080182, 15634101, 16758769, 9317854, 8062792, 14738905, 16588926, 8412599, 1085847, 3821994, 10620236, 11495045, 7476579, 5795196, 6885458, 5484016, 1060493, -1489557, -401510, 847837, 94139, -671453, 115782, 847764, -64063, -1778535, -3109347, -4141149, -4548812, -2957873, 488317, 3191057, 3590032, 3735182, 5998990, 8440239, 6494648, -482720, -7147053, -8024006, -3479790, 1890463, 5053024, 6178517, 5814995]
11943E814995j825438j837909J99839J121098j681769m862428l277831J553196
11935d796247L137467Q0182k192679r88543l74321k639708l046149J654756N773273
11926c391969K882067l042820k950446L177542O251855K083766k844537j873302
11918B92156K493391L602047J35192l737333m676585k688649P96786L769387L592763
11909C579155n47208n235073n631706j258187L149354L427789P41190r01236k69277
11900b945199M03881k49738p92003j01743N50382K64746N37996K040318K178560
11891A887200o26542k889505r91987K032827O94350l257259k770372K445885M134885
11882F59482j430830o653300l862266L457988O911580N097162K314458p2191l136977
$$ y = [5814995, 3989557, 2151648, 2351487, 3472585, 1790816, -3071612, -6349443, -4796247, -1658780, -1578598, -3771277, -4759820, -5134141, -7773849, -10819998, -9165242, -3391969, -509902, -3552722, -6503168, -3325626, 2926229, 5009995, 2165458, 292156, 2785547, 6387594, 6522786, 2785453, -1891132, -4579781, -3782995, -13608, 3579155, 3031947, -2203126, -7834832, -9093019, -5943665, -2515876, -1774686, -2675922, -2945199, -2541318, -2791056, -3583059, -3684802, -3134420, -2869674, -2331678, -291360, 1887200, 1260658, -1628847, -2620834, -588007, 106343, -3150916, -5921288, -3475403, 659482, -771348, -7424648, -11286914, -7828926, -917346, 4179816, 6494274, 6422083, 3285106]
11873C285106m373269m68940N271829O108726K080321m09949N89014k5620m470035
11864G587183p065822k981628L741286N688951K044586j585611j461049L84153
11856F352049L55487j714497l034634k001511k23140M6974q69987j204930j177609
11847c471798k277301l249678r64718L597677M995962J388716j959236p31982
11839b672358J953540J827435J048933L126837M832208J186189m627883n192174
11831A482727j007916M55054k594301m035439j175835J156648K75303L16688L445203
11822a681868M643981L61594m522589l952685N88428L925187M852337M691654
11814H906039K749255j097317l009864j98785L514769K689450j520656l649028
$$ y = [3285106, -1088163, -1557103, 3714726, 9823452, 11903773, 11493824, 12082838, 12057218, 7587183, 521361, -2460267, 1281019, 6969970, 9014556, 7428945, 5967896, 6352049, 6707536, 4993039, 1958405, -43106, -266246, -219272, -1089259, -2294189, -3471798, -5749099, -8998777, -9963495, -6365818, -1369856, 18860, -1940376, -2672358, -718818, 1108617, 2157550, 5284387, 10116595, 11302784, 6674901, 1482727, 474811, 929865, -1664436, -5699875, -6875710, -5719062, -5443759, -5127071, -1681868, 2962113, 3323707, -1198882, -5151567, -4563139, -637952, 4214385, 8906039, 11655294, 10557977, 7548113, 7349328, 10864097, 13553547, 12032891, 8383863]
11806H383863k615724k410417m712336o197546l908293O88739M017617M068042
11798b686055J247850k195288l294951q18668L067568M865622L392196L53031
11790C931305k125346l147259k581159n10340K255641L781265K186124j893204
11782A897027m519746k198837L017724M900121J207184k763159j876877J080466
11774G43903L25225l061840k899299J576625M293401K069684j249193k012700
11766b14194j494164j170846K66611K323105J339663k815449m555799r64038L126127
11757d158984K592771o74198k321747k253003k048191o02314K512682L869540
11749c083444J579054n59838N41405J620850m09584j712368J486223M291211M29031
$$ y = [8383863, 5768139, 3357722, -1354614, -7552160, -11460453, -10771714, -6754097, -2686055, -1438205, -3633493, -6928444, -7747112, -4679544, 186078, 3578274, 3931305, 1805959, -1341300, -3922459, -4432799, -2177158, 1604107, 3790231, 1897027, -2622719, -4821556, -1803832, 3096289, 4303473, 1540314, -336563, 743903, 1069128, -1992712, -4892011, -3315386, 978015, 3047699, 1798506, -214194, -1708358, -2879204, -2612593, -289488, 1050175, -1765274, -6321073, -7285111, -4158984, -1566213, -2240411, -4562158, -6815161, -8863352, -9465666, -6952984, -3083444, -1504390, -2064228, -1522823, 98027, -311557, -2023925, -537702, 3753509, 4182540]
11740D182540n750964m744386K616777N812298Q82286m401829l645789l98757
11732e447824K23857R391K263147M370702K033500l012322n325790l598340j216218
11723i699897j59735J192778L903748N545281L123930k338347n927268m166456
11715h525966P08078L362935J893768o85230j633615j570034j021291J653741
11707e817614N735507N961073k25508o803956o532273j468962O77709j202975
11699i676999j076342K789560M569451J219573j974722j84568L282367L142743
11691B091063P60529Q27984K967638K702957p22165k844607m52839M100018N743563
11682A5174141K003755m505617p963093m806370J699382M179314j07273n427830
$$ y = [4182540, -1568424, -6312810, -3696033, 2116265, 2998551, -1403278, -5049067, -5447824, -5223967, -5214576, -2951429, 1419273, 3452773, 440451, -4885339, -8483679, -9699897, -9859632, -8666854, -4763106, 782175, 3906105, 1567758, -4359510, -8525966, -7817888, -4454953, -2561185, -3246415, -4880030, -6450064, -7471355, -5817614, -82107, 5878966, 5653458, -1150498, -7682771, -9151733, -8474024, -9676999, -10753341, -7963781, -3394330, -2174757, -4149479, -4334047, -1051680, 2091063, 2851592, 3679576, 6647214, 9350171, 8628006, 5783399, 5330560, 9430578, 15174141, 17177896, 12672279, 4709186, -97184, 1602198, 5781512, 5674239, 246409]
11674B46409m758982J166899N180183L106620j587941l103782m89164K138171
11666A898413J315305j614309k472296M23371M051381M320629R53561k619865
11658F256190l793491l282167k719724j845975L51013K890980L321793J161357
11650B339976q30856K5420K476825K491869j308442n088259m274683N11377M258078
11641F01305L765083M22101k961101m782866l767074N04022M767117M061162j104339
11632A505410l945482r98624K229453m4527m172303k849816K671931M365297K34135
11623a004526l170678j744104Q32023Q95076L52281J074547N91676k285248l486575
11614g945528l20664K965003J699978j414171r42361K287278L225127J284452
$$ y = [246409, -4512573, -3345674, 1834509, 4941129, 3353188, 249406, -239758, 1898413, 3213718, 1599409, -872887, -449516, 3601865, 7922494, 8876055, 6256190, 2462699, -819468, -3539192, -5385167, -5034154, -2143174, 1178619, 2339976, 1509120, 1534540, 4011365, 6503234, 5194792, 106533, -4168150, -3656773, 601305, 4366388, 4788489, 1827388, -2955478, -6722552, -6218530, -1451413, 2609749, 1505410, -2440072, -3438696, -1209243, -1253770, -5426073, -8275889, -5603958, -1238661, -1004526, -4175204, -5919308, -5087285, -4192209, -3839928, -2765381, -2173705, -4458953, -7945528, -8266192, -5301189, -3601211, -5015382, -5957743, -3670465, -445338, 839114]
11606H39114K96505Q74791m56735m070387n269037j333325M110499N936172L355201
11597D282798q33304l820386l905208p56488L463028N135891K920980r70980l820143
11588A696188m545972k382466L122111Q905449Q795727Q57407p835276q225982
11580C87186n09345N973071M597214j027675l328279q49314J503073M31545j634812
11571E542664q21030K677551M922249L028794j504660m314822k885271N40289
11563G185764J548589j011709l831123l928248k299724j102702K26517K835747
11555c76889M377496J560107l662236n239027j329891K925097K758953j08760
11547I04850j325571m12029Q161q42146j260010k47388J484364K976493L404065
$$ y = [839114, 1135619, 2010410, 1553675, -2516712, -7785749, -9119074, -5008575, 927597, 4282798, 3449494, -370892, -4276100, -5032588, -1569560, 3566331, 6487311, 5516331, 1696188, -2849784, -5232250, -2110139, 6795310, 15591037, 16448444, 8613168, 387186, -122159, 5850912, 10448126, 9420451, 6092172, 5242858, 6745931, 7177476, 5542664, 4721634, 7399185, 12321434, 15350228, 13845568, 9530746, 6645475, 7185764, 8734353, 7722644, 3891521, -36727, -2336451, -3439153, -3212636, -376889, 4000607, 5560714, 1898478, -3340549, -4670440, -1745343, 1013610, 904850, -420721, -832750, -824589, -1666735, -2926745, -3174133, -1689769, 1286724, 4690789]
11538D690789J861850j366349m066813m049959j163119L171344O872216P363700
11530A3313659L463414j983793m322194l125896k610664m536593n012257j116815
11522e931139L629907M376787J911982J12792m38696j469489k278755j172456
11514a259067K65951n58667k170179j178792J635395K308043R998k159599k071242
11505e178159k07256K564952M865857L935584p31698m459196k787957J715312
11497b82561K912686j96234l266157l506427j597200J537571M517145M169221
11489D288044R3640k087823J571217N653208L058662l121424m734501k279758
11481B441265k236715l178785J895282R780326Q812791j100357n815230L89882
$$ y = [4690789, 6552639, 5186290, 1119477, -2930482, -4093601, -922257, 5949959, 13313659, 16777073, 14793280, 10471086, 7345190, 4734526, 197933, -4814324, -5931139, -2301232, 2075555, 3987537, 4100329, 3661633, 2192144, -86611, -1259067, -993116, -1551783, -3721962, -4900754, -3265359, -957316, -947318, -3106917, -5178159, -5385415, -2820463, 2045394, 5980978, 5249280, 790084, -1997873, -282561, 2630125, 2433891, -832266, -4338693, -5935893, -4398322, 118823, 4288044, 4381684, 2293861, 3865078, 9518286, 12576948, 9455524, 4721023, 2441265, 204550, -2974235, -1078953, 8701373, 17514164, 16413807, 10598577, 10988459]
11473A0988459M984363j698828j0081436p498813J401152L887144k66496j568571
11465A46974J851417L428143J194110o71892j228502k955956m291853j737832
11457d265391K228212K439267M27776J650626N199908N247958J227989k126031
11449A2030314l377604m516364m391225r38552J994875m27127m154647j631366
11441e411696M457371M321925k386513n521345j323707K190690K5361j752093
11433e400007J923161N711596L240681k630646n512664m510686j857452J895183
11425g140834N060642L765850j099093k499105J950954M850687O46963m803966
11417G32098l653412J410472K546180l88435j426410N11367J190240l04951p98774
$$ y = [10988459, 15972822, 14273994, 4192558, -3306255, -1905103, 1982041, 1715545, 146974, 1998391, 5426534, 6620644, 5948752, 4720250, 1764294, -2527559, -4265391, -2037179, 402088, 829864, 2480490, 7680398, 12928356, 14156345, 12030314, 8652710, 4136346, -254879, -1193431, 801444, 374317, -3780330, -5411696, -954325, 3367600, 981087, -4540258, -5863965, -3673275, -3647914, -5400007, -3476846, 2234750, 5475431, 2844785, -2667879, -7178565, -9036017, -7140834, -2080192, 1685658, 586565, -1912540, 38414, 4889101, 5536064, 732098, -2921314, -1510842, 1035338, 646903, -779507, -268140, 922100, 617149, -181625]
11408a81625J07955j07335p44616J339822M894375M885470M56796l704945m621246
11399B324651m049781l500362j819054Q06071J603483J36022J08143L637067P016980
11390F263220N060130k130718q842908r410297l397191M003424O644266L407936
11382A597862r39471j676555O72487K632350K961102K561798J167630j910770
11374G066433m766236m754572k873237k178621k277951j03553L707815M546752
11366a633170J249087j495596n25381J001361l67974k102248k14162L237797K908034
11357B057748j060158k885835j21669K592117Q14445k809978k358397K835149
11349i36578P082372N592936O9712l899269l427900q69046k16042k326969m339651
$$ y = [-181625, -73670, -181005, -925621, 414201, 5308576, 10194046, 10650842, 6945897, 2324651, -1725130, -5225492, -7044546, -6238475, -4634992, -4498970, -4390827, -753760, 6263220, 11323350, 9192632, 349724, -9060573, -12457764, -8454340, -1810074, 1597862, 658391, -1018164, -345677, 2286673, 5247775, 7809573, 8977203, 7066433, 2300197, -2454375, -5327612, -7506233, -9784184, -9887737, -6179922, -1633170, -384083, -1879679, -2405060, -1403699, -1771673, -3873921, -4088083, -850286, 2057748, 997590, -1888245, -2009914, 582203, 1396648, -1413330, -3771727, -936578, 6145794, 11738730, 11808442, 7909173, 4481273, 3612227, 3396185, 1069216, -3270435]
11340c270435l299246M48131L653245L551999N95003k120051k060466J59307J695073
11331f47440J041476q9657P17465K853921L156455L48340k866777l399823j948267
11322h34307j490312k417655j979286Q98717L061825J407736k130653k722074
11314f206009P66206M195552L775541P38746j064572l80251P02058L14112r78993
11305A862390j577951r71060m6138K241j011743j686132l07356K640924M118405
11296C023580J986217j768017k971159l95742K760967K986636N16133j680011
11288D458604j944341j594995k500298m006441l395504K40833L761331L391399
11280a589412O0530j316430J264444L776532K163847j479900k384346n24739K59245
$$ y = [-3270435, -6569681, -6121550, -2468305, 1083694, 1678697, -441354, -2501820, -2342513, -647440, 394036, 304379, 1021844, 3875765, 7032220, 7380560, 4513783, 1113960, -834307, -2324619, -4742274, -6721560, -5822843, -2761018, -1353282, -3483935, -6206009, -5439803, -1244251, 2531290, 3270036, 2205464, 1825213, 2527271, 2841383, 1862390, 284439, -686621, -732759, -730518, -1742261, -3428393, -3735749, -1094825, 3023580, 5009797, 3241780, 270621, -125121, 2635846, 5622482, 6138615, 4458604, 2514263, 919268, -1581030, -5587471, -8982975, -8742142, -4980811, -1589412, -1528882, -2845312, -1580868, 2195664, 4359511, 2879611, 495265, -29474, 229771]
11271B29771n27135N74907L833523M478125K86706m185935m332340j986253j098259
11262b726890q69823J580834M471687L281469j552840m513044k832942M50976
11254b710573K032530K292877K292995J104869j475410k893222j376234O94081
11246c8087k23260l642014n301320k361677L194317O533004M886849N10992j714098
11237A844706j24660J620379r9096l158014k691903J183253L278766J433792l87209
11228B900014Q85521K344175O29571j833618j042294J401455J103932j174280
11220E214476q94020J536482M94135m895922p345065j810035N874287O153255
11212D327593j250873p043958m437894L216330P768635N733625N45967k710928
$$ y = [229771, -297364, 277543, 4111066, 8589191, 8875897, 4689962, 357622, -1628631, -2726890, -3596713, -2015879, 2455808, 5737277, 4184437, -328607, -3161549, -2710573, -678043, 1614834, 3907829, 5012698, 3537288, 644066, -732168, -38087, -261347, -3903361, -9204681, -11566358, -8372041, -1839037, 3047812, 3558804, 1844706, 1720046, 3340425, 3241329, 83315, -2608588, -1425335, 1853431, 3287223, 2900014, 3785535, 6129710, 6759281, 4925663, 3883369, 5284824, 6388756, 5214476, 4320456, 5856938, 6351073, 1455151, -5889914, -7699949, -1825662, 4327593, 3076720, -3967238, -8405132, -5188802, 2579833, 8313458, 8859425, 6148497]
11204F148497k618411j464341j293695j319051J10071K213282K604060J179100
11196E559512L92545Q67353j57861m065316p463136o513931k398474R52195K637301
11187a0189812M214328M844620K080174k672018m651044k630558m66173m01120
11179i871603N3433K272991K880202k82862l202070j569146K103241K770150J320441
11170c525223K400623N536155N393182P97047l221691l457363k379567k228222
11162f85059j390388O86515R19319j368756j400551L216731O587574K699142m197181
11153E067346m734651J755533O201641K883207l521105n969005m024373j490578
11145c831985J12017J433621J720611j88750k561186k169451J165615M048890
$$ y = [6148497, 3530086, 2065745, 772050, -547001, -436930, 1776352, 4380412, 5559512, 5952057, 6819410, 6661549, 2596233, -4866903, -11380834, -13779308, -12827113, -10189812, -5975484, -1130864, 949310, -1722708, -6373752, -9004310, -9470483, -9871603, -9818170, -7545179, -4664977, -4947839, -8149909, -9719055, -7615814, -4845664, -3525223, -1124600, 4411555, 9804737, 10601784, 7380093, 3922730, 1543163, -685059, -2075447, -1388932, -469613, -1838369, -3238920, -22189, 6565385, 9264527, 5067346, 332695, 2088228, 8289869, 11173076, 7651971, 1682966, -2341407, -3831985, -3719968, -2286347, -565736, -754486, -3315672, -5485123, -4319508, -270618]
11137b70618L650965N51117k582504l614258k108213P92508L121673L382979J605826
11128D529475q47124k490751k781406k149731j030678Q24499L339709M679018
11120D073011K657495j653142l950428k170132K39569p40762l563595l798956
11112h906940j381666j37644o06370P82038M479825N953576L357732J059505K008025
11103F608081K426467j086830m586819l119129M64629L52677j958011n99034L413845
11094A915876L088918k312823n267064k233665R12025n62316k374456M75445M154952
11085b203108J900702m630660p182540k346050M864272Q263478O465432J870576
11077G002102k157482k925573m11740K167410J918343k37198j581186j668922
$$ y = [-270618, 3380347, 3931464, 1348960, -2265298, -4373511, -3581003, -459330, 2923649, 4529475, 3682351, 1191600, -1589806, -3739537, -4770215, -3945716, -606007, 4073011, 6730506, 5077364, 1126936, -1043196, -803627, -1544389, -5107984, -8906940, -10288606, -10426250, -11032620, -10250582, -5770757, 182819, 3540551, 4600056, 6608081, 9034548, 7947718, 3360899, 241770, 706399, 1059076, -898935, -1497969, 1915876, 5004794, 2691971, -2575093, -4808758, -3896733, -4459049, -6833505, -6358060, -2203108, -302406, -4933066, -12115606, -14461656, -9597384, -1333906, 5131526, 7002102, 4844620, 1919047, 1507307, 3674717, 5593060, 5355862, 3774676, 2105754]
11069B105754j810661j910302q35244J021242K388932L404550M481744M001453
11061A2847468K90764m777799p224666n587189j545140L038790O613638O601776
11053A0257642J612943m944010p119360l032252L347227P060407O231548J843029
11045A5257174l209092n039565k339197Q83280k58597m309288m928256j34712
11037d078253M653588M462022J021941j395463k209777l058895l384371j658664
11029e647872Q80131J614697O91877M66309J396833J535875L9194j432555j282654
11020a738165j22811K80558p14027j758372q68762J903887L543475J466404k230209
11011b38022k719811L94658J427511l126609p923446n080827M316868J0561308
$$ y = [2105754, 295093, -1615209, -2450453, -1429211, 959721, 4364271, 8846015, 12847468, 13138232, 8360433, 1135767, -4451422, -5996562, -2957772, 3655866, 10257642, 11870585, 6926575, -192785, -3225037, 122190, 7182597, 13414145, 15257174, 12048082, 7008517, 4669320, 5552600, 5294003, 984715, -3943541, -4078253, 575335, 5037357, 6059298, 4663835, 2454058, -604837, -3989208, -5647872, -4767741, -3153044, -2461167, -1994858, -598025, 937850, 977044, -455511, -1738165, -1860976, -1580418, -2294445, -4052817, -4921579, -3017692, 525783, 1992187, -238022, -2957833, -2563175, -1135664, -4262273, -12185719, -17266546, -12949678, -2388370]
11003b388370P847365J256679j224544P46361J468021j412533m370501m466367
10995b543889l279842k807682j559054K214225O075543N938988J956963j615595
10987D379657k206072j340556j007322q42570k4377P33601N01556n81692k256803
10978b644578m111133l987070L25173O396286P874652K516438l850872m735391
10970b216495j298977Q47499M89903J130307L698423M670010K098266j280957
10962H137979k556103k518776l019926l223191j008642L022445N087967K386063
10954F307816k855219m948604j658948K081465O24987l540302l030534K221887
10946d797452L824389j183908m279227N24426N442555J320100o156370n190104
$$ y = [-2388370, 5458995, 6715674, 5491130, 6237491, 7705512, 6292979, 1922478, -2543889, -5823731, -8631413, -10190467, -7976242, -1900699, 4038289, 5995252, 4379657, 2173585, 833029, -174293, -1016863, -1041240, -307639, 193917, -387775, -2644578, -6755711, -10742781, -10417608, -4021322, 3853330, 6369768, 2518896, -2216495, -3515472, -2667973, -2178070, -1047763, 2650660, 7320670, 9418936, 8137979, 5581876, 3063100, 43174, -3180017, -4188659, -1166214, 3921753, 6307816, 3452597, -1496007, -3154955, -1073490, -448503, -3988805, -7019339, -4797452, -973063, -2156971, -6436198, -5911772, -469217, 850883, -5305487, -10495591]
10938a0495591K225446L855911j391897j815606N760085R409136K317186n450592
10930D414078l794823J723347J380210k245366j121618L037875K778389j394416
10922D777676l038899j620904j394655j545618J785458N818686M163972j531654
10914G414062l252802K78116K141839n47461k826267k005634k018499m505354
10906e322000m391252R41479N395048K915518k702915l000010L011896P575327
10898D423091M431484l769258r022405o782438j27854M374742L831499R01101
10890a740038q14158n54262R46833L074734L829941N77231m803707n560947R54223
10881d090150P703982O701784K53186k837779j74211K237508L37583k793428l246893
$$ y = [-10495591, -8270145, -4414234, -5806131, -7621737, -1861652, 7547484, 9864670, 4414078, 619255, 2342602, 3722812, 1477446, 355828, 3393703, 6172092, 4777676, 1738777, 117873, -1276782, -2822400, -1036942, 4781744, 8945716, 7414062, 4161260, 4439376, 6581215, 6033754, 3207487, 1201853, -816646, -5322000, -9713252, -8771773, -3376725, -461207, -3164122, -6164132, -3152236, 4423091, 8854575, 5085317, -3937088, -10719526, -10847380, -6472638, -2641139, -1740038, -2554196, -3108458, -2161625, 913109, 4743050, 5320281, 516574, -5044373, -4090150, 3613832, 10315616, 10568802, 7731023, 7556812, 9794320, 10131903, 7338475, 4091582]
10872D091582j680397l33502N35527R74497j50178k734092m152980k218508K077859
10863c590192N514011N367028J676762k220843k791843q38915l91739k098185
10855F26084k060348O57437J251289k001048k776559K896285P702378L498589
10847I794107m544285n202187R64022L419646k85420j790079J832437L049278
10839G237519j209598l049244J682239M464992j474503q248710n401480K924985
10831c073800M610895j547557n431269k174701J977500J326398j082663o8243
10823e463440L371983M330528J104097l164946m537154k184222J258801K677190
10815b607163J825834J085378J787789K348601Q55369k049223l990919l435107
$$ y = [4091582, 2411185, 2077683, 2613210, 3587707, 3437529, 703437, -3449543, -5668051, -3590192, 1923819, 7290847, 8967609, 6746766, 3954923, 3116008, 2724269, 626084, -1434264, -776827, 474462, -1526586, -4303145, -1406860, 6295518, 9794107, 5249822, 47635, 1011657, 4431303, 4145883, 2355804, 4188241, 7237519, 6027921, 2978677, 4660916, 9125908, 7651405, -597305, -5998785, -3073800, 1537095, -10462, -5441731, -7616432, -5638932, -4312534, -5395197, -5463440, -2091457, 2239071, 3343168, 178222, -4358932, -6543154, -5284353, -2607163, -781329, 304049, 2091838, 4440439, 5295808, 3246585, -744334, -4179441]
10807d179441p43422K146017K780145L98891k710764l516119j701571O98933K242159
10798d585172K511290R26387j920616l065036q25736J786149J439421L83127K440019
10789i10167M784136J207389o353378q047815m31260P289161N792802j851261
10781A479607n613695j964088L602165M926052J499844k489800k807058L30524
10773a036449K019332j006970m937738m013700K01201J140997j582736j605494
10765a0821557K366079L685358J36821q65396M566097Q070314K164692n914330
10757C388078m402555M244776O766026q05013q078654o322843M69152L716421
10749a024612J888616l44974Q1275J857541K373318R95650l55928L83271K104440
$$ y = [-4179441, -4922863, -2776846, 3299, 402190, -2308574, -5824693, -7526264, -6827331, -4585172, -2073882, -1147495, -3068111, -6133147, -6958883, -5172734, -3733313, -3350186, -910167, 3873969, 5081358, -1272020, -9319835, -9751095, -2461934, 3330868, 1479607, -4134088, -6098176, -2496011, 2430041, 3929885, 1440085, -1366973, -1036449, 982883, -24087, -4961825, -8975525, -8774324, -7633327, -9216063, -10821557, -8455478, -4770120, -4633299, -5498695, -932598, 7137716, 9302408, 3388078, -1014477, 3230299, 9996325, 9191312, 1112658, -5210185, -4741033, -1024612, 864004, 519030, 600305, 2457846, 4831164, 5826814, 5470886, 5854157, 7958597]
10740G958597J113213l631377p972021p430403k635874K395206N097028M953025
10732a52606K047845j666012k277050J088593L510181O45576m290444m615792
10724e709709K84320M534668M231385J382198q37915k142275l141773k870259
10716d269360l06655L376408N440497L969186k72839l843188l455682K55788L003416
10707C897571J879567j348155l058827k105904O9559J878939K521562J864832
10699E599144O66798k34487j322237l170368l944830j126389L897030O390495
10691F755156M260287J50808k965714m393083l504452J63581L592016K455227
10683F513826j836632l054709N1259J574818j162058k641393Q68552L944756J099968
$$ y = [7958597, 9071810, 5440433, -2531588, -9961991, -12597865, -10202659, -5105631, -152606, 1895239, 229227, -2047823, -959230, 2550951, 3196527, -1093917, -5709709, -5425389, -890721, 3340664, 4722862, 3884947, 1742672, -1399101, -4269360, -4576015, -1199607, 4240890, 8210076, 7937237, 4094049, 638367, 894155, 3897571, 5777138, 4428983, 1370156, -735748, -666189, 1212750, 3734312, 5599144, 6265942, 6031455, 4709218, 1538850, -2405980, -3532369, 364661, 6755156, 11015443, 11166251, 8200537, 3807454, 303002, 466583, 4058599, 6513826, 4677194, 1622485, 1673744, 3248562, 2086504, -554889, 313663, 4258419, 5358387]
10674E358387l399447k684312J049232Q48455k723093k983016R72664K901468
10666f59662L7561l003768k299566J16530J059109Q92195J154712J488193J082492
10657a32204M91516M63368P05749N19005n12711k200351l053437j034313L451883
10648a301495O553127M767687r67786o101254o648153k391209K726903L818869
10640D56689N62838j765221M38283L210586J202057k936433k596722J124556J064902
10631G61535k877520k946427K295154M404085l32009m110289j272059K220903
10623a856627L13531k519722q47681J111901j783432m880244k183561K172536
10615a0473299J744458p7043K868739O892431M997239K83885K19812K509859j18529
$$ y = [5358387, 1958940, -725372, 323860, 1172315, -1550778, -4533794, -3561130, -659662, -622101, -3625869, -5925435, -5808905, -4749796, -3857601, -2702889, -1214696, -132204, 359312, 822680, 1528429, 2047434, 1534723, -665628, -3719065, -4753378, -1301495, 5251632, 10019319, 9051533, 2950279, -3697874, -6089083, -3362180, 456689, 1019527, -745694, -307411, 2903175, 4105232, 1168799, -1427923, -303367, 761535, -2115985, -5062412, -2767258, 1636827, 1304818, -2805471, -4077530, -1856627, -1543096, -4062818, -4910499, -3798598, -5582030, -10462274, -12645835, -10473299, -8728841, -8805884, -5937145, 955286, 5952525, 6236410, 6456222, 8966081, 8847552]
10606H847552n124081m080400J282696J266223m452596n702808R29912O663051
10598c70451M853380l00816k466200j417319K83303J465037J337714K43139J295231
10589D923018N398979O720497M11115p778412q237128j662770K664881J003735
10581C443915j809421k000638l23781K680480N950492M579738l350686r421622
10573b51523m989521M131177N103868j946793m819431M43617M427086J459993
10565C558473j871085M25801M130358L471184K03427j249542q50678r66862k333260
10556D517816m267069n049083k361225K664333M386445O38564k435403J84289
10548a721333L625936J747683j731326n47080J968689m16935l791112n68056N748206
$$ y = [8847552, 3723471, -356929, 925767, 2191990, -2260606, -7963414, -7033502, -370451, 4482929, 4182113, 1715913, 298594, 581897, 2046934, 3384648, 3627787, 4923018, 10321997, 17042494, 17453609, 9675197, 1438069, -224701, 2440180, 3443915, 1634494, -366144, -689925, 1990555, 7941047, 12520785, 9170099, -251523, -5241044, -1109867, 3994001, 2047208, -2772223, -2328606, 2098480, 3558473, 1687388, 2113189, 6243547, 9714731, 9918158, 8668616, 7817938, 6851076, 4517816, 250747, -4798336, -7159561, -4495228, -108783, 529781, -1905622, -1721333, 1904603, 3652286, 1920960, 1373880, 3342569, 2925634, -865478, -1433534, 4314672]
10539D314672N558454q15022m809722l633342p42323K862736O152910L380176
10531A2268539n873157j0192670l160955L649394l05229n109235J446441R916737
10523B639865N844354l071267j971931K373338l391903q962104J488872J3555497
10515H504721L337477j6279009j2959263Q315391J2693754l176748p661081N915644
10507a309114Q826995n999484j0336563L847174R094452k634952m796682P641321
10499D333147N466836j2678535r696504J5558692J5302246j5666056j7608720
10492a4988894K2343561L0181837j7266920j6731091R5219791J90034484J04920904
10485C93713672r8934605j96629243j08122427J3509222K7031574j9404210j9929186
$$ y = [4314672, 9873126, 9058104, 4248382, 615040, -127283, 2735453, 8888363, 12268539, 6395382, -3797288, -6958243, -3308849, -3614078, -8723313, -7276872, 2639865, 8484219, 5412952, 3441021, 5814359, 2422456, -6539648, -5050776, 8504721, 11842198, -4436811, -17396074, -9080683, 3613071, 436323, -7224758, -1309114, 7517881, 1518397, -8818166, -4970992, 4123460, 1488508, -3308174, 4333147, 9799983, -2878552, -12575056, 2983636, 18285882, 2619826, -14988894, 7354667, 37536504, 20269584, 3538493, 98758284, 288792768, 393713672, 294779067, 98149824, -9972603, 3536619, 30568193, 11163983, -8765203]
10478h765203J4659001J3472285j6503890j7193956R529352J4532211n518880
10471D210920j0656527N030170R869525j919951m796032N396754O402963n117257
10463H420565r039820j383364J419347l423974k483956M039757K740343m507799
10455d218901l108862N131981M548251m479392o152994J339928L970413q66035
10447c835611j045188N453466O776954K74022l109735q8485P2149n064472o114017
10438f680917l4026L979366R12193k696616j685205K85381m00707j639855j169038
10429i129424N04221K957693M858188K707665k833834m540251K82551L709495
10421a483696O09215j342975M231923Q813823L057670n455717m272506K689968
$$ y = [-8765203, 5893798, 19366083, 2862193, -14331763, -4802411, 9729800, 4210920, -6445607, -1415437, 8454088, 6534137, 1738105, 7134859, 13537822, 8420565, -619255, -2002619, -583272, -4007246, -6491202, -2451445, 288898, -4218901, -7327763, -2195782, 2352469, -2126923, -8279917, -6939989, -2969576, -3835611, -4880799, 572667, 7349621, 7623643, 4513908, 4425423, 4497572, -566900, -6680917, -6714943, -2735577, -1823384, -4520000, -6205205, -5919824, -6320531, -7960386, -9129424, -8625203, -5667510, -809322, 1898343, -935491, -5475742, -5193191, -1483696, -874481, -2217456, 2014467, 10828290, 13885960, 8430243, 4157737, 6847705]
10413F847705K894035k968848m476505j075932m96372k246458j59769K756783
10405A074639m79816m750851m5683Q607133P304979k707616o412613J35124N344469
10396H069765L300501R43051J871598M95591m379988o019410l050183j751811
10388e20886k808885k95048M440266L072877l505405m849888O50969K844218j541915
10379b513697l410325J187775L936223L25404k200600J170951L705101J6190m417224
10370b200202l730964p88346M01965J247710K402027J002048j766940n24782L787627
10361a69857M229770Q73784Q71301L524832J53572p957553q178448J538175O853542
10352A739118P97063m506098N3065M526462q56305o966512k367109N454970L418351
$$ y = [6847705, 9741740, 6772892, 2296387, 1220455, 724083, -1522375, -1682144, 1074639, 594823, -4156028, -4201711, 4405422, 11710401, 9002785, 2590172, 2725296, 8069765, 11370266, 12313317, 14184915, 14680506, 10300518, 4281108, 1230925, -520886, -3329771, -3624819, 815447, 3888324, 382919, -4466969, -3816000, -971782, -2513697, -5924022, -4736247, -800024, -474620, -2675220, -1504269, 2200832, 2217022, -2200202, -5931166, -6719512, -6317547, -5069837, -2667810, -1665762, -3432702, -3957484, -169857, 4059913, 4933697, 5804998, 9329830, 9483402, 1525849, -6652599, -5114424, 1739118, 2536181, -1969917, -1916852, 2609610, 1753305, -5213207, -7580316, -2125346, 1293005]
10343A293005l842999l052142L710833L712945l010942m417153J498427L810633
10335b97393j515062n410997k011392K929389L597830K240256J833479P46422
10327B112532j484509j740107q951n64081l506590l012360K532726O230712L019772
10318C579144k177535k146252J607593J768946l220236o618368l030951L822678
10310f414981N935500J910156j190175J490915M425391k94569r101099r629124
10302a2867986J203888J0850529P997156k109722o738639l671873m94741j02804
10294e934192J777417N381716M433115k538510p624050m688184J800022L927211
10286c465455J007898j997095k669922k220014q69102K222089N121990M296360
$$ y = [1293005, -2549994, -5602136, -1891303, 1821642, -1189300, -5606453, -4108026, -297393, -1812455, -7223452, -9234844, -6305455, -2707625, -467369, 1366110, 2112532, 628023, -1112084, -1121035, -1685116, -5191706, -8204066, -5671340, 559372, 3579144, 1401609, -744643, 862950, 2631896, -588340, -7206708, -10237659, -6414981, -479481, 1430675, 240500, 1731415, 6156806, 5862237, -3238862, -12867986, -11664098, -813569, 7183587, 5073865, -1664774, -5336647, -5831388, -5934192, -4156775, 1224941, 5658056, 3119546, -4504504, -9192688, -7392666, -3465455, -2457557, -4454652, -7124574, -9344588, -10213690, -7991601, -2869611, 1426749]
10278A426749L32657j736685M45661K713347N13737l884128m525279p86311J913949
10269c586303Q84243q4953J728722K441160j518675n729804l804637K072142M382023
10260c216082K199970J280617K789546J609103k674121l215878J877461M422658
10252E073274r15222p057633n276370J409939L939109J042133j304820o13088
10244c702678L76537L72270L74029l25823k231867k030057K207761M921053J80042
10235A41267p264710p182269O37556N665716K391460k577007j938562K173050
10227g953499L786990K254580R40155J220222K004780K283500J380393p44929
10219E172192k104763p39367J389102P77984j185325J60589L896302L263965l210174
$$ y = [1426749, 1759406, 22721, 468382, 3181729, 3695466, -188662, -4713941, -5500252, -3586303, -2702060, -2787013, -1058291, 1382869, -135806, -5865610, -9670247, -7598105, -3216082, -1016112, 264505, 3054051, 4663154, 1989033, -1226845, 650616, 5073274, 4158052, -2899581, -8175951, -6766012, -2826903, -1784770, -3089590, -3702678, -3326141, -2953871, -2579842, -2905665, -5137532, -7167589, -4959828, -38775, 141267, -7123443, -14305712, -13668156, -8002440, -5610980, -8187987, -10126549, -7953499, -4166509, -1911929, -971774, 248448, 2253228, 4536728, 5917121, 5172192, 3067429, 2328062, 3717164, 4495148, 3309823, 3470412, 7366714, 10630679, 7420505]
10210G420505p601319m035814K277901L312670N8686q69378J560101K743339J511794
10201F378485J523391L736260M296217J118090k798722m122485k955805o30888
10193F544543K184894L780777J749949k924531n409030k973705J148331K199098
10185F300326R2463j424587m56801R61393L86365j521976j922076L99943L054854
10176E869904K659185o37469k826376j386713R33418K85598j901010r60990K793619
10167D829166L281730j898938o503138m263518J736272L940666J581559J01488
10159B805287P34446j034518n431700n527865J374362P214358M727863o59901
10151D202332O43565O109727M364694n847543j1813354n582396L966826M684013
$$ y = [7420505, -180814, -4216628, -1938727, 1373943, 1432629, 563251, 2123352, 4866691, 6378485, 7901876, 11638136, 15934353, 17052443, 14253721, 10131236, 7175431, 6544543, 8729437, 12510214, 14260163, 11335632, 5926602, 2952897, 4101228, 6300326, 6392789, 4968202, 4511401, 5472794, 5859159, 4337183, 2415107, 2815050, 5869904, 8529089, 7891620, 5065244, 3678531, 4611949, 4897547, 2996537, 2035547, 4829166, 8110896, 6211958, -291180, -4554698, -2818426, 1122240, 2703799, 2805287, 3539733, 2505215, -2926485, -8454350, -7079988, 134370, 4862233, 4202332, 4845897, 10955624, 15320318, 9472775, -2340579, -7922975, -3956149, 727864]
10143G27864j460453l766330k19890J254449k715367n779087k854044K473685
10135a2339173M886418M653011L972469J958699j902373m062565j966344Q63570
10127c936288J63954j742717J17849M377180M886032M87314l382332l375463k229038
10118d633509k510475k328132p0076J694871O96101o49187Q01072L671578M618100
10109A290343L568793K665700K184757J276548P70170J326515O43455l233392
10101A0492889p323660p048342l120232k80341J55057J160174L417214L675760
10093A128519R32117j307537j072392j027545k697710k649804J532972N697612
10085E36232M524325l57812k822914j135253P45802J85398p26933M04532K395210
$$ y = [727864, -732589, -4498919, -4718809, -3464360, -6179727, -11958814, -14812858, -12339173, -7452755, -2799744, 1172725, 3131424, 1229051, -2833514, -4799858, -3936288, -3772334, -5515051, -5397202, -1020022, 3866010, 4353324, 970992, -2404471, -4633509, -7143984, -9472116, -9542192, -7847321, -7151220, -7800407, -6999335, -3327757, 1290343, 4859136, 7524836, 9709593, 10986141, 11756311, 13082826, 13726281, 10492889, 3169229, -3879113, -6999345, -7279686, -7124629, -5964455, -2547241, 1128519, 2060636, 753099, -319293, -1346838, -4044548, -6694352, -5161380, 536232, 5060557, 4702745, 1879831, 744578, 1490380, 1675778, 948845, 1353377, 3748587]
10076C748587K666704Q49857j355110k501227k455391j876237j267352m20990
10068b611159R56547J985144J052411j795635m016342l116136P33224N120262
10060a691684P289768N473496M19883l820712l320309L11687J022939l235360
10052B449708o702987l804647K262525L824013k09621l287240j343544J592816
10044e218977J42051m218567n308395q54845M540246N423319K166288j32392J290329
10035b170943L441059K489142l68159j244156k78308j227332m267200m759053
10027h384950j000255K390674K006644J086739K914098M014001J35927n061801
10019a898923m650393O92907L966245K757146J356082K164779K446598O62982
$$ y = [3748587, 6415291, 7265148, 5910038, 3408811, 953420, -922817, -2190169, -2611159, -1654612, 330532, 1382943, -412692, -4429034, -7545170, -6811946, -1691684, 5598084, 11071580, 11491463, 7670751, 4350442, 4662129, 5685068, 2449708, -4253279, -8057926, -5795401, -1971388, -2181009, -5468249, -6811793, -5218977, -5076926, -9295493, -14603888, -15458733, -10918487, -5495168, -3328880, -3461272, -2170943, 1270116, 3759258, 3391099, 2146943, 1868635, 641303, -3625897, -8384950, -9385205, -6994531, -4987887, -3901148, -987050, 3026951, 3162878, -1898923, -6549316, -5856409, -1890164, 866982, 2223064, 4387843, 6834441, 7497423]
10011G497423p15894l88033k17026l96249J546000M982853N197594O40314m091526
10002A4055456n127982m117533l440855j916397J159620K551481P8253k713273
9994E28770j493765J977476K454716j043740m213977l495145R5851L084518L397547
9985A292251J895158Q33487Q54643K63328j684569k541176l61869K166310J300220
9976D017783j448883j595834O18800P86204j493688j697297J339512L113981J352681
9967D993259n91579o50542j350788l238242k348621J847100L396786l90375l455938
9958a788940r00139K854198K346221L05512Q82380P38659l737488o633004j034747
9949f967348P323376P210751r022k414506K858152N416377n72608o885318m788313
$$ y = [7497423, 6781529, 6393496, 6176470, 5780221, 7326221, 12309074, 17506668, 18146982, 14055456, 8927474, 4809941, 1369086, -547311, 612309, 3163790, 3242043, 528770, -964995, 1012481, 3467197, 2423457, -1790520, -5285665, -5189814, -2105296, 1292251, 3187409, 4020896, 4875539, 5138867, 3454298, 913122, 551253, 2717563, 4017783, 2568900, 973066, 1591866, 2378070, 884382, -812915, 526597, 3640578, 4993259, 4401680, 3751138, 2400350, -837892, -3186513, -1339413, 2057373, 1666998, -1788940, -2689079, 165119, 2511340, 2816852, 3699232, 4437891, 700403, -5932601, -6967348, 356028, 7566779, 7557757, 5143251, 8001403, 13417780, 12845172, 5959854, 1171541]
9940A171541K022529M613257J495713k482128m457984m525028k221263K296459
9932b086904N775612M844608K13755m448948o140306l828336J163055M931760
9924D24296M180567O29777r03967O98455J910628Q09143n44350q74107j548678
9915D781764k315796r40159J102037q84148n843951n810476J677062P284079K822422
9906A872834n669774o441684N78198M779866J661039j573067J291363O067604
9898B566379N503114r1740m300783l350913M22330K243890j55062m162319m426428
9889e751532P26954N673394L935750k130561l533834K267298O967569L791688
9881A1946726k072355j806381L212911M710107K132547L212601Q503538O592358
$$ y = [1171541, 3194070, 7807327, 9303040, 6820912, 2362928, -2162100, -4383363, -2086904, 3688708, 8533316, 8747071, 4298123, -1842183, -5670519, -4507464, 424296, 4604863, 5234640, 4330673, 5029128, 6939756, 7748899, 7204549, 6330442, 4781764, 2465968, 1525809, 2627846, 1743698, -4100253, -9910729, -8233667, -949588, 1872834, -3796940, -10238624, -9660426, -4880560, -3219521, -4792588, -3501225, 2566379, 8069493, 7977753, 3676970, 326057, 748387, 2992277, 2837215, -1325104, -5751532, -5024578, 648816, 4584566, 2454005, -1079829, 1187469, 8155038, 11946726, 9874371, 8067990, 11280901, 15991008, 18123555, 21336156, 29839694, 36432052]
9873C6432052q787506k5378814k5823146j0196961M913097Q418424N497627M916183
9865a0009044N886149L159234k136871m342103k371589j76103L21177R88425K720859
9856e959866L791966L175954J763214R7162j990345l565405l256116j541021O4186
9847g420271J390269K719168K828608R82434n83132K47920J394418j68528k492764
9838a101878j154348L045071M571687J548012k019192l010345k378486p39899
9830a239378K714257N333322K242208m694568o669243r86796L353226o75822o237262
9821f860056l097846N651243P977103J202055n204148m933430k088903j041183
9813h395165O74240M746868O123736J242619m027671k011879N046691P952725
$$ y = [36432052, 27644546, 2265732, -23557414, -33754375, -28841278, -20422854, -14925227, -10009044, -4122895, -963661, -3100532, -7442635, -9814224, -9990327, -9669150, -8680725, -5959866, -2167900, 1008054, 2771268, 2868430, 878085, -2687320, -5943436, -7484457, -7420271, -6030002, -3310834, -482226, 500208, -82924, 164996, 1559414, 1390886, -1101878, -2256226, 788845, 5360532, 6908544, 4889352, 1879007, -499479, -1239378, 1474879, 6808201, 9050409, 4355841, -2313402, -3300198, 53028, -622794, -6860056, -9957902, -4306659, 3670444, 4872499, -331649, -5265079, -7353982, -8395165, -7720925, -2974057, 3149679, 4392298, 364627, -1647252, 3399439, 11352164]
9805A1352164L220220l626265o596642n329227k435533K37812J551886J043320
9797e82265J91537R65442K509487K118925n9296p08390J153972J936297r41459
9788F584250m193024k839905K257806M815808J332846m202055n427721j679479
9780c351474J466023j79718l534227k248382M085208Q252027M805738k077945
9772G217250m245654j110986L82905k514683l878225L69186M343296J096000n267713
9763c608624m906046K499260P069261L714055j397626j983491n61135j476860
9755f51206k652220p84751J232837m78666k771800o46577L127604K259382j655880
9746c021277j547491K330141K462490k101872l041362K543343N547944m92550
$$ y = [11352164, 14572384, 10946119, 4349477, -979750, -3415283, -3177471, -1625585, -582265, -390728, 574714, 3084201, 5203126, 5143830, 4435440, 5589412, 7525709, 6584250, 2391226, -448679, 1809127, 6624935, 7957781, 3755726, -1671995, -3351474, -1885451, -2065169, -5599396, -7847778, -3762570, 4489457, 9295195, 7217250, 2971596, 1860610, 2243515, -271168, -4149393, -3780207, 563089, 1659089, -3608624, -8514670, -6015410, 1053851, 4767906, 3370280, 1386789, 825654, -651206, -3303426, -4088177, -2855340, -3334006, -6105806, -6752383, -3624779, -1365397, -3021277, -4568768, -2238627, 223863, -1878009, -4919371, -2376028, 3171916, 2679366]
9738B679366p572614n107826L288811N624580R2997l538395j76878L940789K882786
9729B113616j26206K72885K763001K686097m90660l746752n291430m844814j942042
9720h606305K347994M404919K341795o88179q54706O46601l9863k972462m505364
9711g925570l178421j424025j140888j128436K05092K363339L962252M319448
9703c947209L216191R64942q84046p58767P29047J547426J129874M59931l96761
9694B060628k134008l593411k496749N91406K225860J026075m83673k23891N35363
9685b492400K74180n0529N97473J333303J765729K988515M031100J560358l860965
9676F146764o064392k249694J313000j320811n346481k447165M851005O249291
$$ y = [2679366, -4893248, -10001074, -6712263, -1087683, -994686, -4533081, -4709959, -769170, 2113616, 1987410, 2260295, 5023296, 7709393, 7218733, 3471981, -1819449, -6664263, -8606305, -6258311, -1853392, 488403, -199776, -1054482, -407881, -447744, -3420206, -7925570, -11103991, -12528016, -13668904, -14797340, -14592248, -12228909, -8266657, -3947209, -731018, 233924, -650122, -1408889, -679842, 867584, 1997458, 2457389, 2060628, -73380, -3666791, -6163540, -5572134, -3346274, -2320199, -2803872, -3027763, -2492400, -2218220, -2268749, -1671276, -337973, 1427756, 4416271, 8447371, 10007729, 6146764, 82372, -2167322, -854322, -2175133, -7521614, -9968779, -5117774, 1131517]
9668A131517L01615l071987J215635N465573K285451l771297m585665j076556
9660b105714O43321K73326J792264M296846L073519j512670m028782k748272j525962
9651a842124k392978k630651n56734J371817J233710Q09087J806964K674352J604692
9642B078135j22130k45247R33284J283263J25711r29731l73867Q11160l8995l378735
9632A42848n413712k537195K511312L173455j067295k827879J787676N866821
9624A636031J963831n216222n119455K250566O237455K007880l052674k256341
9616a548929N11319q50349m036421l044902J521683L986585K556795L99659n84239
9607a088799j458062k468052k270623p23277J102499L064911M952973M598368
$$ y = [1131517, 1433132, -1638855, -423220, 5042353, 7327804, 3556507, -1029158, -2105714, -1462393, -1189067, 603197, 4900043, 7973562, 6460892, 2432110, -316162, -1842124, -4235102, -6865753, -7422487, -6050670, -4816960, -4007873, -2200909, 473443, 2078135, 1956005, 1710758, 2644042, 3927305, 4053016, 3123285, 2749418, 3560578, 3521583, 142848, -5270864, -7808059, -5296747, -2123292, -3190587, -6018466, -4230790, 1636031, 3599862, -1616360, -6735815, -4485249, 1752206, 3760086, 707412, -1548929, -1037610, -1887959, -5924380, -8969282, -7447599, -3461014, -904219, -504560, -1088799, -2546861, -5014913, -7285536, -8008813, -6906314, -3841403, 1111570, 5709938]
9599E709938P02687l483176l459510n4769J500937q02492l405809l342563k323969
9590h958726k502743k020751J621935N960329N472082r24131p393043p356571
9582a6101619n75362O838308Q497714L277465m106191p177597l282187L761541
9574h867928P086682L837011j778876l512791j55802M135708N553043L903812
9566A0200859N21980l573473o564449o242904l166313n59620L84630J796065M021180
9557c182045L494091j173324n165644l882225J77901J864521J332554J781594
9549d752577K341009J68954k523309j270401K037594J606784j596080p36467M389060
9540c35433N525957m45603n644417l631884J011911J576357j56273O35467K407981
$$ y = [5709938, 6412625, 2929449, -530061, -584830, 916107, 113615, -3292194, -6634757, -8958726, -11461469, -13482220, -11860285, -5899956, -427874, -1352005, -8745048, -16101619, -16676981, -9838673, -1340959, 1936506, -2169685, -9347282, -12629469, -8867928, -1781246, 2055765, 276889, -3235902, -3391704, 744004, 6297047, 10200859, 10722839, 7149366, 584917, -5657987, -8824300, -9383920, -8999290, -7203225, -3182045, 312046, -861278, -6026922, -9909147, -9731246, -7866725, -6534171, -4752577, -2411568, -2242614, -4765923, -6036324, -3998730, -2391946, -3988026, -4724493, -335433, 5190524, 4744921, -899496, -4531380, -3519469, -1943112, -2099385, -1463918, 944063]
9531I44063J362018l03515J391524L794919J780788k872124m569448l666819m487307
9522f625901n714924k292998L793883M597977p35973l553119P46183N403173L059268
9513a322431l380289o161996l600817J32869K336923L371534L412634K559787
9505b651786K586416M342661M815992R95246m337295n255391j223432J620759
9497H93170o93740l944767j933076L832632N544078L02745n053436l219247L198695
9488a072946N505948J412204k400001q85204K406646J994075j187427k685262
9480C088033j928735j498901j628968p90591J6265j125762k478300j066732J406273
9471f007418Q41531j764118j515650J633647K371401m62954j228166K756170N861919
$$ y = [944063, 2306081, 2002566, 3394090, 7189009, 8969797, 6097673, 1528225, -2138594, -6625901, -12340825, -14633823, -10839940, -6241963, -6977936, -10531055, -9784872, -4381699, -1322431, -4702720, -10864716, -14465533, -14332664, -11995741, -8624207, -5211573, -2651786, -65370, 4277291, 9093283, 10088529, 5751234, 495843, -727589, 893170, 199430, -3745337, -5678413, -1845781, 3698297, 4001042, -1052394, -4271641, -1072946, 4433002, 5845206, 3445205, 2560001, 4966647, 6960722, 5773295, 3088033, 1159298, -339603, -1968571, -2759162, -2742897, -3868659, -6346959, -7413691, -6007418, -5165887, -6930005, -8445655, -6812008, -4440607, -4903561, -6131727, -3375557, 2486362]
9462B486362L140684j373787j190676K375459L024826l56807l021200k496465
9454B588396j126209o31923J44148J236087L29628k752564m355109j942988K117188
9445d393346L727624J901001j145914k880837k114250M23055J972301J64664l216856
9436e562558l218658J730384O735027O640704L056879J311037J991827Q12072
9428A3496714k943172l903401P15561N242556L172490l000630n419310k197546
9420E163262J356487K072712K277611K812184L20115n066468o374167R5343O670410
9411I327489L778454n558606q936130j873549O042032M588222l853037q628887
9403e114012m644408K694792N285993J519084l246080l807388q87666J143169
$$ y = [2486362, 5627046, 4253259, 3062583, 5438042, 8462868, 8106061, 5084861, 2588396, 1462187, 830264, 974412, 2210499, 2540127, -212437, -4567546, -6510534, -4393346, -665722, 1235279, 89365, -2791472, -4905722, -4482667, -2510366, -2345702, -5562558, -8781216, -7050832, -315805, 6324899, 9381778, 10692815, 12684642, 13496714, 10553542, 6650141, 7365702, 12608258, 15780748, 12780118, 7360808, 5163262, 6519749, 8592461, 10870072, 13682256, 14002371, 8935903, 2561736, 2657079, 9327489, 13105943, 7547337, -1388793, -3262342, 2779690, 7367912, 3514875, -5114012, -9758420, -7063628, -1777635, -258551, -3504631, -7312019, -8199685, -7056516]
9395g056516R78786J625543M302920N184020J269578l856910m625925j578633
9387c757137K16920o39819j021137r7987o81051k742997j888098L075575O373649
9378a162082K855878m358895p676965m165688K274267O257830N841004L017631
9370B882980R44893L51025r91366l959291n136129j754200K246639R12105l578980
9361h082324k921549L793145O972151R81009o294550m870160K727921O252879
9353a441478K717332j957886l664752l884453l605002j456974J551030K175005
9345i567178O53188M94560K119403K470815J258351J407559K662181J346199k180429
9336F64649k670652J216809M049259K528477N48554J440190J801270j658372n052901
$$ y = [-7056516, -6077730, -4452187, -149267, 5034753, 6304331, 2447421, -2178504, -3757137, -3540217, -4180036, -5201173, -5299160, -5980211, -8723208, -10611306, -7535731, -1162082, 1693796, -2665099, -10342064, -14507752, -12233485, -5975655, -134651, 2882980, 3827873, 4178898, 3187532, -771759, -5907888, -7662088, -5415449, -4503344, -8082324, -11003873, -7210728, -238577, 742432, -5552118, -10422278, -7694357, -1441478, 1275854, -682032, -4346784, -8231237, -11836239, -13293213, -11742183, -9567178, -8913990, -8419430, -6300027, -3829212, -2570861, -1163302, 1498879, 2845078, 664649, -2006003, -789194, 3260065, 5788542, 6337096, 7777286, 9578556, 7920184, 2867283]
9327B867283l618068l90480j327290n029952m977946k52530L474006L214107J952850
9318d088020K176901K468916J713338J077438M81694j651556l833128k146937
9310c801354K787697N048135K044192j500266j206933P52506R07798N23161J431418
9301F986354Q80444l160318n627347q34385P087843Q222157O92770p181561q952777
9292a886820o703986m192163j025663K967704M220790J045444j977971j5261M983217
9283b584709P382692N123116L00269m520227o968741m853855O53413M438188L616222
9274B586368J405289J308663J247400j704053m530780k591170J883332K623348
9266B228397o63836k219414R7533K074568Q88372q49385l37600J546792L006424
$$ y = [2867283, -750785, -1141265, -2468555, -7498507, -12476453, -12728983, -9254977, -6040870, -4088020, -1911119, 557797, 2271135, 3348573, 3830267, 2178711, -1654417, -3801354, -1013657, 4034478, 6078670, 4578404, 3371471, 4123977, 5031775, 5554936, 6986354, 7866798, 4706480, -920867, -1755252, 5332591, 13554748, 14247518, 7065957, -1886820, -8590806, -12782969, -13808632, -10840928, -6620138, -5574694, -7552665, -7567926, -2584709, 4797983, 9921099, 10221368, 5701141, -1267600, -6121455, -5468042, -1029854, 2586368, 3991657, 5300320, 6547720, 4843667, 312887, -2278283, -394951, 2228397, 1564561, -654853, -557320, 1517248, 2405620, 1556235, 1218635, 2765427, 5771851]
9257E771851L143707M91984m966385q227147m211710L133579M232540j991889
9249b623470n703471j045283N171330M815473M99641n63293J778294K824653J868875
9240G022749J007872q55523n020279p398494l864880J577145K011652j365813
9232f885571j819279J237944K238089L22067O37038M066014M959113J169557k125185
9223C799787j362002L73976J91804j30347L32658r85311l734651l094673J262418
9214c346341K431887k332301n439914r68940M710152L062359k118835r21721N884348
9205I60694P788686J366050m863588m044676P2779J055667j095803k815965k981324
9196d557480j941355Q33537M367454N205998K189321j034686j175461K12593K74769
$$ y = [5771851, 8915558, 9407542, 4441157, -3785990, -7997700, -4864121, -631581, -2623470, -8326941, -9372224, -4200894, 614579, 1114220, 550927, 2329221, 5153874, 7022749, 8030621, 7175098, 2154819, -5243675, -9108555, -7531410, -5519758, -6885571, -8704850, -7466906, -5228817, -4906750, -4269712, -203698, 4755415, 5924972, 3799787, 2437785, 2811761, 3003565, 2873218, 3205876, 2220565, -1514086, -4608759, -3346341, -914454, -3246755, -8686669, -9655609, -4945457, -1883098, -4001933, -4923654, 960694, 8749380, 10115430, 5251842, 1207166, 1279945, 2335612, 1239809, -1576156, -4557480, -6498835, -5665298, -1297844, 3908154, 6097475, 5062789, 3887328, 4099921, 4374690]
9187D374690l20078N59780K205971K268194N03946j512053k847691l062147j487626
9178F82986J037696J805451k2955j644705j131393q55333k981711m492570j434134
9169i036668L963054N846578L317917O82994m78428k945304o478701n828259M61889
9160a0494928N278236K209352m549856n536423J006984P445245P332027K192948
9152D883585k740797m710521l864778j416934O11351M94208p64300m13987J589199
9143f332974K030129k15890j668025L36945K822623J528383k136353l093293n77195
9134g305650R58045n49506j352047J633078N255357M781088J238630l27784J411269
9125E742480K679342R90593j383877j682184q24816j165328k636247l478388k971378
$$ y = [4374690, 4054612, 4614392, 6820363, 9088557, 9592503, 8080450, 5232759, 2170612, 682986, 1720682, 3526133, 3503178, 1858473, 727080, -128253, -3109964, -7602534, -9036668, -5073614, 772964, 4090881, 4773875, 4295447, 1350143, -5128558, -10956817, -10494928, -5216692, -3007340, -7557196, -13093619, -12086635, -4641390, 2690637, 4883585, 2142788, -2567733, -6432511, -7849445, -7238094, -6743886, -7508186, -7922173, -6332974, -4302845, -4518735, -6186760, -5849815, -3027192, -1498809, -3635162, -6728455, -7305650, -6347605, -6897111, -8249158, -6616080, -1360723, 3420365, 4658995, 4331211, 5742480, 8421822, 9412415, 8028538, 6346354, 5521538, 4356210, 1719963, -1758425, -4729803]
9116d729803j313843J436526M043355L629398n05286m144590k808454J759964
9108b632733L702507J301043j323600j246120m99159r91637p01954J639867K479505
9099A727719j068151m805671k477333M160736O565535J303739m976569m708871
9091d278866R17075M711620L060630q74123k483933j170755J12161o96335k052622
9082b755148j180889J394836J952015p11161k601820n40799K102469P53333j449833
9073c036997K444638J0149998J0009750k000207j3374412j0675825J604844P107950
9065B229739o7307r006190q500616o27540N597944O646863N179622L228884O91445
9056E372844j530823j897337j076828q77350r44318L52046K246816K024490o54488
$$ y = [-4729803, -6043646, -4607120, -563765, 3065633, 2560347, -1584243, -4392697, -2632733, 1069774, 2370817, 1047217, -198903, -698062, -1689699, -2391653, -751786, 1727719, 659568, -4146103, -6623436, -2462700, 4102835, 5406574, 430005, -4278866, -3361791, 1349829, 4410459, 3536336, 1052403, -118352, -6191, -702526, -2755148, -3936037, -2541201, -589186, -1300347, -3902167, -4442966, -2340497, -1587164, -3036997, -592359, 9557639, 19567389, 17567182, 4192770, -6483055, -4878211, 2229739, 2162432, -6843758, -15344374, -15971914, -10373970, -3727107, 1452515, 4681399, 5372844, 3842021, 1944684, 867856, -9494, -953812, -601766, 1645050, 3669540, 3015052]
9047C015052k772230k200065o14191p41775k281488k439631k5048K820533L564886
9038a673957K656560K500623L469949K968313n69812m487575m786514j456492
9030a378905J384379P42964j952121l265558j620213J843867M596100M380901
9022D731414J296879j386843n92844J967181J401629l081854n962120k891905
9014d518463K778465M541650J439719j959698k660105j564700M65062L532599
9006B054529N283776K138061m185834o573121k049048L126822K047934k904709
8998a061590l973400M95351M426515L395125l401j270603Q6171J664972J783007
8989E542147N8847k922469m848545l102095J354830L890333J787088k302319m287711
$$ y = [3015052, 242822, -1957243, -2571434, -3313209, -5594697, -8034328, -8059376, -5238843, -1673957, 982603, 3483226, 6953175, 9921488, 9351676, 4864101, 77587, -1378905, 5474, 748438, -1203683, -4469241, -6089454, -4245587, 350513, 4731414, 6028293, 4641450, 4048606, 6015787, 7417416, 4335562, -1626558, -4518463, -1739998, 2801652, 4241371, 2281673, -378432, -1943132, -1478070, 2054529, 7338305, 9476366, 5290532, -1282589, -3331637, -204815, 1843119, -1061590, -5034990, -4539639, -113124, 3282001, 3278600, 2007997, 2094168, 3759140, 5542147, 5600994, 2678525, -2170020, -5272115, -3917285, -26952, 1760136, -542183, -4829894]
8980d829894l687251k529842j423545M75852K959728M770669N141688L571030
8972D448435k05943m072560l916711P87619M386155K220084j886361q29650M420653
8963E351721N532222m65353o374403n670581j650488r15244k800606j579536L683013
8954d889255P935259P819003M832058R25661l602532o933044n656809k24782L536430
8945C741989J427099l266244m095792m182L743088K795273j114731l219950j961369
8936a954819k37840p54506k165140j326946J593250K839381N47040k089623j224735
8927d773938K009275L344932J821799O45699J418391J489623j232593m222756
8919E00432l899270q97303J473120K439022L597939M173481J024334n275695q597834
$$ y = [-4829894, -8517145, -11046987, -12470532, -11994680, -9034952, -4264283, 877405, 4448435, 4242492, 169932, -3746779, -2959160, 1426995, 3647079, 1760718, 931068, 5351721, 10883943, 10418590, 4044187, -1626394, -3276882, -4192126, -6992732, -8572268, -4889255, 3046004, 10865007, 15697065, 16622726, 13020194, 6087150, 430341, 205559, 3741989, 5169088, 1902844, -2192948, -2197130, 1545958, 4341231, 3226500, 6550, -1954819, -2192659, -2947165, -5112305, -6439251, -4846001, -2006620, -1459580, -3549203, -4773938, -2764663, 580269, 2402068, 3047767, 4466158, 5955781, 4723188, 500432, -3398838, -4296141, -2823021, -383999, 3213940, 7387421, 8411755, 3136060, -5461774]
8910e461774m786656J734722L238740o20917k493870J562796O063569M449016
8902C685626r53633k788262r4025R09754k362088m343337o11238M307670L602104
8893A352571j367337l475965p10918J818703O28144j557062j551784p44099j430860
8884g038607k026984L76783M792048O996119M612385o50795n128713n968695k671919
8875f708378K467232N862409N616022K691310r46745l985472n291986l873336
8867d168944m85704K311626K832614J665540m0998j541195j263808K135914O055249
8858G500294N071455j437470o508271m445422Q54663J741289j581423k089757
8850h94642K193954M960733J833089l220875n011527m549222m788783m173932
$$ y = [-5461774, -10248430, -8513708, -5274968, -5895885, -8389755, -6826959, -763390, 3685626, 2731993, -56269, -150294, 759460, -1602628, -5945965, -6557203, -2249533, 1352571, -14766, -3490731, -4201649, -2382946, -1754802, -3311864, -4863648, -5607747, -7038607, -9065591, -8688808, -3896760, 3099359, 7711744, 7060949, 1932236, -4036459, -6708378, -4241146, 1621263, 7237285, 9928595, 8981850, 4996378, -295608, -4168944, -4654648, -2343022, 489592, 2155132, 2114134, 572939, -690869, 1445045, 7500294, 12571749, 11134279, 4626008, 180586, 1035249, 2776538, 1195115, -894642, 1299312, 6260045, 8093134, 4872259, -139268, -4688490, -9477273, -13651205]
8842a3651205l09631L654354K978654l87849l17515L396455M453653M69487k873424
8833b587021q79500K843676K397135j440261l320806j682768K32066M22707J87848
8824c826924K84678l68176j351021k27190K975050M231619R30054l630228l989495
8815d971633M48053M751147M516615N37401k839049k628290J02223J938436J069244
8806B924147q13561r31575Q70496K184014J631866M13845l16718j375658l360359
8797A226497m509890k944226K52621K442453K897970K533207J281479j240251
8789A939860l050711j405592K470863L783378N96495l262652l568164j175074
8781c671597K60390k15063n23674N95431K236236L333462L791881L741833L109023
$$ y = [-13651205, -13960836, -10306482, -7327828, -7715677, -8033192, -4636737, -183084, 286403, -2587021, -3466521, -622845, 1774290, 334029, -2986777, -4669545, -4437479, -4014772, -3826924, -3542246, -3910422, -5261443, -5488633, -2513583, 1718036, 2648090, -982138, -4971633, -4523580, 227567, 4744182, 5281583, 2442534, -185756, -83533, 1854903, 2924147, 2110586, 1179011, 2049507, 4233521, 5865387, 6279232, 5962514, 4586856, 1226497, -3283393, -6227619, -5974998, -3532545, -634575, 1898632, 3180111, 1939860, -1110851, -2516443, -45580, 3737798, 4334293, 1071641, -2496523, -3671597, -3411207, -3626270, -4149944, -3554513, -1318277, 2015185, 5807066, 9548899, 12657922]
8772A2657922J618295j377181n665348q163366m963573K659994P507878N087303
8764I361924k1459j032051O25265j666977p546257q711657j783547N663749N875819
8755G64809J305337r03482M15925J352220O31770m7461r17228l087532m281869
8746d767511j729154J945910J916048o93662m57537K882307L798893O27708j552184
8737A970818J96857J932818K01249k224384j945929o66888r37698j199817L08117
8728b364857J334037J13956m17951J878074L159224n9523l581177j630614L054174
8719A485343L131340j476699l911102j673923P86686J056448J943200M084890
8711E426183L376932j195754m096061j455638K876357L463111P62520j358137
$$ y = [12657922, 14276217, 12899036, 7233688, -929678, -5893251, -3233257, 4274621, 9361924, 9340465, 8308414, 8933679, 7266702, -279555, -8991212, -10774759, -5111010, 764809, 2070146, 1166664, 1582589, 2934809, 3566579, 3519118, 2601890, -485642, -4767511, -6496665, -4550755, -2634707, -3328369, -3785906, -903599, 2895294, 3523002, 1970818, 2167675, 4100493, 4301742, 2077358, 131429, -535459, -1473157, -2672974, -2364857, -1030820, -916864, -1334815, 543259, 3702483, 3642960, 61783, -1568831, 1485343, 4616683, 3139984, -771118, -2445041, -1658355, -601907, 1341293, 5426183, 8803115, 7607361, 3511300, 2055662, 4932019, 8395130, 9157650, 7799513]
8703G799513j542349o89942P10492J585933j86243m114840o055958l781616m49456
8694f724466M06221J2644J143917K880429K396636k67097k668030l386470k235196
8685h441412Q36686M384147N253691K426703j001796j957789j100499l81699Q6880
8676A04912N01493O6180n29939O75755J951382j462027q164902q650947J308529
8667a4199564J1355252R132569j988791p549415k273885M653003M759909N40576
8659D429654j989756k032512j156968J114643M084934L777702j117148n381895
8651A728654l807969J642342N041838L973454L15128l609619n928851m544372
8643e189395N36621N372595N784860K214071j406466k651942k210837j302357
$$ y = [7799513, 6257164, 5567222, 6277714, 7863647, 7677404, 3562564, -2493394, -6275010, -6724466, -6318245, -6305601, -5161684, -2281255, 115381, -151716, -2819746, -6206216, -8441412, -7604726, -3220579, 2033112, 4459815, 3458019, 1500230, 399731, 18032, 104912, 606405, 672585, 142646, 818401, 2769783, 1307756, -6857146, -15508093, -14199564, -2844312, 6288257, 4299466, -3249949, -5523834, -870831, 3889078, 4429654, 2439898, 407386, -749582, 365061, 4449995, 8227697, 7110549, 1728654, -2079315, -436973, 4604865, 8578319, 8893447, 5283828, -645023, -5189395, -4652774, 719821, 6504681, 8718752, 7312286, 4660344, 2449507, 1147150]
8635A147150O3533J981308L258441J983773k143550n992910m985788J339879O957237
8626C609073N475325j676876o493864m277179J098397L031948J92434l376262
8618b417004l967510j750253N39120R60706M07205J148724L102828L210550J08725
8609A343091k799414j968530O82527R82190m41442K31844K315416J150761l068169
8600a571726m036220P73268N473299M497638K20662k270251k783194l517696l409729
8591f623949n70907K720680K870834O98048l92887j2154j16944o46361l13951
8582b387591j09570j508661k555240k65207L997673N882568M177080J608583J48925
8573H988560n95811q26503j95977L12347l73676q49132O09427K176640P76577
$$ y = [1147150, 1210683, 3191991, 6450432, 8434205, 6290655, 297745, -4688043, -3348164, 3609073, 9084398, 7407522, 913658, -3363521, -2265124, 766824, 959258, -2417004, -6384514, -8134767, -7595647, -6634941, -6227736, -5079012, -1976184, 1234366, 1343091, -1456323, -3424853, -2742326, -1760136, -2201578, -1969734, 345682, 1496443, -1571726, -5607946, -4834678, 638621, 5136259, 5356921, 3086670, 303476, -3214220, -6623949, -7194856, -4474176, -1603342, -905294, -1298181, -1310335, -1427279, -2073640, -2387591, -2497161, -4005822, -6561062, -6826269, -2828596, 3053972, 7231052, 8839635, 8988560, 8392749, 7566246, 7370269, 7682616, 7308940, 6459808, 7069235, 9245875, 10022452]
8564A0022452k353271k803796K79368K946766K376795o3961k297628l908956m144496
8555E3273j802992J440257J719061j156026k538942J4466K642503J410350j131518
8546F50432k39720K798291K404899k036118m560180j662625K250930J684730j606394
8537c15755j740318J974546M247756K168127j036963k078152k305005l380617
8529b466381l010884M57629L042492N92360l462664k696653J492847J612894l108246
8520g546606m300849K378144R695582R265207L007009j524978k049116j528169
8512G396224j181234k3613J053419M93657m02595J10076M95936q64111j572326
8503E505433N82689K235558q45528o043940p155295l568057N0181J620452K748901
$$ y = [10022452, 7669181, 4865385, 5144753, 8091519, 10468314, 10404353, 8106725, 4197769, 53273, -1749719, -309462, 1409599, 253573, -2285369, -2270903, 371600, 1781950, 650432, 410712, 3209003, 5613902, 3577784, -982396, -2645021, -394091, 1290639, -315755, -2056073, -81527, 4166229, 6334356, 5297393, 3219241, 914236, -2466381, -5477265, -5019636, -1977144, -1384784, -4847448, -7544101, -6051254, -4438360, -7546606, -11847455, -9469311, 226271, 9491478, 12498487, 10973509, 8924393, 7396224, 6214990, 6191377, 7244796, 7738453, 7335858, 7445934, 7941870, 7077759, 5505433, 6088122, 8323680, 7478152, 1434212, -5721083, -9289140, -9238959, -7618507, -4869606]
8494d869606L355832J977958M42861J441815K473219m97132m386269k459910L757660
8485A236428N445048O06819k591329M51149L514981R62952k567748p20333L403009
8476I740976K497166l126322o524710m338158K08879K891522K251857p96869l519424
8467g15083l138616m97497N93072o74395r47169N32712j28642l348063k701087
8458a1024768M570285J0134519N602214l895867o417372n64440L703782P67128
8450B875481l920383m144231j230255J003350K492986M200486M399811J734896
8442G412141j487465k299889r42747L63636K86518j225430l016752k554817J448981
8433b015824N851373N911251J747827j910341k906827l781314n468682m545413
$$ y = [-4869606, -1513774, 464184, 907045, 2348860, 4822079, 4324947, -61322, -2521232, 1236428, 6681476, 7288295, 4696966, 5148115, 8663096, 9626048, 7058300, 6337967, 9740976, 12238142, 9111820, 2587110, -1751048, -1542169, 1349353, 3601210, 2804341, -715083, -3853699, -4351196, -3758124, -4432519, -5379688, -4846976, -4975618, -8323681, -11024768, -6454483, 3680036, 9282250, 5386383, -1030989, -1595429, 2108353, 2875481, -1044902, -5189133, -6419388, -5416038, -2923052, 1277434, 5677245, 7412141, 5924676, 3624787, 2682040, 3045676, 3332194, 2106764, -909988, -3464805, -2015824, 3835549, 9746800, 11494627, 9584286, 6677459, 2896145, -2572537, -7117950]
8425g117950J54726L448594J055114l003685j865987L704464O289704K576545
8417E241525k495416l233955k01107K184476J702446l32114j787128j694934m60352
8408a076559O08893N24373j59919j33567O44919J019687P71768R38078J682941
8399D820614J828435J076802M74361j10481k138122m603590l626351J298670M258401
8390C278739P60531m357706l229079K538145L704097j798926n085471p57717M021408
8381i25979J435044l870617k706745L319604N197223J950145Q89690L296693K242161
8372A0827219l457776n405964k78732L113057j639455o974674l447310M490914
8364b772721N441797j268980n793542l229870J262828K438964J347955Q94794
$$ y = [-7117950, -6963224, -3514630, -2459516, -5463201, -7329188, -3624724, 2664980, 5241525, 2746109, -487846, -688953, 1495523, 3197969, 2865855, 1078727, -616207, -1076559, -467666, 56707, -103212, -236779, 408140, 1427827, 2199595, 3137673, 4820614, 6649049, 7725851, 8200212, 8089731, 5951609, 1348019, -2278332, -979662, 3278739, 4039270, -318436, -3547515, -1009370, 2694727, 895801, -4189670, -4947387, -925979, 509065, -3361552, -6068297, -2748693, 2448530, 4398675, 5288365, 8585058, 10827219, 7369443, 1963479, 1684747, 4797804, 3158349, -3816325, -7263635, -2772721, 2669076, 1400096, -4393446, -7623316, -6360488, -3921524, -2573569, -1678775]
8356a678775J767591L506191M480905J586562m824779p838540k448971N145212
8348c04604M943588j759283m401098o2791K700349q32169l730521j3744M997464
8339A537191M114065J2266o28533J445138J024240j672580k557498j940520k925541
8330a591772l699903J80480O572375P910214K331179l407820l663624m70293J585572
8321E746408J591821P37411j072590l832941n494564m129506m51202L237151M993397
8312A325385L613520n39696m315709l990938Q5152L310977K452779p43808k727512
8303a529850k615210j880328j542614j569691j733515j395532M12464L128325
8295h725951M006123J213676k977448m009460k68514M822406O457165L415388
$$ y = [-1678775, 88816, 3595007, 8075912, 9662474, 4837695, -3000845, -5449816, -304604, 4638984, 2879701, -1521397, -1584188, 1116161, 283992, -3446529, -3460273, 1537191, 5651256, 5663522, 5034989, 6480127, 7504367, 5831787, 3274289, 1333769, -1591772, -5291675, -5111195, 1461180, 9371394, 11702573, 8294753, 4631129, 4160836, 5746408, 7338229, 8075640, 7003050, 3170109, -2324455, -6453961, -6905163, -3668012, 1325385, 4938905, 4399209, 83500, -3907438, -3822286, -511309, 1941470, 1197662, -1529850, -4145060, -6025388, -7568002, -9137693, -10871208, -12266740, -11854276, -8725951, -4719828, -3506152, -6483600, -10493060, -10761574, -5939168, 517997, 3933385]
8287C933385j204429l746898l534848k305368j091577P93088L520231N248223
8279A611807M175938J199218q87292n27787J213011K016551L47057l173306n704182
8270B71015m564926o25355K008888R68171j303384j190649J112540K728151K653811
8261B058262K093575J321219k50383j421445l90058J529218J326004l60622K46908
8252F152678L319607M075296K48842l860904m015003k368163k894122m103664
8244c445433j806226K996048M987515K920648J341331K807230L583469j69799
8236A3214783n715703p017849k992643J083495M63708l356645m953356j745814
8228a1020024L084473M598507J846091j520639j956435K13484K125740J984826
$$ y = [3933385, 2728956, -1017942, -4552790, -6858158, -7949735, -7156647, -3636416, 1611807, 5787745, 6986963, 6099671, 5571884, 6784895, 8801446, 9148503, 5975197, 271015, -4293911, -4919266, -2910378, -1942207, -3245591, -4436240, -3323700, -595549, 2058262, 4151837, 5473056, 5222673, 3801228, 3411170, 4940388, 6266392, 5905770, 6152678, 9472285, 13547581, 13796423, 9935519, 5920516, 3552353, 658231, -3445433, -5251659, -2255611, 2731904, 5652552, 6993883, 9801113, 13384582, 13214783, 7499080, 481231, -2511412, -1427917, -964209, -4320854, -9274210, -11020024, -7935551, -3337044, -1490953, -3011592, -4968027, -4754543, -2628803, -643977]
8220f43977L35223j259935j721240j184419q64728j539055j960278q7618L679960
8211e246067O178627N199763J865572j507868l854588m602751l009101p7835J213445
8202c840803k07976j607324o55166R96606J083705Q58810K209472L244892J274715
8193C356931j740860j674795J110369K632813J838856J007330M31793j452517
8185E509920l026945j088916K170906Q96076m358027n793412l64363M881516L678567
8176B505322j86998q2406K853776K889598p47700m056553m956672l916576p73315
8167f471524L349166L973211o56901m265981k77591P320150Q465471J319015n756454
8158F998562o551622l548265r47994J200185L276575L080311R5554k196528j477590
$$ y = [-643977, -308754, -1568689, -3289929, -4474348, -5339076, -6878131, -8838409, -8926027, -5246067, 932560, 6132323, 7997895, 6490027, 2635439, -1967312, -4976413, -5054248, -3840803, -4048779, -5656103, -6311269, -5314663, -4230958, -3372148, -1162676, 2082216, 3356931, 1616071, -58724, 1051645, 3684458, 5523314, 6530644, 6962437, 5509920, 2482975, 1394059, 3564965, 4461041, 103014, -5690398, -6054761, -1173245, 2505322, 2318324, 2235918, 5089694, 7979292, 7231592, 3175039, -1781633, -5698209, -6471524, -3122358, 850853, 193952, -4072029, -4349620, 2970530, 11436001, 12755016, 6998562, 446940, -3101325, -4049319, -2849134, 427441, 3507752, 3603306, 1406778, -70812]
8149g0812J12491M61809R76917K757176L442501J243229j287490q99634J545199
8140H281386K804699J560174j252054m044062m715476k012771J554348J539748
8132C715992j805205k827145R22593M009898J242251l752854l800628P97234L048590
8123A550726N9143l451330l092605m94868R18701J174219J885102K426781J185115
8114B160984j146725k257373j341252M42552J859150K156880N53103k562916m122210
8105d257807q50140N584138Q391121L266597n167123p952500k780944L409844
8097c56814M006176P32687q71357k21138r63002l483479l914166p15179K823144
8088b963128L680729K417875L28152k421773m425512l199635L51061J849682L8090
$$ y = [-70812, 41679, 503488, 1480405, 4237581, 7680082, 8923311, 7635821, 6736187, 8281386, 11086085, 12646259, 11394205, 7350143, 2634667, 621896, 2176244, 3715992, 1910787, -916358, 6235, 4016133, 5258384, 1505530, -2295098, -1497864, 1550726, 1609869, -1841461, -4934066, -5428934, -4510233, -3336014, -1450912, 975869, 2160984, 1014259, -1243114, -2584366, -2141814, -282664, 1874216, 2427319, -135597, -4257807, -5107947, 476191, 8867312, 12133909, 6966786, -985714, -3766658, -356814, 3649362, 4382049, 3510692, 3289554, 2326552, -1156927, -5071093, -5786272, -2963128, 717601, 3135476, 3463628, 1041855, -3383657, -6583292, -6232231, -4382549, -4344459]
8079d344459r30328J458506L402781J109743k453610k247015O32631J283119m11325
8070b499957J64754L904113N523280J208942n571913q203641m444077J848370
8062h070129N060335L028199j102873k109356J418735N221708M645995M15882
8054H508496k924374l072661j695074o88473K29700J690416K715388J666001j636964
8045D792455m998671n095116q84502L882680L865518r44543m347884k156759J902370
8036c984452K023573q91613j316493J748311L599303J803169m75275o07810o92876
8027A205837k752884l927920n03756N442058P468045K711571m344615o903487
8019a605151l373859J261540J673336j278564j984013J823123N237643K739269
$$ y = [-4344459, -5274787, -3816281, -413500, 696243, -1757367, -4004382, -3371751, -2088632, -2499957, -2335203, 1568910, 7092190, 8301132, 2729219, -5474422, -9918499, -8070129, -3009794, 18405, -1084468, -3193824, -1775089, 3446619, 8092614, 8508496, 5584122, 2511461, 816387, 127914, 357614, 2048030, 4763418, 6429419, 4792455, -206216, -5301332, -6185834, -2303154, 1562364, 617821, -3730063, -5886822, -3984452, -1960879, -2852492, -4168985, -2420674, 1178629, 2981798, 2506523, 1898713, 1205837, -1547047, -5474967, -5978723, -536665, 6931380, 9642951, 5298336, -1605151, -4979010, -3717470, -2044134, -3322698, -5306711, -3483588, 1754055, 4493324]
8011D493324l563957o016371j323263N388926P357267L953941j40330j510626
8003H638911j373040k619289n228598n949641k764572J781067L657470K957487
7995i00205L109799M261915K123384m233155q258989m293155L466804O176093
7987A452491K456695j005137j93322J552535N64830j417328r91581J613693L405364
7978G438240K161116j987714o077197n651646N0410M994290L023358k948586m283475
7969c281204O34202M057421J166970k784144j632407K094814K432882k98306j478115
7960I12113l87528P8914k79146P82097K470118J572414j561271k854611r27508
7951a94408P94992m11289k564890k138174J138780M142339L855575L10360l371128
$$ y = [4493324, 929367, -5087004, -6410267, -1021341, 6335926, 10289867, 10149537, 8638911, 7265871, 4646582, -582016, -6531657, -9296229, -7515162, -3857692, -900205, 2209594, 6471509, 8594893, 4361738, -3897251, -8190406, -4723602, 1452491, 3909186, 2904049, 2710727, 4263262, 4828092, 3410764, 2419183, 4032876, 7438240, 9599356, 7611642, 1534445, -4117201, -4066791, 927499, 3950857, 1002271, -3281204, -2647002, 1410419, 2577389, -206755, -1839162, 255652, 2688534, 2390228, 912113, 524585, 603499, 324353, 1106450, 3576568, 5148982, 3587711, 733100, -194408, 600584, 189295, -2375595, -4513769, -3374989, 767350, 4622925, 4933285, 1562157]
7942A562157m019894j842403K19395Q17484J612555L238172K971177p47531m090947
7933b79835k281034K930962M607466j96419o270891o656374q35485N083227N315548
7924A417165L87423l815142k742204J770932M285491K842833N71530R4566J46801
7915D959395o06622m87866J308956J484939k281803n922082m001327J607034L896549
7906d2827R73407j848455p71329J537462J590462M55688N48713J091993J30435
7897C665549j708875k477157j825942k89915K124410M282369L323347j293522
7889E800264n213687m123700J18872J932756k08451k373753j630520J63215L58606
$$ y = [1562157, -2457737, -4300140, -4080745, -3263261, -1650706, 1587466, 4558643, 3811112, -279835, -2560869, 370093, 4977559, 4781140, -1489751, -8146125, -8981610, -3898383, 1417165, 1804588, -2010554, -4752758, -2981826, 1303665, 4146498, 4718028, 4812594, 4959395, 4352773, 3864907, 5173863, 6658802, 4376999, -1545083, -5546410, -3939376, -42827, 930580, -917875, -1689204, -151742, 1438720, 1894408, 2443121, 3535114, 3665549, 1956674, -520483, -2346425, -2636340, -511930, 3770439, 7093786, 5800264, 586577, -3537123, -3418251, -1485495, -1693946, -4067699, -5698219, -5535004, -5176398]
$$ [...]
##END NTUPLES=NMR SPECTRUM
##END=
