##TITLE=31Pdec_SR52+5xTFAA 1n
 CDCl3, 124 sc
 31.05.2021
##JCAMPDX= 6.0         $$ Bruker NMR JCAMP-DX V2.0
##DATA TYPE= NMR SPECTRUM
##DATA CLASS= NTUPLES
##ORIGIN= UXNMR, Bruker Analytische Messtechnik GmbH
##OWNER= root
$$ XWIN-NMR		Version 3.5
$$ Mon May 31 14:00:00 2021 Russian Standard Time (UT+4h)  she@DPX200
##.OBSERVE FREQUENCY= 81.013821
##.OBSERVE NUCLEUS= ^31P
##.ACQUISITION MODE= SIMULTANEOUS
##.ACQUISITION SCHEME= undefined
##.AVERAGES= 124
##.DIGITISER RES= 16
##SPECTROMETER/DATA SYSTEM= spect
##.PULSE SEQUENCE= zgpg30
##.SOLVENT NAME= D2O
##.SHIFT REFERENCE= (INTERNAL, D2O, 0, 248.564)
##AUDIT TRAIL= $$ (NUMBER, WHEN, WHO, WHERE, WHAT)
$$ ##TITLE= Audit trail, XWIN-NMR		Version 3.5
$$ ##JCAMPDX= 5.01
$$ ##ORIGIN= Bruker BioSpin GmbH
$$ ##OWNER= she
$$ F:/spectra/data/she/nmr/P31/1/pdata/1/auditp.txt
$$ ##AUDIT TRAIL=  $$ (NUMBER, WHEN, WHO, WHERE, WHAT)
(   1,<2021-05-31 13:57:55.79 +0400>,<she>,<DPX200>,
      <continue with go, POWCHK disabled, PULCHK disabled
       configuration hash MD5:
       00 E9 B6 7A A2 85 ED C7 34 08 36 98 17 FE 4E 26
       data hash MD5: 32K
       B4 47 30 28 03 20 BE 75 DE 92 77 21 4E DC DD 6E>)
(   2,<2021-05-31 13:57:57.60 +0400>,<she>,<DPX200>,
      <Start of raw data processing
       efp BC_mod = 2 LB = 1 FT_mod = 6 PKNL = 1 PHC0 = -6062.902 PHC1 = 342.8012 SI = 64K 
       data hash MD5: 64K
       5A 98 88 94 A7 09 C8 B3 B2 CB D4 87 A9 A7 3E C2>)
(   3,<2021-05-31 13:58:37.78 +0400>,<she>,<DPX200>,
      <abs ABSG = 5 
       data hash MD5: 64K
       3A 77 16 EF 8E E2 BE C8 44 77 20 5B 73 5E 52 68>)
(   4,<2021-05-31 13:58:59.46 +0400>,<she>,<DPX200>,
      <pk PHC0 = 26.80538 PHC1 = -0.7287999 
       data hash MD5: 64K
       40 74 82 75 51 41 11 1D 27 31 BC 31 DF 04 FB C6>)
(   5,<2021-05-31 13:59:26.45 +0400>,<she>,<DPX200>,
      <pk PHC0 = 156.3489 PHC1 = -196.8 
       data hash MD5: 64K
       CB 21 12 5B 51 22 87 93 4B 2C E9 A2 E7 57 F6 52>)
(   6,<2021-05-31 13:59:29.48 +0400>,<she>,<DPX200>,
      <abs ABSG = 5 
       data hash MD5: 64K
       18 80 9A 02 75 D2 5F A4 ED 86 82 9F E5 E7 9E CE>)
$$ ##END=
$$ 
$$ hash MD5
$$ 02 D2 EE 77 BE CF 57 52 74 9B 2E D4 4D 01 05 BF
##$RELAX= 
##$RELAX= 
##$RELAX= 
##$RELAX= 
##$RELAX= 
##$RELAX= 
##$RELAX= 
##$RELAX= 
$$ Bruker specific parameters
$$ --------------------------
##$DU= <F:/spectra>
##$EXPNO= 1
##$NAME= <P31>
##$PROCNO= 1
##$TYPE= <nmr>
##$USER= <she>
##$AMP= (0..31)
100 100 100 100 100 100 100 100 100 100 100 100 100 100 100 100 100 100 
100 100 100 100 100 100 100 100 100 100 100 100 100 100 
##$AQSEQ= 0
##$AQ_mod= 1
##$AUNM= <au_zg>
##$AUTOPOS= <>
##$BF1= 81.014009
##$BF2= 200.13
##$BF3= 200.13
##$BF4= 200.13
##$BF5= 200.13
##$BF6= 200.13
##$BF7= 200.13
##$BF8= 200.13
##$BYTORDA= 1
##$CFDGTYP= 0
##$CFRGTYP= 5
##$CHEMSTR= <none>
##$CNST= (0..31)
1 1 145 1 1 1 1 1 1 1 1 1 1 1 1 1 1 1 1 1 1 1 1 1 1 1 1 1 1 1 1 1 
##$CPDPRG= <waltz16>
##$CPDPRG1= <>
##$CPDPRG2= <waltz16>
##$CPDPRG3= <>
##$CPDPRG4= <mlev>
##$CPDPRG5= <mlev>
$$ [...]
##$SUBNAM3= <"">
##$SUBNAM4= <"">
##$SUBNAM5= <"">
##$SUBNAM6= <"">
##$SUBNAM7= <"">
##$SUBNAM8= <"">
##$SUBNAM9= <"">
##$SW= 501.771253377433
##$SWIBOX= (0..15)
0 1 3 0 0 0 0 0 0 0 0 0 0 0 0 0 
##$SW_h= 40650.406504065
##$TD= 32768
##$TD0= 1
##$TE= 0
##$TE2= 300
##$TE3= 300
##$TEG= 300
##$TL= (0..7)
0 120 53 12 22 120 120 120 
##$TP= (0..7)
150 150 150 150 150 150 150 150 
##$TP07= 0
##$TPNAME0= <>
##$TPNAME1= <>
##$TPNAME2= <>
##$TPNAME3= <>
##$TPNAME4= <>
##$TPNAME5= <>
##$TPNAME6= <>
##$TPNAME7= <>
##$TPOAL= (0..7)
0.5 0.5 0.5 0.5 0.5 0.5 0.5 0.5 
##$TPOFFS= (0..7)
0 0 0 0 0 0 0 0 
##$TUNHIN= 0
##$TUNHOUT= 0
##$TUNXOUT= 0
##$USERA1= <user>
##$USERA2= <user>
##$USERA3= <user>
##$USERA4= <user>
##$USERA5= <user>
##$V9= 5
##$VALIST= <valist>
##$VCLIST= <CCCCCCCCCCCCCCC>
##$VD= 0
##$VDLIST= <DDDDDDDDDDDDDDD>
##$VPLIST= <PPPPPPPPPPPPPPP>
##$VTLIST= <TTTTTTTTTTTTTTT>
##$WBST= 1024
##$WBSW= 4
##$XGAIN= (0..3)
0 0 0 0 
##$XL= 0
##$YL= 0
##$YMAX_a= 20554
##$YMIN_a= -26437
##$ZGOPTNS= <>
##$ZL1= 120
##$ZL2= 120
##$ZL3= 120
##$ZL4= 120
##$ABSF1= 248.5645
##$ABSF2= -253.2056
##$ABSG= 5
##$ABSL= 3
##$ALPHA= 0
##$AQORDER= 0
##$ASSFAC= 0
##$ASSFACI= 0
##$ASSFACX= 0
##$ASSWID= 0
##$AUNMP= <proc_1d>
##$AZFE= 0.1
##$AZFW= 0.5
##$BCFW= 0
##$BC_mod= 2
##$BYTORDP= 0
##$COROFFS= 0
##$CY= -3
##$DATMOD= 1
##$DC= 0
##$DFILT= <>
##$DTYPP= 0
##$F1P= 0
##$F2P= 0
##$FCOR= 1
##$FTSIZE= 65536
##$FT_mod= 6
##$GAMMA= 0
##$GB= 0
##$INTBC= 1
##$INTSCL= 5.30512e-09
##$ISEN= 30
##$LB= 1
##$LEV0= 0
##$LPBIN= 0
##$MAXI= 10000
##$MC2= 0
##$MEAN= 0
##$ME_mod= 0
##$MI= 50
##$NCOEF= 0
##$NC_proc= -7
##$NLEV= 6
##$NOISF1= 182.463
##$NOISF2= 159.3651
##$NSP= 0
##$NTH_PI= 0
##$NZP= 0
##$OFFSET= 248.5645
##$PC= 4
##$PHC0= -5879.748
##$PHC1= 145.2724
##$PH_mod= 1
##$PKNL= yes
##$PPARMOD= 0
##$PSCAL= 0
##$PSIGN= 0
##$REVERSE= no
##$SF= 81.014009
##$SI= 65536
##$SIGF1= 159.3651
##$SIGF2= -187.1042
##$SINO= 113.3802
##$SIOLD= 16384
##$SREGLST= <1H.CDCl3>
##$SSB= 0
##$STSI= 65536
##$STSR= 0
##$SW_p= 40650.406504065
##$SYMM= 0
##$S_DEV= 0
##$TDeff= 32768
##$TDoff= 0
##$TI= <>
##$TILT= no
##$TM1= 0
##$TM2= 0
##$TOPLEV= 0
##$USERP1= <user>
##$USERP2= <user>
##$USERP3= <user>
##$USERP4= <user>
##$USERP5= <user>
##$WDW= 1
##$XDIM= 65536
##$YMAX_p= 359431963
##$YMIN_p= -83550765
$$ End of Bruker specific parameters
$$ ---------------------------------
##NTUPLES= NMR SPECTRUM
##VAR_NAME=  FREQUENCY,     SPECTRUM/REAL,   SPECTRUM/IMAG
##SYMBOL=    X,             R,               I
##VAR_TYPE=  INDEPENDENT,   DEPENDENT,       DEPENDENT
##VAR_FORM=  AFFN,          ASDF,            ASDF
##VAR_DIM=   65536,         65536,           65536
##UNITS=     HZ,            ARBITRARY UNITS, ARBITRARY UNITS
##FACTOR=    0.620285442955139, 1,           1
##FIRST=     20137.2065510759, 0,            0
##LAST=      -20513.1999529892, 0,           0
##MIN=       -20513.1999529892, -83550765,   0
##MAX=       20137.2065510759, 359431963,    0
$$ Real data points
##PAGE= N=1
##DATA TABLE= (X++(R..R)), XYDATA
$$ [...]
40365G433704q087897j478424J62142m371103n917812j607432K339431L622310
$$ 7433704 -654193 -2132617 -1970475 -6341578 -12259390 -13866822 -11527391 -7905081
40357g905081O028365Q297733M116880n016896r155744m825752N6722j240426
$$ -7905081 -1876716 6421017 10537897 5521001 -3634743 -8460495 -8403773 -9644199
40349i644199o188681r177901p069056J307256J1749280J2805828m77930j3175351
$$ -9644199 -15832880 -25010781 -32079837 -30772581 -19023301 -6217473 -6695403 -19870754
40341a9870754o480813J3404615K0869273P846169n436918l319870L271487j91479
$$ -19870754 -26351567 -12946952 7922321 15768490 10331572 7011702 10283189 10091710
40333A0091710o913053m215000J980290j482849r994030q688458J454460N659646
$$ 10091710 3178657 -1036343 943947 -538902 -10532932 -19221390 -17766930 -12107284
40325a2107284P78857r08779O020678J1818766R157398L961609K964743K435662
$$ -12107284 -11328427 -12237206 -6216528 5602238 14759636 18721245 21685988 24121650
40317B4121650l564380j1866145j4262501q694137j111519K357388K169251L590780
$$ 24121650 20557270 8691125 -5571376 -14265513 -15377032 -13019644 -10850393 -7259613
40309g259613P934519P892619l023659j6950159j6950527L63515J7351425J7462899
$$ -7259613 674906 8567525 5543866 -11406293 -28356820 -27993305 -10641880 6821019
40301F821019N555421k961625m203250n012992p232633o713815m025465k827246
$$ 6821019 12376440 9414815 5211565 198573 -7034060 -13747875 -17773340 -20600586
40293b0600586l87714P293778J3482262P843607n382808j0569626k914126N930092
$$ -20600586 -20988300 -13694522 -212260 7631347 2248539 -8321087 -11235213 -5305121
40285e305121O120258O32545m309820p142172o154524Q96581Q448702O281773
$$ -5305121 815137 1447682 -2862138 -10004310 -16158834 -15262253 -6813551 -531778
40277e31778m429878r767759l042242N242032L791492l819760p446626m817060
$$ -531778 -4961656 -14729415 -17771657 -12529625 -8738133 -12557893 -20004519 -24821579
40269b4821579M29952O640886J1462229Q885710j560533q852802l692562O854468
$$ -24821579 -24391627 -17750741 -6288512 2597198 1036665 -7816137 -11508699 -4654231
40261d654231Q238526p47246o628326q64155Q908296J0385221K211664o819245
$$ -4654231 3584295 2837049 -3791277 -4655432 4252864 14638085 16849749 10030504
40253A0030504j0031429q545350n648504j493230L714954N770712J707281k995755
$$ 10030504 -925 -8546275 -14194779 -15688009 -11973055 -6202343 -4495062 -7490817
40245g490817k49664P232332P794513q60043o198514l89518O192271J922348o249031
$$ -7490817 -7740481 -508149 7286364 6426321 227807 -161711 6030560 7952908 1703877
40236A703877n025349J647125J03062o821167k843649J2335338J9059426Q296517
$$ 1703877 -3321472 -1674347 -1571285 -8392452 -11236101 1099237 20158663 28455180
40228B8455180m759579o117845k568268m542798p244894l257613R04071k989934
$$ 28455180 23695601 17577756 15009488 10466690 3221796 -35817 868254 -2121680
40220b121680p762997k510396P612364R659514L792481k69402j713502o628137
$$ -2121680 -9884677 -12395073 -4782709 4876805 8669286 8399884 6686382 58245
40212E8245j1466468o142704O811505J2503468N379577l082297j875250N665660
$$ 58245 -11408223 -17550927 -10739422 1764046 7143623 4061326 2186076 7851736
40204G851736R470480N488360k472260p276532l768101M769184P093583j982137
$$ 7851736 17322216 22810576 20338316 13061784 9293683 14062867 21156450 19174313
40196A9174313j1495983q214966K762156M538111n610746j2450139p520427j148402
$$ 19174313 7678330 -536636 2225520 6763631 1152885 -11297254 -18817681 -19966083
40188a9966083k678201m136548M672383J6636713J7376724P546309K50769l0488
$$ -19966083 -22644284 -26780832 -22108449 -5471736 11904988 19451297 19702066 19671578
40180A9671578j015610n689419o789480j706095P30867m443797p480518J307037
$$ 19671578 18655968 12966549 6177069 4470974 5201841 758044 -6722474 -5415437
40172e415437J3878539J4212175J856966p650619n793446r54892j712531l384166
$$ -5415437 8463102 22675277 24532243 16881624 11088178 10133286 8420755 5036589
40164E036589R15321O620789N924797J893546K300110M728142R36037o985182
$$ 5036589 5951910 12572699 18497496 20391042 22691152 27419294 28355331 21370149
40156B1370149q598100k523939J824739O78825N8245J296399k501622j0613951
$$ 21370149 12772049 10248110 12072849 12751674 12809919 14106318 11604696 990745
40148I90745j0519974K247882J3676154J0885689L25652m821332m310797m883944
$$ 990745 -9529229 -7281347 6394807 17280496 17606148 12784816 8474019 3590075
40140C590075m521764J800720P367905J359872j1715447j5814397o167441N644564
$$ 3590075 -931689 869031 8236936 9596808 -2118639 -17933036 -24100477 -18455913
40132a8455913J0201124J0626019J1837244J1302125N583519k017651n239321
$$ -18455913 -8254789 2371230 14208474 25510599 31094118 29076467 23837146
40125B3837146j863880M905696Q517619L352514q671737j7781206j7336632j1573405
$$ 23837146 21973266 26878962 35396581 38749095 30077358 12296152 -5040480 -16613885
40117a6613885o901912j345247Q755471J7399769J5902066P184545O23050l810296
$$ -16613885 -23515797 -24861044 -16105573 1294196 17196262 24380807 25003857 21193561
40109B1193561j1794531j7728973r485556Q274504J4281567O03917j4449407j2745543
$$ 21193561 9399030 -8329943 -17815499 -9540995 4740572 5344489 -9104918 -21850461
40101b1850461o28433N230140L360456L602001O447665L504078m368610n628543
$$ -21850461 -22478894 -17248754 -13888298 -10286297 -3838632 -334554 -4703164 -10331707
40093a0331707K999507R237905K766563q909181j0146731J305959J1122847Q053960
$$ -10331707 -7332200 1905705 4672268 -4236913 -14383644 -13077685 -1954838 6099122
40085F099122o27739j17558R037618J0212938l948577j7432448j2549157L137120
$$ 6099122 5471383 5353825 14391443 24604381 20655804 3223356 -9325801 -6188681
40077f188681P252775l843151j0726229k580688O205053O77008r927572p334030
$$ -6188681 1064094 -2779057 -13505286 -16085974 -9880921 -9203913 -19131485 -26465515
40069b6465515O475574J2803137M864584m180653k936901L256687M308975R63005
$$ -26465515 -19989941 -7186804 -2322220 -6502873 -9439774 -6183087 -1874112 -911107
40061i11107J16651J514019r82426o554979n445286O438745J7431616J2342161
$$ -911107 -794456 719563 -262863 -6817842 -12263128 -5824383 11607233 23949394
40053B3949394o622289j9646667j3044784M125584J2938851P837002j258726n336785
$$ 23949394 17327105 -2319562 -15364346 -11238762 1700089 9537091 8278365 2941580
40045B941580m167289K06503O303674Q829169K544873p235209q573676k11571
$$ 2941580 -1225709 -1019206 5284468 14113637 16658510 9423301 849625 638054
40037F38054N933731L219346q05783L76925R66340m115039o761523J195777J1301190
$$ 638054 6571785 9791131 8985348 9362273 10328613 6213574 -547949 647828 11949018
40028A1949018R218874l140005j0431619o196745J125506L848241L929897M873742
$$ 11949018 21167892 18027887 7596268 1399523 2525029 6373270 10303167 15176909
40020A5176909N958243O850814Q197540N605424o595577k2177555k4391697p206242
$$ 15176909 21135152 27985966 36183506 41788930 35193353 13015798 -11375899 -18582141
40012a8582141J3273073J7076340M508704o938937o428801l11407J595146k3520
$$ -18582141 -5309068 11767272 16275976 9337039 2908238 2596831 4191977 4168457
40004D168457O64439K479211k34858n143619k685025P765984J2673418L097672
$$ 4168457 4832896 7312107 7077249 1933630 -751395 7014589 19688007 22785679
39996B2785679r355636p356296N812859R883793j879822j2262385o562237N687916
$$ 22785679 13430043 6073747 11886606 21770399 19890577 7628192 1065955 6753871
39988F753871O970068j817625n806692N747O629747P689484N768157K670653l405236
$$ 6753871 13723939 11906314 6099622 6105369 12735116 20424600 26192757 28863410 25458174
39979B5458174r598890r133880k814844O04749j918159l659762m84896K917846
$$ 25458174 15859284 6725404 3910560 4515309 2597150 -1062612 -1547508 1370338
39971A370338K877457K764928M364928K960133k988380o447791l102853O83257
$$ 1370338 4247795 7012723 11377651 14337784 11349404 4901613 1798760 2482017
39963B482017p39979j593211M480056J0506344N943863m656270p168863l26424
$$ 2482017 1742038 148827 4628883 15135227 21079090 16422820 9253957 8927533
39955H927533K385551n084829j2092744r336912k481939L84622K667471R406597
$$ 8927533 11313084 6228255 -5864489 -15201401 -17683340 -17298718 -14631247 -5224650
39947e224650J3625805O923736k984879j892984O573738M491975j0682633j9046020
$$ -5224650 8401155 15324891 12340012 10447028 17020766 21512741 10830108 -8215912
39939h215912q501281N662505M767280m138055j442864J1772956J5040664J295238
$$ -8215912 -16717193 -11054688 -6287408 -10425463 -11868327 -95371 14945293 16240531
39931A6240531j2247178j0245395R81137P118114N172219J88621n739518j0993346
$$ 16240531 3993353 -6252042 -5270905 1847209 7019428 7208049 1468531 -9524815
39923i524815r800381m66615Q158438P806916K760072J720593L354986K27042
$$ -9524815 -19325196 -19791811 -11633373 -3826457 -1066385 654208 4009194 4236236
39915D236236o731702q546975j943458O309758Q950473N255032j185468n979188
$$ 4236236 -2495466 -11042441 -12985899 -6676141 2274332 7529364 6343896 364708
39907C64708n904422j835337K006171M681706R523404J4528264R955298o248777
$$ 364708 -5539714 -7375051 -5368880 -687174 8836230 23364494 33319792 27071015
39899B7071015j8762429j2913336L153069Q531915j147382r819991o323144K035188
$$ 27071015 8308586 -4604750 -1451681 7080234 5932852 -3887139 -10210283 -8175095
39891h175095M555237J668555j004374j354796J780921R026336J3394156M467298
$$ -8175095 -3619858 -1951303 -2955677 -4310473 -2529552 6496784 19890940 24358238
39883B4358238j4144968k3374160j2853944M416606J0807690O676215K908777
$$ 24358238 10213270 -13160890 -26014834 -21598228 -10790538 -4114323 -1205546
39876a205546J132126l488868o417060J737146J5973065J8788448M963575r131499
$$ -1205546 -73420 -3562288 -9979348 -8242202 7730863 26519311 31482886 22351387
39868B2351387p521973M284731Q525440q12550j2141053j2544101k564800O728875
$$ 22351387 14829414 19114145 27639585 26827035 14685982 2141881 -422919 6305956
39860F305956P091939N33181n352897o410041m594456l089012j865935R79563
$$ 6305956 13397895 13931076 8578179 2168138 -2426318 -5515330 -7381265 -6401702
39852f401702N603882R562695R760705N163553j289950m541317l382048k635632
$$ -6401702 -797820 8764875 18525580 23689133 22399183 17857866 14475818 11840186
39844A1840186n573793o938385m40380Q600453Q219901j443396o290642p0204
$$ 11840186 6266393 -671992 -1112372 7488081 15707982 14264586 7973944 7903740
39836G903740M510678m014049j5733955j3324472J395281J1185365J0092587Q792518
$$ 7903740 12414418 8400369 -7333586 -20658058 -19262777 -8077412 2015175 10807693
39828A0807693J2453086J1250230q03381j2805114j2354032k784316M821675P281194
$$ 10807693 23260779 34511009 33707628 20902514 8548482 5764166 10585841 17867035
39820A7867035O489652M6764j2002856j7559867n290350J5009087K0619787O212515
$$ 17867035 24356687 24403451 12400595 -5159272 -10449622 4559465 25179252 31391767
39812C1391767q900927q404683O64421L620104Q62313J590491M127991o72275
$$ 31391767 22490840 14086157 14750578 18370682 19232995 20823486 24951477 24279202
39804B4279202r919690j0116727Q1333N118427l149024j1416067n886100N092831
$$ 24279202 14359512 4242785 4324118 9442545 6293521 -5122546 -11008646 -5915815
39796e915815M169083p131950j1091026j977846O301909L721734j254489J612382
$$ -5915815 -1746732 -8878682 -19969708 -21947554 -15645645 -11923911 -13178400 -11566018
39788a1566018O620838K797416o573234q170275J346238J1160949J1708669N161940
$$ -11566018 -4945180 -2147764 -8720998 -16891273 -15545035 -4384086 7324583 12486523
39780A2486523m33507p38441K462117L978765K07572n618154n582338J573075
$$ 12486523 12053016 11314575 13776692 17755457 17963029 12344875 6762537 8335612
39772H335612N620986j761689j2718510j2017419J379873J2339915J0253588R75936
$$ 8335612 13956598 12194909 -523601 -12541020 -11161147 1178768 11432356 12408292
39764A2408292n187732o927715p494562n945898j004702K636465M29537l628959
$$ 12408292 7220560 292845 -7201717 -13147615 -14152317 -11515852 -11086315 -14715274
39756a4715274k558877K751585N913871N683337N978189O635604L033029m325288
$$ -14715274 -17274151 -14522566 -8608695 -2925358 3052831 9688435 12721464 8396176
39748H396176q275454n643040k119013k685914l570062Q70791P895108R534792
$$ 8396176 120722 -5522318 -7641331 -10327245 -13897307 -13026516 -5131408 4403384
39740D403384L940230k537216m388894k817809j590104j552197j459484r36112
$$ 4403384 8343614 5806398 1417504 -1400305 -2990409 -4542606 -6002090 -6938202
39732f938202N3981K242263M753506M122820n27168l243989K047109J0552792
$$ -6938202 -6884221 -4641958 111548 4234368 3707200 463211 2510320 13063112
39724A3063112R594083l920676j6015667j2815734j35728M413174k816855o363757
$$ 13063112 22657195 18736519 2720852 -10094882 -10230610 -5817436 -8634291 -14998048
39716a4998048M164700J7275251J6110864K657735o962584o220110l040492k199236
$$ -14998048 -10833348 6441903 22552767 25210502 18247918 12027808 8987316 6788080
39708F788080J678278R552438J1013131R45389q249230l379763Q303972Q948237
$$ 6788080 8466358 18018796 29031927 29977316 21728086 18348323 26652295 35600532
39700C5600532k731149r950135m233970K834179R3145n581868k909886L754079
$$ 35600532 32869383 22919248 18685278 21519457 21612602 16030734 13120848 16874927
39692A6874927K526297m276473l115457O971008J0357114n86766j1766714p985106
$$ 16874927 19401224 15124751 12009294 18980302 29337416 28750650 16983936 8998830
39684H998830L734860M691874p308253j4706143n427039J0871182J6319055O564578
$$ 8998830 12733690 17425564 10117311 -4588832 -10015871 855311 17174366 23738944
39676B3738944o703088j0691871m048477M100961M821841j146364n194171k725897
$$ 23738944 17035856 6343985 2295508 6396469 11218310 10071946 4877775 2151878
39668B151878N87975j452971m261723O30072R952957J1493433L312877k631083
$$ 2151878 2739853 1286882 -2974841 -2344769 7608188 19101621 22414498 19783415
39660A9783415j83973J327090m833979q645093j36416J0918872Q970902j403095
$$ 19783415 19599442 20926532 16092553 7447460 7311044 18229916 27200818 25797723
39652B5797723l118207L899053K953766q509892j1823785J291756J2229568M500784
$$ 25797723 22679516 26578569 29532335 21022443 9198658 10490414 22719982 27220766
39644B7220766r396814q594904K696112M298152n528852q358319L046224J3747064
$$ 27220766 17823952 9229048 11925160 16223312 10694460 2336141 5382365 19129429
39636A9129429J1281666K665686r21154j491656o255097j2675185j2009992k330468
$$ 19129429 30411095 33076781 32155627 30663971 24408874 11733689 -276303 -2606771
39628b606771R489116J5174305J0428557k054077j1822514r261496J680594O542988
$$ -2606771 6882345 22056650 32485207 30431130 18608616 9347120 11027714 17570702
39620A7570702j62818p296503m718780R71597j971044j0319711r933411K336032
$$ 17570702 17407884 10111381 5392601 6364198 4393154 -5926557 -15859968 -13523936
39612a3523936J2756759Q924544m501938j2124631n556979Q147117J4384041O339502
$$ -13523936 -767177 8157367 3655429 -8469202 -14026181 -5879064 8504977 14844479
39604A4844479p718181j3848148q189769R38937O072621Q048182Q378237L915233
$$ 14844479 7126298 -6721850 -14911619 -13972682 -7900061 148121 8526358 12441591
39596A2441591m570810p323575J518270J2373781J1784536Q16798q305681r612988
$$ 12441591 7870781 547206 2065476 14439257 26223793 27040591 18734910 9121922
39588I121922o454377j301576M772662N301641m491367j4556454r392559P595120
$$ 9121922 2667545 1365969 6138631 11440272 6948905 -7607549 -17000108 -9404988
39580i404988J4917842L011494j1706115j0464151L508391J3920573J3623759
$$ -9404988 5512854 8524348 -3181767 -13645918 -10137527 3783046 17406805
39573A7406805P028851j121590q236946j0807914q329629n878001n822296l033488
$$ 17406805 24435656 23314066 15077120 4269206 -4060423 -9938424 -15760720 -18794208
39565a8794208M868576J0365527P645955L104923L897510M266246l628607j2061750
$$ -18794208 -13925632 -3560105 4085850 7190773 11088283 15354529 11725922 -335828
39557c35828o928191Q365142J4711456M173535r662269j1792606l719116L822671
$$ -335828 -7264019 1101123 15812579 19986114 10323845 -1468761 -5187877 -1365206
39549a365206N781537M228214J911488k402j478071l312733m347593l73764Q776751
$$ -1365206 4416331 8644545 10556033 10553631 9075560 5762827 1415234 1041470 9818221
39540I818221J3819758O187753q084390j4574932r904934l981073k642194p52676
$$ 9818221 23637979 29825732 21741342 7166410 -2738524 -6719597 -9361791 -10114467
39532a0114467M718492P703350M569177J351247L034448N457896M256532K397703
$$ -10114467 -5395975 2307375 6876552 8227799 11262247 16720143 20976675 23374378
39524B3374378K317199J25868n236675o759034j355111K436348k021333p430734
$$ 23374378 25691577 25817445 20580770 13821736 12466625 14902973 12881640 5450906
39516E450906m676139J478477J079367l386986j551099O659969J0467967M370658
$$ 5450906 774767 2253244 3332611 -54375 -1605474 5054495 15522462 19893120
39508A9893120n977510j2823418j2304017l732219Q412757J4741210J1350974
$$ 19893120 13915610 1092192 -11211825 -14944044 -6531287 8209923 19560897
39501A9560897N490387K778212l183946j6427405k3139254q776759J4851921K1047625
$$ 19560897 25051284 27829496 24645550 8218145 -14921109 -23697868 -8845947 12201678
39493A2201678O164774n855741j14507J0338551R815884K960556L27175p80645
$$ 12201678 18366452 12510711 12396204 22734755 32550639 35511195 35838370 35057725
39485C5057725o072157r289935l472002L875583K476872l014919k210741K567798
$$ 35057725 28985568 19695633 16223631 20099214 22576086 19561167 17350426 19918224
39477A9918224K826381J123445M488160P096718j074871j2223864q741727O707166
$$ 19918224 22744605 23868050 28356210 35452928 34378057 22154193 13412466 20119632
39469B0119632J1375412k581170j5136697j0150092J15601k395815j0653657m989706
$$ 20119632 31495044 28913874 13777177 3627085 3742686 1346871 -9306786 -14296492
39461a4296492J2422448J8278722L303111j3292936j0917458N742280J6752407
$$ -14296492 -1874044 16404678 19707789 6414853 -4502605 1239675 17992082
39454A7992082J3501092M032859k659471n971849p845152p332285l956634m35205
$$ 17992082 31493174 35526033 32866562 26894713 19049561 11717276 7760642 7325437
39446G325437R96199R45559k24635l177814n210826r44786Q349326J1883485K748040
$$ 7325437 8321636 9267195 9042560 5864746 653920 -290866 8058460 19941945 22689985
39437B2689985r837206j0534782J111709R232979K946303r794138j4144298p116234
$$ 22689985 12852779 2317997 3429706 12662685 15608988 5814850 -8329448 -15445682
39429a5445682J949291N264518L964854K821574L424575L977663K827018K96877
$$ -15445682 -13496391 -8231873 -4267019 -1445445 1979130 5956793 8783811 9080688
39421I080688k439867m959077o716910n212267J518341R395071J0288681L256059
$$ 9080688 6640821 1681744 -5035166 -10247433 -8729092 665979 10954660 14210719
39413A4210719j697666K698366R078876O202793l253014p542328n277175n557639
$$ 14210719 12513053 15211419 24290295 30493088 27240074 19697746 14420571 8862932
39405H862932r434958p750631j4818K080176m023595m568439P026677J6373905
$$ 8862932 -572026 -8322657 -8337475 -6257299 -10280894 -14849333 -7822656 8551249
39397H551249J0175076l258502r693487j0533967j2303403q784247O138810J9208210
$$ 8551249 18726325 15467823 5774336 -4759631 -17063034 -25847281 -19708471 -500261
39389e00261J4009638j391825o071274N94199J877687m302368l365272N880979
$$ -500261 13509377 12117552 6046278 6640477 8518164 4215796 850524 6731503
39381F731503P045596l341785q113415l13547M354034k737696o352938M176047
$$ 6731503 13777099 10435314 2321899 2008352 6362386 3624690 -2728248 1447799
39373A447799J3219972N384102o128860j058845J2924522J2210230m763045j6711142
$$ 1447799 14667771 20051873 13923013 12864168 25788690 37998920 33235875 16524733
39365A6524733j3129951n367688l320054j917732M202911R091679N898030k014808
$$ 16524733 3394782 -1972906 -5292960 -7210692 -3007781 6083898 11981928 9967120
39357I967120o700549n270267J6630N446721O926193K270207n318476r174668
$$ 9967120 3266571 -2003696 -1987066 3459655 10385848 12656055 7337579 -1837089
39349a837089n540612L378453J1220011J1282582K356127p665803r363774m716370
$$ -1837089 -7377701 -3999248 7220763 18503345 20859472 13193669 3829895 -886475
39341h86475m692686j1094975j1565848P73132J4218115J5473916R464420Q691302
$$ -886475 -5579161 -16674136 -28239984 -27466852 -13248737 2225179 11689599 20380901
39333B0380901J1160947N344918p355256j2477557m812896M451233N182585R9187
$$ 20380901 31541848 36886766 29531510 17053953 12241057 16692290 21874875 21974062
39325B1974062l799272m614400l131183J34735L061350L903251M702947N780916
$$ 21974062 18174790 13560390 10429207 10563942 13625292 17528543 22231490 28012406
39317B8012406Q64337j1711094j8204505n737062J3437704J3839539n231421j5748335
$$ 28012406 28876743 17165649 -1038856 -6775918 6661786 20501325 15269904 -478431
39309d78431k726391J2670448O828593r196481q461033Q537588J5420166J534171
$$ -478431 -3204822 9465626 16294219 7097738 -1363295 7174293 22594459 24128630
39301B4128630j3309186j0707577Q01332K778893n781021j1755812r332648m101773
$$ 24128630 10819444 111867 913199 3692092 -2088929 -13844741 -23177389 -27279162
39293b7279162J31002N435723J0709978R953211K624314l160176k113972P96341
$$ -27279162 -27148160 -21712437 -11002459 -1049248 1575066 -1585110 -3699082 -2902741
39285b902741m31513k819699m24768N018538P678058P824828R149959Q960396
$$ -2902741 -3334254 -6153953 -6578721 -1560183 6117875 13942703 23092662 32053058
39277C2053058K197476o052173m976171L692499N707067l335000j0258608o025719
$$ 32053058 34250534 28198361 23222190 26914689 32621756 29286756 19028148 13002429
39269A3002429p7838j996841l577716N035294J3727411P093379p377112q741838
$$ 13002429 12924591 10927750 7350034 12385328 26112739 33206118 25829006 17087168
39261A7087168K846714N467430q123773j7837301q937487M626443M028931m768205
$$ 17087168 19933882 25401312 17277539 -559762 -9497249 -4870806 -841875 -5610080
39253e610080l494957P815696J2590742M895090l929753n499919m565157n443491
$$ -5610080 -9105037 -1289341 11301401 16196491 12266738 6766819 2201662 -3241829
39245c241829k728028O909843J4083063Q136445n876082j2011587m471818N555540
$$ -3241829 -5969857 939986 15023049 23159494 17283412 5271825 800007 6355547
39237F355547O699667K544467L275042Q150960O635863m079276j3429568j2140953
$$ 6355547 13055214 15599681 18874723 27025683 33661546 29582270 16152702 4011749
39229D011749l272535N467023J1177281J2168515N132357n989384q437310J397704
$$ 4011749 739214 6206237 17383518 29552033 34684390 28695006 20257696 21655400
39221B1655400Q331529J59541j0794405n836007Q294060Q719089n449126j0499895
$$ 21655400 29986929 30146470 19352065 13516058 21810118 30529207 25080081 14580186
39213A4580186K593411J2969252M645961q028976o164652L112749K588986m538366
$$ 14580186 17173597 30142849 34788810 26759834 20595182 23707931 26296917 21758551
39205B1758551l607444K958500J033351p138435n750806M580501N051079q604733
$$ 21758551 18151107 21109607 22142958 15004523 9253717 13834218 18885297 10280564
39197A0280564j5733701l312219J2105965J0223192j518118j544131J0768232
$$ 10280564 -5453137 -8765356 3340609 13563801 12045683 10501552 21269784
39190B1269784J5132170L126654r668628q959204j954988k386977p782661n333176
$$ 21269784 36401954 39528608 29859980 20900776 18945788 16558811 8776150 3442974
39182C442974N867236J2853169Q378032j34647l746724l147696k002941Q53953
$$ 3442974 9310210 22163379 30541411 30406764 26660040 23512344 21509403 22363356
39174B2363356N363492M523269n904323j7191697j6873710n274942O061682J0063987
$$ 22363356 27726848 32250117 26345794 9154097 -7719613 -12994555 -6932873 3131114
39166C131114R014752N432801j490513r308638j1513224o213627R92772M736718
$$ 3131114 12145866 17578667 16088154 6779516 -4733708 -10947335 -9954563 -5217845
39158e217845M781544K659774k98259j155158J871033M482120Q45378o706880
$$ -5217845 -436301 2223473 1925214 770056 2641089 7123209 7968587 1261707
39150A261707r551729m775766J616930L867208K260355j05190k91418L231053
$$ 1261707 -8290022 -13065788 -11448858 -7581650 -5321295 -5426485 -5717903 -2486850
39142b486850O546227J935100r007085j1540941J140445J2123890L747060j1711383
$$ -2486850 4059377 5994477 -3012608 -14553549 -13413104 -1289214 2457846 -9253537
39134i253537q204706J1510968J8591328N048642m566016K590635N810546r065461
$$ -9253537 -17458243 -5947275 12644053 17692695 13126679 15717314 21527860 12462399
39126A2462399k0139335o310890J3578102J0603662o155917p241942O194792P825569
$$ 12462399 -7676936 -13987826 -409724 10193938 4038021 -3203921 2990871 10816440
39118A0816440m929112p564137N346759R639964m628842j4485461l634223R860834
$$ 10816440 5887328 -1676809 3669950 13309914 8681072 -5804389 -9438612 422222
39110D22222M600125r975491j2029227j663868N216115M542705M336458N519798
$$ 422222 5022347 -4953144 -16982371 -18646239 -13430124 -8887419 -4550961 968837
39102I68837K122180l558255l023481K862203M661675K74724k367995P40667L850907
$$ 968837 3091017 -467238 -3490719 -628516 4033159 4307883 1939888 2680555 6531462
39093F531462J675614l279462o419737p283176o890134m215525P88017M060493
$$ 6531462 8207076 4927614 -1492123 -8775299 -15665433 -19880958 -19092941 -15032448
39085a5032448J746692l420981m292911J039295N697277L693846j16823L465673
$$ -15032448 -13285756 -16706737 -20999648 -19960353 -14263076 -10569230 -10686053 -7220380
39077g220380J2509274J4401642M626951n317725n570782l095690q023497j3548958
$$ -7220380 5288894 19690536 24317487 18999762 13428980 10333290 2309793 -11239165
39069a1239165n354361J2840534K0803875J0307769m045930p133801k001147P16563
$$ -11239165 -16593526 -3752992 17050883 27358652 23312722 16178921 14177774 14894337
39061A4894337m88336r77717k84444j39288R84153L183135J189210o766365j1803575
$$ 14894337 14406001 13428284 13143840 13004552 13988705 17171840 18361050 11594685 -208890
39052b08890n137755P761429J2796753N533292m077438n370008J210369P442819
$$ -208890 -5346645 2414784 15211537 20744829 16667391 11297383 12507752 19950571
39044A9950571P723574L476659p64004k976220m321917n228158l943242o60214
$$ 19950571 27674145 31150804 30386800 27410580 23088663 17860505 13917263 13257049
39036A3257049M69181k769311o001727m729675k216303l905557o765507l463655
$$ 13257049 13726230 10956919 4955192 225517 -1990786 -5896343 -12661850 -16125505
39028a6125505L859347M789279k647539p083691J30606J2750897J8437623J2671316
$$ -16125505 -12266158 -7476879 -10124418 -17208109 -17077503 -4326606 14111017 26782333
39020B6782333j21655j2340466j6549068j0432286j831437j084537n796726l331701
$$ 26782333 26660678 14320212 -2228856 -12661142 -14492579 -15577116 -21373842 -24705543
39012b4705543Q059566J3575266M507992o852031o084248J621572K824026j148151
$$ -24705543 -16645977 -3070711 1437281 -5414750 -11498998 -9877426 -7053400 -8201551
39004h201551J93643M737872J195500q114547p963653M193483J2217389O463359
$$ -8201551 -8007908 -3270036 -2074536 -10189083 -18152736 -13959253 -1741864 4721495
38996D721495k327148k743589m45430m253709p712663j7758J2912935J4960025
$$ 4721495 2394347 -349242 -794672 -5048381 -12761044 -12778802 134133 15094158
38988A5094158M300077m212533j880341K772970R4808n378924l603046M221199
$$ 15094158 19394235 15181702 13301361 16074331 16169139 10790215 7187169 11408368
38980A1408368O663430k000012j3621089j5371728m316124Q872708J1274311K638466
$$ 11408368 18071798 16071786 2450697 -12921031 -17237155 -8364447 2909864 5548330
38972E548330l843971J645844J1614465J0800308j986159j1214208o341058L772372
$$ 5548330 1704359 3350203 14964668 25764976 23778817 12564609 6223551 9995923
38964I995923M770172k973325p540378l815028K006063M198024L397837N68792
$$ 9995923 14766095 11792770 4252392 437364 2443427 6641451 10039288 10608080
38956A0608080n092309j0123202p377667L601577J3296307J3139471N093067k408089
$$ 10608080 5515771 -4607431 -11985098 -8383521 4912786 18052257 23145324 20737235
38948B0737235m008467r54435J456715r21335n628198n052719K598271P928585
$$ 20737235 16728768 15774333 17231048 16309713 10681515 5628796 8227067 16155652
38940A6155652L264576l865275j261284P671504Q670446K19838m655363j681940
$$ 16155652 19420228 15554953 14293669 21965173 30635619 30855457 26200094 24518154
38932B4518154j312067o372851m432011P679886J2325153r86214j4378903p263862
$$ 24518154 23206087 16833236 12401225 20081111 32406264 31420050 17041147 9777285
38924I777285J1464357J7787667P753610l472256q766657j2343156j2173967k926943
$$ 9777285 21241642 39029309 46782919 43310663 34544006 22200850 10026883 7099940
38916G099940O528543J956700j0481270j0121398N328374J5605374J0053223J305310
$$ 7099940 13628483 15585183 5103913 -5017485 310889 15916263 25969486 27274796
38908B7274796M44954K83901o554766j1663288n473760O000337J0629044O202494
$$ 27274796 27719750 28003651 21448885 9785597 4311837 10312174 20941218 27143712
38900B7143712j505246p335905p358191q08157M222266j648368j2445289j1439084
$$ 27143712 25638466 18302561 10944370 10136213 14358479 12710111 264822 -11174262
38892a1174262L436189J4410675J0257296J102618j816446l940238j2334699j8112732
$$ -11174262 -7738073 6672602 16929898 18032516 16216070 12275832 -58867 -18171599
38884a8171599r827139O002881J3158289P624279j561072p091974p529746k600130
$$ -18171599 -27998738 -21995857 -8837568 -1213289 -2774361 -9866335 -17396081 -19996211
38876a9996211M835319P238435K050626k554917N37226O697560Q487347P058960
$$ -19996211 -15160892 -7922457 -5871831 -8426748 -7889522 -1191962 7295385 14354345
38868A4354345N814959J758238o131207q582481J250450J3545537J3458395K099279
$$ 14354345 20169304 21927542 15796335 7213854 8464304 22009841 35468236 37567515
38860C7567515o807196p171199m621572l137109p05584J961457J01489o036896
$$ 37567515 30760319 23589120 18967548 15830439 15124855 17086312 17187801 11150905
38852A1150905r826578p834665l912984k392932k745529k251623p0323K281159
$$ 11150905 1324327 -6510338 -10423322 -12816254 -15561783 -17813406 -17883729 -15602570
38844a5602570K707617J159345N18843K588272M321148K507916L03846K061889
$$ -15602570 -12894953 -11735608 -11216765 -8628493 -4307345 -1799429 -1495583 566306
38836E66306L818448r28304p163072l258811Q792020J2831490K321449j0015389
$$ 566306 4384754 3456450 -3706622 -6965433 1826587 14658077 16979526 6964137
38828F964137j1860975n804524J915288J0874854J6832401J0308397m610878q099145
$$ 6964137 -4896838 -10701362 -8786074 2088780 18921181 29229578 24618700 16519555
38820A6519555N657820J5072064L942720j1049955o998314P507673P643358n735489
$$ 16519555 22177375 37249439 41192159 30142204 23143890 30651563 38294921 32559432
38812C2559432q496873O166887J7271902R046943q298964j6760637j2472299l342207
$$ 32559432 24062559 30229446 47501348 56548291 48249327 31488690 19016391 15674184
38804A5674184L155382N044312N724771R111033J0918198J768759j4827484k0003990
$$ 15674184 18829566 23873878 29598649 38709682 49627880 51396639 36569155 16565165
38796A6565165o468040O382861P70113j0594211n787995Q999810J0397788k315697
$$ 16565165 10097125 16479986 17250099 6655888 867893 9867703 20265491 17949794
38788A7949794p908006k57604N172591K322894K468755P510396M236511p788546
$$ 17949794 10041788 9784184 14956775 17279669 19748424 27258820 31495331 23706785
38780B3706785j0083906L269483J3284720O698886m169170m751901q1440L00834
$$ 23706785 13622879 16892362 30177082 36875968 32706798 27954897 27873457 28174291
38772B8174291m4054L811660N767655J713998n22168L192074L263234n410217
$$ 28174291 28130237 31941897 37709552 39423550 38901382 42093456 45356690 39946473
38764C9946473j0960809m164974M318952J274299p654866r093959l147752J229305
$$ 39946473 28985664 24820690 29139642 30413941 22759075 13665116 10517364 11746669
38756A1746669K108410K138200m39502n620341n841764J566185N946696n80513
$$ 11746669 13855079 15993279 15553777 9933436 4091672 5657857 11604553 11024040
38748A1024040q845587p151381K22300K528450O47865J379619K734864l26102
$$ 11024040 2178453 -4972928 -4750628 -2222178 -1574313 -194694 2540170 2214068
38740B214068l547548j214959J566165j248186l104980L213835R092197L646456
$$ 2214068 -1333480 -2548439 -982274 -2230460 -5335440 -2121605 6970592 10617048
38732A0617048m047242K610053J7798111J9049061L180718o909067K825080J6879465
$$ 10617048 6569806 9179859 26977970 46027031 49207749 42298682 45123762 62003227
38724F2003227J5280292K886723r02174Q079604J4612562P228483o910711j3157746
$$ 62003227 77283519 80170242 79268068 87347672 101960234 109188717 102278006 89120260
38716H9120260p947000q19149m84201n063917q189425r152679j0892222j1560423
$$ 89120260 81173260 80354111 79869910 74805993 66616568 57463889 46571667 35011244
38708C5011244p133325j434057k990087j0365236j1870858l543703M227842L622377
$$ 35011244 27877919 26443862 23453775 13088539 1217681 -2326022 1901820 5524197
38700E524197J017282L829769P217939M242361m72847J010809N465904L872714
$$ 5524197 6541479 10371248 17589187 21831548 21358701 22369510 27835414 31708128
38692C1708128m207784j1618949j3753778r570527N53055J0012100Q083598m006222
$$ 31708128 27500344 15881395 2127617 -7442910 -6889855 3122245 11205843 7199621
38684G199621r829222j496148N952171j580416j2251894o910353Q068421J0519288
$$ 7199621 -2629601 -4125749 1826422 246006 -12005888 -18916241 -10847820 -328532
38676c28532j012174o275211K082492Q351169K052595o634076o557600q70408
$$ -328532 -1340706 -7615917 -5533425 2817744 4870339 -1763737 -8321337 -9191745
38668i191745M783803J1264371J5475518Q388985p703924j6155570r393964m7806
$$ -9191745 -4407942 6856429 22331947 30720932 23017008 6861438 -2532526 -2580332
38660b580332N93439p95835M237998Q763827L702122m634892n411002j377906
$$ -2580332 -1986893 -2782728 1455270 10219097 13921219 9286327 3875325 2497419
38652B497419j127299k187360K529689Q432270N463443l754126p068229j589022
$$ 2497419 1370120 -817240 1712449 10144719 15608162 11854036 4785807 3196785
38644C196785M259528N698996N820007N756229K505770l331490p476819q946923
$$ 3196785 7456313 13155309 18975316 24731545 27237315 23905825 16429006 7482083
38636G482083q672374m361068L484773N321860m611080j3558890m900369J4069922
$$ 7482083 -1190291 -5551359 -2066586 3255274 -1355806 -14914696 -19815065 -5745143
38628e745143J8133789O64195j5652752j2007998J535785O161147K701447L527667
$$ -5745143 12388646 13052841 -2599911 -14607909 -13072124 -6910977 -4209530 -681863
38620f81863Q227154O405246j496427m423187K46978L765691K047984M89845J811069
$$ -681863 7545291 13950537 12454110 8030923 8277901 12043592 14091576 14581421 16392490
38611A6392490K096776N67208J050542J991569k565129r856432r499160r71240
$$ 16392490 18489266 19056474 20107016 22098585 19533456 9677024 177864 -793376
38603g93376M115608J980684L326218J2241924J4999730K631292j0118494n515025
$$ -793376 3322232 5302916 8629134 20871058 35870788 38502080 28383586 22868561
38595B2868561Q557242J0406791j957217j0220270o053597m64193q63592M92967
$$ 22868561 31425803 41832594 39875377 29655107 23601510 23137317 22273725 22766692
38587B2766692Q353665J2431853L693093j0094322j5174430r019129J076217Q063292
$$ 22766692 31120357 43552210 47245303 37150981 21976551 12957422 14033639 22096931
38579B2096931P398832j539740j0112164o615364N783121R340290j690907q876374
$$ 22096931 29495763 27956023 17843859 11228495 17011616 26351906 24660999 15784625
38571A5784625K742060J8145142J2711050r373670j9830719p813863O306302L855124
$$ 15784625 18526685 36671827 49382877 40009207 20178488 12364625 18670927 22526051
38563B2526051o268960o069312L072692O195689K77019k690809L541921R925363
$$ 22526051 16257091 10187779 13260471 19456160 19733179 17042370 20584291 30509654
38555C0509654P001754n12420o69911Q766705J7062075J4136900K834871m971554
$$ 30509654 37511408 36998988 36329077 45095782 62157857 76294757 79129628 74158074
38547G4158074k716759L731722M097336l792013j2239462j3521792q107160j972016
$$ 74158074 71441315 75173037 79270373 75478360 63238898 49717106 41609946 39637930
38539C9637930J273878K490525K532484Q917m871205p704091m768497J144937
$$ 39637930 40911808 43402333 45934817 45943734 41072529 33368438 28599941 29744878
38531B9744878L734526J237447k653008n015728n354069j669149P231349J4363531
$$ 29744878 33479404 34716851 32063843 27048115 21694046 20024897 27256246 41619777
38523D1619777R545376m037120r433199N6613Q144980o46934j5010219j2529636
$$ 41619777 51165153 47128033 37694834 37751447 45896427 45249493 30239274 17709638
38515A7709638N074471J3823372M050114p008410m058114N708731J0152647J1510560
$$ 17709638 22784109 36607481 40657595 33649185 29591071 35299802 45452449 56963009
38507E6963009J5308103J5524030O178392l739000k517771N401338P355792K354270
$$ 56963009 72271112 87795142 93973534 90234534 87716763 93118101 100473893 102828163
38499A02828163j111610j238465k592146m108040j449827J877082q69266o727121
$$ 102828163 101716553 100478088 97885942 93777902 92328075 94205157 93335891 86608770
38491H6608770p712671n446183p138340r598309l289066P864642P980512n865959
$$ 86608770 78896099 73449916 66311576 56713267 53424201 61288843 69269355 63403396
38483F3403396j6529340j1431610j6366K722037j871837k626705J352615P79765
$$ 63403396 46874056 35442446 35426080 38148117 36276280 33649575 35002190 35781955
38475C5781955o499150j0902250n771490K614924M304467o30694l468317J81484
$$ 35781955 29282805 18380555 12609065 15223989 19528456 18897762 15429445 15610929
38467A5610929M861919M120748k30972j797891P99407L575314M597172N193946
$$ 15610929 20472848 24593596 24362624 22564733 23364140 26939454 31536626 36730572
38459C6730572M390644l40901o090761o374365j638539Q23350m37495R55161M710190
$$ 36730572 41121216 40780315 34689554 28315189 26676650 27500000 27062505 28017666 32727856
38450C2727856L68394j3751706k1160354r413354Q663218J1585453P4779o048130
$$ 32727856 33096250 19344544 -1815810 -11229164 -2565946 9019507 9094286 3046156
38442C046156J323570R149880O463246K41383J445883P545260P819773o20605
$$ 3046156 4369726 13519606 19982852 20224235 21670118 29215378 37035151 36414546
38434C6414546r681144j0509429k535963O656730Q963479L758527k557655n121135
$$ 36414546 26733402 16223973 13688010 20344740 29308219 33066746 30509091 25387956
38426B5387956m766283k337094M469163J4272637J9087192J4851247Q682647Q289725
$$ 25387956 20621673 18284579 22753742 37026379 56113571 70964818 79647465 87937190
38418H7937190J0437730Q371987M295540M305410O310740M040968j186374l944147
$$ 87937190 98374920 106746907 111042447 115347857 121658597 125699565 124513191 120569044
38410A20569044o203633j3539747k2378376k2860192j3486372k776750K508398
$$ 120569044 114365411 100825664 78447288 55587096 42100724 39323974 41832372
38403D1832372K002458k755397q473471r067566l130455K022221J879257K737691
$$ 41832372 43834830 41079433 32605962 23538396 20407941 22430162 24309419 27047110
38395B7047110Q183007P900419n520633j8628626j4271325J192646P972021L507792
$$ 27047110 35230117 43130536 37609903 18981277 4709952 5902598 13874619 17382411
38387A7382411R49549K328801j895517q982697o092861K927556j4350j4330466
$$ 17382411 18331960 20660761 18765244 9782547 3689686 6617242 6602892 -7727574
38379g727574j7495280j540442J3742018J3537824Q396327J0079946J1383790
$$ -7727574 -25222854 -26763296 -13021278 516546 8912873 18992819 30376609
38372C0376609M533920j849351M20812L975893J653336o14606N16469l564064
$$ 30376609 34910529 33061178 33481990 37457883 39111219 38496613 39013082 35449018
38364C5449018j3846515j5255971k704630N605191k017524r307104m90538J1006397
$$ 35449018 21602503 6346532 3641902 9247093 7229569 -2077535 -2568073 8438324
38356H438324O115782o463270p041151N08096o44957p273649l200850Q536417
$$ 8438324 14554106 8090836 1049685 1557781 912824 -6360825 -9561675 -1025258
38348a025258R663674j214889p339120k806008J777746J822305L863738Q150148
$$ -1025258 8638416 7423527 84407 -2721601 -943855 878450 4742188 12892336
38340A2892336P513651L744948N020237P613944L93760j2931542j6513153p555155
$$ 12892336 20405987 24150935 29171172 36785116 37178876 24247334 7734181 179026
38332A79026J082826L508670N660741P284002O23886j0679650j2579784l959021
$$ 179026 1261852 4770522 10431263 17715265 18339151 7659501 -4920283 -8879304
38324h879304J276289j200586l94129O744750Q091689o81444o676936j798547
$$ -8879304 -7603015 -8803601 -9197730 -2452980 5638709 4957265 -1719671 -3518218
38316c518218N180062P363167J0954312J7332079J3660613m692840j9525425j3721876
$$ -3518218 1661844 9025011 19979323 37311402 50972015 46279175 26753750 13031874
38308A3031874L386493J0552043M064859k999825l264543j499372k377766m062821
$$ 13031874 16418367 26970410 31035269 28035444 24770901 23271529 20893763 16830942
38300A6830942k892939K600358J0010216J2129145L672312q457291j0565934j307830
$$ 16830942 13938003 16538361 26548577 38677722 42350034 33892743 23326809 22018979
38292B2018979N533772K197265k052100J334922N002185l45037q316220p059501
$$ 22018979 27552751 29750016 27697916 29032838 34035023 33689986 25373766 18314265
38284A8314265J076799M352863P58056j397000R16759J923268j341873m160144
$$ 18314265 19391064 23743927 24501983 23104983 24021742 25945010 24603137 20442993
38276B0442993j804099M755394J0762038J0824798K649644p997594j0260318j491997
$$ 20442993 18638894 23394288 34156326 44981124 47630768 39633174 29372856 27880859
38268B7880859P121652M501867n513886j0524075o500779k32830K352000K028377
$$ 27880859 35002511 39504378 33990492 23466417 16965638 16732808 19084808 21113185
38260B1113185J361189R66383R91298J589052J961293J752436J804187J410320
$$ 21113185 22474374 23440757 24432055 26021107 27982400 29734836 31539023 32949343
38252C2949343j849737o956196q441128l894254K079996N098193P059302J0340476
$$ 32949343 31099606 24143410 15702282 11808028 13888024 18986217 26045519 36385995
38244C6385995J1147473M874597n249098j0775561p710602J40585N590820L763944
$$ 36385995 47533468 52408065 47158967 36383406 28672804 28813389 34404209 38168153
38236C8168153l601385q520209n716705q48107k703358p746020l530041J0259131
$$ 38168153 34566768 26046559 20329854 19481747 16778389 9032369 5502328 15761459
38228A5761459J7667714R651315k123982m209499j056951k779908m980040K116684
$$ 15761459 33429173 43080488 40956506 36747007 35690056 32910148 27930108 30046792
38220C0046792J2211417R941895l393265r933994k489632N410804J374367q468122
$$ 30046792 42258209 52200104 48806839 38872845 36383213 41794017 43168384 34700262
38212C4700262j1096191m649009L263926P838725R676020R098585M659505l105567
$$ 34700262 23604071 18955062 22218988 30057713 39733733 48832318 53491823 50386256
38204E0386256r782363r951727k656958N865448P845091L708516J535837M273791
$$ 50386256 40603893 30652166 27995208 33860656 41705747 45414263 46950100 51223891
38196E1223891M292715l789805j2032119r546827J529951J0234759J2572651J2405100
$$ 51223891 55516606 51726801 39694682 30147855 31677806 41912565 54485216 66890316
38188F6890316R967866J660680r481547j4494674j0656673l980278L55752J737683
$$ 66890316 76858182 78518862 69037315 54542641 43885968 39905690 40261442 41999125
38180D1999125q7150l828835l715735K253023M727380m229889j4948795j1901130
$$ 41999125 41911975 38083140 34367405 36620428 41347808 37117919 22169124 10267994
38172A0267994J562452Q335641N850100P643611J4732065J0318250q414778j7919007
$$ 10267994 11830446 20166087 26016187 33659798 48391863 58710113 50295335 32376328
38164C2376328k880178J7579175J7223785j47342j1311477q351249j212622M560182
$$ 32376328 29496150 47075325 64299110 64151768 52840291 44489042 43276420 47836602
38156D7836602J0208577J0373104l20566j0892546n981421P515739P785064p216326
$$ 47836602 58045179 68418283 68097717 57205171 51223750 58739489 66524553 59308227
38148E9308227j5003127l153087J2777682J4495671N625499J0151J94077j22575
$$ 59308227 44305100 41152013 53929695 68425366 74050865 74061016 74255093 74132518
38140G4132518k738055n058139n838142l013928N883516J4973861J2389479j190981
$$ 74132518 71394463 66336324 60498182 57484254 63367770 78341631 90731110 89540129
38132H9540129q491269m1053R919913N359865n328526k910736J0636946J4722658
$$ 89540129 81048860 81007807 90927720 96287585 90959059 88048323 98685269 113407927
38124A13407927L157810o691061k377847M908026J13405j1397151j2758135r81771
$$ 113407927 116565737 109874676 107496829 112404855 112518260 101121109 88362974 87381203
38116H7381203R923372Q806624n77172q057411r080894n440540L637M824510N994662
$$ 87381203 97304575 106111199 105534027 97476616 88395722 82955182 82958819 87783329 93777991
38107I3777991K025104l613836m756805l03677K726107k458948j2062938j4761947
$$ 93777991 95803095 92189259 87432454 87128777 89854884 87395936 75332998 60571051
38099F0571051o353881M019343N768304K00668l362573j209904J947123K312038
$$ 60571051 54217170 58236513 64004817 64205485 60842912 59633008 61580131 63892169
38091F3892169J833365K784260L550323J899040j599918m747203n275018j717978
$$ 63892169 65725534 68509794 72060117 73959157 72359239 67612036 62337018 60619040
38083F0619040L468124L575844l501527q130707K36136J5227452J8150848M018937
$$ 60619040 64087164 67663008 64161481 56030774 56266910 71494362 89645210 93664147
38075I3664147r330439o036733N075734M872997o855951j2017640j757879J1941615
$$ 93664147 84333708 78296975 83372709 88245706 81389755 69372115 67614236 79555851
38067G9555851J4808462P698506K30392l057343l424500j638860K053497N162282
$$ 79555851 94364313 102062819 102293211 99235868 95811368 94172508 96226005 101388287
38059A01388287M992588J373966m323332r221431p839746K252593J2410804R697468
$$ 101388287 106380875 107754841 103431509 94210078 86370332 88622925 101033729 110731197
38051A10731197m331947j1850694l067888P980464L468753j0788997j3729426
$$ 110731197 106399250 94548556 91480668 99461132 102929885 92140888 78411462
38044G8411462j045631R172472M871173l267470j148344P069530Q208485J249247
$$ 78411462 77365831 86538303 91409476 88142006 86993662 94063192 102271677 103520924
38036A03520924l871890l583249m061393q384571j1074620p132974J043512P862617
$$ 103520924 99649034 96065785 92004392 83619821 72545201 65412227 66455739 74318356
38028G4318356J0731794J1122030J3024641J9525483K7320523K7310298J5948423
$$ 74318356 85050150 96172180 109196821 128722304 156042827 183353125 199301548
38021A99301548K716349j269012N90657m391903j7382754k4315312j6314716k723106
$$ 199301548 202017897 200748885 201339542 196947639 179564885 155249573 138934857 136211751
38013A36211751K697328m52812l235777k074767j52487J162286K643592J372396
$$ 136211751 138909079 138456267 135220490 133145723 132993236 134155522 136799114 138171510
38005A38171510o190526j5797471j8476291j2957741p654490q177582r534242
$$ 138171510 131980984 116183513 97707222 84749481 77094991 68917409 59383167
37998E9383167m605004M426627Q540945M423460n64955J762254Q555173R153081
$$ 59383167 54778163 59204790 67745735 72169195 71604240 73366494 81921667 91074748
37990I1074748Q85638n412349j520140L444296l672699j5794469j2194284P795520
$$ 91074748 91960386 86548037 85027897 88472193 84799494 69005025 56810741 64606261
37982F4606261J7983988L525402j3406810n664978J6067346J8742747k250106
$$ 64606261 82590249 86115651 72708841 67043863 83111209 101853956 99603850
37975I9603850j7441953r530428M380082N805030L073694J0451215K0538149J7607557
$$ 99603850 82161897 72631469 77011551 82816581 85890275 96341490 116879639 134487196
37967A34487196M166117n084911n499456j422474P475862K1225144K9381354K3921334
$$ 134487196 138653313 133568402 128068946 126646472 134122334 155347478 184728832 208650166
37959B08650166J5220125J7208710K4008547K1168599J2804385J3785482J9590047
$$ 208650166 223870291 241079001 265087548 286256147 299060532 312846014 332436061
37952C32436061J1318576r115562j8050928r821227p492604k2361948l2248891
$$ 332436061 343754637 334639075 316588147 306766920 299274316 276912368 244663477
37945B44663477j8932535r54684l945980j8983562k0046974q524186p677616j9771793
$$ 244663477 225730942 224776258 220830278 201846716 181799742 173275556 165597940 145826147
37937A45826147k2480666r159624p40699r307742j8032478j0966093P66379P0122
$$ 145826147 123345481 114185857 113445158 104137416 86104938 75138845 75905224 75975346
37929G5975346p161363m520961N621394O548599m621257j2649590p880778J506911
$$ 75975346 68813983 64293022 69914416 76463015 71841758 59192168 51311390 52818301
37921E2818301L802722j288452n992004n116586O0693M226502L235437l20651
$$ 52818301 56621023 55332571 49340567 44223981 44284674 48511176 51746613 51425962
37913E1425962J235974R632350J5233803R035843l466880q447056j650060Q173752
$$ 51425962 52661936 62294286 77528089 86563932 83097052 74649996 72999936 81173688
37905H1173688J2230966R398700K199796n206569n335443N433113J6604679J2085053
$$ 81173688 93404654 102803354 105003150 99796581 94461138 99894251 116498930 128583983
37897A28583983p411827k1697767j6457488r47716O608959J715981o915664j2287379
$$ 128583983 121172156 99474389 83016901 82069185 88678144 90394125 83478461 71191082
37889G1191082j3424412j0616844o127152n473059r697614j0939803l588573N868344
$$ 71191082 57766670 47149826 41022674 35549615 25852001 14912198 11323625 17191969
37881A7191969Q805466P502613P923887P196789J716898L55605J2395102K7479835
$$ 17191969 25997435 33500048 41423935 48620724 50337622 50693227 63088329 90568164
37873I0568164K7699825J7084514J5908006K4636600K0346031l412786k1338072
$$ 90568164 118267989 135352503 151260509 175897109 196243140 192830354 171492282
37866A71492282j6358072q367795j9810902l5059137k5143972J617430R696219
$$ 171492282 155134210 146766415 126955513 91896376 66752404 68369834 78066053
37859G8066053p368566j7367311j668949J6754039J1854012o943152j4996544
$$ 78066053 70697487 53330176 51661227 68415266 80269278 73326126 58329582
37852E8329582j0432598q419666j1003646p225557K648707N769699o04566m216408
$$ 58329582 47896984 39477318 28473672 21248115 23896822 29666521 29061955 24845547
37844B4845547J308069O765428M044815p74003J246774P100475P293610M80208
$$ 24845547 26153616 32919044 36963859 36189856 37436630 44537105 51830715 52310923
37836E2310923n825069o675815m424662k068709J740560Q201865J2966517J0341648
$$ 52310923 46485854 39810039 35385377 33316668 35057228 43259093 56225610 66567258
37828F6567258K433421j451554K515739N630185j394483j2816971j3976133l270821
$$ 66567258 69000679 67549125 70064864 75695049 74300566 61483595 47507462 44236641
37820D4236641L515586m168538j5672403j4858338k983340O068881P295826P221786
$$ 44236641 47752227 43583689 27911286 13052948 10069608 16138489 23434315 30656101
37812C0656101P926258L972576l307476l425538O187490J3283548P908001l894225
$$ 30656101 38582359 42554935 39247459 35821921 42009411 55292959 63200960 59306735
37804E9306735j0669940j0436083p305657k436337K665785K176299m678826p855167
$$ 59306735 48636795 38200712 30895055 28458718 31124503 33300802 28621976 20766809
37796B0766809q42203O855678M163979k203732J232358R972112P261519o833508
$$ 20766809 19924606 26780284 30944263 28740531 29972889 39945001 47206520 40373012
37788D0373012j3307902m835746K623404k676437q986635k447791R181157J0962601
$$ 40373012 27065110 22229364 24852768 22176331 13189696 10741905 19923062 30885663
37780C0885663N869593O487122J0866275P067314l226206o365186r98537o80629
$$ 30885663 36755256 43242378 54108653 61175967 57949761 51584575 50586038 49905409
37772D9905409r702671j4941871p503216L806258Q044888O861644N184938L92822
$$ 49905409 40202738 25260867 17757651 21563909 29608797 36470441 41655379 42048201
37764D2048201q748598j3339685o436200M123262O505394K095129M95406K695804
$$ 42048201 33299603 19959918 13523718 17646980 24152374 26247503 26742909 29438713
37756B9438713J617590l529630n750115k641594O68901J735862L962730P774432
$$ 29438713 31056303 27526673 21776558 19134964 19803865 21539727 25502457 33276889
37748C3276889P947062K937959j208262l23992J565937K52440o47005L786899
$$ 33276889 41223951 44161910 42953648 42629656 44195593 44448033 43801028 47587927
37740D7587927R678163Q695878J018264m076501k039063K4928n093959j2093513
$$ 47587927 57266090 65961968 66980232 62903731 60864668 60889596 55795637 43702124
37732D3702124r971262R30070Q155145N027841p8858K491901Q973686R364372
$$ 43702124 33730862 34660932 42816077 47843918 47765060 50256961 59230647 68595019
37724F8595019K914437l551139q030973j2497518j3030684m495684N980102N498823
$$ 68595019 71509456 67958317 59927344 47429826 34399142 29903458 35883560 41382383
37716D1382383l152563l292959P974587J2453224N21759j0710400m237340Q196939
$$ 41382383 38229820 34936861 42911448 55364672 55886431 45176031 40938691 49135630
37708D9135630M989593r362977j1601746K244421J1648922N540140k920669j993604
$$ 49135630 54125223 44762246 33160500 35404921 47053843 52593983 49673314 47679710
37700D7679710L45645m993458r905946m338742M033875K286397m801103k054916
$$ 47679710 48025355 43031897 33125951 28787209 32821084 35107481 30306378 28251462
37692B8251462J0245062J5527832O600744l761444k982529L483282L135379l691102
$$ 28251462 38496524 54024356 60625100 56863656 53881127 57364409 60499788 56808686
37684E6808686o169831j455106J065318m387530j0207853p377161K49652K276133
$$ 56808686 50638855 49183749 50249067 45861537 35653684 28276523 28526175 30802308
37676C0802308j971897l760649n3071L010384L017102N450881J0531958Q611032
$$ 30802308 28830411 25069762 25016691 28027075 31044177 36495058 47027016 55638048
37668E5638048k967017j0352023k831373P746147K912513j3162199j8328272n061874
$$ 55638048 52671031 42319008 39487635 47233782 50146295 36984096 18655824 13593950
37660A3593950R630072J0216941K366093k64350L903278O435265K653234m577857
$$ 13593950 23224022 33440963 35807056 35542706 39445984 45881249 48534483 43956626
37652D3956626r619226p691694J295485R718557Q967096J026721l745965j631865
$$ 43956626 34337400 26645706 27941191 37659748 46626844 47653565 43907600 42275735
37644D2275735O51577r73931j782501R53436J917263j780552m169485r17000L116361
$$ 42275735 42927312 41953381 40170880 41124316 43041579 41261027 37091542 36174542 39290903
37635C9290903L234288K248337K022357j565599p606019o119110M942811J1022628
$$ 39290903 42525191 44773528 46795885 45230286 37624267 31505157 36447968 47470596
37627D7470596K235132q590804n408159M090290J321897j0524663j0573620M114993
$$ 47470596 49705728 41114924 35706765 39797055 41118952 30594289 20020669 24135662
37619B4135662J1805310P21057j1947908p022467Q180754J2647467J173873j2963889
$$ 24135662 35940972 36662029 24714121 17691654 25872408 38519875 39693748 26729859
37611B6729859j7206741r357370N982619J9189808J8557571K677075j3150334
$$ 26729859 9523118 165748 6148367 25338175 43895746 46572821 33422487
37604C3422487j3148814j259888N070983p78635q079874o929012r77141J932418
$$ 33422487 20273673 19013785 24084768 23306133 15226259 8297247 7320106 9252524
37596I252524J708427K256833L186741K450345K083142L867168L029353n306899
$$ 9252524 10960951 13217784 16404525 18854870 20938012 24805180 27834533 22527634
37588B2527634j5012604j3687947l62536J0223045O299361m522381n506310N889009
$$ 22527634 7515030 -6172917 -6535453 3687592 9986953 5464572 -41738 5847271
37580E847271J4803960J0288054J02317j858615M146595N810220j403672p917730
$$ 5847271 20651231 30939285 31041602 29182987 33329582 39139802 37736130 29818400
37572B9818400o119784k155436m352121p997799k925340P532763Q584292l493818
$$ 29818400 23698616 21543180 17191059 9193260 6267920 13800683 22384975 18891157
37564A8891157j3863056j0323696q15678K74160n232835l925308N939678J1217527
$$ 18891157 5028101 -5295595 -6111273 -5837113 -11069948 -14995256 -9055578 2161949
37556B161949N553076k06174M170068J1580481Q705012l275547j0208016m595600
$$ 2161949 7715025 7508851 11678919 23259400 31964412 28688865 18480849 13885249
37548A3885249O271485J2067000J0738006N470283k500683j2244134j7606135
$$ 13885249 20156734 32223734 42961740 48432023 45931340 33687206 16081071
37541A6081071j0775752O188628J8539700J3660730k874746j3611143j2233084
$$ 16081071 5305319 11493947 30033647 43694377 40819631 27208488 14975404
37534A4975404r976562j4231080j3759902J819086J8474208J3856234p080270
$$ 14975404 4998842 -9232238 -22992140 -21173054 -2698846 11157388 4077118
37527D077118j5715747j586334J3178693R549187j688629l147734N93871k630414
$$ 4077118 -11638629 -13224963 -46270 9502917 7814288 4666554 5260425 2630011
37519B630011o944302n76338Q707418N081467o555469q066972J018710N159312
$$ 2630011 -4314291 -4890629 3816789 8898256 2342787 -5724185 -4705475 453837
37511D53837K094326M209302J0861819O736340q118690j3387905j456347R685483
$$ 453837 2548163 6757465 17619284 24355624 16236934 2849029 1392682 11078165
37503A1078165O711788M03249K290716M635789o95314m206844K181681O485756
$$ 11078165 17789953 18193202 20483918 25119707 24424393 20217549 22399230 28884986
37495B8884986k644837j2563848o489876O321469N116779o629874o692090Q142247
$$ 28884986 26240149 13676301 7186425 13507894 18624673 11994799 5302709 13444956
37487A3444956J6385557O529116o696095q064141l240149l298772m307566L006292
$$ 13444956 29830513 36359629 29663534 21599393 18359244 15060472 10752906 13759198
37479A3759198J3380657J2416153j461968j3583732j2769818m468288j26144q77885
$$ 13759198 27139855 39556008 38094040 24510308 11740490 7272202 7146058 6268173
37471F268173R07623P079499R707517L583961m894550o512908j510699L050215
$$ 6268173 7175796 14255295 23962812 27546773 22652223 16139315 14628616 17678831
37463A7678831L680287J352065l521875q752480p399000K860201J1266245O666187
$$ 17678831 21359118 22711183 19189308 10436828 3037828 5898029 17164274 23830461
37455B3830461m505146o550193J410702N501150Q33192k517741L86508J711800
$$ 23830461 19325315 12775122 14185824 19686974 20520166 18002425 18388933 20100733
37447B0100733j731254j727309L868329N029853q72748j932842N997867R056781
$$ 20100733 18369479 16642170 20510499 25540352 24667604 22734762 28732629 37789410
37439C7789410k29134p615250j569241N519195j073907j2342810j1760664l167974
$$ 37789410 37560276 29945026 28375785 33894980 32821073 20478263 8717599 5549625
37431E549625m68406j920159K054323O012332q35027j0072791m530980J1908829
$$ 5549625 5081219 3161060 5215383 11227715 10392688 319897 -4211083 7697746
37423G697746J9594735J4223399P943725K737762j0288920k5112168k2477022
$$ 7697746 27292481 41515880 49459605 52197367 41908447 16796279 -5680743
37416e680743k435358J0650853L672790p758190o866666O79287K415567k20404
$$ -5680743 -8116101 2534752 6207542 -1550648 -8417314 -7738027 -5322460 -5542864
37408e542864j68125Q00630j166855j865618L067157Q666037P951707J744058
$$ -5542864 -5710989 -4910359 -6077214 -7942832 -4875675 3790362 11742069 13486127
37400A3486127m579920p031241l001543N672320Q693345j790006j5456413j3690465
$$ 13486127 8906207 1874966 -1126577 4545743 13239088 11449082 -4007331 -17697796
37392a7697796K765906J3039420P121213j302843l49897J781889l972799q700515
$$ -17697796 -14931890 -1892470 5228743 3925900 3576003 5357892 1385093 -7315422
37384g315422k019212P576250O666019o67855k605640j558776o384210j0427896
$$ -7315422 -9334634 -1758384 4907635 4239780 1634140 75364 -6308846 -16736742
37376a6736742O4450J8360744K1218828L572259j1780913o915645O764579Q459332
$$ -16736742 -16672292 1688452 22907280 26479539 14698626 7782981 14547560 23006892
37368B3006892j714433p460778k893279K202820J365457L1573K331972K823309
$$ 23006892 21292459 13831681 10938402 13141222 14506679 14538252 16870224 19693533
37360A9693533j865646l979459K978501J0654535O739449n164157j0183111n155296
$$ 19693533 17827887 13848428 16826929 27481464 34220913 29056756 18873645 13718349
37352A3718349k140305p102413j0630119n712488J74039n5821K81715Q045086
$$ 13718349 11578044 4475631 -6154488 -11866976 -11692937 -11748758 -11467043 -3421957
37344c421957J4845460R535637k686905q612193p460466p623530q800352l946731
$$ -3421957 11423503 20959140 18272235 9660042 2199576 -5423954 -14224306 -18171037
37336a8171037M505697O998771L772922L563696O242284K825047o522863j0259858
$$ -18171037 -13665340 -6666569 -2893647 670049 6912333 9737380 3214517 -7045341
37328g045341l799034L828459M527148K71962m049895n417721j53245J0975807
$$ -7045341 -10844375 -7015916 -2488768 -2216806 -6266701 -11684422 -11837667 -861860
37320h61860J6088463N146177j1087810j1883664K684469J0681415K087438o426690
$$ -861860 15226603 20372780 9284970 -2598694 85775 10767190 12854628 6427938
37312F427938M06412J1755144Q212561q192335j6931331o906530J0516365J6100785
$$ 6427938 6834350 18589494 26802055 18609720 1678389 -5228141 5288224 21389009
37304B1389009M234829j1258721j2740666k89356Q047888J627430o889971j471614
$$ 21389009 25623838 14365117 1624451 1335095 9382983 11010413 4120442 2648828
37296B648828J1519454J3766649L625010n191165q182061j1418252j1874875j226314
$$ 2648828 14168282 27934931 31559941 26368776 18186715 6768463 -5106412 -6332726
37288f332726J1318590P062257q350819p799371J3526793K6618546J2941366q204040
$$ -6332726 4985864 12048121 3697302 -4102069 9424724 36043270 48984636 40780596
37280D0780596j3135055q152250r521360j2015740k459249J1682287J2445417
$$ 40780596 27645541 19493291 9971931 -2043809 -4503058 7179229 19624646
37273A9624646O6794r778805r787530m474327K344188P850646O268602j261814
$$ 19624646 19691440 9912635 125105 -4349222 -2005034 5845612 12114214 10852400
37265A0852400k344241P619576J3600678L326317j0846139j0416629k58262N95995
$$ 10852400 8508159 16127735 29728413 33054730 22208591 11791962 11533700 12129695
37257A2129695r752361j4571398n148339Q876989J5141290J1070912J925748l832685
$$ 12129695 2377334 -12194064 -17342403 -8465414 6675876 17746788 19672536 15839851
37249A5839851n57079N988780L240223q277856j1543344R42064J2187080N691822
$$ 15839851 15282772 21271552 24511775 16233919 4690575 5632639 17819719 23511541
37241B3511541q583793j0504859j35882P023378N527838J655020k247446o379314
$$ 23511541 14927748 4422889 4287007 11310385 16838223 18493243 16245797 9866483
37233I866483m140427P142316J3919717M363763r162914o831358O349274Q531173
$$ 9866483 5726056 12868372 26788089 31151852 21988938 15157580 21506854 30038027
37225C0038027k934796q682927n80369O873336K862034l772001k424992K721973
$$ 30038027 27103231 18420304 17839935 24713271 27575305 23803304 21378312 24100285
37217B4100285K651738k386579n947262m314623J418820O035530L323065n114225
$$ 24100285 26752023 24365444 18418182 14103559 15522379 21557909 24880974 19766749
37209A9766749q034630K86179R063601N817076m353590p109420n52526N325896
$$ 19766749 11732119 12018298 21081899 26898975 22545385 15435965 14883439 20209335
37201B0209335N578777K463947m060655j3266169j6283393o958091N069605P140424
$$ 20209335 25788112 28252059 24191404 10925235 -5358158 -12316249 -7246644 -106220
37193a06220L036511L614945N930938R25883n373266n51530R320316P201025n105816
$$ -106220 2930291 6545236 12476174 13402057 8028791 7477261 16797577 23998602 18892786
37184A8892786q934076k28648N356348O51678l755452k152397k298446o107233
$$ 18892786 9958710 9730062 15086410 15738088 11982636 9830239 7531793 1424560
37176A424560m137106M010780N172955l854435q610733j300774O470744M652863
$$ 1424560 -2712546 1298234 6471189 2616754 -5993979 -7294753 -824009 3828854
37168C828854L07514J981852M951062K706848j074933j805736k352942l896118
$$ 3828854 4136368 6118220 11069282 13776130 12701197 10895461 8542519 4646401
37160D646401j237836N266311O201576r89172n533000l83685O641728O280032
$$ 4646401 3408565 8674876 14876452 13887280 8354280 7970595 14612323 20892355
37152B0892355Q00684l240196m271121k185719L364959O879936J136551r147380
$$ 20892355 21693039 18452843 14181722 11996003 15360962 22240898 23377449 14230069
37144A4230069j0907975k961536K075880q43624k581484J126468K048241k852433
$$ 14230069 3322094 360558 2436438 1592814 -988670 137798 2186039 -666394
37136f66394m495183k37805o30373q164346q489065M866588J5417545Q589804
$$ -666394 -5161577 -5399382 -6029755 -14194101 -22683166 -17816578 -2399033 6190771
37128F190771m439349n090005L436464M107578n393829j0503031k771635R645811
$$ 6190771 1751422 -3338583 97881 4205459 -1188370 -11691401 -14463036 -4817225
37120d817225J4159516P191743l881329p569738J17648R471961Q522653N8514
$$ -4817225 9342291 16534034 12652705 5082967 5200615 14672576 23195229 23253743
37112B3253743l042178J191133K027403l352589m884282J61382N95363p399979
$$ 23253743 20211565 21402698 23430101 20077512 15193230 15354612 15949975 8549996
37104H549996j1002321k997342M641602J641982l188816N35656N871232K766779
$$ 8549996 -2452325 -5449667 -808065 833917 -2354899 -1819243 4051989 6818768
37096F818768l045290j880278J735084n17809l555505P42911O182437K808118
$$ 6818768 3773478 1893200 3628284 3110475 -445030 297881 6480318 9288436
37088I288436l993817k621215L971919M319299p79558j157180L336918L407043
$$ 9288436 5294619 2673404 6645323 10964622 10185064 9027884 12364802 15771845
37080A5771845k170521n211874l023909p14231M60213M190134Q778043P276452
$$ 15771845 13601324 8389450 5365541 4651310 5111523 9301657 18079700 25356152
37072B5356152j146209q920223r898351n371553j033440j856737p097236q319651
$$ 25356152 24209943 15289720 5391369 19816 -1013624 -2870361 -9967597 -18287248
37064a8287248J388283J4642175J6154046M689815m356257k999027j278691n893397
$$ -18287248 -16898965 -2256790 13897256 18587071 14230814 11231787 9953096 4059699
37056D059699o517851L291370R240884j411978j5169350j0891975P321190J7266582
$$ 4059699 -2458152 833218 10074102 8662124 -6507226 -17399201 -10078011 7188571
37048G188571J1324520J207987m504190p086587n587984K002205P380586M66654
$$ 7188571 18513091 19721078 15216888 8130301 2542317 4544522 11925108 12391762
37040A2391762j1574499j1486343K240198J3461314J2358057N199548l30545m029504
$$ 12391762 817263 -10669080 -8428882 5032432 17390489 22590037 22259492 18229988
37032A8229988o085435m939453l255739m223814l527487K731499O377994j185486
$$ 18229988 12144553 7205100 3949361 -274453 -3801940 -1070441 5307553 4122067
37024D122067j0204149m384423J0932938J3828530J08662r770946l184272O793874
$$ 4122067 -6082082 -10466505 466433 14294963 14403625 4632679 1448407 8242281
37016H242281M857699m311241q631916p266789m235520K761351J3556290J6915978
$$ 8242281 13099980 8788739 156823 -7109966 -11345486 -8584135 4972155 21888133
37008B1888133N427585r049766r519546J571521O271723k303092j1359405q635713
$$ 21888133 27315718 18265952 8746406 10317927 16589650 14286558 2927153 -5708560
37000e708560O83410L612281j736240n605295k380135K227740K220396J546384
$$ -5708560 -5025150 -1412869 -3149109 -8754404 -11134539 -8906799 -6686403 -5140019
36992e140019O298027J1886591Q312500l066069r505491n498423L13587J009146
$$ -5140019 1158008 13044599 21357099 18291030 8785539 3287116 3600703 4609849
36984D609849J710486O839535R268179K580511o138263p446265m384424l878079
$$ 4609849 6320335 13159870 22428049 25008560 18870297 11424032 7039608 3161529
36976C161529k600139M082264P747573r60965j2114519q068149P554693J2939309
$$ 3161529 561390 4643654 12391227 11430262 -684257 -8752406 -1197713 11741596
36968A1741596R38954j1487519j1106077o158120p588500r265107K36604J6768875
$$ 11741596 12680550 1193031 -9913046 -16071166 -23659666 -32924773 -32688169 -15919294
36960a5919294K4633459J6763109J270969r810037j1448247o241373J014391P845217
$$ -15919294 8714165 25477274 26748243 16938206 5489959 -751414 262977 8108194
36952H108194J3181191J3014178K346267j4690265k2922664j2714440N464423
$$ 8108194 21289385 34303563 36649830 21959565 -963099 -13677539 -8213116
36945h213116J2843392O323145l24045J593622N112224K004834l756237l708937
$$ -8213116 4630276 10953421 10629376 12222998 17335222 19340056 15583819 11874882
36937A1874882J294285K618769l651889j1482227j2337892n173168K546681M017744
$$ 11874882 13169167 15787936 12136047 653820 -11684072 -16857240 -14310559 -10292815
36929a0292815J217309O81996L153736L885482K684149M464789Q025335N153156
$$ -10292815 -9075506 -8393510 -5239774 -1354292 1329857 5794646 13819981 18973137
36921A8973137m630159r932712m786886J574969O73444j715901J102147K184214
$$ 18973137 14342978 4410266 -376620 1198349 1871793 155892 1258039 3442253
36913C442253o135350j5095614j1374402J309010Q130950M736984j682414o493110
$$ 3442253 -2693097 -17788711 -29163113 -27854103 -19723153 -14986169 -16668583 -23161693
36905b3161693q153526j811116J1766919J8035753O630021r286942r810502K345511
$$ -23161693 -31315219 -33126335 -21359416 -3323663 3306358 -5980584 -15791086 -13445575
36897a3445575R118911P077348P329432R960739L706355r242714j2769521l748304
$$ -13445575 -4326664 2750684 10080116 20040855 23747210 14504496 1734975 -2013329
36889b013329L296712J773360J231106N922257O969591J431156j446174J094825
$$ -2013329 1283383 3056743 4287849 10210106 17179697 18610853 17164679 18259504
36881A8259504J48332n746481o244264R0348Q46812p584303j2118938n066786
$$ 18259504 18407836 12661355 6417091 6507439 7354251 -230052 -12348990 -17415776
36873a7415776M845752J0186118J4022352J5236551O023981q430132j0202325
$$ -17415776 -12570024 -2383906 11638446 26874997 32898978 24468846 14266521
36866A4266521K318073Q498398j130577r657831m500081J981090j177401j707617
$$ 14266521 16584594 25082992 23952415 14294584 9794503 11775593 10598192 8890575
36858H890575J0559459J9203276O750703j3411423j6763394n558271r69647p359095
$$ 8890575 19450034 38653310 45404013 31992590 15229196 9670925 8701278 1342183
36850A342183r974413k715567M736104N177409J164304l370747m679287K076447
$$ 1342183 -8632230 -11347797 -6611693 -1434284 -269980 -3640727 -8320014 -6243567
36842f243567J2712292J1563035o189469k0318045j1330481R558140J6311583
$$ -6243567 6468725 18031760 11842291 -8475754 -19806235 -10248095 6063488
36835F063488N598245l590222k170366N61327p75480O95227P349760J0442297
$$ 6063488 11661733 8071511 5901145 6462472 5686992 6382219 13731979 24174276
36827B4174276M543781n191862j2492771j4986693j0134687J568762J0439612
$$ 24174276 28718057 23526195 11033424 -3953269 -14087956 -12519194 -2079582
36820b079582P279166k056365m231652J493877M253497Q27193p74351K885828
$$ -2079582 5199584 3143219 -1088433 405444 4658941 5486134 4711783 7597611
36812G597611N310239K320189k062467l614274k281287J191037M345173J486266
$$ 7597611 12907850 15228039 13165572 9551298 7270011 8461048 12806221 14292487
36804A4292487p464485j1382340k745597P654487M943726o208786q782928l14844
$$ 14292487 6828002 -4554338 -7299935 354552 5298278 -910508 -9693436 -10008280
36796a0008280N881043M506555L468449M683507K61295q520936q556033K467827
$$ -10008280 -4127237 379318 3847767 8531274 8792569 271633 -8284400 -5816573
36788e816573R551427M457384j604448R20488L560431k663015q743658k713815
$$ -5816573 3734854 8192238 6587790 7508278 11068709 8405694 -337964 -3051779
36780c051779Q088472P254845m460238j0086544k108748P517902N615431m682781
$$ -3051779 5036693 12291538 7831300 -2255244 -4363992 3153910 8769341 4086560
36772D086560r779320l475878O209185P620054l0773n893468k094140N682037
$$ 4086560 -5692760 -9168638 -2959453 4660601 4629828 -1263640 -3357780 2324257
36764B324257P255583K984258P63542Q52708l836040j1343708q732121P350923
$$ 2324257 9579840 12564098 13327640 14180348 10344308 -999400 -9731521 -2380598
36756b380598K0696039J5862546p33345j0938597r147788m537172l525346l068177
$$ -2380598 18315441 34177987 33444642 22506045 13358257 8821085 5295739 2227562
36748B227562q09650K33785l21149K456121R037725J0857691J565952j2058660
$$ 2227562 1417912 1651697 1330548 3786669 12824394 23682085 25248037 13189377
36740A3189377j6764183q331585M562847J1024006Q180690R08206m541900n083175
$$ 13189377 -3574806 -11906391 -7343544 3680462 11861152 12769358 8227458 3144283
36732C144283j560268K746682M694662L250062n25036m142730l921319K443958
$$ 3144283 1584015 4330697 9025359 12275421 11750385 7607655 3686336 6130294
36724F130294J0617137J0235437l068212j7858155j7675202k799673Q623150N274339
$$ 6130294 16747431 26982868 23914656 6056501 -11618701 -14418374 -5795224 -520885
36716e20885k552618r76222N684111M462115l064200m337381J077971R81599n889907
$$ -520885 -3073503 -4049725 1634386 6096501 3032301 -1305080 -227109 754490 -5135417
36707e135417n332066P357290J6173257Q520533m826839p130196j014357r78505
$$ -5135417 -10467483 -3110193 13063064 21583597 16756758 9626562 8612205 7633700
36699G633700q363283j0150925n98733R816799R030028j960950j1669944j0887229
$$ 7633700 -729583 -10880508 -11479241 -1662442 7367586 5406636 -6263308 -17150537
36691a7150537j698609N112082K952582j865414L11194O736079O623954N83113
$$ -17150537 -18849146 -13737064 -10784482 -12649896 -12338702 -5602623 1021331 1604444
36683A604444Q34193Q685821R148222l525839j2558533m425276P909291N138809
$$ 1604444 2438637 11124458 20272680 16746841 4188308 -236968 7672323 12811132
36675A2811132p713153j1127766k607787L485182K551338M003673R853462J0023915
$$ 12811132 5097979 -6029787 -8637574 -5152392 -2601054 1402619 11256081 21279996
36667B1279996J569065n584727n860062n101800o618457n123993Q21955M067226
$$ 21279996 22849061 17264334 11404272 6302472 -315985 -5439978 -4618023 -550797
36659e50797J607819k55683J709268J901306k550422n675780l512115p80673j311337
$$ -550797 1057022 801339 2510607 4411913 1861491 -3814289 -7326404 -8107077 -9418414
36650i418414j470113J234669K039568k405054o880100n111379J581151P778582
$$ -9418414 -10888527 -9653858 -7614290 -10019344 -16899444 -22010823 -20429672 -12651090
36642a2651090J0460308Q562972K254317l926841l426428L205112P173138K743147
$$ -12651090 -2190782 6372190 8626507 4699666 1273238 4478350 11651488 14394635
36634A4394635n449497r232314o241771j04728M243554L605464j213621n440277
$$ 14394635 8945138 -287176 -6528947 -6633675 -2390121 1215343 1722 -5438555
36626e438555n990839n535816o359652l767849O529741J7352453J6668641M796112
$$ -5438555 -11429394 -16965210 -23324862 -27092711 -20562970 -3210517 13458124 18254236
36618A8254236n350217n928083j878045L34972R06879P63989k165273o489982
$$ 18254236 12904019 6975936 5097891 5432863 6339742 7103731 4938458 -1551524
36610a551524o267247q69589K408742P9452j574804K427102O711593M344740j611895
$$ -1551524 -7818771 -8688360 -6279618 -6200166 -7774970 -5347868 1363725 5708465 4096570
36601D096570k909484J399687M522896K436018j328587k050900n74592r52558
$$ 4096570 1187086 2586773 7109669 9545687 8217100 6166200 5591608 4639050
36593D639050l000142j534497M658505P617004O76265q791481p686711K085067
$$ 4639050 1638908 104411 4762916 12379920 13056185 4264704 -3422007 -1336940
36585a336940N090432k302376n086436L769067Q875434p48034r071425J183714
$$ -1336940 3753492 1451116 -3635320 133747 9009181 8261147 -810278 373436
36577C73436J5944032J0534286p691722r530227P276403J3608616l147879j9959240
$$ 373436 16317468 26851754 19160032 9629805 16906208 30514824 27366945 7407705
36569G407705j6723720l906275K239623M910129J0162493R185379k967581j0902330
$$ 7407705 -9316015 -13222290 -10982667 -6072538 4089955 13275334 10307753 -594577
36561e94577j947301J0862906R414650p52701l660509j504384o596659j4446541
$$ -594577 -2541878 8321028 17735678 16982977 13322468 11818084 5221425 -9225116
36553i225116r606938N984888J3378875M977980o634055r266005m199673K793301
$$ -9225116 -18832054 -12847166 531709 5509689 -1124366 -10390371 -14590044 -11796743
36545a1796743R078456J1389718O323614k644127p215634m492639J146138M762988
$$ -11796743 -2718287 8671431 14995045 12350918 5135284 642645 1788783 6551771
36537F551771L597693k936894r705314q188985O35027L966650l373279p704794
$$ 6551771 10149464 7212570 -2492744 -10681729 -10046702 -6080052 -9453331 -17158125
36529a7158125K344730J4357644R908064m605398p337527K605000L516727j1289356
$$ -17158125 -14813395 -455751 9452313 4846915 -2490612 114388 3631115 -7658241
36521g658241j9824854o038272J3517437J4015849j677300j0136255k175934Q262236
$$ -7658241 -27483095 -33521367 -20003930 -5988081 -7665381 -17801636 -19977570 -11715334
36513a1715334Q236337K349202J339869N700112P325206J688759p502209j3526877
$$ -11715334 -3478997 -1129795 210074 5910186 13235392 14924151 7421942 -6104935
36505f104935j2531211n293836L585631Q226104N958122N15595j002534M006447
$$ -6104935 -18636146 -23929982 -20344351 -12118247 -6160125 -5644530 -6647064 -2640617
36497b640617R938054Q976688J35082r549777j2333892o493323L402092J0496793
$$ -2640617 7297437 16274125 16409207 6859430 -5474462 -11967785 -8565693 1931100
36489A931100J0265730L519657m772650j0292221j1824507q980768j581362O846721
$$ 1931100 12196830 15716487 10943837 651616 -11172891 -20153659 -21735021 -14888300
36481a4888300J0262128Q422738Q101852J1209898R389065j672264j0798316o047267
$$ -14888300 -4626172 3796566 11898418 23108316 32497381 30825117 20026801 13979534
36473A3979534N681983Q130918J11918n703521n307528o269854q865083m537536
$$ 13979534 19661517 27792435 27904353 22200832 16893304 10623450 1758367 -2779169
36465b779169M370826M435272m075939m060024Q436294J3710695P53817j1631879
$$ -2779169 1591657 6026929 1950990 -2109034 6327260 20037955 20791772 9159893
36457I159893l814913J2944234J4663794N55591j0989931j1948220q544860l261560
$$ 9159893 5344980 18289214 32953008 33508599 22518668 10570448 2025588 -1235972
36449a235972N574921J1078233M994294n316972n670622J988307L818191j494768
$$ -1235972 4338949 15417182 20411476 15094504 9423882 11412189 15230380 13735612
36441A3735612k492981J615016j471097j2864713j6203043l218831J1435216J1088587
$$ 13735612 11242631 12857647 11386550 -1478163 -17681206 -20900037 -9464821 1623766
36433A623766J3041n480508k60735O163344N289632l14511k744807M94017L925672
$$ 1623766 1636807 -3843701 -4104436 2058908 7348540 7034029 4289222 4783239 8708911
36424H708911K121842k113111j821889K334554J754293o056112j1558238o718367
$$ 8708911 10830753 8717642 6895753 9230307 10984600 4928488 -6629750 -13348117
36416a3348117L428556R413925J0004716Q871683N925656k5930o301058j0576168
$$ -13348117 -9919561 -505636 9499080 18370763 24296419 24270489 17969431 7393263
36408G393263j3043624j0164267K346706J5409023J1714427o353446j3416629
$$ 7393263 -5650361 -15814628 -13467922 1941101 13655528 7302082 -6114547
36401f114547O69908J1213167k044562j8180306p232650J8383022K1306713j245932
$$ -6114547 -5444639 5768528 3723966 -14456340 -21688990 -3305968 18000745 16754813
36393A6754813j5098520n369093M633707k122100j0316629m832299K819260o68169
$$ 16754813 1656293 -3712800 920907 -1201193 -11517822 -16350121 -13530861 -14199030
36385a4199030n155025K748600J4171132J2890738J235864o491539n212021M34962
$$ -14199030 -19354055 -16605455 -2434323 10456415 11692279 5200740 -11281 423681
36377D23681O415744Q635727K478735p391276q081371K315657R225055L502635
$$ 423681 6839425 15475152 17953887 10562611 2481240 4796897 14021952 17524587
36369A7524587n050224n012540R8947K207174J501322n92083o613625j1884612
$$ 17524587 12474363 7461823 7560770 9767944 11269266 10677183 4063558 -7821054
36361g821054m448405J2990271J8681700K962305j3584900r431822O332064J0411183
$$ -7821054 -12269459 720812 19402512 22364817 8779917 -651905 5680159 16091342
36353A6091342m440q909812q080634k924835J212009K117644l230122j1470367
$$ 16091342 16086902 7177090 -903544 -3828379 -2616370 -498726 -3728848 -15199215
36345a5199215r922095N377426J8377335J4199537R91322m731854k754783j822121
$$ -15199215 -25121310 -19743884 -1366549 12832988 13824310 9092456 6337673 4515552
36337D515552K4416P482831J1427027K488209q367385o078617R41551m765247
$$ 4515552 4539968 12022799 23449826 25938035 17570650 11492033 12433584 7668337
36329G668337j5937423j0974695O364513J0153177l761985j0120316K686944J3896597
$$ 7668337 -8269086 -19243781 -12879268 -2726091 -6488076 -16608392 -13921448 -24851
36321b4851P041577l672379o22328Q012729O052510k814122n281723j890351q40361
$$ -24851 7016726 3344347 2722019 10734748 16787258 13973136 8691413 6801062 5960701
36312E960701k05206M951917P413161j592850j3726750j3450138j923560N740575
$$ 5960701 5755495 10707412 18120573 16527723 2800973 -10649165 -12572725 -6832150
36304f832150L961106J299610K981649M453395L493583M584280P993972O643995
$$ -6832150 -2871044 -1571434 1410215 5863610 9357193 13941473 21935445 28579440
36296B8579440j467364p708401n342079J84688j90480n803394q186418l394240
$$ 28579440 27112076 19403675 14061596 14246284 14055804 8252410 65992 -3328248
36288c328248L868357P835137Q094301P053134M918679L22364n669166r534098
$$ -3328248 540109 8375246 16469547 23522681 28441360 28763724 23094558 13560460
36280A3560460r428978o712813l066939Q35271L148978J499517k187019k041454
$$ 13560460 4131482 -2581331 -5648270 -4812999 -1664021 -164504 -2351523 -4392977
36272d392977L112990O080837J232597o062776o437778J10197N151598M169668
$$ -4392977 -1279987 4800850 6033447 -29329 -6467107 -6356910 -1205312 2964356
36264B964356L49728k860810n016279m576202N85663P660911J0792520R030636
$$ 2964356 3314084 453274 -4563005 -9139207 -8553544 -892633 9899887 18930523
36256A8930523N873409J720773m896234r395649n193346L213841L201603o345913
$$ 18930523 24803932 26524705 21628471 12232822 7039476 10253317 13454920 7109007
36248G109007j0747922j341559J0212461Q963370j699431p200105l823508o38989
$$ 7109007 -3638915 -4980474 5231987 14195357 12495926 5295821 1472313 833324
36240H33324k421119l304990J590154Q124848R626880N047588j723224o363817
$$ 833324 -1587795 -4892785 -3302631 4822217 14449097 19496685 17773461 11409644
36232A1409644o555531l168323K93103J494357J724911K663443K960565R20105
$$ 11409644 4854113 1685790 1978893 3473250 5198161 7861604 10822169 11742274
36224A1742274j832188k705855j970517j211885o60108q71581l246000n490778
$$ 11742274 9910086 7204231 5233714 4021829 3361721 2490140 -755860 -6246638
36216f246638j722301P765770J2396791M394973q559202j2581613o088746Q36940
$$ -6246638 -7968939 -203169 12193622 16588595 8029393 -4552220 -10640966 -9804026
36208i804026L059862M623045O602542L674856l907344o898825j266200M687143
$$ -9804026 -6744164 -2121119 4481423 8156279 4248935 -2649890 -3916090 771053
36200G71053M209442K995749P174739R631058P35576j2986756j5049038k837375
$$ 771053 4980495 7976244 15150983 24782041 25517617 12530861 -2518177 -5355552
36192e355552P875115M764528n620320r023656j874380P168971Q778641J294987
$$ -5355552 2519563 7284091 1663771 -7359885 -9234265 -2065294 6713347 8008334
36184H008334q781751j1518901k763672R110528J0879127J409498n926924k075519
$$ 8008334 -773417 -12292318 -15055990 -5945462 4933665 6343163 416239 -1659280
36176a659280M691654K657209l881866j608833Q682238J0960267j462906j4218529
$$ -1659280 3032374 5689583 1807717 198884 8881122 19841389 18378483 4159954
36168D159954j2216406p03784M692101J554852J137893P660780J0912372L148019
$$ 4159954 -8056452 -8760236 -4068135 -2513283 -1375390 6285390 17197762 20345781
36160B0345781p386154p521157J959436P184368M8241j1163444j2852567l290337
$$ 20345781 12959627 5438470 7397906 14582274 14630515 3467071 -9385496 -12675833
36152a2675833O282089O759169J834669Q07534N041741P490872M297260l48299
$$ -12675833 -6393744 365425 2200094 3007628 8049369 15540241 19837501 19489202
36144A9489202k487907m297167p584197p951859j854636N532280P014230L996132
$$ 19489202 17001295 12704128 5119931 -2831928 -4686564 845716 7859946 11856078
36136A1856078K106601J31250n973835j0736894m649687P399850Q861838k531766
$$ 11856078 13962679 14093929 8120094 -2616800 -7266487 133363 8995201 6463435
36128F463435q179833K218747J1357870M98826j8276870j8340589k23690Q732713
$$ 6463435 -1716398 502349 11860219 12359045 -5917825 -24258414 -24482104 -15749391
36120a5749391k533581j2418046k642975J3117542J3170706J978392j024997N009867
$$ -15749391 -18282972 -30701018 -33343993 -20226451 -7055745 -5077353 -6102350 -1092483
36112a092483L997927o339689r335584K313894J3744954J0784410o12715p003959
$$ -1092483 2905444 -3434245 -12769829 -10455935 3289019 14073429 13460714 6456755
36104F456755o669055n744925m871808q55135M255701N471334K704934p53255
$$ 6456755 -212300 -5957225 -10829033 -11684168 -7428467 -1957133 747801 -5454
36096e454l819248n912698m524399l79754M82142l776257n448023P65775P104643
$$ -5454 -3824702 -9737400 -14261799 -14641553 -14159411 -17935668 -23383691 -22617916 -15513273
36087a5513273M211667k358851L15088J1267324J5446466N467876q613369j3916108
$$ -15513273 -11301606 -13660457 -13345369 -2078045 13368421 18836297 10222928 -3693180
36079c693180q693606J417726J1221872J5710108J0696714p83537q892966q167817
$$ -3693180 -12386786 -10969060 252812 15962920 26659634 25876097 16983131 8815314
36071H815314l111393j0707N27048J22028j274519k199274O85370N907417O729426
$$ 8815314 5703921 5693214 6220262 6342290 5067771 2868497 3553867 9461284 16190710
36062A6190710J214659m253070n536532o695467r918443q489267J716905J1292276
$$ 16190710 17405369 13152299 7615767 920300 -8998143 -17487410 -15770505 -4478229
36054d478229Q673568k201091o953683j428626L912664R00571n276655n472622
$$ -4478229 4195339 1994248 -4959435 -6388061 -2475397 -1574826 -6851481 -12324103
36046a2324103L79455M687999L012285q87755l40733N790204J1002936Q555404
$$ -12324103 -11944648 -7256649 -4244364 -5132119 -5472852 317352 11320288 19875692
36038A9875692J46748o071962o206381m265513l691899j969992K285706L771955
$$ 19875692 20022440 13950478 7744097 3478584 -213315 -2183307 102399 3874354
36030C874354j177879o137048k845715N528972Q261069K428654m410384o504254
$$ 3874354 2696475 -3440573 -6286288 -757316 7503753 9932407 5522023 -982231
36022i82231o137560o288108m985536l9511O230399R941900R661443O113048J394887
$$ -982231 -7119791 -13407899 -18393435 -18432946 -12202547 -2260647 7400796 13513844 14908731
36013A4908731j149893j97000N69397k757305o978531n026731K926688P997965
$$ 14908731 13758838 13561838 14131235 11373930 4395399 -631332 2295356 10293321
36005A0293321M520390k219476l761256J96065K431072j950825r776102j3415246
$$ 10293321 14813711 12594235 8832979 9029044 11460116 9509291 -266811 -13682057
35997a3682057q504803J502588Q150101O282013o97122n166145m012842p48762
$$ -13682057 -22186860 -20684272 -12534171 -6252158 -6949280 -12115425 -16128267 -16877029
35989a6877029N46104L95638K047353O124757Q675718N277130k554812o780454
$$ -16877029 -16330925 -15935287 -13887934 -7763177 912541 6189671 3634859 -3145595
35981c145595j715084P307357Q950183L63906q787539q967533j828929M617794
$$ -3145595 -4860679 2446678 11396861 11760767 2973228 -5994305 -7823234 -3205440
35973c205440O356076M670915K024569R07463K412466K963656j723275p230077
$$ -3205440 3150636 7821551 9846120 10753583 13166049 16129705 14406430 7176353
35965G176353m028533N837177P780435k455718q843473L03635J1805962Q334408
$$ 7176353 3147820 8984997 16765432 14309714 5466241 5769876 17575838 25910246
35957B5910246l026773m350135R92172l976766j5218112j0932405Q629151J5778625
$$ 25910246 22883473 18533338 19525510 15548744 330632 -10601773 -1972622 13806003
35949A3806003o27035j5019413n091105J3220849J2074239o164560j7117355j1953627
$$ 13806003 13178968 -1840445 -6931550 6289299 18363538 12198978 -4918377 -16872004
35941a6872004k870092J699896N113514Q440167P168791J998635j226587j564085
$$ -16872004 -19742096 -18042200 -12928686 -4488519 2680272 4678907 3452320 1888235
35933A888235j663844J46338M941702N415978l611419j1640966m589839J2321801
$$ 1888235 224391 370729 5312431 10728409 7116990 -4523976 -9113815 3207986
35925C207986J9076244P379175j1202242k2494778k1336981p824321J2188516
$$ 3207986 22284230 29663405 18461163 -4033615 -25370596 -33194917 -21006401
35918b1006401K2910599J1722573j0923118k0179796q514538O547980R547701
$$ -21006401 1904198 13626771 2703653 -17476143 -25990681 -19442701 -9895000
35911i895000M703235N61200m682111j1997337j1818593M60749J1506824P532364
$$ -9895000 -5191765 -4630565 -9312676 -21310013 -33128606 -32667857 -21161033 -13628669
35903a3628669m320402p078869P08025O462367N623804N356069P331446L699614
$$ -13628669 -17949071 -25027940 -24319915 -17857548 -12233744 -6877675 453771 4153385
35895D153385o302292j0513798j874769Q805709P405963l348602q417588j821651
$$ 4153385 -2148907 -12662705 -14537474 -5731765 1674198 -1674404 -10091992 -11913643
35887a1913643O622551O632984P32547k175069m01567L88260j656283j266588
$$ -11913643 -5291092 1341892 2074439 -100630 -502197 -113937 -1770220 -3036808
35879c036808M232294Q667835N193926l622253r315897q302861l640235J622985
$$ -3036808 1195486 9863321 15057247 11434994 2119097 -6183764 -9823999 -8201014
35871h201014O459888Q425905M986602j407313n305187n340739l855476p27681
$$ -8201014 -1741126 6684779 11671381 10264068 4958881 -381858 -4237334 -4965015
35863d965015M941794P936235J692901q592903q677603M455716J5534278J1075965
$$ -4965015 -23221 7913014 9605915 1013012 -7664591 -3208875 12325403 23401368
35855B3401368k676468j0366682q064109l129440N9314K610322L034334j524250
$$ 23401368 20724900 10358218 2294109 -835331 -776017 1834305 4868639 3344389
35847C344389p034351o114909J64724L660624K524655L165340P508405Q692491
$$ 3344389 -3689962 -9804871 -9640147 -5979523 -3454868 -289528 7218877 15911368
35839A5911368K997303l277922l875299j705105k244229m446388m521960l358477
$$ 15911368 18908671 15630749 11755450 10050345 7806116 3359728 -1162232 -4520709
35831d520709l370961k084062L847766J0600912J0467808K940910l661523k991640
$$ -4520709 -7891670 -9975732 -6127966 4472946 14940754 17881664 14220141 11228501
35823A1228501J348525Q91388o845287j4857230j4331379n093302L652714M621293
$$ 11228501 12577026 13468414 6623127 -8234103 -22565482 -27658784 -24006070 -19384777
35815a9384777J570671K402130N641473K482779o929247j0195853j146715Q784676
$$ -19384777 -17814106 -15411976 -9770503 -7287724 -14216971 -24412824 -25559539 -16774863
35807a6774863P114219m85876l07423O317180O011254k641408n646432K819964
$$ -16774863 -9660644 -10146520 -10453943 -4136763 1874491 -766917 -6413349 -3593385
35799c593385J0137425N775866k475717k809759K244922L580132J766190K549650
$$ -3593385 6544040 12319906 9844189 7034430 9279352 12859484 14625674 17175324
35791A7175324L747720J96366m220050l414351k681768r979505j7658394j0932835
$$ 17175324 20923044 21119410 16899360 13485009 10803241 823736 -16834658 -27767493
35783b7767493O024495J1809113n51511j2226495o541063Q303999J4964955J1163910
$$ -27767493 -21742998 -9933885 -10485396 -22711891 -29252954 -20948955 -5984000 5179910
35775E179910N523047O80786n292862q704486n474934j157552k918925n978315
$$ 5179910 10702957 11383743 6090881 -2613605 -8088539 -9246091 -12165016 -18143331
35767a8143331p34897R861727J2931980M478775n928313r109534n082982J508694
$$ -18143331 -18878228 -9016501 3915479 8394254 2465941 -6643593 -11726575 -10217881
35759a0217881N626724K718040n487813q101552J955908J4583573J3883345R96348
$$ -10217881 -4591157 -1873117 -7360930 -15462482 -13506574 1076999 14960344 15956692
35751A5956692q063822o825713m910131p865142p298017K191563J1407460J1376325
$$ 15956692 7892870 1067157 -3842974 -11708116 -19006133 -16814570 -5407110 5969215
35743E969215P109821O074193M385761l187981r246507m328460N027374M180360
$$ 5969215 13079036 19153229 23538990 20351009 11104502 6776042 11803416 15983776
35735A5983776o585955j1959069m840515M210965M157530j782520m526948l245428
$$ 15983776 9397821 -2561248 -7401763 -3190798 966732 -815788 -5342736 -8588164
35727h588164l276543n060804l275773L812751J0229605R462372K788876k152676
$$ -8588164 -11864707 -16925511 -20201284 -16388533 -6158928 3303444 6092320 3939644
35719C939644n29518M400288O293636L828994R52336K29209N6721j044541j512653
$$ 3939644 3410126 7810414 14104050 17933044 18885380 19114589 19171310 18126769 16614116
35710A6614116Q2381K169677K495840Q46296k083021o073853j0143760j1941874
$$ 16614116 16696497 18866174 21362014 22208310 20125289 14051436 3907676 -8034198
35702h034198r522770k692070O397825J2181154Q474416l004927j0412090n297773
$$ -8034198 -17556968 -20249038 -13851213 -1670059 6804357 3799430 -6612660 -11910433
35694a1910433M519416N069118k844840n195322K417956Q030817L679084k190569
$$ -11910433 -7391017 -2321899 -5166739 -10362061 -7944105 86712 3765796 1575227
35686A575227m39715M016703L200950j18715r96236l659563j1390332j5144399
$$ 1575227 1135512 5152215 8353165 8234450 7238214 3578651 -7811681 -22956080
35678b2956080o923634M082462M549426j187033L89901P797685Q049252P95950
$$ -22956080 -29879714 -25797252 -21247826 -22434859 -22044958 -14247273 -6198021 -5402071
35670e402071j352414L892620N311059K15866p74425M409547L068074q548352
$$ -5402071 -6754485 -2861865 2449194 2665060 1890635 6300182 9368256 819904
35662H19904j4306859k574525J4095826J6790216N663400n196900q257025n370193
$$ 819904 -13486955 -16061480 -1965654 14824562 20487962 15291062 7034037 1663844
35654A663844J353027Q861825R747050J251069p267456o228838k02058q9354n696323
$$ 1663844 3016871 11878696 21625746 22876815 15609359 9380521 9178463 9089109 3392786
35645C392786p415027k604937R20380k135357p156167o966911p94398N711496
$$ 3392786 -4022241 -6627178 -5706798 -7842155 -14998322 -21965233 -22759631 -17048135
35637a7048135O664171K211118p99733K886262Q408735O572021j529052m643034
$$ -17048135 -10383964 -8172846 -8972579 -6086317 2322418 8894439 7365387 2722353
35629B722353J095232N230567m65157q647954q223666j133227K671349Q87064
$$ 2722353 3817585 9048152 8582995 -64959 -8288625 -9421852 -6750503 -5863439
35621e863439m27258K362296P294107J0731512Q229687k885919j5606454j5613334
$$ -5863439 -6290697 -3928401 3365706 14097218 22326905 19440986 3834532 -11778802
35613a1778802J97931J5299074J3304513r02918r967060o952524J525145Q326589
$$ -11778802 -11580871 3718203 17022716 16119798 6152738 -799786 725359 9051948
35605I051948J0176655M982817l682777n502521K117151O411555j639509j0670630
$$ 9051948 19228603 24211420 20528643 15026122 17143273 23554828 21915319 11244689
35597A1244689p108948Q07595k434828j0418134n242173Q353783P966176p353826
$$ 11244689 4135741 4943336 2508508 -7909626 -13151799 -4798016 3168160 -4185666
35589d185666j2914221O94863J1718547L924961p517947l411763Q481698R397332
$$ -4185666 -17099887 -16405024 -4686477 -761516 -8279463 -11691226 -3209528 6187804
35581F187804k38126o396997n118747k336900P20377N637221P791207L270429
$$ 6187804 5949678 -447319 -5566066 -7902966 -7182589 -1545368 6245839 9516268
35573I516268k288670l606712n640409j1625204j1905368P16823J4264749J2861594
$$ 9516268 7227598 3620886 -2019523 -13644727 -25550095 -24833272 -10568523 2293071
35565B293071J297345k727841M499072J0548684Q110634K063118l008216p442469
$$ 2293071 3590416 862575 5361647 15910331 24020965 26084083 23075867 15633398
35557A5633398r444382o579772l244512m618276n617092J359821J0596086R421201
$$ 15633398 6189016 -390756 -3635268 -8253544 -13870636 -12510815 -1914729 7506472
35549G506472j130820o981434k465980L323018K850423j051057m654996q406689
$$ 7506472 6375652 -605782 -3071762 251256 3101679 2050622 -2604374 -11011063
35541a1011063r940298m548117M401568P167972K415595j120946K11072O69149
$$ -11011063 -20951361 -25499478 -21097910 -13929938 -11514343 -12635289 -12424217 -11755068
$$ [...]
##END NTUPLES=NMR SPECTRUM
##END=
