##TITLE=31Pdec_SR52+5xAcCl
 CDCl3, 124 sc
 31.05.2021
##JCAMPDX= 6.0         $$ Bruker NMR JCAMP-DX V2.0
##DATA TYPE= NMR SPECTRUM
##DATA CLASS= NTUPLES
##ORIGIN= UXNMR, Bruker Analytische Messtechnik GmbH
##OWNER= root
$$ XWIN-NMR		Version 3.5
$$ Mon May 31 11:58:26 2021 Russian Standard Time (UT+4h)  she@DPX200
##.OBSERVE FREQUENCY= 81.013821
##.OBSERVE NUCLEUS= ^31P
##.ACQUISITION MODE= SIMULTANEOUS
##.ACQUISITION SCHEME= undefined
##.AVERAGES= 124
##.DIGITISER RES= 16
##SPECTROMETER/DATA SYSTEM= spect
##.PULSE SEQUENCE= zgpg30
##.SOLVENT NAME= CDCl3
##.SHIFT REFERENCE= (INTERNAL, CDCl3, 0, 248.564)
##AUDIT TRAIL= $$ (NUMBER, WHEN, WHO, WHERE, WHAT)
$$ ##TITLE= Audit trail, XWIN-NMR		Version 3.5
$$ ##JCAMPDX= 5.01
$$ ##ORIGIN= Bruker BioSpin GmbH
$$ ##OWNER= she
$$ F:/spectra/data/she/nmr/P31/1/pdata/1/auditp.txt
$$ ##AUDIT TRAIL=  $$ (NUMBER, WHEN, WHO, WHERE, WHAT)
(   1,<2021-05-31 11:56:44.65 +0400>,<she>,<DPX200>,
      <continue with go, POWCHK disabled, PULCHK disabled
       configuration hash MD5:
       00 E9 B6 7A A2 85 ED C7 34 08 36 98 17 FE 4E 26
       data hash MD5: 32K
       3E D3 96 45 2C 1E BB 9B 58 41 59 B7 5E 75 A9 21>)
(   2,<2021-05-31 11:56:49.39 +0400>,<she>,<DPX200>,
      <Start of raw data processing
       efp BC_mod = 2 LB = 1 FT_mod = 6 PKNL = 1 PHC0 = -6612.797 PHC1 = 171.8011 SI = 64K 
       data hash MD5: 64K
       FC DC A8 D3 35 95 4B 1A 4C FD 56 4A 09 18 64 C4>)
(   3,<2021-05-31 11:57:49.68 +0400>,<she>,<DPX200>,
      <pk PHC0 = 189.9873 PHC1 = -40.19994 
       data hash MD5: 64K
       FC FF 60 DB F4 A4 30 57 3E 55 CD B8 DD 27 C3 8E>)
$$ ##END=
$$ 
$$ hash MD5
$$ 5C BD E7 AD 4D E0 30 8C 38 CD 5F 4A 2A 27 23 FE
##$RELAX= 
##$RELAX= 
##$RELAX= 
##$RELAX= 
##$RELAX= 
##$RELAX= 
##$RELAX= 
##$RELAX= 
$$ Bruker specific parameters
$$ --------------------------
##$DU= <F:/spectra>
##$EXPNO= 1
##$NAME= <P31>
##$PROCNO= 1
##$TYPE= <nmr>
##$USER= <she>
##$AMP= (0..31)
100 100 100 100 100 100 100 100 100 100 100 100 100 100 100 100 100 100 
100 100 100 100 100 100 100 100 100 100 100 100 100 100 
##$AQSEQ= 0
##$AQ_mod= 1
##$AUNM= <au_zg>
##$AUTOPOS= <>
##$BF1= 81.014009
##$BF2= 200.13
##$BF3= 200.13
##$BF4= 200.13
##$BF5= 200.13
##$BF6= 200.13
##$BF7= 200.13
##$BF8= 200.13
##$BYTORDA= 1
##$CFDGTYP= 0
##$CFRGTYP= 5
##$CHEMSTR= <none>
##$CNST= (0..31)
1 1 145 1 1 1 1 1 1 1 1 1 1 1 1 1 1 1 1 1 1 1 1 1 1 1 1 1 1 1 1 1 
##$CPDPRG= <waltz16>
##$CPDPRG1= <>
##$CPDPRG2= <waltz16>
##$CPDPRG3= <>
##$CPDPRG4= <mlev>
##$CPDPRG5= <mlev>
##$CPDPRG6= <mlev>
##$CPDPRG7= <mlev>
##$CPDPRG8= <mlev>
##$CPDPRGB= <>
##$CPDPRGT= <>
##$D= (0..31)
0 1 0 0 0 0 0 0 0 0 0 0.03 2e-05 3e-06 0 0 0 0 0 0 0 0 0 0 0 0 0 0 0 0 
0 0 
##$DATE= 1622447635
##$DBL= (0..7)
120 120 120 11 120 120 24 19 
##$DBP= (0..7)
150 150 150 150 150 150 150 150 
##$DBP07= 0
##$DBPNAM0= <>
##$DBPNAM1= <>
##$DBPNAM2= <>
##$DBPNAM3= <>
##$DBPNAM4= <>
##$DBPNAM5= <>
##$DBPNAM6= <>
##$DBPNAM7= <>
##$DBPOAL= (0..7)
0.5 0.5 0.5 0.5 0.5 0.5 0.5 0.5 
##$DBPOFFS= (0..7)
$$ [...]
##$SUBNAM2= <"">
##$SUBNAM3= <"">
##$SUBNAM4= <"">
##$SUBNAM5= <"">
##$SUBNAM6= <"">
##$SUBNAM7= <"">
##$SUBNAM8= <"">
##$SUBNAM9= <"">
##$SW= 501.771253377433
##$SWIBOX= (0..15)
0 1 3 0 0 0 0 0 0 0 0 0 0 0 0 0 
##$SW_h= 40650.406504065
##$TD= 32768
##$TD0= 1
##$TE= 0
##$TE2= 300
##$TE3= 300
##$TEG= 300
##$TL= (0..7)
0 120 53 12 22 120 120 120 
##$TP= (0..7)
150 150 150 150 150 150 150 150 
##$TP07= 0
##$TPNAME0= <>
##$TPNAME1= <>
##$TPNAME2= <>
##$TPNAME3= <>
##$TPNAME4= <>
##$TPNAME5= <>
##$TPNAME6= <>
##$TPNAME7= <>
##$TPOAL= (0..7)
0.5 0.5 0.5 0.5 0.5 0.5 0.5 0.5 
##$TPOFFS= (0..7)
0 0 0 0 0 0 0 0 
##$TUNHIN= 0
##$TUNHOUT= 0
##$TUNXOUT= 0
##$USERA1= <user>
##$USERA2= <user>
##$USERA3= <user>
##$USERA4= <user>
##$USERA5= <user>
##$V9= 5
##$VALIST= <valist>
##$VCLIST= <CCCCCCCCCCCCCCC>
##$VD= 0
##$VDLIST= <DDDDDDDDDDDDDDD>
##$VPLIST= <PPPPPPPPPPPPPPP>
##$VTLIST= <TTTTTTTTTTTTTTT>
##$WBST= 1024
##$WBSW= 4
##$XGAIN= (0..3)
0 0 0 0 
##$XL= 0
##$YL= 0
##$YMAX_a= 6966
##$YMIN_a= -16984
##$ZGOPTNS= <>
##$ZL1= 120
##$ZL2= 120
##$ZL3= 120
##$ZL4= 120
##$ABSF1= 0
##$ABSF2= 0
##$ABSG= 0
##$ABSL= 0
##$ALPHA= 0
##$AQORDER= 0
##$ASSFAC= 0
##$ASSFACI= 0
##$ASSFACX= 0
##$ASSWID= 0
##$AUNMP= <proc_1d>
##$AZFE= 0.1
##$AZFW= 0.5
##$BCFW= 0
##$BC_mod= 2
##$BYTORDP= 0
##$COROFFS= 0
##$CY= -3
##$DATMOD= 1
##$DC= 0
##$DFILT= <>
##$DTYPP= 0
##$F1P= 0
##$F2P= 0
##$FCOR= 1
##$FTSIZE= 65536
##$FT_mod= 6
##$GAMMA= 0
##$GB= 0
##$INTBC= 1
##$INTSCL= 5.30512e-09
##$ISEN= 30
##$LB= 1
##$LEV0= 0
##$LPBIN= 0
##$MAXI= 10000
##$MC2= 0
##$MEAN= 0
##$ME_mod= 0
##$MI= 50
##$NCOEF= 0
##$NC_proc= -6
##$NLEV= 6
##$NOISF1= 182.463
##$NOISF2= 159.3651
##$NSP= 0
##$NTH_PI= 0
##$NZP= 0
##$OFFSET= 248.5645
##$PC= 4
##$PHC0= -6422.81
##$PHC1= 131.6012
##$PH_mod= 1
##$PKNL= yes
##$PPARMOD= 0
##$PSCAL= 0
##$PSIGN= 0
##$REVERSE= no
##$SF= 81.014009
##$SI= 65536
##$SIGF1= 159.3651
##$SIGF2= -187.1042
##$SINO= 113.3802
##$SIOLD= 16384
##$SREGLST= <1H.CDCl3>
##$SSB= 0
##$STSI= 65536
##$STSR= 0
##$SW_p= 40650.406504065
##$SYMM= 0
##$S_DEV= 0
##$TDeff= 32768
##$TDoff= 0
##$TI= <>
##$TILT= no
##$TM1= 0
##$TM2= 0
##$TOPLEV= 0
##$USERP1= <user>
##$USERP2= <user>
##$USERP3= <user>
##$USERP4= <user>
##$USERP5= <user>
##$WDW= 1
##$XDIM= 65536
##$YMAX_p= 396151158
##$YMIN_p= -27267183
$$ End of Bruker specific parameters
$$ ---------------------------------
##NTUPLES= NMR SPECTRUM
##VAR_NAME=  FREQUENCY,     SPECTRUM/REAL,   SPECTRUM/IMAG
##SYMBOL=    X,             R,               I
##VAR_TYPE=  INDEPENDENT,   DEPENDENT,       DEPENDENT
##VAR_FORM=  AFFN,          ASDF,            ASDF
##VAR_DIM=   65536,         65536,           65536
##UNITS=     HZ,            ARBITRARY UNITS, ARBITRARY UNITS
##FACTOR=    0.620285442955139, 1,           1
##FIRST=     20137.2065510759, 0,            0
##LAST=      -20513.1999529892, 0,           0
##MIN=       -20513.1999529892, -27267183,   0
##MAX=       20137.2065510759, 396151158,    0
$$ Real data points
##PAGE= N=1
##DATA TABLE= (X++(R..R)), XYDATA
$$ [...]
##PAGE= N=2
##DATA TABLE= (X++(I..I)), XYDATA
12998d285279K309429O897786O194902K087751J02199J50547j648543n070482
12990F738310o096179l363323P98172M007640M250796n26614q248632j1173463
12982a3613293m617499N143393Q211233M284572J261494K097989J660559k757631
12974A670817o360375m877624o35313K381523L570122L211854Q00142j578652
12966a817506j64010L609575L562480j119149l480264k65136K157851j242999
12958A240842n181848l212173J269530J663365l84038L57199J958485j98576k613419
12949e100633R80000O541450M686792k817161m953972J00397K701078j29378M95612
12940B504185P447019R732777R84921p824642n291618K128035J680081m761739
$$ y = [-4285279, -1975850, 4921936, 11116838, 13204589, 13306788, 13457335, 11808792, 6738310, 642131, -2721192, -1923020, 2084620, 6335416, 5808802, -2439830, -13613293, -18230792, -13087399, -4876166, -591594, 669900, 2767889, 4428448, 1670817, -4689558, -9567182, -10202495, -7820972, -4250850, -1038996, -238854, -1817506, -1981516, 1628059, 5190539, 4071390, 591126, 325990, 2483841, 1240842, -3941006, -7153179, -5883649, -4220284, -4604322, -4247123, -2288638, -2487214, -5100633, -4120633, 2420817, 7107609, 4290448, -663524, -563127, 2137951, 2008573, 2504185, 9951204, 19683981, 20668902, 12844260, 7552642, 9680677, 11360758, 6599019]
12932F599019n697978Q0612L375820J221519n40749j28588j786367m674351k788271
12923d339334K524671K643686k970061m081662L151395Q578763M374695k121487
12915G760666q24544M787664M290868k805731p545694n607929j151328J798434
12907G02406L186195K879627M88806j069146J081218L246295m74669p097214o519567
12898c576049L318591J1292687P770455k215416o680924k979991P88605j326155
12890F391803n865764o354815j778935L300637M130395j70462n869406p248195
12882a3464742k046770N269402P916168M701840O49412p29386j648498m384772
12874c737346n756151j842745M357682N614170M23714m819580m451700K7672L514832
$$ y = [6599019, 901041, 981653, 4357473, 5578992, 5038243, 4909655, 3123288, -1551063, -4339334, -1814663, 829023, -2141038, -6222700, -3071305, 5507458, 9882153, 7760666, 6936122, 11723786, 16014654, 13208923, 5663229, 55300, -1096028, 702406, 3888601, 6768228, 7257034, 6187888, 7269106, 10515401, 10040732, 2943518, -3576049, -257458, 11035229, 18805684, 16590268, 9909344, 6929353, 7717958, 6391803, 526039, -5828776, -7607711, -4307074, -176679, -347141, -6216547, -13464742, -15511512, -10242110, -2325942, 2375898, 3025310, 2295924, 647426, -3737346, -9493497, -11336242, -6978560, -1364390, -940676, -5760256, -10211956, -10184284, -6669452]
12865f669452L489956J001581j324884r22182K013234K911844j941398q163510
12857i604811p210571P81099N492304J632419k475791J611082P988169N569192
12849C783092l549888p146191k143381K126769P52614L70621N478541R289685
12841H961862M903133l348612o959329m827017j161649J952297L385764M31980
12833C338429n524696o480036J387265R491472P734263p93244n016882k261821
12825A874750L54653j155335l319975l351004k351384j10990M576884P921093
12817D438692M299569l562163o532051k737142M4248k029429l010917R16542L810901
12808d361750Q06001k309140J289778P124809N997716j626846o897118n465749
$$ y = [-6669452, -3179496, -2177915, -3502799, -4424981, -2411747, 500097, -1441301, -9604811, -16815382, -16034283, -10541979, -8909560, -11385351, -9774269, -1786100, 3783092, 233204, -6912987, -9056368, -6929599, -6176985, -5806364, -327823, 8961862, 13864995, 10516383, 3557054, -1269963, -2431612, -479315, 2906449, 3338429, -2186267, -8666303, -7279038, 2212434, 9946697, 9153453, 4136571, 1874750, 2229403, 1074068, -2245907, -5596911, -7948295, -8059285, -3482401, 4438692, 8738261, 5176098, -1355953, -4093095, -4048847, -6078276, -9089193, -8172651, -4361750, -3555749, -5864889, -4575111, 2549698, 8547414, 6920568, 23450, -5442299]
12800e442299r22830K612740L692076J084302m268177o244881l00896P764407
12792b025558Q058574J183283k586003N75929L040725p1226k364935J777639N944177
12783A3532605J730507o569968q057175k256372J269929q62528j804004J677657
12775a339349K974717j685190m751504L46532O523358L151896o237993q309075
12767i326608k78733O391398M291807N0893J060533L022413r16627o655230n215838
12758g575992K176271N733649K110436k163905k250623o27188K46427J998901
12750c52024M345185L215983j308199k755944J348321M055097r0178n332668l597803
12741d72230K119414K483487k938447n113217k41131M382156J997374l613896
$$ y = [-5442299, -6365129, -3752389, -60313, 1023989, -3244188, -9489069, -9789965, -2025558, 6033016, 7216299, 4630296, 5206225, 8246950, 8175724, 5810789, 7588428, 13532605, 15263112, 8693144, 635969, -1620403, -350474, -1213002, -3017006, -1339349, 1635368, -49822, -4801326, -4454794, 2068564, 5220460, -1017533, -9326608, -9605341, -3213943, 1077864, 1128757, 2189290, 5211703, 4295076, -2360154, -7575992, -5399721, 333928, 2444364, 280459, -1970164, -2597352, -2350925, -352024, 3993161, 7209144, 5900945, 3145001, 4493322, 8548419, 8458241, 3125573, -472230, 1647184, 4130671, 1192224, -3920993, -4162124, 220032, 2217406, -1396490]
12733a396490m333139Q70217N592104M845892L36527k674268j502712J355018
12725C093149J468093j752052l927062j683576K328888L379843J862027K107291
12717F876601M580020M545092k04936n147284n214467j557538R87945O40823l95265
12708E110991l38122p4148r44369k124769j124068K872620O462603M758150j941855
12699A2657033o688941m226520J489247K719086r43132l121028j602813r88488
12691g05556l060414k862349J885192N268206K615661j362931o41917J857539
12683B993431J28458l523830k269356K801121L744457j325956n489715m048678
12675f990068k37086J735115K170092K285398J366865k29880m33528O25240Q93564
$$ y = [-1396490, -5729629, -4859412, 732692, 5578584, 5915111, 3240843, 1738131, 3093149, 4561242, 2809190, -1117872, -2801448, -472560, 2907283, 4769310, 6876601, 11456621, 16001713, 15796777, 10649493, 5435026, 3877488, 4865433, 5506256, 5110991, 4772869, 4698721, 3754352, 1629583, 505515, 3378135, 9840738, 14598888, 12657033, 5968092, 1741572, 3230819, 5949905, 5006773, 1885745, 282932, -705556, -3765970, -6628319, -4743127, 525079, 3140740, 1777809, 1135892, 2993431, 3121889, -401941, -2671297, 129824, 3874281, 2548325, -2941390, -6990068, -7227154, -5492039, -3321947, -1036549, 330316, 100436, -333092, 292148, 1185712]
12666A185712J071612L341404N288503J990074n044001q503128o171297l210394
12658a0051515j971412J197000O118694O142383L47841j966540L968742R028118
12650A2813311M426797l774907n091570j648991k353984o113761m742216R86006
12642e499315K489127p25779m34420M444970N244741n40407l865850O63663N789654
12633G566384L758499k232898n064219l964161j642210J550377M638720L832487
12625H442979r23143l319977J7831L766934K758564R6893M23965J445106r07268
12616A1801884m342363m414548k226177j114509j36238K355453L209927k21949
12608D911480l604074j931690J783455J891821o2642N85978J837828r66067m687413
$$ y = [1185712, 2257324, 5598728, 10887231, 12877305, 7833304, -669824, -6841121, -10051515, -12022927, -10825927, -4707233, 1435150, 1782991, -183549, 3785193, 12813311, 17240108, 13465201, 8373631, 6724640, 4370656, -1743105, -6485321, -5499315, -3010188, -3735967, -4170387, 274583, 5519324, 4978917, 1113067, 1776730, 7566384, 11324883, 9091985, 4027766, 63605, -1578605, -28228, 4610492, 8442979, 7519836, 4199859, 4217690, 7984624, 10743188, 10840081, 11264046, 12709152, 11801884, 7459521, 3044973, 818796, -295713, -431951, 1923502, 5133429, 4911480, 1307406, -624284, 1159171, 3050992, 2988350, 3574328, 5412156, 4446089, -241324]
12599b41324k739922K199507J420045m421088n223355J796053P161731M311580
12591D263227j331096l190790l236489m735017m469237K05300L904172J251835
12583g338095l021825p11926O574884R283312L706807l552982n109865q60714
12575a030404M279673O062227L190729k499130o723729n903330q94267L494647
12567b3584L246464j063267n044476m766229o55999K929926K591773m56393k783897
12558f025682l282466k908957j417624K039867N823264P171513O064948L756360
12550A1221223j091095r042633j3838236p817223N407617J2380850P229478q11042
12542C638939k088825Q9771j733108m937587j964135N105348O683681R66995l692994
$$ y = [-241324, -2981246, -781739, 638306, -3782782, -9006137, -7210084, -48353, 4263227, 2932131, -258659, -3495148, -8230165, -12699402, -12494102, -8589930, -7338095, -10359920, -11071846, -4496962, 4786350, 8493157, 4940175, -169690, -1030404, 3249269, 9311496, 12502225, 10003095, 3279366, -2623964, -3518231, -23584, 3222880, 2159613, -2884863, -7651092, -8307091, -5377165, -2785392, -3241785, -6025682, -9308148, -12217105, -13634729, -11594862, -5771598, 1399915, 7464863, 11221223, 10130128, 1087495, -12750741, -20567964, -15160347, -2779497, 4449981, 3638939, 1550114, 1639885, -93223, -5030810, -6994945, -1889597, 4794084, 5761079, 2068085]
12533B068085k409468K2796j107137l018945j593058J808949L869794M481034
12525D122050M461706K516968j568036m278134k854163K13965O92985j500300
12517A807041l064825k264514k37209J385411J771515Q20106l95754k73058Q48430
12508C97143N07467k061840l920030k302852J260404L131181K423963R95211l24568
12499A06079k227458l697391j661888M433858R705918Q044184n94048q834194
12491E275060r193331k254847M103278L893195p03387l540266k476653r2284J729135
12482c260100L351843L751092N03615m988078p007918l035781K301799L999246
12474d384282L335765L645061L514224P2379l914000l390827j26863o94612n034880
$$ y = [2068085, -341383, -318587, -1425724, -4444669, -6037727, -4228778, -358984, 4122050, 8583756, 11100724, 9532688, 5254554, 2400391, 2614356, 3307341, 1807041, -1257784, -3522298, -3759507, -2374096, -602581, 217525, -178229, -451287, 397143, 904610, -1157230, -5077260, -7380112, -6119708, -2988527, -564564, 430647, 106079, -2121379, -5818770, -7480658, -3046800, 6659118, 14703302, 14109254, 5275060, -3918271, -6173118, -2069840, 1823355, 1119968, -2420298, -4896951, -4989235, -3260100, 91743, 3842835, 4346450, -641628, -7649546, -10685327, -8383528, -4384282, -1048517, 2596544, 6110768, 6183147, 2269147, -1121680, -1248543, -1943155, -6978035]
12465f978035n259680J762703Q591069Q326377M465556L641447M421702R90113
12457A9961252n866518r721843q602590o169574l600607J535341P631067Q448792
12449C615320K749276k494724j966448R07581N84221k305388l772220l062543
12441e744925j742177J39545K522682L294214J903091J511403L478504L944513
12433I306850P26543j342611J512630L506258k369584j1014925j0819953j481572
12425a1976364N048070K730897q17691J361713M347634J243371m307673m144437
12417f514480J384557M901266L251751k15940k508469l409308k331975J363494
12409d079104N522944P157575O167988L634920q63043n956593o310502J02878
$$ y = [-6978035, -12237715, -10475012, -1883943, 6442434, 10907990, 14549437, 18971139, 19961252, 14094734, 4372891, -4229699, -10399273, -13999880, -12464539, -4833472, 3615320, 6364596, 3869872, 1903424, 2811005, 3395226, 1089838, -2682382, -5744925, -7487102, -7347557, -4824875, -1530661, 372430, 1883833, 5362337, 9306850, 10033393, 8690782, 10203412, 13709670, 11340086, 325161, -10494792, -11976364, -6928294, -4197397, -5015088, -3653375, 694259, 1937630, -2370043, -6514480, -5129923, -228657, 3023094, 2807154, 298685, -3110623, -5442598, -4079104, 1443840, 8601415, 14769403, 18404323, 17541280, 11584687, 5274185, 5377063]
12401E377063N897261L036325m644774o321054l61501M083895K144615o29803
12393H582027L6025j56819m314530o751014k620218K648908K303270K31373L724208
12384C683230Q894981N305351o219664j2586466p199700J154759K435734j054436
12376e586211j445494J692153K897843R39494l47314O28448J614105J544558J817412
12367C754994K600086K119700k41830l230600n506043n625094k192485K724777
12359e596495L215709k585041p105479k549208O436214P762314l94861o339159
12351g156006j940761O271069Q180531M104853P50734l42393j982876l346320
12343D538831j517164J412106R15184j725549j462345J210225R19652k750373
$$ y = [5377063, 11274324, 14310649, 9665875, 3344821, 2983320, 7067215, 9211830, 8582027, 8618052, 8461233, 4146703, -2604311, -5224529, -2575621, -272351, -40978, 3683230, 12578211, 17883562, 11663898, -922568, -8122268, -6967509, -4531775, -5586211, -7031705, -5339552, -2441709, -1502215, -1849529, -1221081, 393024, 1937582, 3754994, 6355080, 8474780, 8232950, 5002350, -503693, -6128787, -8321272, -5596495, -2380786, -4965827, -12071306, -14620514, -8184300, -421986, -816847, -7156006, -9096767, -2825698, 5354833, 9459686, 10210420, 9868027, 7885151, 4538831, 3021667, 4433773, 5348957, 3623408, 2161063, 3371288, 4290940, 1540567]
12335A540567m195222j526639N84101k44556k47229K362209K945988j227178m728315
12326d736274j949920L566777M273063r2353k829960m18059L545286M461782K090874
12317G911216q72177k146700j062392J135255J757334n38948l291745k604734
12309B87109J596536M581032K248954l479123o312128k918937K845505M708248
12301C557196K091430K43714J708782K154720k125544o812505n351987L71102
12293d163092K114872k433225o517272m553458J102248N592958P476190O591578
12285E210799K193141l307800m416935l45480K547783K33895k620892q52212K165491
12276H07790L72777m358130n131369j089236K113486J988478K056042M372432
$$ y = [1540567, -2654655, -4181294, -3597193, -3841749, -4088978, -1726769, 1219219, -7959, -4736274, -6686194, -3119417, 1153646, 1061293, -1768667, -2186726, 1358560, 5820342, 7911216, 7039039, 4892339, 3829947, 4965202, 6722536, 6183588, 2891843, 287109, 1883645, 6464677, 8713631, 5234508, -1077620, -3996557, -1151052, 3557196, 5648626, 5892340, 7601122, 9755842, 7630298, 817793, -4534194, -4163092, -2048220, -4481445, -10998717, -15552175, -14449927, -8856969, -1380779, 5210799, 7403940, 4096140, -320795, -666275, 1881508, 2115403, -505489, -1357701, 807790, 1180567, -3177563, -8308932, -9398168, -7284682, -5296204, -3240162, 1132270]
12268A132270N592460K593507k356419m385876j655605L045961N056651K185603
12260A1208552k732982m629932k317767L51692M24243n31510o75410j464219l564690
12251c932023l470821J072323N757974N127617O20872j981723p50361J829884
12243D273742L825867M020234J59322o672320q963384j670594P982718Q173227
12235A1128812r62433p449643m508292J916746M629672M769934N669873N229674
12227B0424343N46346n257599o897576m322789j321958O89196K946188M992403
12219A1798554M194038l30153n564413o983886l054880K348317L304144r39470
12211D772251m223933j658829L166698L578699q6610j910447m33736M7226j656900
$$ y = [1132270, 6724730, 9318237, 6961818, 2575942, 920337, 3966298, 9022949, 11208552, 8475570, 3845638, 1527871, 1879563, 2303806, 1772296, 1096886, -367333, -3932023, -7402844, -6330521, -572547, 4555070, 5175942, 3194219, 2443858, 4273742, 8099609, 12119843, 12279165, 5606845, -3356539, -5027133, 2955585, 11128812, 10166379, 2716736, -1791556, 125190, 4754862, 9524796, 15194669, 20424343, 20970689, 15713090, 8815514, 4492725, 3170767, 3859963, 6806151, 11798554, 15992592, 15662439, 10098026, 3114140, 59260, 2407577, 5711721, 4772251, 548318, -1110511, 2056187, 5634886, 5548276, 3637829, 3204093, 3251319, 1594419]
12202A594419j149839L269983O697741M804121n75036n297358p156132m805123
12194b617224J469958O290772L405271m398844p071898j824505K565376J84314
12186a996780k540605J389565O840713M908822k254854n237520k068985R53671
12178e973Q17825L61105K46621k197598n693758n132126k78599L222042L055033
12169e605428L087218M920730L987301k245021q330545p837480k060819K757615
12161a1326429L910366L630756L899649L929628K569858M53636q12251n47021
12153E708192J80619l01776j966866k708837j304637M64433M94709k25224L80970
12144G21583J310415M7641k264399j638201K253915M846651L281746j09719k751020
$$ y = [1594419, 444580, 3714563, 10412304, 15216425, 14641389, 9344031, 2187899, -2617224, -1147266, 5143506, 8548777, 4149933, -2921965, -4746470, -2181094, -1996780, -4537385, -3147820, 3692893, 8601715, 6346861, 1109341, -959644, -5973, 811852, 1172957, 1419578, -778020, -6471778, -11603904, -11882503, -8660461, -5605428, -2518210, 2402520, 6389821, 4144800, -4185745, -12023225, -14084044, -11326429, -7416063, -3785307, 114342, 4043970, 6613828, 7067464, 6255213, 5708192, 5888811, 5587035, 3620169, 911332, -393305, 71128, 565837, 340613, 721583, 2031998, 2079639, -184760, -1822961, 430954, 5277605, 8559351, 8449632, 5698612]
12135E698612n463783q070414o242186J974356R797072Q489086m17146o117140
12127c51543k557761M495050O563124L083045q69063k947483m269695m420855
12119a275181j764176J772432J840321j489190k953002J37999L938201M395728
12111D603132L141579L194437K464406k921285j0319500j1573348l558507O583391
12103h385695R247934L161917l978043m801124j18775L230587J349174k123691
12095b417716j704617J891386L232286R43906l77997J580042K554550p47000m205441
12086G49399k779261Q74927P73285k488858l291044m92205J908809K505951L477552
12077A238555M305952K080949j693253k147239N28974J450998M63291K423271
$$ y = [5698612, 234829, -7835585, -14077771, -12103415, -2306343, 6182743, 5765597, -351543, -2909304, 1585746, 8148870, 11231915, 10362852, 7415369, 3145674, -1275181, -3039357, -1266925, 573396, -915794, -3868796, -3730797, 207404, 4603132, 7744711, 10939148, 13403554, 10482269, 162769, -11410579, -14969086, -8385695, 862239, 4024156, 46113, -4755011, -4873786, -1643199, -294025, -2417716, -4122333, -2230947, 1001339, 1945245, 1567248, 3147290, 5701840, 4954840, 749399, -2029862, -1154935, -381650, -2870508, -6161552, -6653757, -4744948, -2238997, 1238555, 5544507, 7625456, 5932203, 3784964, 4313938, 5764936, 6228227, 8651498]
12069H651498O514845N088121l346444r694073p915731l773712l560862l263839
12061a1300197K499639Q615671O946576K41443k188029P03773J776749j217377
12053F078248l041176j376881k06830j449793j654322P65770K305078J083671
12045B503765M36345K537456L740458J97474n429338o739842j566288N372969
12037A052999P457616K988263k916273l956875l01666J880533m50113k626167
12029C128317J8850M127009L335096j686056m540799k878158m18449J75686O3856
12020A325352l55558k543875n186867m110526J339420O385483O870769L347716
12012G071914j659374o157598p652176m301208J500951M871991M833396M601918
$$ y = [8651498, 15166343, 20254464, 16908020, 7213947, -701784, -4475496, -8036358, -11300197, -8800558, -184887, 6761689, 7003132, 4815103, 5518876, 7295625, 6078248, 3037072, 1660191, 1453361, 3568, -1650754, -884984, 1420094, 2503765, 2940110, 5477566, 9218024, 9415498, 3986160, -2753682, -4319970, 1052999, 8510615, 11498878, 8582605, 4625730, 4324064, 6204597, 5754484, 3128317, 3147167, 7274176, 10609272, 8923216, 4382417, 1504259, 1085810, 1261496, 1325352, 969794, -1574081, -6760948, -10871474, -9532054, -3146571, 3724198, 7071914, 5412540, -745058, -8397234, -12698442, -11197491, -6325500, -1492104, 3109814]
12004C109814M790606J919361m260753p740718m338759J663882L418436Q65672
11996e72459m96420J638194L666253K233071o78278p31269K226179L175629j290190
11987I170710o955670o407364K39112M145946K76209m355523r89383O759909P924437
11978I808383J415033k227842K197327O259674J486079p351693r764031m588959
11970b766029M12397R17365L44992K326868N117789M966393J450711k176609k676566
11961G917311k73978J628693Q66461l48056Q40922K179548j119930p772343j0030419
11952f111791m131856M029058O867521M181721P41471p55721k09274K303867M901006
11943A1816002L495327k240644o017618l057465K409967L328706L6685k106568
$$ y = [3109814, 7900420, 9819781, 5559028, -2181690, -6520449, -4856567, -1438131, -572459, -1068879, 569315, 4235568, 6468639, 5790361, 5059092, 7285271, 10460900, 9170710, 2215040, -4192324, -3953212, 192734, 468943, -3886580, -4875963, 1883946, 9808383, 11223416, 8995574, 11192901, 17452575, 18938654, 11586961, 1822930, -2766029, -2353632, -1436267, -1091275, 1235593, 6353382, 11319775, 12770486, 10593877, 7917311, 7643333, 9272026, 10138487, 9790431, 10631353, 12810901, 11690971, 3918628, -6111791, -10243647, -6214589, 652932, 4834653, 5576124, 4820403, 4611129, 6914996, 11816002, 15311329, 13070685, 7053067, 3995602, 6405569, 9734275, 9770960, 7664392]
11935G664392k126771k862595l262073L7698M156001K312584m151167n510731
11927c742662J427673P110899L264246m555470n708775k01447K908226J7837k938337
11918b417810j142645K050421J363535k489457m762528l406269l65766K195647
11910h974872L810593M285470L078723Q68857K4477K037039M929136M697359N3232
11901A4810014n114754n427383l60983M480132L569411j928226n588065l827129
11893F13017k58149l05857l360958l731929O49714M691583L642356M69111J257338
11884C666226N350368O039886J235633k942210j649291J503204J014985j773890
11876A2444911k354245j616559l445438n791135k478393N639691R503456M423087
$$ y = [7664392, 5537621, 2675026, -587047, -549349, 3606652, 5919236, 1768069, -3742662, -2314989, 4795910, 8060156, 3504686, -2204089, -2405536, 502690, 520527, -2417810, -3560455, -1510034, -146499, -2635956, -7398484, -10804753, -11170519, -8974872, -5164279, -878809, 2199914, 3068771, 3093248, 5130287, 10059423, 14756782, 14810014, 9695260, 4267877, 3906894, 8387026, 11956437, 10028211, 4440146, 613017, 354868, 49011, -3311947, -7043876, -6394162, -1702579, 1939777, 2408888, 3666226, 9016594, 15056480, 16292113, 13349903, 11700612, 13203816, 14218801, 12444911, 10090666, 8474107, 5028669, -762466, -3240859, 2398832, 11902288, 16325375]
11868A6325375l263612n895310m471110l891162l772694p28024L665149M389998
11860B358610J249683q10036L74732J491541k36997k989057l611151j588275J231769
11851b529181K475122Q72339j676836r90588L379180N348275L86952n869461m085928
11842b690126M550753Q945355M105020k380639l192685j658380l388234n377469
11834a086405j697396N152483P398186L701777k83238j398801j643910k288372
11826G854324k218503j916219l030139m160865k496471R45583K930911L543789
11818A452410M391838L220604k527749q224022o486532J086125N329653L365012
11810A607339J831263M375545N567062J244211l801271l833411q32065K84013
$$ y = [16325375, 13061763, 7166453, 2695343, -1195819, -4968513, -5696537, -2031388, 2358610, 3608293, 2798257, 3172989, 4664530, 4427533, 1438476, -2172675, -3760950, -2529181, -54059, 818280, -858556, -1849144, 1530036, 6878311, 7265263, 1395802, -2690126, 1860627, 10805982, 14911002, 12530363, 9337678, 7679298, 4291064, -1086405, -2783801, 2368682, 9766868, 13468645, 13185407, 11786606, 10142696, 7854324, 5635821, 3719602, 689463, -3471402, -5967873, -5022290, -2091379, 1452410, 5844248, 9064852, 6537103, -1686919, -8173451, -7087326, -1757673, 1607339, 3438602, 7814147, 13381209, 14625420, 10824149, 6990738, 6158673, 6442686]
11802F442686p08171j423067j527606j249740j49863j61186l761592p005776k760580
11793a2304895O039869O925226k766841q724376p72539J0093321Q210279k470263
11785D229781n798558R37780N440686K074820j510018m44150P5529k804413l394484
11776a193027J025848L888752N82469l576186k868903l08618o29186j348070J902171
11767b524750O477708O475132K150277p80613L25169K135106O00770l894066o863935
11758D100798m626799O73622K482403j576681n269004k271064L755522M159954
11750A428751j583243n761862m740237k536141j548203P98900M141660L568588
11742f231787o72120j264721L899075O809505K434473k255324K50249N349196
$$ y = [6442686, 5734515, 4311448, 2783842, 1534102, 1384239, 1223053, -2538539, -9544315, -12304895, -6265026, 660200, -2106641, -10831017, -11603556, -1510235, 6700044, 4229781, -1568777, -630997, 4809689, 6884509, 5374491, 4930341, 5005870, 2201457, -1193027, -167179, 3721573, 4304042, 727856, -2141047, -2449665, -3078851, -4426921, -2524750, 3952958, 10428090, 12578367, 11797754, 12122923, 14258029, 14858799, 10964733, 4100798, -526001, 147621, 2630024, 1053343, -4215661, -6486725, -2731203, 1428751, -154492, -5916354, -10656591, -13192732, -14740935, -13942035, -9800375, -6231787, -6903907, -8168628, -4269553, 2539952, 4974425, 2719101, 2969350, 8318546]
11734H318546L925814l175973p269608m652169P17937M592110N521974L098641
11726A1077272p83823j572600J636750K975372j432579o036836m083229J080734
11718B861061J279244l104965m229159K55185M541064M900019L859905L012811
11710A3375165k24371o124998r642253p205039j775957J647700J903177R38341
11702g108235M06904Q33671J881218K385977J796254J359763J997921K225984
11694E779457Q12280j93094J421026L509980K295157j684128m668148n494175
11686A778355n583033m266028K55030N397216N451368l65073n796666n094188
11678h223019Q12280O572138P687809L320503k882648m966307j081760L119123
$$ y = [8318546, 12244360, 9068387, 1798779, -2853390, -2135453, 2456657, 7978631, 11077272, 10293449, 8720849, 10357599, 13332971, 11900392, 5863556, 1780327, 2861061, 4140305, 1035340, -3193819, -2938634, 1602430, 6502449, 10362354, 13375165, 13150794, 7025796, -2616457, -9821496, -11597453, -9949753, -8046576, -7108235, -6701331, -5867660, -3986442, -1600465, 195789, 1555552, 3553473, 5779457, 6591737, 6398643, 7819669, 11329649, 13624806, 11940678, 7272530, 1778355, -3804678, -8070706, -7815676, -2418460, 3032908, 2667835, -3128831, -8223019, -7410739, -838601, 6849208, 10169711, 7287063, 2320756, 1238996, 4358119]
11670D358119J505334l563728m659646n16655K910691K550919J667889J712500
11662E965423j046205p030445r077784k430906O653435Q730735L665586j039562
11654D390277j439319n5196O87285J202111J032330j500436m830086m554908k14389
11645e282331K828017R72551j895130m4780N133468O445012Q84486o083872p756712
11636d799291m157050m6244K195514L540725L706904J030349k412933j221310
11628b163336N008659Q764643M460632k790252m047452M29060J967043l203129
11620H425868q508852o730905N70816O169735N565475l25357p199869r493532
11612a1526621l989190N610019J0581156O810272N6711j648082J521263K448595
$$ y = [4358119, 5863453, 2299725, -2359921, -2876576, 34115, 2585034, 4252923, 5965423, 4919218, -2111227, -11189011, -13619917, -6966482, 1764253, 5429839, 4390277, 2950958, 2895762, 3583047, 4785158, 5817488, 4317052, -513034, -5067942, -5282331, -2454314, -1481763, -3376893, -3421673, 1711795, 8156807, 9041293, 2957421, -4799291, -8956341, -9002585, -6807071, -3266346, 440558, 1470907, -942026, -2163336, 2845323, 11609966, 16070598, 13280346, 9232894, 9661954, 11628997, 8425868, -82984, -6813889, -6243073, -73338, 5492137, 5166780, -2033089, -11526621, -15515811, -9905792, 675364, 7485636, 7542347, 5894265, 7415528, 9864123]
11604I864123k358368p908600p215484K86859Q113842R187854K428002o156679
11596F241549q958092m238060K221741L833490O68289j582804M30080L576529
11588B192722L237210J04561q40266K290643N061136K457468m186296q595163
11580A722015p100963k095132J934296K916051J259407j445223k473569K90059
11572d993059M822746N987881K113715k467193l742993l202924l433191k703604
11564g618622J085579M707001M166446K136958L477696N436088J290843o626479
11556H055510p805570K00885O550831L027938l989541m473974R7132J435568j244195
11547A854584j645326J617829L239498J001272j305802j515686j997580l429214
$$ y = [9864123, 7505755, -402845, -7618329, -7331470, 782372, 9970226, 12398228, 6241549, -2716543, -6954603, -4732862, -899372, -231083, -1813887, -1383807, 2192722, 5429932, 5534493, 4694227, 6984870, 12046006, 14503474, 10317178, 1722015, -5378948, -7474080, -5539784, -2623733, -1364326, -2809549, -5283118, -4993059, -170313, 5817568, 7931283, 5464090, 1721097, -1481827, -4915018, -7618622, -6533043, -1826042, 2340404, 4477362, 7955058, 13391146, 14681989, 8055510, 249940, 450825, 7001656, 10029594, 6040053, 1566079, 1663211, 3098779, 1854584, 209258, 1827087, 5066585, 6067857, 4762055, 3246369, 1248789, -2180425]
11539b180425k637794J073962L613059K782743J683880K438048K008408j682895
11531G098986m351801j416485L775764L707611k494205p438330n209093J505324
11523d822229N590473L985125l2530j679489J36455K562896K671202N33056j797242
11514G147717l191328l877353l612542j714860P52133J236685o85718k008171
11506e953437j92671L301313N131740M274728K237496L42123j106034j816525
11498F218733j742013j781986k575894l237024k755500j610540l90917J640734
11490f234407M449142N545398L449286J085854J769773L260557R67812l534635
11482A0758780l621536J562752M318069j11212n628759m432851R55575K055010
$$ y = [-2180425, -4818219, -3744257, -131198, 2651545, 4335425, 6773473, 8781881, 7098986, 2747185, 1330700, 5106464, 8814075, 6319870, -1118460, -6327553, -4822229, 768244, 4753369, 4720839, 3041350, 3177805, 5740701, 8411903, 8944959, 7147717, 3956389, 79036, -3533506, -5248366, -4496233, -3259548, -3945266, -5953437, -6146108, -2844795, 2286945, 6561673, 8799169, 9141292, 8035258, 6218733, 4476720, 2694734, 118840, -3118184, -5873684, -7484224, -7875141, -6234407, -1785265, 3760133, 7209419, 8295273, 10065046, 13325603, 14293415, 10758780, 7137244, 8699996, 13018065, 12906853, 7278094, 2845243, 3800818, 5855828]
11474E855828k092223l961947J32834M543155L370002j121052k864192o22921
11466C239484J774388J459772q60742l224901m352205l470510m70415L215333
11458b689796N077986L705297M55711j507560m49471J872445K442025J066410
11450I973047J97039M51116n43771l410999m828826k911850j097277k525205m011373
11441h708099j131095L554664M168006J526954J553210M230721L113119k694639
11433E612841n281263l53884N425741M763758K29676j728537j141180j845032
11425E682120l155703j662257J628545K724881J229329k08775r15670j448852
11417C873618l41683L014867M817399J776510k935767m285872l011948k515915
$$ y = [5855828, 3763605, -198342, -65508, 4477647, 7847649, 6726597, 3862405, 3239484, 5013872, 6473644, 5612902, 2388001, -1964204, -5434714, -5905129, -2689796, 2388190, 6093487, 6549198, 5041638, 4592167, 6464612, 8906637, 9973047, 10170086, 10621202, 10077431, 6666432, 1837606, -1074244, -2171521, -4696726, -8708099, -9839194, -6284530, -2116524, -589570, 963640, 5194361, 8307480, 5612841, 331578, -22306, 5403435, 10167193, 10396869, 8668332, 7527152, 5682120, 2526417, 864160, 2492705, 5217586, 6446915, 6238140, 5322470, 3873618, 3531935, 6546802, 11364201, 13140711, 10204944, 5919072, 2907124, 391209]
11409C91209j430720L231537Q119971P056125J029369l456520m656425n645020
11401D639526n577950r03040N047152M639933p89448j719315L203066M077675
11393A2617599k494931n784690J054968P629866K251713q421652r219586L13180
11385b053533O852542M494855P17606R21405N58726l777547o755978l577493J460680
11376a158737K017916n35064o86203J850712K472377m96690l576150l509816j104730
11367d726385R26261J552542J764627K351056K557657J428161k28475p59703n54935
11358D310806j609037l377195k347806J986888M334519Q00103m094801k997603
11350b994126L437553P390234M989504K59452k432010l245211k680758O89431
$$ y = [391209, -1039511, 2192026, 10311997, 17368122, 18397491, 14940971, 10284546, 4639526, -938424, -1841464, 3205688, 7845621, 7056173, 5336858, 8539924, 12617599, 10122668, 4337978, 5392946, 13022812, 15274525, 6852873, -2366713, -2053533, 4799009, 9293864, 10011470, 10932875, 11491601, 7714054, 958076, -2619417, -1158737, 859179, 324115, -362088, 1488624, 3961001, 3464311, -111839, -3621655, -4726385, -3800124, -2247582, -482955, 1868101, 4425758, 5853919, 5625444, 4865741, 4310806, 2701769, -675426, -3023232, -1036344, 3298175, 4098278, 3477, -2994126, 443427, 7833661, 12823165, 13082617, 10650607, 7405396, 4724638, 5414069]
11342E414069N237956N163363j354086p725871p237278j861990J571608N24656
11334b67573k259963l688973k085421K713216P030769N056570k599200o723190
11326b823765j716001N002153L574116k872734l513283K255962M137412j673459
11318B370401o657731m493044l1183J097602J457844L979721M441143m52579n165293
11309c453119l722696N60046J958950K439301N639309O922112M92977p954649
11301B882231p697085K67537M859153K299459k80396R18799R46925k386300l226704
11292a416381J508971N927543M944418J699404R3669j842582n470748o241219
11284g96925j475587L142006J736368k530300l038294K46470K767678L173547
$$ y = [5414069, 10652025, 15815388, 14461302, 6735431, -501847, -2363837, -792229, -267573, -2527536, -6216509, -8301930, -5588714, 1442055, 6498625, 3899425, -2823765, -4539766, 462387, 4036503, 1163769, -2349514, -93552, 4043860, 2370401, -4287330, -8780374, -8811557, -7713955, -6256111, -2276390, 2164753, 1712174, -3453119, -7175815, -6615769, -4656819, -2217518, 3421791, 10343903, 10836880, 2882231, -4814854, -4547317, 311836, 2611295, 2330899, 3249698, 4196623, 1810323, -1416381, 92590, 6020133, 10964551, 12663955, 12757624, 10915042, 5444294, -796925, -2272512, 869494, 2605862, 75562, -2962732, -2716262, 51416, 3224963]
11276C224963K823323J309330j432616k057735J193923L772861J013456m045157
11268E802348m942819j128304K712310M024740L532097J606181j062458j722534
11260H821561L61999J085810k065632m553569j910896J689270l92328n673532
11252b637317n760908M44828N360238M303985N64431j609145j889586p82187J949550
11243e6111M504646L922375N45520k601565m313177m814376k879188J248867K642782
11234a800227j799382o126105k708298N152263P331624K535461o47592J247970
11226C185714J876211j966876l993376j17106L435188N54102m100539k633368
11218c760050L407960N652815J290806l634505k525850L978420Q367853L879025
$$ y = [3224963, 6048286, 7357616, 5925000, 3867265, 5061188, 8834049, 9847505, 5802348, 859529, -268775, 2443535, 6468275, 10000372, 11606553, 10544095, 8821561, 9183560, 10269370, 8203738, 3650169, 1739273, 3428543, 3036215, -2637317, -8398225, -7953397, -2593159, 1710826, 2275257, 666112, -1223474, -2005661, -56111, 4448535, 8370910, 8916430, 6314865, 2001688, -2812688, -5691876, -4443009, -1800227, -3599609, -9725714, -12434012, -7281749, 49875, 2585336, 1937744, 3185714, 5061925, 3095049, -898327, -1015433, 2419755, 2973857, -1126682, -3760050, -352090, 5300725, 6591531, 2957026, 431176, 4409596, 12777449, 16656474]
11210A6656474o601128j1102413k770000Q810166Q530919k933747r466708k986454
11202a862891N578196M385241j958035k422696K290247L244740p89980k898601
11194E566221j058139n63056l411702m660658j121603L404426L910177M23478
11186B489144l214662l562458l0824M235326M407381m86661n231309m513188J01683
11177e805568K541953L58843k901277k837738J065689N549365O770682M067392
11169H809341J026466R80234J791826j021285n967581o279398o28299L624661
11161B335965J466492k236470j356579J765566J777507j04677L13376J444392
11153E405572r20738m802863m686294q09458K045217K896567L636885K133335
$$ y = [16656474, 10055346, -1047067, -3817067, 4993099, 13524018, 10590271, 1123563, -1862891, 3715305, 8100546, 6142511, 3719815, 6010062, 9254802, 8464822, 5566221, 4508082, 3945026, 533324, -4127334, -5248937, -1844511, 2065666, 2489144, -725518, -4287976, -4318800, -83474, 4323907, 3837246, -1394063, -5907251, -5805568, -3263615, -2904772, -5806049, -8643787, -7578098, -2028733, 4741949, 8809341, 9835807, 10816041, 12607867, 11586582, 5619001, -660397, -1288696, 2335965, 3802457, 1565987, 209408, 1974974, 3752481, 3647804, 3961180, 5405572, 4484834, -318029, -5004323, -5813781, -3768564, -871997, 2764888, 4898223]
11145D898223m321187j0069183o284137M253684Q467388J784909m886588j830776
11137g987667N406309N832744l85090l929765j010506K596012J424352k645207
11129f98818m451351k168012J881305M506197M224636J776385o48091q08015J900665
11120E514901N104577M456994j597165p778897o424759K048025P541695L203162
11112A2068533m422452m517879K127473M900240k45128n920195o133717m087783
11104f230908l420505j120510M636957P709401L161424k951519k166603K423154
11096B040891J035297o175178q408262j084278O906797O524216O88187k273463
11088g45793q08288O63955M76470Q29513K084532K042557O76122O53980K531539
$$ y = [4898223, 577036, -9492147, -15776284, -11522600, -3055212, -1270303, -6156891, -7987667, -2581358, 3251386, 2866296, -1063469, -2073975, 522037, 1946389, -698818, -5150169, -7318181, -5436876, -930679, 3293957, 5070342, 4422251, 3614236, 5514901, 10619478, 15076472, 13479307, 5700410, -724349, 1323676, 8865371, 12068533, 7646081, 3128202, 5255675, 10155915, 9910787, 3990592, -2143125, -6230908, -9651413, -10771923, -6134966, 1574435, 4735859, 1784340, -382263, 2040891, 3076188, -3098990, -11507252, -12591530, -5684733, 839483, 1527670, -745793, -1554081, -890126, -413656, 415857, 2500389, 4542946, 5219068, 5873048, 8404587]
11079H404587L257830N53896l889997o481224n202287r03860L152057L495157
11071B386159K38930k141593l83997K383497P82945m255636o116948k365142J512310
11062g959475O07738k259893j695504K085576M803114M814692L462482J031694
11054D890424k536975m415918j664337L271074M735515J611648j582446j593296
11046B715689k8234O73038P18623J067270J288991O30819j001369l438362n551309
11037b924844m969030j288843J755882R92012q49852R25823N166638O652012M672683
11028A0132481L187344K661388o16516n951944p048161k144000K243148J431457
11020C895197p58397M5141J145133j135039l817215k346649J347037K353518N51026
$$ y = [8404587, 11662417, 12216313, 8326316, 1845092, -3357195, -4261055, -1108998, 2386159, 2625089, 483496, 99499, 2482996, 3265941, -989695, -7106643, -9471785, -7959475, -7351737, -9611630, -11307134, -9221558, -4418444, 396248, 3858730, 4890424, 2353449, -2062469, -3726806, -455732, 4279783, 5891431, 4308985, 2715689, 2687455, 3360493, 4079116, 5146386, 6435377, 7066196, 6064827, 2626465, -2924844, -7893874, -9182717, -7426835, -6434823, -7284675, -6358852, -1192214, 5459798, 10132481, 13319825, 15981213, 15364697, 9412753, 2364592, 220592, 2463740, 3895197, 3136800, 3181941, 4327074, 3192035, -625180, -2971829, -1624792, 728726, 1279752]
11011A279752j141638k549973m256923l653062N18560L335655N75482k919290
11003h811437J39597O965866P838040R72513m871347l584610R70543K996221K465960
10994E081346J607248K00993j789346k099266l76184o3151k608944m101724j468695
10985e617723K062973K210309P98779K204142M973679L389328k797290o474063
10977G50134l108643K454742K857612j455468l548371l13955L603483L087058
10969D326592n88103k567070j046801J798673L462667K844643J7907l002163k995472
10960B250873R7080J734048p08065k584347J626339Q484269Q844914Q61833p097276
10951A3509668p873097l485262M04914J854154J489104m34734k237656p67953
$$ y = [1279752, 138114, -2411859, -6668782, -10321844, -9803284, -6467629, -5892147, -8811437, -8671840, -1705974, 6132066, 7104579, 2233232, -1351378, -380835, 2615386, 5081346, 6688594, 6889587, 5100241, 3000975, 2624791, 2561640, -47304, -4149028, -5617723, -3554750, -1344441, -545662, 1658480, 6632159, 10021487, 7224197, 750134, -2358509, 96233, 2953845, 1498377, -2049994, -2363949, 1239534, 4326592, 3738489, 1171419, 124618, 1923291, 5385958, 8230601, 8248508, 5246345, 2250873, 2347953, 4082001, 3373936, 789589, 2415928, 10900197, 19745111, 20606944, 13509668, 5636571, 2151309, 2556223, 4410377, 5899481, 5464747, 3227091, 2459138]
10943B459138L355258M762058R43999l478799l647225j330391q61904k003146
10935A98988j321403J887775M840904M736239Q93380m372501o279667k535175
10927a951460K183966J889669r43503R73184N769632K789660r226815j5982661
10919a4498328p383406O767372J0998203N637125K070377K945251Q51789n967976
10911A420407r823593n988242J491388P255271R379766O698961k41179n601284
10903D591495l733577J896905L143519k73666j462487R63473J031331k674783
10895C482210l665386P02431L590408l84472o262009o356837j109386L099655
10887f903386L087952J047946r2801J38405L11865o76564j444027P07661M677749
$$ y = [2459138, 5814396, 10576454, 11520453, 8041654, 4394429, 3064038, 2202134, 198988, -1122415, 765360, 5606264, 10342503, 11235883, 6863382, 583715, -1951460, 232506, 2122175, 1178672, 2151856, 7921488, 10711148, 1484333, -14498328, -21881734, -15114362, -4116159, 1520966, 3591343, 6536594, 7388383, 1420407, -8403186, -14391428, -12900040, -5644769, 3734997, 10433958, 10192779, 4591495, 857918, 2754823, 5898342, 5624676, 4162189, 5125662, 6156993, 3482210, -183176, 519255, 4109663, 3725191, -2536818, -8893655, -10003041, -6903386, -3815434, -2767488, -2860289, -2721884, -2410019, -3086583, -4530610, -3822949, 854800]
10878H54800M541086k102492p795465l922389N913691R313606K302497n229978
10870C875356l943715K571953M418883q92770o659438o417636r01766L951778
10862c997355L756849Q8204j938196l85812J371156L74789j491579j521050p29640
10853d472634l05248K332398Q227194J1396625N875056m140111q735609n394074
10845D783597j98984K678662M391952M771950J234163m253365n242132m03701
10837G762142L629533J637620l604422o395223m834202o39553L383570M363988
10829E303453J650622j498824j959401j407132k809649m366073k428118J656585
10821e858537L846353M342186N416861M987960M81307l402722l30784N865406
$$ y = [854800, 5395886, 3293394, -4502071, -8424460, -2510769, 6802837, 9105334, 3875356, -68359, 2503594, 6922477, 6029707, -629731, -7047367, -7949133, -3997355, -240506, -152302, -2090498, -2476310, -1105154, -730365, -2221944, -3742994, -4472634, -4777882, -2445484, 5781710, 17178335, 23053391, 18913280, 10177671, 4783597, 4584613, 7263275, 11655227, 16427177, 17661340, 13407975, 8165843, 7762142, 11391675, 13029295, 9424873, 3029650, -1804552, -2444105, 939465, 5303453, 6954075, 5455251, 3495850, 2088718, -720931, -5087004, -7515122, -5858537, -2012184, 2330002, 7746863, 12734823, 13216130, 9813408, 9482624, 15348030]
10813A5348030N408613k051933p139805n909535l795304l351174l28246N206654
10805C387300O024271M60572l281976p72628J475949j526578m080360n29008M067138
10796E224680K493494k619652l841090n74805K015961J621282j23362j835316
10788B361192k727761j892374m51853n18038k92576L883971Q991158O893813k473148
10779A3774384q444982m938954N83314k10581l594700j733436L619548M754514
10771C809107O23223l003995l020552j154418R79473K634501J916312j492582
10763A291069l734414j600347K366730L641449J950038J23835l99682K44220J622018
10754E504916K074775J95699j285603J613486N847379L199283o508422j2178408
$$ y = [15348030, 20756643, 18704710, 11564905, 5655370, 1860066, -1491108, -1819354, 3387300, 9411571, 9872143, 6590167, 5817539, 7293488, 5766910, 1686550, 1157542, 5224680, 7718174, 5098522, 1257432, 682627, 2698588, 4319870, 4196508, 2361192, -366569, -2258943, -2710796, -3228834, -3521410, 362561, 9353719, 16247532, 13774384, 5329402, 390448, 973762, 763181, -2831519, -4564955, -945407, 3809107, 4432330, 1428335, -1592217, -2746635, -1767162, 867339, 2783651, 1291069, -2443345, -4043692, -1676962, 1964487, 3914525, 4038360, 3638678, 3882898, 5504916, 7579691, 7775390, 6489787, 8103273, 13950652, 17149935, 10641513, -1536895]
10746a536895o521821L238828O171990K321492p81381m52995M61030R66244J903971
10737E770463J443859k100256n156536l229782J465644K847090K2760k188432
10729a125190r19900J658234K708201K098871J096446K68991r10843l064994n055147
10720c245331m075545L04897L919396L430802J689090K485735K909793j433899
10712E984938o179679l382858M057840N053448j713933n453506j629379J319630
10704a943499j271773j426532N345436Q975531J294177q165888o217039L149146
10696b60441O258702J601097o76604K358522K695457l297037q187678m989196
10688d497178L172932Q097398O105752M93325k913468j940503k92494j951934
$$ y = [-1536895, -8058716, -4819888, 1352102, 3673594, 2892213, 2439218, 2900248, 3866492, 5770463, 7214322, 5114066, -42470, -3272252, -1806608, 1040482, 1063242, -1125190, -2045090, -386856, 2321345, 4420216, 5516662, 5785653, 4874810, 1809816, -3245331, -7320876, -7015979, -3096583, 334219, 2023309, 4509044, 7418837, 5984938, -194741, -3577599, 480241, 5533689, 3819756, -1633750, -3263129, -1943499, -3215272, -4641804, 703632, 9679163, 10973340, 2807452, -3409587, -260441, 5998261, 7599358, 6922754, 9281276, 11976733, 8679696, 492018, -4497178, -1324246, 6773152, 12878904, 13372229, 10458761, 8518258, 8225764, 6273830]
10680F273830m313348j896335L578155M504487j00524k515790O04044L077672
10672I212191J244696M26401L432059L525373l195537q492116m442087L431734
10664E142714N218186J266008j823695k896294m319520m556861j825777M47524
10656c347715j81977J82882L638577M681133L50001k615948M45703K777983j176892
10647D753747l974122J644015P384991J918203q879542j0055585q41981N925928
10639b124346M587873J854941K438488L086313J331875q30421k306877l356726
10631D681120k006982K417756N108403K412234j582857k218086k046664l709939
10623C054985k630131L799098P818938K947781l935877l791475m88492j941716
$$ y = [6273830, 1960482, 64147, 3642302, 8146789, 8046265, 5530475, 6134519, 9212191, 10456887, 10883288, 14315347, 17840720, 14645183, 6153067, 1710980, 5142714, 10360900, 11626908, 9803213, 6906919, 2587399, -1969462, -3795239, -3347715, -3529692, -3346810, 291767, 4972900, 5322901, 2706953, 3152656, 5930639, 4753747, 779625, 2423640, 9808631, 11726834, 2847292, -7208293, -8050274, -2124346, 2463527, 4318468, 6756956, 9843269, 11175144, 10344723, 8037846, 4681120, 2674138, 5091894, 10200297, 12612531, 11029674, 8811588, 6764924, 3054985, 424854, 4223952, 12042890, 14990671, 11054794, 7263319, 6774827, 4833111]
10615D833111m568249r69885M521168L442911m12639J706461O013404K952444
10607A7518726l779636k828127L908836L981196m070208r182790o709797k607983
10599c769783L69904M895383Q301767M975815j201800j555248J574238j270048
10591A2320228q468242q746419k10901P180514P881818N313962J302575m799793
10583A1773742q020154l082689M153349M485054J088546K666237N872654J739935
10575B0676674n183881l398703L555143K278956n722143o095642K286764N377486
10567A3774654q57116m930590j898468q1047k567243j938054L044352M389063
10559H935551J416146J755866L920469j487110j1089698r963248L057809J1627549
$$ y = [4833111, 264862, -705023, 3816145, 7259056, 6846417, 8552878, 14566282, 17518726, 13739090, 10910963, 14819799, 18800995, 14730787, 5547997, -1161800, -3769783, -3399879, 1495504, 9797271, 14773086, 13571286, 12016038, 13590276, 12320228, 3851986, -4894433, -5105334, 2075180, 9956998, 15270960, 16573535, 11773742, 3753588, 670899, 4824248, 9309302, 10397848, 13064085, 18936739, 20676674, 15492793, 12094090, 15649233, 17928189, 12206046, 6110404, 8397168, 13774654, 12917538, 7986948, 6088480, 6007433, 3440190, 1502136, 4546488, 8935551, 10351697, 12107563, 16028032, 14540922, 3451224, -6512024, -3454215, 8173334]
10551H173334P518504M83348j368852j767715l069269j639765L15070l492879
10543E151776q307638l831237N353580N653626m68553J209734Q495493N475948
10535A8732729o199867p578755L252969O990778j734651n501981K458068O461929
10527A6881219p63842n085818P08655M186763m13652j188475N543922O331291
10519B6200063k142599n034287J760867L620332l077449l832825L024211J140995
10511B1659308r627127r094762M258613P987145j551927k321103Q030109N813296
10503B5153552q545097n189486J6155086J8373639l901577r790340J0670842J4860641
10495E7787260p582705p546125K5793232K9993703j0336859r285342O6478929
$$ y = [8173334, 15691838, 16175186, 14806334, 13038619, 9969350, 8329585, 8644655, 5151776, -3155862, -6987099, -1633519, 4020107, 3551554, 4761288, 13256781, 18732729, 12532862, 4954107, 8207076, 15197854, 13463203, 7961222, 10419290, 16881219, 16117377, 11031559, 11740214, 15926977, 15513325, 14324850, 19868772, 26200063, 24057464, 19023177, 20784044, 24404376, 21326927, 17494102, 20518313, 21659308, 12032181, 2937419, 7196032, 15183177, 13631250, 11310147, 19340256, 25153552, 16608455, 11418969, 27574055, 45947694, 42046117, 32255777, 42926619, 57787260, 50204555, 42658430, 68451662, 98445365, 88108506, 78823164, 145302093]
10488A45302093R1595722m0346516k10384878k07085918l0994513J03718951P5210751
10481g2984308p371636j1689366L0949028K8761831p612492j1981138J1336351
10474d0591730J2416696n844930m829768J0501123P589210o165406q26483J4009646
10466a3741642P427083j1697713j0288592P860759J1391236q42166l162692N327670
10458g726057K143873j1312569j0545794N644584J1937601Q94361p021939p79301
10450a6765241O752614N445058J048876j501746m388082n295880J87676O053223
10442h463502M061484k62167K120948N156563j052848r180535o171736K695807
10434a1095986L286650k116317j511294L064739J687356j548917L170051Q789936
$$ y = [145302093, 236897815, 196551299, -13833579, -220919497, -251914010, -148195059, -72984308, -80355944, -92045310, -61096282, -32334451, -39946943, -51928081, -40591730, -28175034, -34019964, -38849732, -28348609, -20759399, -26924805, -27751288, -13741642, -6314559, -18012272, -28300864, -20440105, -9048869, -9891035, -13053727, -7726057, -5582184, -16894753, -27440547, -21795963, -9858362, -8964001, -15985940, -16765241, -10012627, -4567569, -3518693, -5020439, -9408521, -14704401, -14516725, -8463502, -4402018, -4664185, -2543237, 2613326, 1560478, -7620057, -13791793, -11095986, -7809336, -9925653, -11436947, -8372208, -6684852, -8233769, -5063718, 3726218]
10426C726218K258247q792678o527548N346292P513737j056186l262927L516678
10418B721833L521071o874064j2024106m869449K851561L444981L272755M680329
10410c275089N04626p196640m999784P664963J3055876K860597q043571n790940
10402e219962K206798K723397k732404n130751l759658l059506k376840J072504
10394a6276422N234067O403064M312829K17493m195561m470406K203451R341889
10386B770404P261821k088241o621866j877569L650654L117182N6750o74530j64956
10377E429649j09774L68341m4272l473792n446480L26682Q584598O749655m706016
10368G678591j0008932j428909Q676398O795919k750095p117282l630379Q14124
$$ y = [3726218, 5984465, -2808213, -9335761, -3989469, 3524268, 2468082, -794845, 2721833, 6242904, -631160, -12655266, -17524715, -14673154, -11228173, -7955418, -3275089, -2770463, -9967103, -14966887, -7301924, 5753952, 8614549, 570978, -5219962, -3013164, -289767, -3022171, -8152922, -11912580, -14972086, -17348926, -16276422, -11042355, -4639291, -326462, -108969, -4304530, -8774936, -6571485, 2770404, 10032225, 7943984, 1322118, -555451, 3095203, 6212385, 6269135, 5594605, 5429649, 5319875, 5688216, 5643944, 2170152, -3276328, -2949646, 5634952, 12384607, 7678591, -2330341, -3759250, 4917148, 11713067, 8962972, 1845690, -1784689, -970565]
10360i70565K086028J152362j260519m493213n679207l325639j23899J451968
10352a1162684K241609K467442L44351k480353p41163N317155P462852J126000
10344D575209o704264p016320j086164K820843J267467j729564j746176J112155
10336h506814L521507K703503l52896j311388J754200M438552J999296k628831
10328A617129l074629k09865l46606l281952k161101L256254M178591k353176
10320b375355o842224j857768O166777P328103K613057n47486o58024j214589
10312B612491k262488j625754r36092k351041k569705J834315O240991L856494
10304D799211k499472l788393R38540L259456o26126m045685j179315L890632
$$ y = [-970565, 1115463, 2267825, 1007306, -3485907, -9165114, -12490753, -12614652, -11162684, -8921075, -6453633, -6109282, -8589635, -9330798, -4013643, 3449209, 4575209, -2129055, -9145375, -10231539, -7410696, -6143229, -7872793, -9618969, -8506814, -4985307, -2281804, -2634700, -3946088, -2191888, 2246664, 4245960, 1617129, -1457500, -1667365, -2013971, -5295923, -7457024, -4200770, -22179, -2375355, -9217579, -11075347, -4908570, 2419533, 5032590, 4485104, 3827080, 2612491, 350003, -1275751, -2211843, -4562884, -7132589, -5298274, 942717, 4799211, 2299739, -1488654, -550114, 2709342, 2083216, -1962469, -3141784, 748848]
10296G48848M400692J077778p12469N7596M1568j571865j988118n33384l49840
10287A170806k915738m865165k917886O72532J034154k075246l641840m92861
10279a4031244M290511N756497L395128P19398J44068Q61965J132761M68483l25288
10270B412279N4480K024328L650701K098166k106045m393813k023144J517897
10262C234849J146840k476509m128212j691292J460711J956989O74333N22841
10254G00550K499842M797613M460071K51288m871408n722567j326533K904323
10246C693179K403990L2002Q80197L156179P97957n674652q320946l322102L189784
10237c164412L862248m75024l722280k950256j79925J791413K073012J421726
$$ y = [748848, 5149540, 6227318, 5514849, 5572445, 5614013, 4042148, 2054030, 1520646, 1170806, -1744932, -6610097, -9527983, -8855451, -7821297, -9896543, -13538383, -14031244, -9740733, -3984236, -589108, 130290, 274358, 1136323, 2269084, 2737567, 2412279, 2466759, 4491087, 8141788, 10239954, 8133909, 3740096, 1716952, 3234849, 4381689, 1905180, -2223032, -3914324, -2453613, -496624, 177709, 700550, 3200392, 7998005, 12458076, 12709364, 7837956, 2115389, 788856, 3693179, 6097169, 6129171, 7009368, 10165547, 10963504, 5288852, -3032094, -6354196, -3164412, 697836, 222812, -3499468, -6449724, -6629649, -4838236, -2765224, -1343498]
10229a343498J222795J840453J657773m98283k475389j354401J538569K147816
10221B735835J56376p92165K45485K42096j035697O46168N849822P912381K369014
10212A8329315n216131o712605k825591n45476j844494k029536J313672M436123
10204D905277L595590k692k943206l414822j225544K361566L882020N80774m656286
10195C082677n270473J03135M786881L141682j283818j316998K739468L739468
10187I722022p97055m446385j905757K289531L61772o522392r209226l514311
10179a4021801M022615N554460K093430M30819L136733O178235N263559N70236
10171A3228286m726824p550008o415611k445175Q16916O86262j432391j903304
$$ y = [-1343498, -120703, 1719750, 3377523, 2879240, 403851, -950550, 588019, 2735835, 2892211, 2100046, 2345531, 2587627, 1551930, 2198098, 8047920, 15960301, 18329315, 13113184, 6400579, 3574988, 3029512, 1185018, -844518, 469154, 4905277, 8500867, 8498175, 5554969, 2140147, 914603, 3276169, 7158189, 7738963, 3082677, -2187796, -2084661, 2702220, 5843902, 4560084, 3243086, 5982554, 9722022, 8924967, 4478582, 2572825, 4862356, 5224128, -1298264, -10507490, -14021801, -9999186, -4444726, -2351296, -1920477, 1216256, 7394491, 12658050, 13228286, 8501462, 951454, -5464157, -7909332, -7092416, -6406154, -7838545, -9741849]
10163i741849L83971L232957M614078M178846J509653l613707q208503o946660
10155a4591214J302833R923504J0735169L281755m571402n609830p71432L340504
10147C039887K855256L87041L56415K773228L503587m9258n563533q331808n795304
10138f824489M87797N972100O432659K051228j974697j258093J644200L77414
10130F908119n599554r135813n187190J995354N049903L218477J358858J804490
10122D12644K259374P99982j448343k536437j562775J019010K629443N5840n377275
10113c748537o976054j224519N771264N958679R48590j040221J633696K309593
10105C632491j861761m854359k011435K300596K165116p26446j039199J400072
$$ y = [-9741849, -9357878, -6124921, -1510843, 2668003, 4177656, 563949, -7644554, -14591214, -13288381, -3364877, 7370292, 10652047, 6080645, 470815, -300617, 3039887, 5895143, 6282184, 6638599, 9411827, 12915414, 12866156, 7302623, -1029185, -6824489, -6336692, -364592, 6068067, 8119295, 6144598, 4886505, 6530705, 6908119, 1308565, -7827248, -13014438, -11019084, -5969181, -2750704, -1391846, 412644, 2672018, 3472000, 2023657, -512780, -2075555, -1056545, 1572898, 1628738, -3748537, -10724591, -11949110, -6177846, -219167, 729423, -310798, 1322898, 3632491, 1770730, -3083629, -5095064, -2794468, -629352, -1355798, -2394997, -994925]
10097i94925K574614J229487n93841k182269m299100n677957l935014J15523K763725
10088a0999757K315431Q40836P07482J722727K235684J472504L08629L85677K193337
10079A182550L753021K389720j615044m771033m709657k914741j844579j360749
10071i890512M4365K082294K931192J756328o25330k623768k386513P67724M084112
10062c860108L009032k604667o397091k978282M235275O665298J391772n636482
10054f175253p384063l046145L163315P088140O993305L629646q5781j137180
10046C045984L42864J214827l15286k153303j369598J732001M083158L354490
10038I935137j83322m280873o146911m364821m81804K263130K574898K149502
$$ y = [-994925, 1579689, 2809176, 2215335, 33066, -4266034, -9943991, -13879005, -13763482, -10999757, -8684326, -7843490, -7136008, -5413281, -3177597, -1705093, -1396464, -1010787, 1182550, 4935571, 7325291, 5710247, 939214, -3770443, -6685184, -8529763, -9890512, -9846147, -7763853, -4832661, -3076333, -3701663, -6325431, -8711944, -7944220, -3860108, -851076, -3455743, -9852834, -12831116, -8595841, -1930543, -538771, -6175253, -13559316, -16605461, -13442146, -6354006, 639299, 4268945, 4183164, 3045984, 3388848, 4603675, 4288389, 2135086, 765488, 2497489, 6580647, 9935137, 9751815, 5470942, -675969, -5040790, -5522594, -3259464, -684566, 1464936]
10030A464936K382192K100981Q5631k272662k991248k319936j216017P94508L149919
10021A178304K231506l440023p884469l921344N445917R129833L234760l221819
10013B752665j788984L355971L195748j919243m166244j304810R25698j097060
10005d6259m256096m936206l100445Q28005O497710R749294N344971l856003p434847
9996a209876j073192O569288N652353j530458n156131j896941K479600K706119
9988F540762j83449k573572k710762p17712K111757L278999J125240k526135l929207
9979D15921j953646O92196J002279r50989k464626j309715J731756L548155K368362
9970C079693q3149j426157k153923l569395l704078J92272N519464O177354J466389
$$ y = [1464936, 3847128, 5948109, 6033740, 3761078, 769830, -1550106, -2766123, -1971615, 1178304, 3409810, -30213, -7914682, -11836026, -6390109, 2739724, 5974484, 2752665, 963681, 4319652, 7515400, 5596157, 1429913, 125103, 1050801, -46259, -4302355, -9238561, -12339006, -11511001, -5013291, 4736003, 10080974, 6224971, -1209876, -2283068, 4286220, 9938573, 8408115, 3251984, 1355043, 3834643, 6540762, 6357313, 3783741, 1072979, 355267, 2467024, 5746023, 6871263, 4345128, 415921, -1537725, -845529, 156750, -794239, -3258865, -4568580, -2836824, 711331, 3079693, 2996544, 1570387, -583536, -4152931, -7857009, -7664737, -2145273, 4032081, 5498470]
9961E498470k528315k197744j020442k126584k558797O79231M371238M064758
9953D181815P77986k224656m748355o566316m187480K743692O686600J737447
9945a599267n922038n833973J277602N350242K778030J46993J718055L347969
9937A263613J557199l72240N23814J283365n80521j312433K718600P391438N732761
9928A8205596j796484p414011o087637j344655L0793l314182n930515k862780
9920a0513875L557547O577575M114066J005497R43583J052581k014195n325793
9912f03014m475203j391746p11412j016275K649695Q658690R254139J956371o442863
9903G878382q895319n467988n16426K300983J342718j811464k359861J647396
$$ y = [5498470, 2970155, 772411, -248031, -2374615, -4933412, -4254181, 117057, 4181815, 4959801, 2735145, -2013210, -8579526, -12767006, -10023314, -3336714, -1599267, -7521305, -13355278, -12077676, -6727434, -3949404, -3802411, -2084356, 1263613, 2820812, 2448572, 2972386, 4255751, 3675230, 2362797, 5081397, 12472835, 18205596, 16409112, 8995101, 2907464, 1562809, 1593602, -1720580, -7651095, -10513875, -6956328, -378753, 3735313, 4740810, 5684393, 6736974, 4722779, -603014, -5078217, -6469963, -7181375, -8197650, -5547955, 3110735, 12364874, 14321245, 7878382, -1016937, -6484925, -7001351, -4700368, -3357650, -5169114, -7528975, -5881579]
9895e881579M524468O70504m762848j939960P346696J0301252K247770o100408
9887F405895n233995o4484M94160k125142j196755K824560M505864L461255L077102
9878A2148460K706093k941j659362K714061R193093P891023k608128j1874856
9870A8507443j1238612m281213k97553k134376m817547l794518l39004J513411
9862f881969R20170J021597L543178M997301J285533n042133o923502k893733
9854i973558N86304m79398j075302L742553Q672367N139458m335873q063509j944163
9845g731121M657660L069493k489918k841292J579774K272017k977390n880830
9837a0341607k12990Q117236Q898505J857162l512930j734759J775854J8090n022332
$$ y = [-5881579, -1357111, -686607, -5449455, -7389415, -42719, 10258533, 12506303, 6405895, 1171900, 1107416, 1601576, -523566, -1720321, 1104239, 5610103, 9071358, 12148460, 14854553, 14851612, 13192250, 15906311, 25099404, 32990427, 30382299, 18507443, 7268831, 2987618, 2690065, 555689, -4261858, -8056376, -8395380, -6881969, -5961799, -4940202, -1397024, 3600277, 4885810, -156323, -7079825, -9973558, -9387254, -9866652, -10941954, -7199401, 1472966, 6612424, 2276551, -5786958, -7731121, -3073461, -3968, -2493886, -5335178, -3755404, -1483387, -4460777, -10341607, -10554597, -2437361, 6461144, 8318306, 4805376, 3070617, 4846471, 4864561, -157771]
9828a57771n967428j026355M242184N273906L464167K115227J626956M76177j679964
9819H367099l646281m191936l128067j588576j011532j256518r56674l95283j448853
9810i256621l169082j212285N099450R191567N731618p33047j963013J757027
9802E445614L020802n13389l516282k654624p18832J57630J574366L150200J334993
9793G280478l315914m925837j659432O73369j735187m198013j557713L165817
9785f272432L751303J20983k576196j377503K057211M272496K918477p82638j906548
9776B05153K012703N299399Q52706p770098r488213k045941M654995M311451K307595
9767C39750L272668K366362l309324n837377O08728P488544M438355l657665n015975
$$ y = [-157771, -6125199, -7151554, -2909370, 2364536, 5828703, 7943930, 9570886, 10047063, 8367099, 4720818, 528882, -2599185, -4187761, -5199293, -6455811, -7412485, -7807768, -9256621, -12425703, -13637988, -8538538, 653029, 6384647, 5651600, 3688587, 5445614, 8466416, 7953027, 4436745, 1782121, 1063289, 1220919, 2795285, 5945485, 7280478, 3964564, -961273, -2620705, -1947336, -3682523, -7880536, -9438249, -6272432, -2521129, -2400146, -4976342, -6353845, -4296634, -24138, 2894339, 2111701, 205153, 2217856, 7517255, 8369961, 599863, -8888350, -10934291, -6279296, -1967845, 339750, 3612418, 5978780, 2669456, -3167921, -2559193, 4929351, 9367706, 5710041, 694066]
9758F94066j06086J428939j536747j751544J005113j89743m256431k013373O440569
9749b85237Q828172J61274p959427m745846L884558N622638j36762m200376k605438
9740a436444k22913j054927k841795k046459J086663L919567M798750L770006
9732E972448J588407q96792k870245l759466l584515k789746j237987J850626
9724e727270N559353O154331J543083l780205l006068L111140O221385K171272
9716A2247021l235490l520669l56980J362321J208566N57990j825822n355303
9708A081634m739752J340325M808841j36159o067680l304345L654906L073527
9700b88703m310882o482294j43407M705786K053329j537089L33906M048441M028520
$$ y = [694066, 587980, 2016919, 480172, -1271372, -266259, -456002, -4712433, -6725806, -285237, 8542935, 8704209, 744782, -4001064, -116506, 5506132, 5369370, 1168994, -1436444, -1659357, -2714284, -5556079, -7602538, -6515875, -2596308, 2202442, 5972448, 7560855, 6664063, 3793818, 34352, -3550163, -6339909, -7577896, -5727270, -167917, 5986414, 7529497, 3749292, 743224, 3854364, 10075749, 12247021, 9011531, 5490862, 5133882, 6496203, 7704769, 8262759, 6436937, 1081634, -3658118, -2317793, 2491048, 2354889, -3712791, -7017136, -3362230, -288703, -4599585, -11081879, -11225286, -6519500, -4466171, -6003260, -5669354, -1620913, 2407607]
9691B407607J262960j211494l346773m384453j738535K733882L025533j037860
9683b289133k244395J884633M120458n07732o155345n460275j34689L802891M973455
9674b010132M879713L051450k13492j411085O36070J785971m05786k307082j306343
9665B699284r22013l664280n387247k756855J06067p99512j393296L050981P959024
9656a107847N790656j427891m744548j357014K912798L165174O67736r92300J38218
9647C044982L438098N113627R90556o719370r593753m240400J833806J314677
9639d817777j686425P07317O271913O255027l8027m452913l049057l96983j98806
9630a405731l62891Q12988J126282m12692j031172Q41394K822692K575552P12300
$$ y = [2407607, 3670567, 2459073, -887700, -5272153, -7010688, -4276806, -1251273, -2289133, -4533528, -2648895, 1471563, 963831, -5191514, -10651789, -10786478, -6983587, -2010132, 2869581, 5921031, 5707539, 4296454, 4932524, 6718495, 6312709, 4005627, 2699284, 1777271, -1887009, -7274256, -10031111, -9925044, -10724556, -12117852, -9066871, -1107847, 4682809, 3254918, -1489630, -2846644, 66154, 3231328, 3899064, 2906764, 3044982, 6483080, 11596707, 12587263, 5867893, -3725860, -7966260, -6132454, -4817777, -6504202, -5796885, 475028, 6730055, 6692028, 2239115, -809942, -1206925, -1405731, -1768622, -955634, 170648, -242044, -1273216, -431822, 2390870, 4966422, 5678722]
9621E678722j140600j819429n05999J417383K1976n302213q135979l154884M401825
9612h539198M895381j502151n309410k312065J574567J554267P72365K397503
9604f468741L213582J27426l446892k995108K61021K605189L561386M115602L266737
9595D240202N44618j590516j569062j320570j728939J22082M986533P292339K544635
9586A3521322m548036n664761n59017L267529J819521r60230r88848k92222k350079
9577C245179n265891m029570J609924N648051L402988k146502m246267j337658
9569c119746J478918L13602k414177k943736j950624j355430P18969N951162R683483
9560F362421O136097j584791m773862k283197j455841m663266m995201Q45815
$$ y = [5678722, 4538122, 2718693, 2212694, 3630077, 3652053, -1650160, -9786139, -12941023, -8539198, -3643817, -5145968, -10455378, -12767443, -11192876, -9638609, -8866244, -6468741, -3255159, -3127733, -6574625, -9569733, -9308712, -6703523, -3142137, 973465, 4240202, 4784820, 3194304, 1625242, 304672, -1424267, -1302185, 3684348, 10976687, 13521322, 8973286, 3308525, 2749508, 6017037, 7836558, 6876328, 5887480, 5595258, 3245179, -2020712, -6050282, -4440358, 1207693, 4610681, 2464179, -1782088, -3119746, -1640828, -1327226, -3741403, -6685139, -8635763, -9991193, -9272224, -3321062, 6362421, 12498518, 10913727, 6139865, 3856668, 2400827, -2262439, -7257640, -6411825]
9552f411825N525675L370049L84526L295783O569758J450009p622627q353422
9544a792074k5318N342007J883711k523374r97037J483502j516771n577865k432494
9535f155713N713524Q128692Q59946p516717p378857l80075L274449j704149q616492
9526a3775392p066173L441411J2189591J0565806K294110l081081k918613j906314
9518b56655k306210j262242K068637L939867K446796M71484N2768m97834j662788
9509B993823r07045J509877J279128j995749k508255J436501K332929m363075
9501b21866j0057963m678766O494287R199581J352473m407454m95814N146406
9493B330884K896381m090359o225013j652644L337128M236412K114041l72440
$$ y = [-6411825, -886150, 2483899, 2868425, 6164208, 12733966, 14183975, 6561348, -1792074, -1817392, 3524615, 5408326, 2884952, 1887915, 3371417, 1854646, -3723219, -6155713, -442189, 7686503, 8546449, 1029732, -6349125, -6729200, -3454751, -5158900, -13775392, -20841565, -17400154, -5210563, 5355243, 7649353, 4568272, 1649659, -256655, -2562865, -3825107, -1756470, 2183397, 4630193, 5101677, 5154445, 4656611, 2993823, 2086778, 3596655, 4875783, 2880034, 371779, 1808280, 4141209, -221866, -10279829, -14958595, -8464308, 735273, 2087746, -2319708, -2815522, 2330884, 5227265, 1136906, -5088107, -6740751, -3403623, 832789, 2946830, 2574390]
9485B574390j363787N23541M544833O757829M117581j194011m320933l504168
9477H135275r28391O16663m61414m162208p736005p109512k235376J600734J098603
9468a1181631L46638M240534R552771Q961927K359069l024928l563494k808873
9460D882013l108019j666762K053291K791024j704319m992190j347122M631989
9452A539905N046921R04754r59159P5073j046921l804042j838660M645607O416231
9443A0979709p41678q251867o953350j49353K561900o01948l360588k246722j40248
9434h904145K39915P6778J229368L533511N511938N096288R24450m629981o403469
9425c325347l374320p64587j337467k813O574108J0775775M084584p589724j0272402
$$ y = [2574390, 1210603, 1734144, 6278977, 13036806, 17154387, 15960376, 11639443, 8135275, 7206884, 7823547, 7362133, 3199925, -4536080, -11645592, -13880968, -12280234, -11181631, -10834993, -6594459, 2958312, 11920239, 14279308, 11254380, 7690886, 4882013, 1773994, 107232, 2160523, 4951547, 3247228, -1744962, -3092084, 1539905, 6586826, 7491580, 6532421, 6607494, 5560573, 1756531, -82129, 4563478, 10979709, 10238031, 1986164, -4967186, -5116539, -2554639, -3156587, -6517175, -8763897, -8904145, -8664230, -8587452, -7358084, -3824573, 1687365, 6783653, 7708103, 3078122, -3325347, -6699667, -7464254, -8801721, -8804534, -2230426, 8545349, 12629933, 5040209, -5232193]
9416e232193k204454M539656L235682L15832J182691J467760j970950l523420
9408b189396K84545L225762R14718m79632L563744N340777j829589r026038m434747
9399d629856O189190P316841j911562p017734j310671N597440M704367k07733
9391H730282j538339J263610M056332L653601j276851q245789r721791j727159
9383d806104P223914N426120m447347q373615j945297M320636K826852j076011
9375h50852j224450l11208j512924j601216J205160K533074Q44064J025614L566194
9366C673456J521527n336969n942508L908235J1428504N817166m278507n088472
9358E702432Q59159K202241r93291n83129K116051r48048p404153o522129K006862
$$ y = [-5232193, -7436647, -2896991, 338691, 654523, 1837214, 3304974, 1334024, -2189396, -1904851, 1320911, 2235629, 1755997, 5319741, 10660518, 8830929, -195109, -4629856, 1559334, 8876175, 6964613, -53121, -1363792, 4233648, 8938015, 8730282, 7191943, 8455553, 12511885, 16165486, 14888635, 6642846, -3078945, -4806104, 2417810, 7843930, 3396583, -4977032, -6922329, -2601693, 225159, -850852, -2075302, -2386510, -3899434, -5500650, -4295490, -1762416, -918352, 107262, 3673456, 5194983, -141986, -6084494, -2176259, 9252245, 15069411, 10790904, 5702432, 6561591, 8763832, 7770541, 7187412, 9303463, 8355415, 951262, -5570867, -3564005]
9349c564005O458889J612345m439740m304190m10513K554312M017263L555766
9341E480127l84675n207901n381691p75588L099794L641894K839097J023350k867033
9332A467374n368881j844373M251162M597669j169893n024892l246708n2587J852299
9323d538830M153737N383403J261076n412479n953199K66817L594118p38027n593686
9314g577070m271568J18263K369562K898669K876613O81661k001649K57821O040694
9305A392996N767194l210105j0059304n971720L132830P064683N554559L544187
9297G215320Q85650l637542n386284j034946L508678K058968j055217P62029L547156
9288F863812j44971o380214n064127K825630O446471K731019j31563J991965K770153
$$ y = [-3564005, 2894884, 4507229, 67489, -4236701, -4647214, -2092902, 1924361, 5480127, 5095452, -112449, -5494140, -6269728, -3169934, 471960, 3311057, 4334407, 1467374, -3901507, -5745880, -1494718, 3102951, 1933058, -3091834, -6338542, -6391129, -4538830, -385093, 4998310, 6259386, 846907, -5106292, -4839475, -1245357, -1983384, -7577070, -11848638, -11730375, -9360813, -6462144, -3585531, -2903870, -4905519, -4647698, 1392996, 7160190, 3950085, -6109219, -12080939, -8948109, -1883426, 3671133, 7215320, 8100970, 4463428, -922856, -1957802, 1550876, 3609844, 2554627, 3316656, 6863812, 6718841, 338627, -4725500, -1899870, 4546601, 7277620, 7146057, 9138022, 11908175]
9279A1908175k268811p668069p208396k846611M59803K093331L155034K296123
9271g9421q30300k403610M71786M656134N061953J510163j832890j913059R87993
9262E628749M539441N522911J780746m537036p654926m805178l79859k62458l445887
9253c613497l494032J692000O323589N031172N51965r47839O21344J35550l287123
9244C013129m430531j103999J655336J75278j402702J167365L768156O91348m481166
9235i47786l818763J742018L989873J230885j743K306693K114353k739531n553720
9226a677721k181269K011279J856079K69256N73042m81751n030853p306194k507332
9217a4475464M216381N785447M025929M002348L562322j641135p473510o366529
$$ y = [11908175, 9639364, 1971295, -5237101, -8083712, -7623909, -5530578, -2375544, -79421, -909721, -3313331, -2841545, 1814589, 6876542, 8386705, 6553815, 4640756, 5628749, 10168190, 15691101, 17471847, 12934811, 5279885, 474707, 94848, -167610, -3613497, -7107529, -5415529, 908060, 5939232, 6491197, 5543358, 6164702, 6300252, 3013129, -1417402, -2521401, -866065, -690787, -2093489, -926124, 2842032, 3533380, -947786, -4766549, -3024531, 965342, 2196227, 2194484, 4501177, 6615530, 3875999, -1677721, -3858990, -1847711, 8368, 277624, 850666, 368915, -4661938, -11968132, -14475464, -10259083, -4473636, -447707, 3554641, 7116963, 5475828, -1997682, -8364211]
9209h364211j77956K385559m24970k215472m09868N60797j146762j232390K419632
9200h605641N474261M095643L39905j917271j824213m66997J108847J431941n13666
9191h77191l161315l806732k010281Q40588L947261O203431N184268Q43337k190712
9182D972654l91428K993411K701475q02534l533328m920803o317056n363538P11076
9173i950071P721257Q121568J680477m242825m795977j574568K685414O177049
9165E822324N329644k004970j0095159r904006j599044M835823L336376j070972
9157e349984j383723J840780L619168J974270j252446l377459k508102O59202
9149e778294K065388r93163m844328l970683L50872K175056R99356K066028O021963
$$ y = [-8364211, -8542167, -6156608, -6581578, -8797050, -9206918, -8646121, -9792883, -11025273, -8605641, -3131380, 964263, 1304168, -613103, -2437316, -2904313, -1795466, -363525, -877191, -4038506, -7845238, -9855519, -9014931, -5067670, 1135761, 6320029, 7163366, 4972654, 4581226, 7574637, 10276112, 9473578, 5940250, 1019447, -5297609, -10661147, -9950071, -2228814, 5892754, 7573231, 3330406, -1465571, -3040139, -354725, 5822324, 11151968, 9146998, -948161, -10852167, -12451211, -7615388, -4279012, -5349984, -6733707, -4892927, -1273759, 700511, -551935, -3929394, -6437496, -5778294, -3712906, -4706069, -9550397, -13521080, -13170208, -10995152, -9995796, -7929768, -1907805]
9140a907805O734552J625243l912804n483537n258884m960083j381910N900340
9132h644888R810180N414095j491107k422161J619565L100805j75563l320891
9124C890035k911533r49267m83418j951117l869653m007481p16369M214789N798477
9115i85537K061570k052422r05217L404018L586296k244742p443036n701787Q59558
9106i421299N204831M570458K488728K049132J326869k028181m871996k301142
9098b982600L498629M476167j315802n495897j487576N156485N303539K90559
9090G443504j364761J522162J756720k890938n604119k297652J706852J022425
9082A294193j443008o29191K264719K981841J236434n11181j622548k189211q32705
$$ y = [-1907805, 4826747, 6451990, 2539186, -2944351, -8203235, -13163318, -14545228, -8644888, 1165292, 6579387, 5088280, 2666119, 4285684, 7386489, 7210926, 3890035, 978502, 29235, -454183, -2405300, -6274953, -10282434, -10998803, -6784014, -985537, 1076033, -976389, -1881606, 1522412, 5108708, 2863966, -4579070, -10280857, -9421299, -4216468, 353990, 2842718, 4891850, 6218719, 4190538, -681458, -2982600, 516029, 4992196, 3676394, -1819503, -3307079, 1849406, 7152945, 7443504, 6078743, 7600905, 9357625, 6466687, 862568, -1435084, 271768, 1294193, -148815, -778006, 1486713, 4468554, 5704988, 5193807, 3571259, 1382048, 549343]
9073E49343K179867K981088l64623l497895j706182K358229K308056j945738l541993
9064f79848J108128O325017M476220l186181p268779k522873M611131M583948
9056G446763j677156m389575k09519K741374j041703m500312q9454N992237K968156
9047G240811o148990q467801j408287M595720L735392J383624R04656k039205
9039b04080p479370p045779J193026O014899j76611q301605o029363M244033J0815149
9030f969701R311470M259473m95768l755549l618214j87731K098161J090440Q42327
9021B574908L148698K262665m552522r002549l895224L782465L195034k721539
9013e208064k591802M302316P562538K883581l006965m971624n281899n253826
$$ y = [549343, 2729210, 5710298, 5345675, 1847780, 141598, 2499827, 4807883, 2862145, -679848, 428280, 6753297, 11229517, 8043336, 774557, -1748316, 2862815, 7446763, 5769607, 1380032, 1170513, 3911887, 2870184, -1630128, -1719582, 4272655, 7240811, 1091821, -7375980, -8784267, -4188547, -453155, 930469, 1835125, -204080, -7683450, -14729229, -13536203, -7521304, -7697915, -15999520, -22028883, -17784850, -6969701, 2341769, 6601242, 6105474, 2349925, -1268289, -1456020, 642141, 1732581, 2574908, 5723606, 7986271, 3433749, -5568800, -9464024, -5681559, -2486525, -5208064, -7799866, -3497550, 4064988, 6948569, 3941604, -1030020, -6311919, -11565745]
9005a1565745j937635L931844O046553K241294j516994m16930K354227J605648
8997G42262k213613m817183l937377q03176J898350K285918J085014Q66669K180637
8988b712499K468384O25257o99085N4806M57343o74660l10244K368014K683588
8979D260904j011403k470015J825121M708055P7691m955049j255451N556351L454963
8970A0191167n351508p566019o98470L976925Q93567k696277j518888J73440m58994
8961c055057L71935L094361K046781k822516l719057R20008K528468k215506m968625
8952g819208j068976J732299j995553m488690J284319Q027593O007999o46479
8944A033304j705221K357076L606529J290702J107667L266292K532882j458493
$$ y = [-11565745, -13503380, -9571536, -3524983, -1283689, -2800683, -3217613, -863386, 742262, -1471351, -6288534, -10225911, -11029087, -9130737, -6844819, -5759805, -4893136, -2712499, -244115, 381142, -317943, -263137, 194206, -480454, -790698, 1577316, 4260904, 3249501, 779486, 2604607, 7312662, 7390353, 2435304, 1179853, 6736204, 10191167, 4839659, -2726360, -3424830, 552095, 1445662, -1250615, -2769503, -2596063, -3055057, -2683122, 411239, 2458020, -364496, -4083553, -3163545, -635077, -2850583, -7819208, -8888184, -7155885, -9151438, -13640128, -12355809, -4328216, 1679783, 1033304, -671917, 1685159, 5291688, 6582390, 7690057, 10956349, 13489231, 12030738]
8936A2030738l546192j971112l03596j087490l376679n232984m317019J067974
8928f736360P559140P879378Q37471n317789m517370j341189j886154l460585
8920f983458j110461K474528K428151R02504J649987J587884k426944m754991
8912f232800P1430N667715L390410k088144o90132M513853K562914m721012m953824
8903b479590K293925L678857m370951q578006j421579O147677L595595k348799
8895c482871q37055M994695N226585k37067l985979l739838k199686N68844N008076
8886A315704O753516K422019l020696k812418J336666L156547K006911J223757
8878A2382006K56966k898286m725833q20731M739980L916950k541681n872601
$$ y = [12030738, 8484546, 6513434, 6209838, 5122348, 1745669, -3487315, -7804334, -6736360, 822780, 8702158, 9539629, 4221840, -295530, -1636719, -3522873, -6983458, -8093919, -5619391, -3191240, -2288736, -638749, 949135, -1477809, -6232800, -6161370, -493655, 2896755, 808611, 118479, 4632332, 7195246, 2474234, -2479590, -185665, 3493192, -877759, -9455765, -10877344, -4729667, -1134072, -3482871, -4319926, 674769, 5901354, 5664287, 1678308, -2061530, -4261216, -3692372, 1315704, 8069220, 10491239, 7470543, 4658125, 5994791, 9151338, 11158249, 12382006, 12638972, 9740686, 5014853, 4194122, 8934102, 12851052, 10309371, 4436770]
8870D436770k616214J459274J457331o37306j573765j449020q49402P21892K046505
8861B996065J006275j072284j054826J15966q77694k596252p44131K680582Q79345
8852A333046n415615o637125P15809P222690M591014j906463k919370K27306n111
8843b793819l199930k318623K911030M952886J360713j322401R90270L482833
8835D062959J384450k243268k764036j739084k438017k547705J636741O881345
8827B233385O374020L98274l470108j456072J669851R45975j634076j911145p06014
8818B444090j265400k633606j147595K661248M217470K320364J152510L026223
8810A0775304L842425p39539p919726j0863296p462417j712968K804955O179717
$$ y = [4436770, 1820556, 3279830, 4737161, 4099855, 2526090, 1077070, 227668, 949560, 2996065, 4002340, 2930056, 1875230, 1991196, 1113502, -1482750, -2226881, 453701, 1333046, -4082569, -10719694, -10003885, -2781195, 1809819, -96644, -3016014, -2788708, -2793819, -5993749, -8312372, -5401342, -448456, 912257, -410144, 580126, 4062959, 5447409, 3204141, 440105, -1298979, -3736996, -6284701, -4647960, 2233385, 8607405, 9005679, 5535571, 4079499, 5749350, 6695325, 5061249, 3150104, 2444090, 1178690, -1454916, -2602511, 58737, 4276207, 6596571, 7749081, 10775304, 14617729, 13878190, 5958464, -4904832, -12367249, -14080217, -11275262, -5095545]
8802e095545Q493082P643262L097316j626859l104753k356691k333430l021391
8794A694991k213812Q6517J421219P55145l18416l68566L60057J329133K192118
8785D938386J793969p18303l413614k914914R81522M535702M804016K625252k2962
8776A2609054k606621m362805l210915R85145M436390L677257J51673k122993
8768I556185j875465q80597o38678j688495m446512p375177o286446K01235O135011
8759g298939M552758k298504n132490n34983M846079M991136K597040K532301
8751D254398L339901J153435k281268k301676L72522P63679j895150l149561r59432
8742g03152J359603Q05313j517825l340746l695537j756335K245506M366288N88470
$$ y = [-5095545, 3397537, 11040799, 14138115, 12511256, 9406503, 7049812, 4716382, 1694991, -518821, -432304, 988915, 1744060, 1425644, 1057078, 1417135, 2746268, 4938386, 6732355, 6014052, 2600438, -314476, 667046, 5202748, 10006764, 12632016, 12609054, 10002433, 5639628, 2428713, 3413858, 7850248, 11527505, 11679178, 9556185, 7680720, 6800123, 6161445, 4472950, 26438, -7348739, -13635185, -13433950, -7298939, -2746181, -5044685, -10177175, -10712158, -5866079, -874943, 1722097, 4254398, 7594299, 8747734, 6466466, 4164790, 4537312, 5300991, 3405841, 256280, -703152, 656451, 1461764, -56061, -3396807, -7092344, -8848679, -6603173, -2236885, -1648415]
8733a648415n648484n731760J722852P270900L802441k942084l423209J225960
8725e371799K156958k512871n321983k004334K311942K084563n71105p91470J291787
8716h728312K156341P74464j074469k062964j886492o37711K67238q87265k414980
8707a4494150j65268N500523Q113711M160834q25356m44717K455783P98562m416260
8698F83662n202577M91459N454242M463613J088574L9562l35605l155103n992493
8689b464666m492968J49115K518011J37030m503563p482104n989687N01893Q369295
8680a3257644J1243888O672164m48411m028645l889650l311330k597156q0978
8672i697762K593423K013941q20252j299048J666490M243872L837183J891960
$$ y = [-1648415, -7296899, -13028659, -11305807, -4034907, -232466, -3174550, -6597759, -5371799, -3214841, -5727712, -11049695, -13054029, -10742087, -8657524, -9228629, -10020099, -8728312, -6571971, -5797507, -6871976, -8934940, -10821432, -11459143, -11191905, -12079170, -14494150, -14659418, -9158895, -1045184, 3115650, 2290294, 1845577, 4301360, 5099922, 683662, -4518915, -4027456, 1426786, 5890399, 6978973, 7018535, 6682930, 3527827, -2464666, -6957634, -6808519, -4290508, -4153478, -8657041, -16139145, -22128832, -21626939, -13257644, -2013756, 4658408, 4209997, 181352, -3708298, -7019628, -9616784, -9697762, -7104339, -5090398, -5910650, -7209698, -5543208, -1299336, 2537847, 4429807]
8664D429807j19463k625650m546768k785216K511102O109625L983123j277651
8656E678909l888355j769349J995661L165834M68069l173035l238454J059657
8648B98937M655633K419530l580932o191972k451346L288239N927983M966625
8640I332697K277810r87380l521966l764711k407227j637236j132280R88165K886428
8631B034300N11679m378515m562844J603823O603715N024505J103611L7883n76305
8622G401852l824618n343999q76798M102530K267037k867005k920039N78159m66992
8613a949873n011839m051504K484194M160257j804104m630228K169965R674270
8605A041138Q229688K397522J384050L151781m98825q347799j0777873m382774
$$ y = [4429807, 4310344, 1684694, -2862074, -5647290, -3136188, 2973437, 6956560, 5678909, 1790554, 21205, 2016866, 5182700, 5650769, 2477734, -760720, 298937, 4954570, 7374100, 3793168, -2398804, -4850150, -1561911, 4366072, 9332697, 11610507, 10623127, 7101161, 3336450, 929223, -708013, -1840293, -852128, 2034300, 2545979, -1832536, -6395380, -4791557, 1812158, 6836663, 7940274, 7978157, 7401852, 3577234, -1766765, -2643563, 1458967, 3726004, 858999, -2061040, -1482881, -1949873, -6961712, -11013216, -8529022, -4368765, -6172869, -10803097, -8633132, 1041138, 9270826, 11668348, 13052398, 16204179, 15705354, 7357555, -3420318, -7803092]
8597g803092M069849P830376O584897K831224j352744l442947j909730Q27455
8589G635288R75602j300763k755686k290755j426966o35749Q02505K134121J933824
8580E071421N98842r50459l182545n464063m554777L33541M151734K653282q49217
8571b192241j229965n24504l522318p136378l710696N473524R904048M905345
8563A966815k105820l609957j741378j510766j841255O03861M227544N331243
8555A320287M223697L014290P06376m060278q088821p000530k034372J342424
8547a0576927P71058j034637r84357J155986L759499M854280L233630J29455j263337
8538D4650L25873K483775K948717K729842K974140J616952l066128p681944p082864
$$ y = [-7803092, -3733243, 4097133, 10682030, 13513254, 12160510, 8717563, 6807833, 7635288, 8610890, 7310127, 4554441, 2263686, 836720, 200971, 1003476, 3137597, 5071421, 5670263, 4719804, 1537259, -3926804, -8481581, -8148040, -3996306, -1343024, -2192241, -3422206, -3946710, -7469028, -14605406, -18316102, -12842578, -2938530, 1966815, -139005, -3748962, -5490340, -7001106, -8842361, -8238500, -4010956, 1320287, 5543984, 8558274, 9264650, 5204372, -2884449, -9884979, -11919351, -10576927, -9805869, -10840506, -11824863, -10668877, -6909378, -2055098, 1178532, 1307987, 44650, 370523, 2854298, 5803015, 8532857, 11506997, 13123949, 10057821, 2375877, -4706987]
8529d706987j845357J912454N62243k838227l417398n74760K530960L642133L356628
8520a378311K832417J557027j250689l801871k770521J760071M818294K517593
8512D284010k398723m282638k206652K42563J316893K020125J616557j369297
8504g77162l629081J19260P489978R466173L604843k092253k201634j683084m978977
8495E318063o718986j788608L569182J364761l838255k261713L975230M266121
8487C885795k151417n013985o51456K560090p22476m435103k632204J014452J190066
8478f956238n9200J358221L791070L301056N9025l169604m537393k323259L882636
8469d653686Q886190N694491l371017p132248j162100N419793M141756n99651
$$ y = [-4706987, -6552344, -4639890, -4077647, -6915874, -10333272, -10908032, -8377072, -4734939, -1378311, 1454106, 3011133, 1760444, -2041427, -4811948, -3051877, 1766417, 4284010, 1885287, -2397351, -4604003, -4361440, -3044547, -1024422, 592135, -777162, -4406243, -4286983, 3202995, 12669168, 16274011, 14181758, 11980124, 10297040, 5318063, -1400923, -3189531, 379651, 1744412, -2093843, -4355556, -380326, 3885795, 1734378, -3279607, -3931063, -1370973, -2093449, -6528552, -9160756, -8146304, -6956238, -7015438, -5657217, -1866147, 1434909, 1493934, -1675670, -6213063, -8536322, -4653686, 4232504, 9926995, 6555978, -576270, -1738370, 3681423, 7823179, 7223528]
8461G223528r68882R15607j229533n043717l645320J304620J946756k078644l091148
8452d666733J412192M988717L211059m01149j743882j637898j082339J876280
8444A956247O654029P497982J198068o592618p601382j386694M476292L849543
8436A0051467j386710m550120k271170J852694K186625j353192l277258p03199
8428E49137K214910Q56755k428257k195447J111954J932603j201953l226355n70704
8419b957357L439116L619496j76249l756536l999079j481574J112376J923374
8411b276433J605851K017834L024471K319054m86338k364939j806622j852077
8403A80801m309925m587413J609412Q990515P967932j197471p807214n676791
$$ y = [7223528, 6254646, 7170253, 5940720, 897003, -2748317, -1443697, 503059, -1575585, -4666733, -3254541, 1734176, 4945235, 4544086, 2800204, 1162306, 79967, 1956247, 8610276, 16108258, 17306326, 10713708, 3112326, 1725632, 6201924, 10051467, 8664757, 4114637, 1843467, 3696161, 5882786, 4529594, 1252336, 549137, 2764047, 3620802, 1192545, -1002902, 109052, 2041655, 839702, -2386653, -2957357, 481759, 4101255, 3925006, 168470, -3830609, -5312183, -4199807, -2276433, -670582, 1347252, 4371723, 6690777, 6204439, 3839500, 2032878, 180801, -4129124, -8716537, -7107125, 1883390, 9851322, 8653851, 846637, -4830154]
8395d830154m54517R75112J88977J202810K031495n21869k878662K17940N600055
8386A531187N244215r48442m374269q66103L323187J911393j925037j799323J140198
8377C237006P39180l132120l771154J262694N307570K432393l377258m333669
8369a635358n25222J354597n15756o33286L557884O450283L131985k561929l985164
8360D638034j161652J211257J604523J539173O23969j764755k174171K375989
8352F892367P071401M448058l546456p127420l235804M49283j284043l198188
8344D69198J118L557995N95895n622141o110416L3074M587990K408592k506483
8335b585178m141284k050491J36821J36754j021730p26479K205322N420876N019975
$$ y = [-4830154, -5284671, -4309559, -4120582, -2917772, -886277, -1408146, -4286808, -4068868, 1531187, 6775402, 5826960, 1452691, 586588, 3909775, 5821168, 3896131, 2096808, 3237006, 3976186, 844066, -2927088, -1664394, 3643176, 6075569, 2698311, -1635358, -2160580, -805983, -1321739, -1955025, 1602859, 8053142, 11185127, 8623198, 4638034, 3476382, 4687639, 6292162, 7831335, 8455304, 6690549, 4516378, 6892367, 13963768, 18411826, 14865370, 7737950, 4502146, 4951429, 3667386, 469198, 470316, 4028311, 4624206, -997935, -7108351, -7075277, -2487287, -78695, -2585178, -6726462, -8776953, -8640132, -8503378, -9525108, -10251587, -8046265, -2625389, 2394586]
8326B394586R69281j731008J63736K827309R06050l766715m570388n83359J738762
8317a651746j062520l604614j82589N563202N411240r80658m855215o88301N815881
8308C764680N763643l95168l820708j87835M189959J734477n359956q262297l619565
8299f192770K814022M648214J962221j386234l066924k498480M90809M107635
8291H78493M535487P54051k783889j675658K092111L018391k5925k767090j897251
8282B128720J299876L755795L621482L03094m924312p791324m395475K853502
8274c148642O303509K340414l647995m551438q62657J373300j5127j178201M60996
8265b925841K031194L27409l109887m955363m772988l347264L77952N994172P941597
$$ y = [2394586, 3363867, 1632859, 1796595, 4623904, 5529954, 1763239, -2807149, -3390508, -1651746, -2714266, -6318880, -6501469, -938267, 4472973, 3492315, -1362900, -2051201, 3764680, 9528323, 9133155, 5312447, 5124612, 9314571, 11049048, 5689092, -2573205, -6192770, -3378748, 1269466, 3231687, 1845453, -1221471, -3719951, -3229142, 878493, 5413980, 6168031, 3384142, 1708484, 3800595, 6818986, 6793061, 4025971, 2128720, 3428596, 7184391, 10805873, 11108967, 6184655, -1606669, -6002144, -3148642, 3154867, 5495281, 1847286, -2704152, -3566809, -2193509, -2208636, -3386837, -2925841, -894647, -567238, -3677125, -8632488, -13405476, -16752740, -16374788, -10380616, -2439019]
8256b439019J631801p445890q042155J803267J0956195R675185J484043l949367
8248C674060l653086r20788K508906N921631N232835j776912q067498m858029
8240a938881M241818O866355L36022m602371j302911L062599J112383k271527
8232E503487M1919L684980K83914o863047o774861J680309P866507N566582O83014
8223A1672804J25954J912472Q19374k683190m382014l095359q46001J093738K340636
8214F958414J428932k403316o057808m756778J654877P012270N582569m15533
8206I003627l054359O49618M045245M81417n639830m411043L740208O871330p99508
8197A0886705r334094p828939o29578R55709k719366j648396N428516P975188
$$ y = [-2439019, -807218, -8253108, -16295263, -14491996, -3535801, 6139384, 7623427, 3674060, 20974, -899814, 1609092, 7530723, 12763558, 10986646, 2919148, -1938881, 2302937, 9169292, 9505314, 4902943, 3600032, 6662631, 7775014, 5503487, 5545406, 9230386, 9514300, 2651253, -4123608, -2443299, 5423208, 10989790, 11672804, 11798758, 13711230, 14530604, 11847414, 7465400, 4370041, 3524040, 4617778, 6958414, 8387346, 5984030, -73778, -4830556, -3175679, 3836591, 9419160, 9003627, 5949268, 6598886, 10644131, 11125548, 5485718, 1074675, 4814883, 11686213, 10886705, 1552611, -6276328, -6905906, -5950197, -8669563, -10317959, -4889443, 3085745]
8189C085745J056709o179958m516129K317169N101260K419755n75768j559771
8181A149012k043435k073626l63663J780684J783370J79629k59992J016222J942116
8172C110317J139295q02893k484945k513381n46242J411203Q92246j085526j095545
8163a975471P93962M96654k959305m789744j918855J963938K705085K028540K820889
8154h34307L124309P73581o84723K145235M767197J134023n407570o624404k607854
8145d214513l92177o81442K379553P538390N619028l769211p800442J06869Q377484
8136G163539M909063l737121l775994K930026L134679m348891o504740J325685
8128A096246P001322J453956o751859n581924K309467O135552M182118K939625
$$ y = [3085745, 4142454, -2037504, -6553633, -4236464, 864796, 3284551, 2708783, 1149012, -894423, -2968049, -3331712, -1551028, 232342, 411971, 151979, 1168201, 3110317, 4249612, 3446719, 961774, -1551607, -2097849, -686646, 205600, -879926, -1975471, -1181509, -684855, -3644160, -8433904, -10352759, -8388821, -5683736, -3655196, -834307, 2290002, 3063583, 2378860, 4524095, 9291292, 10425315, 5017745, -1606659, -4214513, -4606690, -5288132, -2908579, 4629811, 10248839, 6479628, -1320814, -1213945, 7163539, 12072602, 8335481, 4559487, 7489513, 10624192, 6275301, -229439, 1096246, 8097568, 9551524, 2799665, -2782259, -472792, 5662760, 9844878, 12784503]
8120A2784503L495312O63314n441797p880086m301868o09907n05241L72723N546378
8111D123331R801765O269650k686955p880796n046913Q82227L048945K33014l696376
8102E047892n211576m388630l414062l035618j702324J195238L006186J302061
8094g200833j418912m85717L328772L798408j272511n525735k785050L749734
8086g811844O145973K876971m63589l29937R28468P39664K77571J103968K229354
8077E696599K479709K266796J368607j442185m752764m444693J3557K925699k31253
8068C880072n660870o019993o49704L819285K818041q50645k186795o25945Q06245
8059d670309N56560j5749M12490R91121K28325j269787q62429K657144O459851
$$ y = [12784503, 16279815, 16943129, 11501332, 3621246, -680622, -1290529, -1795770, -1423047, 4123331, 13925096, 20194746, 17507791, 9626995, 4580082, 5462309, 8511254, 8744268, 5047892, -163684, -4552314, -7966376, -11001994, -12704318, -11509080, -8502894, -7200833, -8619745, -9105462, -5776690, -1978282, -3250793, -8776528, -11561578, -7811844, -1665871, 1211100, 747511, 417574, 1346042, 2085706, 2363277, 3467245, 5696599, 8176308, 10443104, 11811711, 10369526, 5616762, 1172069, 1185626, 4111325, 3880072, -1780798, -7800791, -8450495, -4631210, -1813169, -2663814, -4850609, -5476554, -4670309, -4113749, -4129498, -3717008, -2725887, -2497562, -3767349, -4629778, -1972634, 4487217]
8050D487217O371712K400883p53229l4429J674601K79823k694556k268109J697731
8041A1161644L350221o90666o100623o725038k425799K007546L285923J643547
8033E506755j597936m773942n321021k173786J729065K632359J163244Q28755
8025b006507J831591Q43221k535044l965855j027335K685059L083052J535512
8017D43694J580664K616180J339137k143599m149036k940936n85409P46490J020353
8008b072462P50466K28092N03450K195702L259729J169010k436363k967688L63836
7999I93772K904485J449232r86017j88529K453449K044126k347319o082731m866491
7990d626023M51485N449319O632555L863994l23457l121679l578627k560947q71144
$$ y = [4487217, 10858929, 13259812, 12506583, 12472154, 14146755, 14426578, 11732022, 9463913, 11161644, 14511865, 13821199, 7720576, 995538, -1430261, 577285, 3863208, 5506755, 3908819, -865123, -6186144, -8359930, -6630865, -3998506, -2835262, -2006507, -174916, 668305, -1866739, -5832594, -6859929, -4174870, -1091818, 443694, 2024358, 4640538, 5979675, 3836076, -312960, -3253896, -3839305, -3092815, -2072462, -1321996, -1093904, -590454, 1605248, 4864977, 6033987, 3597624, 629936, 993772, 3898257, 5347489, 4361472, 4172943, 6626392, 8670518, 6323199, 240468, -4626023, -4174538, 1274781, 7907336, 11771330, 11447873, 8326194, 4747567, 2186620, 1315476]
7981A315476J526341L974196M319963J211835l388985n589392l716015j99874
7973e46455J121780o77838k486368r41989K799816L807481O9192l702916k048687
7964b605984K897352L808949q37806l963256p38589L485056J445510m133876m490119
7955e132763J010571L375536j639946o005949j386057P574724R368760J977114
7947I141990n002084m460001j99689J227047J96289N83244J680293J49856k506051
7938H10894j507048K613435L900551O20382j748423J64890J902394p27312l727357
7929B302406j444080L401489L850248K05217r75320J527287J880887j759537l338886
7920E649711N40759M032356J348379l591074l389031J167602K703304j526493
$$ y = [1315476, 2841817, 6816013, 11135976, 12347811, 8958826, 3369434, -346581, -546455, 575325, -102513, -2588881, -3530870, -731054, 3076427, 3145619, -557297, -2605984, 291368, 4100317, 3262511, -700745, -1439334, 2045722, 3491232, -642644, -5132763, -4122192, -746656, -2386602, -8392551, -9778608, -2203884, 7164876, 9141990, 4139906, -320095, -519784, 707263, 903552, 1486796, 3167089, 3316945, 810894, -696154, 1917281, 5817832, 6438214, 4689791, 4854681, 6757075, 6029763, 2302406, 858326, 4259815, 8110063, 8315280, 7339960, 8867247, 10748134, 8988597, 5649711, 6190470, 10222826, 11571205, 7980131, 4591100, 5758702, 8462006, 6935513]
7912F935513o433964o725805k633407K185096M535379L320296M39782j75345K768711
7903D216256N167000K794934j759603j985321K735441N290620O95144o525043
$$ y = [6935513, 501549, -6224256, -8857663, -6672567, -2137188, 1183108, 1622890, 1447545, 4216256, 9383256, 12178190, 10418587, 8433266, 11168707, 16459327, 17154471, 10629428]
$$ [...]
##END NTUPLES=NMR SPECTRUM
##END=
