##TITLE=31Pdec_SR52+5xAcCl'
 CDCl3, 124 sc
 31.05.2021
##JCAMPDX= 6.0         $$ Bruker NMR JCAMP-DX V2.0
##DATA TYPE= NMR SPECTRUM
##DATA CLASS= NTUPLES
##ORIGIN= UXNMR, Bruker Analytische Messtechnik GmbH
##OWNER= root
$$ XWIN-NMR		Version 3.5
$$ Mon May 31 13:02:35 2021 Russian Standard Time (UT+4h)  she@DPX200
##.OBSERVE FREQUENCY= 81.013821
##.OBSERVE NUCLEUS= ^31P
##.ACQUISITION MODE= SIMULTANEOUS
##.ACQUISITION SCHEME= undefined
##.AVERAGES= 124
##.DIGITISER RES= 16
##SPECTROMETER/DATA SYSTEM= spect
##.PULSE SEQUENCE= zgpg30
##.SOLVENT NAME= D2O
##.SHIFT REFERENCE= (INTERNAL, D2O, 0, 248.564)
##AUDIT TRAIL= $$ (NUMBER, WHEN, WHO, WHERE, WHAT)
$$ ##TITLE= Audit trail, XWIN-NMR		Version 3.5
$$ ##JCAMPDX= 5.01
$$ ##ORIGIN= Bruker BioSpin GmbH
$$ ##OWNER= she
$$ F:/spectra/data/she/nmr/P31/1/pdata/1/auditp.txt
$$ ##AUDIT TRAIL=  $$ (NUMBER, WHEN, WHO, WHERE, WHAT)
(   1,<2021-05-31 13:01:15.93 +0400>,<she>,<DPX200>,
      <continue with go, POWCHK disabled, PULCHK disabled
       configuration hash MD5:
       00 E9 B6 7A A2 85 ED C7 34 08 36 98 17 FE 4E 26
       data hash MD5: 32K
       9D 6B 86 90 14 27 B4 C8 CA BF 2E D8 2E 22 D3 1F>)
(   2,<2021-05-31 13:01:19.95 +0400>,<she>,<DPX200>,
      <Start of raw data processing
       efp BC_mod = 2 LB = 1 FT_mod = 6 PKNL = 1 PHC0 = -6272.731 PHC1 = 258.8012 SI = 64K 
       data hash MD5: 64K
       19 DB A5 86 07 BC B5 73 6D 22 EF A7 38 13 F4 7A>)
(   3,<2021-05-31 13:01:23.84 +0400>,<she>,<DPX200>,
      <abs ABSG = 5 
       data hash MD5: 64K
       E2 0E 30 DC 25 35 2B 7A A0 C4 D9 AE 21 D7 A0 37>)
(   4,<2021-05-31 13:01:58.10 +0400>,<she>,<DPX200>,
      <pk PHC0 = 166.7665 PHC1 = -4.199992 
       data hash MD5: 64K
       22 C6 62 1E 7D 9F A7 B3 84 A9 99 AF 4E 81 95 F2>)
(   5,<2021-05-31 13:02:01.18 +0400>,<she>,<DPX200>,
      <abs ABSG = 5 
       data hash MD5: 64K
       41 73 34 EC D6 5A 51 5D D3 AC 14 E5 E2 41 2A 1B>)
$$ ##END=
$$ 
$$ hash MD5
$$ 0F 4F D3 C1 25 BD 74 DF 42 A5 74 76 21 29 98 23
##$RELAX= 
##$RELAX= 
##$RELAX= 
##$RELAX= 
##$RELAX= 
##$RELAX= 
##$RELAX= 
##$RELAX= 
$$ Bruker specific parameters
$$ --------------------------
##$DU= <F:/spectra>
##$EXPNO= 1
##$NAME= <P31>
##$PROCNO= 1
##$TYPE= <nmr>
##$USER= <she>
##$AMP= (0..31)
100 100 100 100 100 100 100 100 100 100 100 100 100 100 100 100 100 100 
100 100 100 100 100 100 100 100 100 100 100 100 100 100 
##$AQSEQ= 0
##$AQ_mod= 1
##$AUNM= <au_zg>
##$AUTOPOS= <>
##$BF1= 81.014009
##$BF2= 200.13
##$BF3= 200.13
##$BF4= 200.13
##$BF5= 200.13
##$BF6= 200.13
##$BF7= 200.13
##$BF8= 200.13
##$BYTORDA= 1
##$CFDGTYP= 0
##$CFRGTYP= 5
##$CHEMSTR= <none>
##$CNST= (0..31)
1 1 145 1 1 1 1 1 1 1 1 1 1 1 1 1 1 1 1 1 1 1 1 1 1 1 1 1 1 1 1 1 
##$CPDPRG= <waltz16>
##$CPDPRG1= <>
##$CPDPRG2= <waltz16>
##$CPDPRG3= <>
##$CPDPRG4= <mlev>
##$CPDPRG5= <mlev>
##$CPDPRG6= <mlev>
##$CPDPRG7= <mlev>
##$CPDPRG8= <mlev>
##$CPDPRGB= <>
##$CPDPRGT= <>
##$D= (0..31)
0 1 0 0 0 0 0 0 0 0 0 0.03 2e-05 3e-06 0 0 0 0 0 0 0 0 0 0 0 0 0 0 0 0 
0 0 
$$ [...]
##$SUBNAM3= <"">
##$SUBNAM4= <"">
##$SUBNAM5= <"">
##$SUBNAM6= <"">
##$SUBNAM7= <"">
##$SUBNAM8= <"">
##$SUBNAM9= <"">
##$SW= 501.771253377433
##$SWIBOX= (0..15)
0 1 3 0 0 0 0 0 0 0 0 0 0 0 0 0 
##$SW_h= 40650.406504065
##$TD= 32768
##$TD0= 1
##$TE= 0
##$TE2= 300
##$TE3= 300
##$TEG= 300
##$TL= (0..7)
0 120 53 12 22 120 120 120 
##$TP= (0..7)
150 150 150 150 150 150 150 150 
##$TP07= 0
##$TPNAME0= <>
##$TPNAME1= <>
##$TPNAME2= <>
##$TPNAME3= <>
##$TPNAME4= <>
##$TPNAME5= <>
##$TPNAME6= <>
##$TPNAME7= <>
##$TPOAL= (0..7)
0.5 0.5 0.5 0.5 0.5 0.5 0.5 0.5 
##$TPOFFS= (0..7)
0 0 0 0 0 0 0 0 
##$TUNHIN= 0
##$TUNHOUT= 0
##$TUNXOUT= 0
##$USERA1= <user>
##$USERA2= <user>
##$USERA3= <user>
##$USERA4= <user>
##$USERA5= <user>
##$V9= 5
##$VALIST= <valist>
##$VCLIST= <CCCCCCCCCCCCCCC>
##$VD= 0
##$VDLIST= <DDDDDDDDDDDDDDD>
##$VPLIST= <PPPPPPPPPPPPPPP>
##$VTLIST= <TTTTTTTTTTTTTTT>
##$WBST= 1024
##$WBSW= 4
##$XGAIN= (0..3)
0 0 0 0 
##$XL= 0
##$YL= 0
##$YMAX_a= 12109
##$YMIN_a= -15802
##$ZGOPTNS= <>
##$ZL1= 120
##$ZL2= 120
##$ZL3= 120
##$ZL4= 120
##$ABSF1= 248.5645
##$ABSF2= -253.2056
##$ABSG= 5
##$ABSL= 3
##$ALPHA= 0
##$AQORDER= 0
##$ASSFAC= 0
##$ASSFACI= 0
##$ASSFACX= 0
##$ASSWID= 0
##$AUNMP= <proc_1d>
##$AZFE= 0.1
##$AZFW= 0.5
##$BCFW= 0
##$BC_mod= 2
##$BYTORDP= 0
##$COROFFS= 0
##$CY= -3
##$DATMOD= 1
##$DC= 0
##$DFILT= <>
##$DTYPP= 0
##$F1P= 0
##$F2P= 0
##$FCOR= 1
##$FTSIZE= 65536
##$FT_mod= 6
##$GAMMA= 0
##$GB= 0
##$INTBC= 1
##$INTSCL= 5.30512e-09
##$ISEN= 30
##$LB= 1
##$LEV0= 0
##$LPBIN= 0
##$MAXI= 10000
##$MC2= 0
##$MEAN= 0
##$ME_mod= 0
##$MI= 50
##$NCOEF= 0
##$NC_proc= -6
##$NLEV= 6
##$NOISF1= 182.463
##$NOISF2= 159.3651
##$NSP= 0
##$NTH_PI= 0
##$NZP= 0
##$OFFSET= 248.5645
##$PC= 4
##$PHC0= -6105.964
##$PHC1= 254.6012
##$PH_mod= 1
##$PKNL= yes
##$PPARMOD= 0
##$PSCAL= 0
##$PSIGN= 0
##$REVERSE= no
##$SF= 81.014009
##$SI= 65536
##$SIGF1= 159.3651
##$SIGF2= -187.1042
##$SINO= 113.3802
##$SIOLD= 16384
##$SREGLST= <1H.CDCl3>
##$SSB= 0
##$STSI= 65536
##$STSR= 0
##$SW_p= 40650.406504065
##$SYMM= 0
##$S_DEV= 0
##$TDeff= 32768
##$TDoff= 0
##$TI= <>
##$TILT= no
##$TM1= 0
##$TM2= 0
##$TOPLEV= 0
##$USERP1= <user>
##$USERP2= <user>
##$USERP3= <user>
##$USERP4= <user>
##$USERP5= <user>
##$WDW= 1
##$XDIM= 65536
##$YMAX_p= 375264985
##$YMIN_p= -62195470
$$ End of Bruker specific parameters
$$ ---------------------------------
##NTUPLES= NMR SPECTRUM
##VAR_NAME=  FREQUENCY,     SPECTRUM/REAL,   SPECTRUM/IMAG
##SYMBOL=    X,             R,               I
##VAR_TYPE=  INDEPENDENT,   DEPENDENT,       DEPENDENT
##VAR_FORM=  AFFN,          ASDF,            ASDF
##VAR_DIM=   65536,         65536,           65536
##UNITS=     HZ,            ARBITRARY UNITS, ARBITRARY UNITS
##FACTOR=    0.620285442955139, 1,           1
##FIRST=     20137.2065510759, 0,            0
##LAST=      -20513.1999529892, 0,           0
##MIN=       -20513.1999529892, -62195470,   0
##MAX=       20137.2065510759, 375264985,    0
$$ Real data points
##PAGE= N=1
##DATA TABLE= (X++(R..R)), XYDATA
$$ [...]
##PAGE= N=2
##DATA TABLE= (X++(I..I)), XYDATA
13017a447560M086892R311481O689365q48836m349594k160661j204021m075757
13009F001309m437413R86085N202985K248447k334186o86918M038053L284703
13001A4303065k362040m682191j560188J118569O34739O11260K436234K724647
12993A3224095P98787K96760J626072Q12785k439332l661177k367909l192724
12985E097357n916400l933771L413662O765978Q85981o111817n051224O43266
12977d206968K151013l99114m81255K442426L073902M45990j255447r65053j605047
12968g99553l125145k256429P16381J916639R41722J373423L690293M169061J871835
12959H498227M09827J192472J029125j357578k275904M44462L096988J984476
$$ y = [-1447560, 2639332, 11950813, 18640178, 17791342, 13441748, 11281087, 10077066, 6001309, 1563896, 2549981, 7752966, 10001413, 7667227, 6980309, 11018362, 14303065, 11941025, 7258834, 5698646, 6817215, 7451954, 8063214, 10499448, 13224095, 14022882, 14319642, 15945714, 16758499, 14319167, 10657990, 8290081, 5097357, -819043, -4752814, -1339152, 5426826, 6312807, 200990, -4850234, -4206968, -2055955, -2455069, -2936324, -493898, 2580004, 3025994, 1770547, 805494, -799553, -3924698, -6181127, -5464746, -3548107, -2606385, -1232962, 2457331, 6626392, 8498227, 8908054, 10100526, 11129651, 9772073, 7496169, 7940631, 11037619, 13022095]
12951A3022095o78332j053738l93445k395687n889871n688037p29447L675253
12943a31209L490604J683626K870995N099448K322219n091636q480673k741962
12935i78588N073210M860951k072342n248376p44446M006771K835529n34562p58773
12926F439374J73159j391342k675967J78604L559860J678494k934944l059926
12918A967312J149739K808201K38531r52159J498547K694991l47212l725439l822588
12909A509923k533752j933013j19648L649108N379322K412158j532224j854831
12901D977043J97387O10075q63718j543184p49780k1054j23010q05214j875719
12892a97174k426150j157164Q61103O73068j603200j921074J411401M629642M400638
$$ y = [13022095, 12343763, 11290025, 10896580, 8500893, 2611022, -3077015, -3806462, -131209, 3359395, 5043021, 7914016, 13013464, 15335683, 10244047, 1763374, -978588, 4094622, 8955573, 6883231, 1634855, 890409, 4897180, 7732709, 7198147, 6439374, 6612533, 5221191, 2545224, 2723828, 6283688, 7962182, 5027238, 1967312, 3117051, 5925252, 6163783, 5211624, 6710171, 9405162, 9057950, 5332511, 1509923, -1023829, -2956842, -3076490, 572618, 5951940, 8364098, 6831874, 4977043, 5174430, 5784505, 4920787, 3377603, 2627823, 2606769, 2483759, 1678545, -197174, -2623324, -3780488, -2919385, -2246317, -3849517, -5770591, -4359190, 270452, 4671090]
12883D671090K417212P82376k204955o905748p948042j601855O119586O412041
12875A741705N65505k300916N16134K382493j57103j386458K810074O339096J972507
12866A2483037o367727q464653k520315K896277J594656k774224m015359j973187
12858i141495j9511J381512L420577M010691J37771n374193n531926P68739N798230
12849d549605L444459j982896k379406K022553L714771K8356l058036q06936L174258
12840c92482L408729R21053P9036O59601r96056m517574n150792j153113L387532
12831c754066M245219J584870k306095n774087o631058k487886M717566Q081161
12823b324376L717474l061998m209067N2694K304795k24426j645731K232963O019172
$$ y = [4671090, 7088302, 7870678, 5665723, -1240025, -9188067, -10789922, -4670336, 1741705, 2307210, 6294, 522428, 2904921, 2747818, 1361360, 4171434, 10510530, 12483037, 6115310, -2349343, -4869658, -1973381, -378725, -3152949, -7168308, -9141495, -9161006, -7779494, -4358917, -348226, -210455, -5584648, -11116574, -10347835, -4549605, -1105146, -3088042, -5467448, -3444895, 269876, 298232, -2759804, -3566740, -392482, 3016247, 3937300, 4016336, 4675937, 3679881, -837693, -5988485, -7141598, -3754066, 491153, 2076023, -230072, -6004159, -12635217, -15123103, -10405537, -2324376, 1393098, -1668900, -5877967, -5825273, -3520478, -3744904, -5390635, -3157672, 2861500]
12814B861500K899581l606256l794260L389026P792499K534596n993842p356749
12806a273905j440518K613733l00881n300359n289948J35280N404473N694634
12798B42509J145500m075361n637802k673018J946357M987403N633248M435834
12790F004670J556740k073260l767506k113381K81387J62240j308277m13237K868837
12781A198213M578571K912733N23580k14126l43144j291245k213647k130311j673744
12772A346880j071890N35195K155803R14455k708554l396546J656675P073032
12764F505050N628082j608449o629021n520541k741537l004210l936850o38654
12756a1946130N415113P193854J984372m097900l984778R42872L275553K38258
$$ y = [2861500, 5761081, 2154825, -1639435, 1749591, 9542090, 12076686, 6082844, -1273905, -2714423, -100690, -401571, -5701930, -10991878, -10856598, -5452125, 242509, 1388009, -2687352, -8325154, -10998172, -9051815, -4064412, 1568836, 6004670, 7561410, 5488150, 1720644, -392737, -111350, 50890, -1257387, -1670624, 1198213, 5776784, 8689517, 9213097, 8998971, 8655827, 7364582, 5150935, 3020624, 1346880, 274990, 810185, 2965988, 3880443, 1171889, -2224657, -567982, 6505050, 12133132, 10524683, 3895662, -1624879, -4366416, -7370626, -11307476, -11946130, -6531017, 662837, 2647209, -1450691, -5435469, -4492597, -1217044, -978786]
12748i78786k819100o45296M619446P182243N278890J509054j980454m452108
12740G713889m431857j218928K189859K110771k22416m74947J570936J629076
12732H866383j572779l594588j105005K955216L649595L23362l665003m970866
12724H86315k404283K459221N548778L690233j323524m478873l573509o38012
12716A66346K131243L810933K697531j893817n725464l574452K270951M109368
12708C992639N14381j773310L09963J266978k054000l869041N6202L814112J131240
12699C389164l541927k702354J473064J789881j310020j839361N15269J268960
12691i57324M94909J470043K406294m69109l903129k271246R89225j608107o784539
$$ y = [-978786, -3797886, -4443182, 176264, 7358507, 12637397, 14146451, 12165997, 7713889, 3282032, 2063104, 4252963, 6363734, 6141318, 5666371, 7237307, 8866383, 7293604, 3699016, 2594011, 5549227, 9198822, 9522184, 5857181, 886315, -1517968, 941253, 6490031, 10180264, 8856740, 4377867, 804358, 166346, 2297589, 6108522, 8806053, 6912236, 1186772, -2387680, -116729, 3992639, 4507020, 2733710, 3043673, 4310651, 2256651, -1612390, -1556188, 2257924, 3389164, -152763, -2855117, -1382053, 407828, -902192, -2741553, -2226284, -957324, -462415, 1007628, 3413922, 2944813, -958316, -3229562, -2240337, -3848444, -10632983]
12682a0632983m176277N081376Q158468J431170l540004N9932L517307m10782
12674e11793m103415M18581O068432L074307l170558j627804M281849K513383
12666F942982n640585o691106J857584O251479j248883r517594n871293M927819
12658h989597R017652L767657r20230J127619M629846K608790l316070o196863
12650A728804l749263o73073j289151l563359k746550J150106L391537J864158
12642c886791m5201N53706J646422Q57067J56169J750796K928498L57111l263483
12633A054294k855107P20539K394563J502541J679099K929547J548241j758273
12625G215444j908043R53710N32504m158495n455177J65890M735955R58025n969100
$$ y = [-10632983, -14809260, -9727884, -1569416, -138246, -3678250, -3618318, -101011, -511793, -4615208, -4196627, 1871805, 4946112, 1775554, 147750, 4429599, 6942982, 1302397, -5388709, -3531125, 2720354, 1471471, -8046123, -13917416, -8989597, 28055, 3795712, 2875482, 4003101, 8632947, 11241737, 7925667, 1728804, -2020459, -2693532, -3982683, -7546042, -10292592, -9142486, -5750949, -3886791, -3931992, -3378286, -1731864, -874797, -718628, 1032168, 3960666, 4317777, 1054294, -1800813, -1080274, 1314289, 2816830, 4495929, 7425476, 8973717, 7215444, 5307401, 6261111, 6793615, 2635120, -2820057, -2654167, 2081788, 3039813, -2929287]
12616b929287o890719k581631L12915J847404O238333J0104284N540247n329488
12608F312058j0652361n634487J586157L688984L277541L902851K449566k681856
12600B248453m745349J326533Q708025P715580L32536l550473j102023J555182
12592A2488464N32990j814145l474826m917834m549410j24621M728769L508489
12584F377876k360333l939274J666935O267538K817248m593375p736817n202822
12576f703024j232436J477217K653112J963872K47749Q7934J770736K365283J484163
12567D114606K666372N675252M169291l593513q770064m316252K836356J659348
12559D441396n512505o669383R32362P406757O202765K014766L00104n81847k634138
$$ y = [-2929287, -9820006, -12401637, -12088722, -10241318, -4002985, 6101299, 11641546, 6312058, -4340303, -9974790, -8388633, -4699649, -1422108, 2480743, 4930309, 2248453, -2496896, -1170363, 7537662, 15253242, 15585778, 12035305, 10933282, 12488464, 13021454, 11207309, 7732483, 2814649, -1734761, -1859382, 2869387, 6377876, 4017543, 78269, 1745204, 8012742, 10829990, 6236615, -1500202, -6703024, -7935460, -6458243, -3805131, -1841259, -1593510, -1505576, 265160, 2630443, 4114606, 6780978, 12456230, 16625521, 13032008, 4261944, -54308, 2782048, 4441396, -1071109, -7740492, -6808130, 598627, 6801392, 8816158, 9116262, 8534415, 5900277]
12550E900277k837485K63366K192972J17310j929325o53933L26268k135160l690330
12541b446040q1632L939484J757651l328487k913093K394912L666714j718730
12533A270779n923189l216766K003747L590843K720880L343474M129163J296568
12525I215499l691145n505137k928022j65697j78516j215033q25792N15246J379694
12516c398903J935439K490582J818873o36521k529203j368397J310559J505340
12508A127769j473978l727468k200476J234196K799185J810364M68257J08570
12500A46419J05130j69455n11747q08175j064799p71647L39501J416945J662893
12491C45065J436082Q29572j160006l977265m238432m73645K884801R26488l567807
$$ y = [5900277, 3062792, 3326158, 5519130, 5636440, 3707115, 3053182, 3379450, 1244290, -2446040, -2527672, 1411812, 3169463, -159024, -3072117, -677205, 2989509, 1270779, -4652410, -7869176, -5865429, -2274586, 446294, 3789768, 7918931, 9215499, 5524354, 19217, -2908805, -3074502, -3253018, -4468051, -5293843, -4778597, -3398903, -1463464, 1027118, 2845991, 2209470, -319733, -1688130, -377571, 1127769, -346209, -4073677, -6274153, -5039957, -2240772, -430408, 37849, 146419, 251549, 82094, -429653, -1237828, -2302627, -3074274, -2734773, -1317828, 345065, 1781147, 2610719, 1450713, -2526552, -6764984, -7238629, -4353828, -3427340, -6995147]
12482f995147l189806K769621O596044L656542q88228o48505K445413K506517
12474F252451o54179k446348j511158n54766m05584P62509K483048J915418o80984
12465E160407j591451O8034P02425j256400k067816J024318M352434K941202j595337
12456G737816l139532k17174J723710j654447o940106p069474m31893P023221
12448b967879Q901805N204939P28858j561726k811114m203214m086883j163800
12440a959014J932952J526155j612734l120132j432852K20306p37747k293615
12432g476681j602074K52159N65895J11128J795030M893348N138865J456892j703619
12423C430943j066431K45770k096674n981283n390042M09670N550430O042019
$$ y = [-6995147, -10184953, -7415332, -819288, 2837254, 1949026, 1300521, 3745934, 6252451, 5598272, 3151924, 1640766, 1086000, 680416, 1442925, 3925973, 5841391, 5160407, 3568956, 3636990, 4339415, 3083015, 1015199, 2039517, 6391951, 9333153, 7737816, 4598284, 4381110, 6104820, 4450373, -2489733, -9559207, -9991100, -2967879, 5933926, 11138865, 11867723, 10305997, 7494883, 3291669, -795214, -1959014, -26062, 1500093, -112641, -3232773, -4665625, -4445319, -5183066, -7476681, -9078755, -8826596, -8260701, -8149573, -6354543, -1461195, 3677670, 5134562, 3430943, 2364512, 2610282, 513608, -5467675, -10857717, -10448047, -4897617, 1144402]
12415A144402M263449K972592J81098n796914j0296939p251208J437580P261336
12407f084604N867417J387879o64399J00879J180281J440296O99214j320229l042946
12398d36212j400332L032802M638618J59711n424188m992277O76771M092906J647495
12389A995294k213678k210488J063507L610936L561016J746176o04666k174868
12381D773229j466748J094227K374959L28525k511867k010580J657360L963857
12373H202962K165680j295980k642887j630350p00652r06837j023034r5405J245463
12364C318960J982417J594889q0641k215149k602443j50291K399374J165559k914583
12355B498092m274790n40715L358929J954924k713877l933790L00381N061902
$$ y = [1144402, 5407851, 8380443, 8561541, 2764627, -7532312, -14783520, -13345940, -6084604, -217187, 1170692, 506293, 607172, 1787453, 3227749, 3926963, 2606734, -436212, -1836544, 1196258, 5834876, 5994587, 570399, -4421878, -3745107, 347799, 1995294, -218384, -2428872, -1365365, 2245571, 5806587, 7552763, 6948097, 4773229, 3306481, 4400708, 6775667, 7104192, 4592325, 2581745, 4239105, 8202962, 10368642, 9072662, 6429775, 4799425, 4098773, 3191936, 2168902, 2073497, 3318960, 5301377, 6896266, 6815625, 4600476, 1998033, 1847742, 4247116, 5412675, 2498092, -1776698, -2317413, 1041516, 2996440, 282563, -3651227, -3350846, 1711056]
12347A711056N412826J749995k210334l710913k533116n24113J15698n47580k74003
12338h10484J132712M29168l120017m043001J436969O958123L664380n048590
12330E99260o453060K440553R445104N280492l110131m547255r8795J931034P48356
12321F235558J583564L417375N2624p421358j0208752n130758J051910K840073
12313g579764L077856N644153Q246402O545823N16823o293287r973796p656032
12305g471822n15604M342683J178716m921435l666555M384603P227990J68597
12297G27173n828264j312127O456390N543572j610727l599347P73200K472719
12289C622589o03761n61102M935383P255713J449734m965156m255340l16946o40098
$$ y = [1711056, 7123882, 8873877, 6663543, 2952630, 419514, -104599, 11099, -536481, -810484, 322228, 751396, -2368621, -6411622, -4974653, 1983470, 5647850, 599260, -5853800, -3413247, 6031857, 11312349, 8202218, 3654963, 3556168, 5487202, 6235558, 7819122, 11236497, 11289121, 3867763, -6340989, -11471747, -10419837, -7579764, -4501908, 1142245, 9388647, 15934470, 16451293, 10158006, 184210, -7471822, -7987426, -3644743, -2466027, -7387462, -11054017, -6669414, 558576, 727173, -5101091, -6413218, 43172, 5586744, 3976017, 376670, 1149870, 3622589, 3018828, 2457726, 7393109, 14648822, 16098556, 11133400, 6878060, 6561114, 5921016]
12280E921016l603152k417627K840720N618276K974212j832519n276588n915257
12272a690919k465525M119656P842992L533816m813572q006194m009109M06370
12264e082485R71847J157966L597567M091334p26929n872987m673143J058297
12256e478533M184937L013870K058045L270362L524716J391477j6122R32645P92963
12247A3674360l355394q388955q665008l074830M013621P498988N496229J16708
12239G315719m005878l388294N37534K618179K42388l181589k722463J481392
12231a103012M305794J901322l836606p271438m818469J302626N247096M008013
12223b64674Q85904Q41053L348376L235696j045962m223155j662174L472628M354887
$$ y = [5921016, 2317864, -99763, 2740957, 8359233, 11333445, 9500926, 4224338, -1690919, -4156444, -36788, 7806204, 11340020, 6526448, -1479746, -5488855, -5082485, -4110638, -2952672, 644895, 4736229, 4009300, -1863687, -6536830, -5478533, -1293596, 1720274, 3778319, 7048681, 10573397, 11964874, 11948752, 12881397, 13674360, 10318966, 1930011, -6734997, -9809827, -5796206, 1702782, 7199011, 7315719, 3309841, -78453, 459081, 3077260, 3319648, 138059, -2584404, -1103012, 3202782, 5104104, 1267498, -6003940, -10822409, -9519783, -4272687, -264674, 621230, 1462283, 4810659, 8046355, 7000393, 2777238, 1115064, 4587692, 8942579]
12214H942579j48821m431581m005600n98320J409619P55439j62089Q36803K842746
12205E440775L004041J50093l352713m177936k130560j57387k48572j334762j730202
12196d537223j318262l61051J334745K731841J795008q06400j228569J851167
12188e38744M143680J681544k910566m135612j429740J271459K130133K572241
12180B784395K710982Q69624k116594k977934j152570M89068Q01397J746929L461884
12171F617181K625000k021248o448384o375532k673927O87716J767953J554523
12163d266718J591593K469341L402909K671287L8908j697407k85893J710550L96738
12154F031308k321530r68919L518122L334448l724121q820937m595585L282690
$$ y = [8942579, 8793758, 4362177, 356577, -241743, 1167876, 1923315, 1761226, 2598029, 5440775, 8444816, 8594909, 5242196, 1064260, -1066300, -1223687, -1472259, -2807021, -4537223, -5855485, -6216536, -4881791, -2149950, -354942, -1161342, -2389911, -538744, 3604936, 5286480, 2375914, -1759698, -3189438, -1917979, 212154, 2784395, 5495377, 6365001, 4248407, 1270473, 117903, 606971, 1408368, 3155297, 6617181, 9242181, 7220933, 772549, -5602983, -8276910, -7589194, -5821241, -4266718, -2675125, -205784, 3197125, 5868412, 5907320, 4209913, 3924020, 5634570, 6031308, 3709778, 2740859, 6258981, 9593429, 5869308, -2951629, -7547214, -4264524]
12146d264524M511809n39315k679594J317067N023425L697626Q06941Q51137K456224
12137A1180796K002429p63302l902938o228733o431803k929926K671439N278977
12129H76939K410659k137756l458813j711509k15687R1189P53644K032618K590084
12120A231368K078108J007613j195507m885681p348479m650413K842711R287555
12112a632725R074002K609033m268791n934119j939297K928370L604453P9564
12104D520490l027345k517757k50493N83045J94584K70721l25340l272929n363920
12095i188944j328080O950910J0259999M246252l715066m651967m03024O52994
12087B823074k769901l727119O67208M297476K217312j446255p06092K494525
$$ y = [-4264524, 247285, -292030, -2971624, -1654557, 3368868, 7066494, 7873435, 8724572, 11180796, 13183225, 12419923, 8516985, 2288252, -4143551, -7073477, -4402038, 876939, 3287598, 1149842, -2308971, -4020480, -4236167, -4144978, -3391334, -1358716, 1231368, 3309476, 4317089, 3121582, -1764099, -9112578, -13762991, -10920280, -1632725, 7441277, 10050310, 5781519, -152600, -2091897, 836473, 4440926, 4520490, 1493145, -1024612, -1275105, -692060, -497476, -226755, -552095, -3825024, -9188944, -10517024, -3566114, 6693885, 10940137, 7225071, 2573104, 2170080, 2823074, 53173, -3673946, -3006738, 1290738, 3508050, 2061795, 1355703, 3850228]
12079C850228J959479k391380m491327j635985J980931K007147o31171k498230
12071a850308k017113N17358L919896N392544K130955m031332o594695k102194
12063d634889M425979N462902R48439k021523N82409M408225L585919p75087k612648
12054I369726K27797L271753J956399k552340n800689n795529l845568j362320
12046d530771J020347J818742k12491k876521k039592K175275M349671J553404
12038A258064j484213O39702M725454L057847l983346o965068j332345N013140
12030I29235L371548k357625j966375M454529O137668j124636p308663l072952
12022i37271N425083N259815l823388q868920k716427O202968O884768P03175
$$ y = [3850228, 5809707, 3418327, -1073000, -2708985, -728054, 1279093, 647922, -1850308, -3867421, -3350063, 569833, 5962377, 8093332, 4062000, -2532695, -4634889, -208910, 5253992, 6202431, 4180908, 4763317, 9171542, 12757461, 11982374, 9369726, 9597523, 12869276, 14825675, 12273335, 6472646, 677117, -3168451, -4530771, -3510424, -1691682, -1904173, -4780694, -6820286, -4645011, -295340, 1258064, -226149, 413553, 5139007, 8196854, 4213508, -2751560, -4083905, 929235, 4300783, 1943158, -23217, 4431312, 10568980, 9444344, 2135681, -937271, 4487812, 9747627, 5924239, -2944681, -5661108, 541860, 7426628, 8129803]
12014H129803l073861j520365P6528j493869l029985j538962J216890K731519
12006A497698L227146K867523R9323m371142o014492k396587K598746M123227
11998A631442K955617K521465K042979j751171p149110p802032j766373M831122
11990d486061N658838J977683n33176m1836L12689j341653k404351k87039K737962
11981A593056K204005j776464l841679p84195L421858L083760p84283k069366
11973A046692Q76268K766960J05999l055271j747675J937513K519818k52575k156931
11964B040798k140140l046569m862553l366427K736005Q171661P306664R67053
11956G806492n184688o915392m361446n04090J814405K332596L174789N231584
$$ y = [8129803, 5055942, 3535577, 3612105, 2118236, -911749, -2450711, -1233821, 1497698, 4724844, 7592367, 7691690, 3320548, -2693944, -5090531, -2491785, 1631442, 4587059, 7108524, 9151503, 7400332, 251222, -7550810, -9317183, -4486061, 1172777, 3150460, 2617284, 2575448, 2888137, 1546484, -857867, -1144906, 1593056, 3797061, 2020597, -1821082, -2605277, 816581, 3900341, 3116058, 1046692, 1922960, 4689920, 4795919, 1740648, -7027, 1930486, 4450304, 4197729, 2040798, -99342, -3145911, -8008464, -11374891, -8638886, -467225, 6839439, 7806492, 2621804, -4293588, -8655034, -9159124, -7344719, -5012123, -1837334, 3394250]
11948C394250N808816K327623k725950m275230j842768m1709j297790k612993
11940a265751j206618J050716J515934J228099K010466K192625n69154m008118
11932I48199l264531J955612N985742M014740k148966o535558n849190k310934
11924g204886o0535l12758j047477n76799N56165J413371K096218K278505P41987
11915b116209j798592k003560J228805L756176J717152k239576k872664o31549
11907d960017l17778k360104j996996K131451N095919L443391M9977j443041j694778
11898b051976k034043q22827K677957N084337L699021J073330P63471J691621
11890A0080891Q55060j096204j318790J51287Q49455J58326k88314L37557J133863
$$ y = [3394250, 9203066, 11530689, 8804739, 4529509, 2686741, 2645032, 1347242, -1265751, -2472369, -1421653, 94281, 1322380, 3332846, 5525471, 4956317, 948199, -2316332, -360720, 5625022, 9639762, 7490796, 955238, -4893952, -7204886, -7265421, -7578179, -8625656, -9202455, -8646290, -7232919, -5136701, -2858196, -2116209, -3914801, -5918361, -4689556, -933380, 783772, -1455804, -4328468, -4960017, -5277795, -7637899, -9634895, -7503444, -2407525, 1035866, 1085843, -357198, -2051976, -4086019, -4908846, -2230889, 2853448, 6552469, 7625799, 8389270, 10080891, 10935951, 9839747, 8520957, 8672244, 9521699, 9680025, 9391711, 9729268, 10863131]
11881A0863131Q75213j053635l797595m642458k077350N74445j324708n926063
11873f509020o059636l2603M950298L454010m28139n71819K029888L317423L620612
11864C771014M317467K304983m275083r107352n333017K897659N634290J884111
11856B094072l65684J934326K929955r49760m951418l991648M48068M230806N595643
11847F974360M285103J034214p79245J494588M078418Q00513o432215q634896
11839B820840k991089K813521K599194J32842R03325K679642O23444l471475l952395
11830B157849k76415K805697K328996l22709k611999k879699m57376L182480M582620
11821H509444J962319k508573n505609n703305l258805Q51811L745043K437955
$$ y = [10863131, 11738344, 10684709, 6887114, 2244656, 167306, 741751, -582957, -6509020, -12568656, -12601259, -7650961, -4196951, -4625090, -5196909, -3167021, 150402, 3771014, 8088481, 10393464, 6118381, -2988971, -8321988, -5424329, 209961, 2094072, 1728388, 3662714, 6592669, 5642909, 691491, -3300157, -2852089, 1378717, 6974360, 11259463, 12293677, 11514432, 13009020, 17087438, 17887951, 11455736, 2820840, -170249, 2643272, 5242466, 5375308, 6278633, 8958275, 9581719, 6110244, 2157849, 1881434, 4687131, 7016127, 6693418, 4081419, 1201720, 744344, 3926824, 8509444, 10471763, 7963190, 2457581, -3245724, -6504529, -5652718, -1907675, 530280]
11813E30280j468098k515188J180728M925834M100677Q129l375044m542064l591522
11804d746268l12763L536790L893601M8282k791636m09605M109638M871018J133727
11795I332784l068941m782721l998281j864746n7921K61374P71088L859085O752822
11786G204543L470180m484956o583002J947885J0674113P353403m508855j0962433
11778D110878p078467j004657M6158k196547l674496l648887j966408J856749
11770a3555677N114557M088460Q30700R80126L986714L218710k542325n934145
11762c812880k394116L032595M241500K308453O36318j369903m338465m627129
11754f323627j15138M527080M399603J862548J388586J363636j782317m934834
$$ y = [530280, -937818, -3453006, -2272278, 2653556, 6754233, 6762362, 3387318, -1154746, -4746268, -5059031, -1522241, 2371360, 2419642, -371994, -781599, 3328039, 8199057, 9332784, 6263843, 1481122, -2517159, -4381905, -4439826, -4178452, -3407364, 451721, 7204543, 10674723, 6189767, -393235, 1554650, 12228763, 19582166, 15073311, 4110878, -2967589, -3972246, -3926088, -6122635, -9797131, -13446018, -15412426, -13555677, -8441120, -4352660, -3521960, -2541834, 1444880, 4663590, 2121265, -3812880, -6206996, -3174401, 1067099, 3375552, 4011870, 2641967, -1696498, -6323627, -6438765, -1911685, 2487918, 4350466, 5739052, 7102688, 5320371, 385537]
11746C85537k272238L881845M979938o51595m885478k043165L222121L929988
11738F546953Q02441n74745J253514K772281J865634R2293j250891l072274n295562
11729C139644n169525j281127K838412K452798j588733l387511j27650M002139
11721H78447M211274J838547Q76659Q08966j550215m738987l938987K32032J418746
11712C6482k032583l581314Q47764N606102M219326l80614j390072P90696R11690
11703E027477r96665m83619K025193J655060j440302j848743R39740J120782k364051
11694C634872k538343L403599P175883J503894p486653q334689o68536N122892
11686A812919L064312j850298k982431p81436N14304j07569l85114O71396J350425
$$ y = [385537, -1886701, 1995144, 6975082, 6323487, 1438009, -605156, 2616965, 6546953, 7349394, 6774649, 8028163, 10800444, 12666078, 12758371, 11507480, 8435206, 3139644, -2029881, -3311008, -472596, 1980202, 391469, -2996042, -3123692, 878447, 5089721, 6928268, 7804927, 8613893, 7063678, 2324691, -1614296, -1382264, 36482, -1996101, -5577415, -4729651, 876451, 5095777, 4715163, 3325091, 4115787, 5027477, 4030812, 3547193, 5572386, 7227446, 5787144, 3938401, 4878141, 5998923, 3634872, 1096529, 4500128, 11676011, 13179905, 5693252, -2641437, -3309973, 1812919, 4877231, 3026933, 44502, -736934, -222630, -330199, -715313, -43917, 1306508]
11677A306508J4571k290286k603502L24524L606178L158760m53972j809097J870332
11668C124016N858777M021399k319681o121616m372118j082968m077M46626K602398
11659B152756M326880K400200j481583k690282q69929o58129m322766p682865
11651h825718n927360o58386K617462K573634K929603M952927M592926Q491l108733
11642h45154P53609P253581P380760R73566l068987q16597J242548j981244n577031
11633E315051l726152M1648m78877k956619j014973L984247N186587J859748q32270
11624G378390j994780m728007o598995j902705N720218N398954l071554o305565
11616f104044J873763R378017M540448n461279o690433j06409K650954p59335
$$ y = [1306508, 1321079, -969207, -3572709, -3248185, 357993, 3516753, 3062781, 1253684, 3124016, 8982793, 13004192, 10684511, 4562895, 190777, -892191, -896268, -449642, 2152756, 6479636, 8879836, 7398253, 4707971, 3838042, 3179913, -1142853, -8825718, -14753078, -15411464, -12794002, -10220368, -7290765, -2337838, 2255088, 2263579, -845154, -91545, 7162036, 14542796, 15516362, 12447375, 11630778, 12873326, 10892082, 5315051, 1588899, 1630547, 1151670, -1804949, -2819922, 1164325, 6350912, 8210660, 7378390, 5383610, 655603, -5943392, -7846097, -2125879, 3273075, 201521, -6104044, -4230281, 5147736, 9688184, 4226905, -2463528, -2569937, 81017, -678318]
11608f78318k415268l05217n15919l312083j582682M452495M964694k413982o491424
11599h297704n66937N565356J466963o259044m615240M315156O701938q48752
11591b538264o580949k569220M142266M179789l35920j511019J657699L987546
11583D31928L389783K096446P58389j814393l759522j553502L076925L709680
11575F335734j408252n989275m655896l81058J188346O93359K619038O355781
11567D757777O421079J542594k799667k587340n87872p08150j722323n79320J463757
11558E200535P34316k530670m274683k736077o63855p53116j718790l33847L924909
11549c151278P517403O398040R84010l353496k387350J102715O55661m497181
$$ y = [-678318, -3093586, -3398803, -3914722, -7226805, -8809487, -4356992, 607702, -1806280, -8297704, -8864641, -3299285, -1832322, -8091366, -12706606, -8391450, -1689512, -2538264, -9119213, -11688433, -7546167, -3366378, -3702298, -5213317, -3555618, 431928, 3821711, 5918157, 6676546, 4862153, 1102631, -450871, 2626054, 6335734, 4927482, -1061793, -5717689, -6098747, -4910401, -4217042, -1598004, 4757777, 11178856, 12721450, 9921783, 7334443, 6746571, 6038421, 4316098, 3736778, 5200535, 5934851, 3404181, -870502, -3606579, -4270434, -5023550, -6742340, -7076187, -3151278, 4366125, 10764165, 11748175, 8394679, 6007329, 7110044, 7765705, 3268524]
11541C268524p625599l939904K554704N145809L524677K013941J610792j73381
11533F379563k694255j791343L008081O278756M000228p35145k078705P40837
11525A3108017K631277p36651p081684r256626l477062N082889P527371K186560
11517I984091l611306m072747k054392k206658k620738N82304M705616M219809
11509D925979L82726r74520L85276l75195l398446l923780j792797j628466k897802
11500i297025l03978M217282J848716o785243q387394K730521J3220669R771625
11492G015173p66430l020423L169328N433086N94469k101693J169039K699208
11484A4191757k222897p255933o052947j336490J900776L788249N284034L953624
$$ y = [3268524, -4357075, -8296979, -5742275, -596466, 2928211, 4942152, 6552944, 6379563, 3685308, 1893965, 4902046, 11180802, 15181030, 14445885, 12367180, 13108017, 15739294, 15002643, 7920959, -1335667, -4812729, 270160, 7797531, 9984091, 6372785, 2300038, 245646, -1961012, -4581750, -3999446, 706170, 4925979, 5308705, 4334185, 4719461, 4344266, 945820, -2977960, -4770757, -6399223, -9297025, -9601003, -5383721, -3535005, -10320248, -18707642, -15977121, -2756452, 7015173, 6248743, 3228320, 6397648, 11830734, 12425203, 10323510, 11492549, 14191757, 11968860, 4712927, -1340020, -2676510, -775734, 3012515, 8296549, 12250173]
11476A2250173p89188m373008l746360j964609k111120k303301p19409M76727
11468c280095N75764L046350P560710O627905k431244r141947l481410P361556
11460F837589P852668k696079r051219l173229M971478M473885p54249j464510
11452F996334J258008M89540k593335j182175L455594K710669m379268p999505
11444a244138k671459M182377M082820j58322r43644J410279R48998k489695l084075
11435C3141M64326K414109o08775m354882l725027J74903K719711K032273o4049
11426i14270r50692P36493L905516M901080J004132n325101q460808o326409j937773
11417a3367832J951435N510789Q248510P637895L518864l52242j479714j393970
$$ y = [12250173, 11460985, 7087977, 3341617, 1377008, -734112, -3037413, -3756822, -3280095, -2704331, 342019, 7902729, 14530634, 12099390, 2957443, -523967, 6837589, 14690257, 11994178, 2942959, -230270, 4741208, 9215093, 8460844, 6996334, 8254342, 8743882, 6150547, 4968372, 8423966, 11134635, 6755367, -1244138, -3915597, 266780, 4349600, 4191278, 3247634, 4657913, 5606911, 3117216, 33141, 497467, 2911576, 2302801, -2052081, -5777108, -5602205, -2882494, -850221, -914270, -1864962, -1128469, 2777047, 7678127, 8682259, 3357158, -5103650, -11430059, -13367832, -11416397, -5905608, 2342902, 9980797, 13499661, 13147419, 11667705, 10273735]
11409A0273735j391457m19289N32253k001548o425556n010969L977654R980985
11401I515808M123150o315365p782271q31059J836151l348375n345963K380832
11393e767092J0274295P502709j691353n855693l495871j952596l267394k161655
11385f414650K580296M826714J421720k233800p52155L007096K906328j232671
11377D108878m285989l590507j387275j98962O4463m5713r93162k282074j879468
11368a0489809N46057K184226J238669M24319K966795O411499M865220k078479
11360F068497p098973m179065L373512P063705L406704l091702o029229l407290
11352c893841J614286M077393J746953k323947k855620Q18817L236928L30406
$$ y = [10273735, 8882278, 8462989, 8995242, 6993694, 568138, -4442831, -465177, 9515808, 13638958, 7323593, -458678, -1289737, 546414, -2801961, -8147924, -5767092, 4507203, 12009912, 10318559, 4462866, 966995, -985601, -4252995, -6414650, -3834354, 992360, 2414080, 180280, -571875, 2435221, 5341549, 4108878, -177111, -3767618, -5154893, -5353855, -5289392, -5335105, -6328267, -8610341, -10489809, -9943752, -7759526, -6520857, -6096538, -3129743, 3281756, 8146976, 6068497, -1030476, -5209541, -1836029, 5227676, 8634380, 5542678, -486551, -3893841, -2279555, 1797838, 3544791, 1220844, -1634776, -815959, 2420969, 2751375]
11344B751375m247812m029410J024183M797988L721872M29455j429602j457040
11336A561009o22976P89200J843139R10320j516573k785074j989219j094931j225033
11327d130138r14495P66249K445484L108998L477887L471009J605394j545908
11319H284480k799162j194335J42193p79650j492593L9490R95443j689296n270214
11310c763644m722871o20061J631136o1814j957132p29843K035445L185499K516903
11301b486382J774840J300246Q4167j683856k181268l67760K275885L202737J757350
11292C675959j97191r49547j091726j761983j858679N59866M319431N571629L114121
11283A1381880M25965O21978J861341M06532l323928m863444j797570K643360
$$ y = [2751375, -1496437, -5525847, -4501664, 296324, 4018196, 4447651, 3018049, 1561009, 938033, 1727233, 3570372, 4480692, 2964119, 179045, -1810174, -2905105, -4130138, -5044633, -4278384, -1832900, 1276098, 4753985, 8224994, 9830388, 8284480, 5485318, 4290983, 4433176, 3653526, 2160933, 2200423, 3195866, 1506570, -3763644, -8486515, -9106576, -7475440, -7537254, -9494386, -10224229, -8188784, -5003285, -2486382, -711542, 588704, 672871, -1010985, -3192253, -3560013, -1284128, 1918609, 3675959, 3478768, 2529221, 1437495, -324488, -2183167, -1623301, 2696130, 8267759, 11381880, 11807845, 12429823, 14291164, 14697696, 11373768, 6510324, 4712754, 7356114]
11275G356114L158203j258807n612936m378499J521655N205238K612484j829980
11267F773472j671010J806249J872768k437588m585320j547210J024272j312947
11259g7314l843091r06237L738890K855974j787156k083260K683075M250331j197093
11250C634119o514152m040411L695487Q045036N100541j261510m840969l032686
11242G85455J174395K092852k022685n711701k939645L765067N866588R05161
11234C915487l977286k662626J787523L298777J868336J458154K604095K723139
11226A1015599J623753J367189J591932k25260l835995n531388l110884J232544
11218D127490L757695L141734J115465P7434K24718p32264l911949o142290l522179
$$ y = [7356114, 10514317, 9255510, 3642574, -735925, 785730, 5990968, 8603452, 6773472, 5102462, 6908711, 8781479, 6343891, 1758571, 211361, 1235633, -77314, -3920405, -4826642, -1087752, 1768222, -18934, -2102194, 580881, 4831212, 3634119, -2880033, -6920444, -3224957, 4820079, 9920620, 8659110, 3818141, 785455, 1959850, 4052702, 2030017, -3681684, -6621329, -2856262, 3010326, 3915487, -61799, -2724425, -936902, 2361875, 4230211, 5688365, 8292460, 11015599, 12639352, 14006541, 15598473, 15373213, 11537218, 6005830, 2894946, 4127490, 7885185, 11026919, 12142384, 12219818, 12444536, 11712272, 7800323, 1658033, -1864146]
11209a864146J985710L931768N91817k320278q09189J109799j217225m675318
11201c267062l685834J53531J212367j42584J120260M702771M963605J015600
11193F072654j738871j380993k175258n149068m684535J510793P079346O736770
11185F270838L973043L234983J677197l861317q070700m527025K672021M462373
11177E831413J114313N90881L863963L064629m180995r238231n498302J820142
11169b632187M510668L127259L364868N599052N110543M40032m582392o544062
11161H393781n715015l759243j540234N73488K215729K816876J367878k068641
11153B284619m276671j481456M488413O373147P05079o491865p073502j256204
$$ y = [-1864146, 121564, 4053332, 4645149, 2324871, 1515682, 2625481, 1408256, -3267062, -6952896, -6799365, -5586998, -5729582, -4609322, 93449, 5057054, 6072654, 4333783, 2952790, 777532, -4371536, -9056071, -7545278, -465932, 6270838, 10243881, 13478864, 15156061, 11294744, 3224044, -1302981, 1369040, 5831413, 6945726, 7536607, 11400570, 14465199, 10284204, 1045973, -4452329, -2632187, 1878481, 5005740, 8370608, 13969660, 19080203, 19520235, 14937843, 8393781, 2678766, -1080477, -2620711, -2047223, 168506, 2985382, 4353260, 2284619, -1992052, -3473508, 1014905, 7388052, 8093131, 1601266, -5472236, -6728440]
11145f728440L645223L226870J07812j316976N7019K474788L520216J631842k045363
11136D572991l687316j196633K240026J978516j490820l210846p39651K932227
11128A398494L709407R03230k718047l358852N32923N444385N290495m63257m297942
11119F440836p50294M558619K862530l629681m790752J035001M425314N84098
11111A0735671l453855j896098K96117j923239l328738J722430P136471M154101
11103A3442860l247145m435719Q5194K02364n765983q099111k257982M217664
11095e857858M899072L101083K618591N46819m470630o393525j539067L891025
11087c204490L668064J472367K719565L726997q76545n834478k245959O366670
$$ y = [-6728440, -3083217, 143653, 251465, -1065511, -1008492, 1466296, 4986512, 6618354, 4572991, 885675, -310958, 1929068, 3907584, 2416764, -794082, -1533733, 1398494, 5107901, 6011131, 3293084, -65768, 467155, 5911540, 11202035, 10738778, 6440836, 5690542, 10249161, 13111691, 9482010, 4691258, 5726259, 10151573, 10735671, 7281816, 5385718, 5681835, 3758596, 429858, 2152288, 9288759, 13442860, 10195715, 5759996, 5845190, 6047554, 281571, -7817540, -10075522, -5857858, -958786, 2142297, 4760888, 5307707, 837077, -5556448, -7095515, -3204490, 463574, 1935941, 4655506, 8382503, 7505958, 1671480, -574479, 5792191]
11079E792191P441684j428161q457514n060968K956774N551146J466674l681841
11071D579985n927855m544059J36789N708987P650726M111473j421013m564191
11063E730842m693700l554108k240087j217934n00210J249449M579931N998442
11055E352625J585524n442001o825040r85414L857633J774729k282389j103053
11047d067386L592878N180066K577346n57764l244945n994432n340972J580726
11039f274483Q707185O845926k099064o339500j352911L941736J931442k272734
11031C087597o86580M086902M029434n88952k349413M38635J560448j625480l274255
11022D678336R79654O038240M580383k041721n956406l821311j99277n3453k609864
$$ y = [5792191, 13233875, 11805714, 3348200, -1712768, 1244006, 6795152, 8261826, 4579985, -1347870, -5891929, -5755140, -46153, 7604573, 11716046, 10295033, 5730842, 1037142, -2516966, -4757053, -5974987, -6475197, -5225748, -645817, 5352625, 6938149, 1496148, -5328892, -6314306, -2456673, -681944, -2964333, -4067386, -474508, 4705558, 7282904, 6725140, 3480195, -2514237, -7855209, -6274483, 2432702, 9278628, 7179564, 840064, -512847, 3428889, 5360331, 3087597, 2401017, 6487919, 10517353, 9928401, 7578988, 8017623, 9578071, 7952591, 4678336, 5657990, 11696230, 16276613, 14234892, 8278486, 4457175, 4257898, 4204445, 1594581]
11013A594581l890748j865341K452985O371512O675877K162177l518091m618206
11005E364746r52028P16976l826733r009575o808411J289511O129562L700788
10997c395164r29915k932247l434373l721135j242561M316348P399207M417383
10989D77543J7453k31746J343640m43455l932785l531285M70824K905033K814273
10980a10505L465413M194525R10670m650836m949905J599887O762817M150157
10972A1372223j931371l890812j533750P7275o04576q79922J29005J22828j642398
10963A218502k308088M59178M270464L978860j664990o779486m518848L354830
10955a989578P288796K651610l325356k186244K935104K817822k625905m382847
$$ y = [1594581, -2296167, -4161508, -1708523, 4662989, 11338866, 13501043, 9982952, 5364746, 4412718, 5129694, 1302961, -7706614, -14515025, -13225514, -7095952, -3395164, -4325079, -7257326, -10691699, -14412834, -15655395, -11339047, -3939840, 477543, 494996, 263250, 1606890, 1163435, -2769350, -6300635, -5829811, -2924778, -110505, 3354908, 7549433, 8460103, 3809267, -1140638, 459249, 7222066, 11372223, 9440852, 5550040, 4016290, 4093565, 3488989, 2609067, 2738072, 2860900, 1218502, -1089586, -630408, 3640056, 7618916, 5953926, -825560, -5344408, -1989578, 5299218, 7950828, 4625472, 2439228, 5374332, 8192154, 5566249, 1183402]
10947A183402O50133M751933J865634l949995o264758m693639j495477K915019
10939e037748O495168M673036j821922m800603n9407N263762L214068l040793
10931D885561n295156l197424k385573l241627q90038M623194O824833K597898
10923C921668l151722m436309j171186K339321K713618K29708j905598r83234
10915b443734J682470K232356n330j341813L85144K754991L528279L694639L229897
10906A3716899m26510n925728o456370j0220N098132J783423m596894m672249
10898a489517N15558K922525J219571O21900J626678J1179k883170j099053M061804
10889E507475M134587k317211o065387j543848M527578L804421k142069o300002
$$ y = [1183402, 1833535, 6585468, 8451102, 4501107, -1763651, -6457290, -7952767, -5037748, 1457420, 6130456, 4308534, -492069, -551476, 4712286, 7926354, 4885561, -409595, -3607019, -5992592, -9234219, -10124257, -5501063, 1323770, 3921668, 769946, -3666363, -4837549, -2498228, 215390, 445098, -1460500, -2443734, -761264, 1471092, 1465762, 123949, 509093, 3264084, 6792363, 10487002, 13716899, 13290389, 7364661, 908291, 898071, 5996203, 7779626, 3182732, -1489517, -973959, 1948566, 3168137, 3790037, 5416715, 5427894, 2544724, 1445671, 5507475, 9642062, 7324851, 1259464, -284384, 4243194, 8047615, 5905546, -394456]
10881c94456n948199k742699J608795M812053L669454j096839l752492j485763
10873e330146P37981k082203o308266m539152L036884Q132376N266667j413349
10865b499208l709337Q21983O559483O772642J400802l314304k629860J483812
10857D886013L925776K697239n54704l645176m568727j674590L198633M321771
10849H586235o93812n715657l624109K986429N144696N14194m049638l251845
10841a03507L40399K178728J601040j22815k090441k344340O62034L882348K547688
10832F551134j645708j750158L193688N468732O31971n098330m479873M3220J625223
10823D539899Q0809L19172K688854K554005j047388l113800m52596L310697K943738
$$ y = [-394456, -6342655, -9085354, -7476559, -2664506, 1004948, -91891, -3844383, -5330146, -4592165, -6674368, -12982634, -17521786, -14484902, -6352526, -1085859, -2499208, -6208545, -5386562, 1172921, 7945563, 9346365, 6032061, 3402201, 4886013, 8811789, 11509028, 10954324, 7309148, 2740421, 1065831, 4264464, 8586235, 7892423, 2176766, -1447343, 1539086, 6683782, 7197976, 3148338, -103507, 236892, 2415620, 4016660, 3893845, 1803404, -540936, 121098, 4003446, 6551134, 4905426, 3155268, 6348956, 11817688, 12449659, 7351329, 2871456, 2914676, 4539899, 4620708, 4939880, 7628734, 10182739, 9135351, 6021551, 5568955, 8879652, 11823390]
10814A1823390j346404m827841m650623k550005j128103q7432J924198L440299
10806B597479J680874k072184k821263O90382L039781k11238n567870o354084
10798i018123j463638M769634Q489064P769566J716772o441139q910548k588557
10790e676969M371665K764099l804828m262338K596100O630539K588518k895598
10782B311188l181120p48793k37081o40430M90628J655161J203782J276231L468595
10773E598161M943832K761382j484929m290758m353357k358447p20J53520k290681
10764a321997l081178J055186N378360K599361n129521p921464k578337L448065
10756g551525M373658L348754M174812M381049J277830k036592j614069J431537
$$ y = [11823390, 10476986, 5649145, 998522, -1551483, -2679586, -2767018, -842820, 2597479, 4278353, 2206169, -615094, 75288, 3115069, 2903831, -2664039, -9018123, -10481761, -5712127, 2776937, 10546503, 12263275, 5822136, -3088412, -5676969, -1305304, 1458795, -2346033, -6608371, -4012271, 2618268, 5206786, 2311188, -869932, -1618725, -1855806, -2496236, -2005608, -350447, 853335, 2129566, 5598161, 10541993, 13303375, 11818446, 7527688, 3174331, 815884, 815164, 968684, -1321997, -4403175, -3347989, 2030371, 4629732, -499789, -8421253, -10999590, -7551525, -3177867, 170887, 4345699, 8726748, 10004578, 7967986, 6353917, 7785454]
10748G785454L412395K293869j913524o326207n413868J625957N838556j41829
10740G160803q225079m726934P097519R866539p82052r038561m370654L235948
10732B17529K481556j148384J335651N098339J643232m759762n290001k294426
10724b716266k719079l728079Q35656O361416M399212j583409j715190L050809
10716B185070L338049j770834l925831l21309L133217L040248J962828J036383
10708H677821j059930k476225n37979J613583o43891m441895l550457Q79421K756776
10699A217224J735304K003959K789239M4758m094267l608433N15864J198715l214575
10690a412212o866738n572074p53144M709822P845422N127525k433052o881465
$$ y = [7785454, 11197849, 13491718, 11578194, 5251987, -161881, 1464076, 7302632, 7160803, -1064276, -5791210, 1306309, 11172848, 10390796, 1352235, -3018419, 217529, 2699085, 1550701, 2886352, 7984691, 9627923, 4868161, -421840, -2716266, -5435345, -9163424, -8327768, -1966352, 2432860, 849451, -865739, 2185070, 5523119, 3752285, -173546, -494855, 2638362, 5678610, 7641438, 8677821, 7617891, 5141666, 4603687, 6217270, 5573379, 1131484, -2418973, -1539552, 1217224, 2952528, 4956487, 7745726, 7790484, 3696217, 87784, 603648, 1802363, -1412212, -8278950, -13851024, -14604168, -9894346, -2048924, 3078601, 645549, -6235916]
10682f235916l159215K738501L071589M30532J341202L753873K096599o19852
10674C417313J481620L910334j469104r677692q075089K455300P546196J790841
10666A379719m058565j557948L718515L827309K8264k697916l247955j923059
10658d531636J665199M927239L854663J58926n36652J666387J344919j943990
10650F605055k906547n85886L47045q45238Q6462K827417J919081k765197m824266
10641a42074k296409j89213n44045J88218K307631J558596j484480r77501L096352
10632A517075L677052j074212m490498l145482j679471k865296k953717k76330
10624a1290879J322275J031855L324388Q181573Q802946K890164l086474m494166
$$ y = [-6235916, -9395131, -6656630, -3585041, -3154509, -1813307, 1940566, 4037165, 3417313, 4898933, 8809267, 7340163, -2337529, -10412618, -7957318, -411122, 1379719, -2678846, -4236794, -518279, 3309030, 3337294, 639378, -2608577, -4531636, -2866437, 2060802, 5915465, 6074391, 5537739, 7204126, 8549045, 6605055, 3698508, 3112622, 3459667, 2614429, 2700891, 5528308, 7447389, 4682192, -142074, -2438483, -2627696, -3171741, -2983523, -675892, 882704, -601776, -1579277, 1517075, 5194127, 4119915, -370583, -3516065, -5195536, -8060832, -11014549, -11290879, -9968604, -8936749, -5612361, 2569212, 11372158, 14262322, 11175848, 6681682]
10616F681682m103507l775139o69636M194368L904178k595725o287518j503436
10608d154733N030671M751344o45772l830616k366417R40449L222903K772771
10600E720600o29178l866210l140447M93535K909958L537726M203732L185855
10592A2415571j705571o071762m260827J39688l71072l483064r58416N394347
10584A098894N845815N62504l00238M293477L702761m312839p984137j934501
10576I71736L255638j32666l901580N53285P191850O603025J125214j919889k602721
10567A1143892m001821l802859K47556L513967J419562k843360m128872k761783
10559a213718j025268J142735K920565K354135K116194O765091J2098962Q122578
$$ y = [6681682, 2578175, -1196964, -1866600, 2327768, 6231946, 3636221, -2651297, -4154733, 875938, 5627282, 4981510, 1150894, -1215523, -275074, 2947829, 5720600, 5091422, 1225212, -1915235, -1421700, 1488258, 5025984, 9229716, 12415571, 10710000, 4638238, 377411, 517099, 146027, -3337037, -4295453, 1098894, 6944709, 7507213, 7206975, 11500452, 15203213, 10890374, 2906237, 971736, 4227374, 4094708, 193128, 746413, 7938263, 14541288, 15666502, 13746613, 11143892, 7142071, 3339212, 3586768, 7100735, 8520297, 5676937, 1548065, -1213718, -2238986, -1096251, 1824314, 4178449, 6294643, 13059734, 25158696, 33281274]
10551C3281274m287118j1733184p666148j101727p49353k949520j908472j4702
10543B871050n78783q16760J027192J229164j032613p00130K891775L194465j632049
10534F453311m838730l156449j388060j510225N20174L907323K317895k646366
10526c41127j392851O680421J0624023N846409o7125k158926l366585l279973
10518A2544266J694248O059581J297679o074891k888020N859158M437062l511882
10510A9417201o63358R475988O640932o774931p232098N651428O855863n948304
10502B7422721o597771Q100360R947185m742440m521682J4661251J6026211n907969
10494E4387866p079446K0720638K3559116r398717l084337O7164259Q6861597
$$ y = [33281274, 28994156, 17260972, 9594824, 8493097, 7743744, 4794224, 2885752, 2871050, 2292267, 1475507, 2502699, 3731863, 2699250, 1999120, 4890895, 8085360, 6453311, 1614581, -1541868, -2929928, -4440153, -3919979, -12656, 2305239, -341127, -1733978, 4946443, 15570466, 21416875, 21349750, 19190824, 15824239, 12544266, 14238514, 20298095, 21595774, 15520883, 12632863, 18492021, 22929083, 19417201, 18753843, 28229831, 34870763, 28095832, 20863734, 26515162, 33371025, 27422721, 20824950, 28925310, 38872495, 34130055, 29608373, 44269624, 60295835, 54387866, 47308420, 68029058, 91588174, 82189457, 79105120, 146269379, 233130976]
10487B33130976l7295068j95835741j96517204l7005454R0221155P0198069m220840
10480g7324107j2012947K4974641K5925219l353200n742354J5942570J6827301
10473a4762877k526348o927525L022580K45788j0211646l018544J3586187J1082623
10465i509762n304898o465015P288026R888121j482388n194581K181427K762427
10457e836643n822180p308014P73850M353931J192369K120296N943109J502952
10449c080330p232860n419044M939112P405507p3241l515192R68463L180877N16165
10440b310543R55918M240398J392527o311588p735127j933883P03523k085036
10432a3083811j530398M600548P874085M158264j286155m431029o058447n386996
$$ y = [233130976, 195835908, 167, -196517037, -233522491, -143301336, -73103267, -77324107, -89337054, -64362413, -38437194, -41790394, -47532748, -31590178, -14762877, -17289225, -24216750, -21194170, -20948382, -31160028, -34178572, -20592385, -9509762, -14814660, -21279675, -13991649, -4103528, -5585916, -10780497, -8599070, -5836643, -11658823, -18966837, -18192987, -13839056, -12646687, -10526391, -4583282, -3080330, -10313190, -15732234, -10793122, -3387615, -3460856, -6976048, -6007585, -2826708, -2310543, -1354625, 2885773, 4278300, -2033288, -9768415, -11702298, -10998775, -13083811, -14614209, -10013661, -2139576, 2018688, 732533, -3698496, -9756943, -15143939]
10424a5143939j152158K833817K911788K437447M417551M009491j659073m850349
10416f195425K0110M601148N77105m904181k269076K777697P58047l145666Q859
10407g771382M069945o64029o870353k236595O805910N848067q70956J281699
10399d07694Q806265N682664o262808r341516j379598J724159l614674k735388
10391g528590P848136J1260970o01716j1915751q259380K248108N232850J459807
10383b55566l06426P80694M06151j223177j463469l84243J470318L934504L692377
10374F651163j963824p282481m043932M264698N855467r78247n483314k140636
10366e121106K328226K460835J670383K468205J090896l536411n968373l468824
$$ y = [-15143939, -16296097, -13462280, -10550492, -8113045, -3695494, 313997, -1345076, -6195425, -6175315, -1574167, -997062, -5901243, -8170319, -5392622, -4634575, -7780241, -7771382, -3701437, -4365466, -11235819, -13472414, -6666504, -818437, -1689393, -407694, 8398571, 14081235, 7818427, -1523089, -2902687, -1178528, -4793202, -7528590, 319546, 11580516, 10978800, -936951, -9196331, -6948223, -1715373, -255566, -561992, 218702, 624853, -598324, -2061793, -2446036, -975718, 2958786, 6651163, 4687339, -2595142, -6639074, -2374376, 3481091, 2502844, -2980470, -5121106, -2792880, -332045, 1338338, 3806543, 4897439, 1361028, -4607345, -8076169]
10358h076169J42055K355106M342517M359928o70683o161628m091458K746271
10350e054061L382022k920674m789861J679928N978034J206618m464083j725357
10342f707434N638943Q190602L866360k927489p960340q059118k276335M386133
10334e848678N354859K287918K392063N381596L545036l723270p277654l299421
10326a187551P03046o49263k421965L0447K746857J482914p48979k68440J146383
10317H33449J568315K549206L415563K44586n490330n937631R73591O694946M123902
10308H975597k969586o849739n189735p8240N422703O906708J729243n427320
10300B519631o964375l070615l46886l60845Q08280K414096K1234l468116p16548
$$ y = [-8076169, -7934114, -5579008, -1236491, 3123437, 2452754, -3708874, -7800332, -5054061, -1672039, -4592713, -9382574, -7702646, -1724612, -517994, -4982077, -6707434, -1068491, 7122111, 10988471, 8060982, 100642, -7958476, -10234811, -5848678, -493819, 1794099, 4186162, 9567758, 13112794, 9389524, 2111870, -1187551, -484505, -1133768, -3555733, -3525286, -778429, 704485, -44494, -312934, 833449, 2401764, 4950970, 8366533, 8611119, 3120789, -2816842, -1843251, 4851695, 8975597, 6006011, -843728, -6033463, -6111703, -689000, 6217708, 7946951, 2519631, -4444744, -7515359, -7862245, -8223090, -7414810, -5000714, -4979480, -8447596, -9164144]
10291i164144N386199M128941m135560o771000J44651N466278K568236p51648
10283c128047J535150L361085K38101j904156K6562p88985o034971n751386L069272
10274i377375P537000M18242n659286K66657P661801L130609n512058l334753
10266d869163N257402N287339k147765l625903J768939K708687k206109l039260
10258h65833J509567K170951k014692j436978M987902O091344j796892p444215
10250A201154l092114L662376L357842j437875k947323M8337L633482M996178
10242I422057K678553l049318p175799m233633K343938L124406k939349o171487
10234f000632j526083L481239J561600k719928j529299L148182L592719r18941
$$ y = [-9164144, -3777945, 350996, -3784564, -10555564, -10410913, -4944635, -2376399, -3128047, -1592897, 1768188, 2006289, 102133, 128695, -660290, -6695261, -12446647, -9377375, -1840375, -1422133, -7081419, -6814762, 847039, 3977648, -1534410, -4869163, 388239, 5675578, 3527813, -98090, 1670849, 4379536, 2173427, -865833, 643734, 2814685, 799993, -636985, 4350917, 10442261, 8645369, 1201154, -1890960, 1771416, 5129258, 3691383, 744060, 792397, 4425879, 9422057, 12100610, 9051292, 1875493, -2358140, -14202, 3110204, 170855, -6000632, -7526715, -4045476, -2483876, -5203804, -6733103, -3584921, 7798, -911143]
10226i11143l812196j549187K756351N153186M531568J033056l994212o484546
10218c277123l094380K995842M317219j038983n992489l935505J971075L712097
10210d342247L91166j237235J591532L117786l61723k863572J438935O711326
10202D445968L539898m941974o665880Q6496L681856j680896o423024j636939
10194i594495O426276P057181J705328o27850J308171J243860k369703m517640
10186F31128k712594M95014L168117M887812L355068k646111p995503o192261
10178g009330R81873N485265M158130J167801k70395j590415l664838m346066
10170e087975k729289q87119j58342K99082Q51147Q84525O37014K53028j538556
$$ y = [-911143, -4723339, -6272526, -3516175, 1637011, 6168579, 7201635, 3207423, -3277123, -6371503, -3375661, 941558, -97425, -6089914, -10025419, -8054344, -4342247, -3951081, -5188316, -3596784, -478998, -840721, -3704293, -2265358, 4445968, 7985866, 3043892, -3621988, -3535492, 146364, -1534532, -7957556, -9594495, -3168219, 3888962, 5594290, 4966440, 6274611, 7518471, 5148768, 631128, -2081466, -1586452, 1581665, 6469477, 9824545, 7178434, -817069, -7009330, -6027457, -542192, 3615938, 4783739, 4513344, 2922929, -741909, -5087975, -7817264, -8704383, -8862725, -8563643, -7712496, -6827971, -6190957, -5937929, -7476485]
10161g476485m213909l597090J890481O176195L188819k973866l212053K792046
10153g425862O488510L905833J92488n99437j339082m333389n966023l217005
10145a2293967P03250J746417J035466J353983K100579J768573J516727K415631
10137C46659K687184J278714O12873K035650K174821j663574n573177l872697
10129a973547J873546M222988K41769m381309l146118K792506O395433L428465
10121I453733k931562o327399m564935j307886n62580j589892j131237Q60152
10113h101606J162253r05708j518954J678424M759924K400736l765004n996602
10105a0286537n17912O920954Q111062K653416k533149l145892k249148l494538
$$ y = [-7476485, -11690394, -15287484, -13397003, -7220808, -4031989, -7005855, -10217908, -7425862, -937352, 2968481, 3160969, 2561532, 1222450, -3110939, -9076962, -12293967, -11590717, -9844300, -8808834, -7454851, -5354272, -3585699, -2068972, 346659, 3033843, 4312557, 4925430, 6961080, 9135901, 7472327, 1899150, -1973547, -100001, 4122987, 4364756, -16553, -3162671, -370165, 6025268, 9453733, 6522171, 194772, -4370163, -5678049, -6240629, -7830521, -8961758, -8101606, -6939353, -7845061, -9364015, -7685591, -2925667, -524931, -4289935, -10286537, -10804449, -3883495, 4227567, 6880983, 4347834, 1201942, -1047206, -4541744]
10097d541744m260193j70154O098938O786819K60184n679345m342506Q66673K204060
10088b777268j157917l006461J12740M393744M860677J734403j198875j767058
10080A193985p02815O50747J730163K351442K503349K426800J808440p05243n493098
10071E763770r392946p723732o22748M990561L208247k471247l253525K478230
10063g023390O674931L633239j780873k322565Q46041J914473N51796M59386O86585
10054C639623k740152p494287o447238N77292N228708L038014o36878k34033J915184
10045c153767J324092j151913k294239k062934j743598m90713K552646N903612
10037a116814P977366Q346166N680788q86907p433824q075372l406694J23415
$$ y = [-4541744, -8801937, -8972091, -2873153, 3913666, 4173850, -1505495, -5848001, -4981328, -2777268, -3935185, -6941646, -6828906, -2435162, 2425515, 4159918, 2961043, 1193985, 491170, 1141917, 2872080, 5223522, 7726871, 10153671, 11962111, 11256868, 5763770, -3629176, -11352908, -11975656, -6985095, -3776848, -6248095, -9501620, -7023390, -348459, 3284780, 1503907, -818658, 27383, 1941856, 2493652, 2953038, 3639623, 899471, -6594816, -13042054, -12464762, -7236054, -4198040, -4834918, -5068951, -3153767, -1829675, -2981588, -5275827, -7338761, -9082359, -9573072, -7020426, -1116814, 6860552, 15206718, 20887506, 20000599, 12566775, 4491403, 1084709, 1208124]
10029A208124J86054L13841O61295l174210r260926q294757J191230P496738L050657
10020f621954l332897q05144O304611O781758N36791l697577l228097k113269
10012f175778j081313J878838M011254J601596j670458m68849J646426j607163
10004a865447o269706l880924K700742L134944k072224k065166M670052O654536
9996A006807p83194o891292l118601L743644M342916J550993K652669N465939
9988G969881L099000l072883n682384l509994j903052k499758j274715K698823
9980d175082M263781N34214l507100j821075L600841N286341J125481k444948
9972B862453j35897L900398K427696l167437m856970j211305J38538m197758o757896
$$ y = [1208124, 1394178, 1708019, 2369314, -804896, -10065822, -18360579, -17169349, -9672611, -6621954, -9954851, -10759995, -4455384, 2326374, 2863165, -834412, -4062509, -6175778, -7257091, -5378253, -1366999, 234597, -1435861, -1904710, -258284, -1865447, -8135153, -12016077, -9315335, -6180391, -8252615, -10317781, -5647729, 1006807, 223613, -6667679, -9786280, -6042636, -1699720, -148727, 2503942, 7969881, 11068881, 7995998, 2313614, -1196380, -3099432, -5599190, -6873905, -4175082, 88699, 622913, -2884187, -4705262, -1104421, 4181920, 5307401, 2862453, 2726556, 6626954, 9054650, 5887213, 1030243, -181062, -42524, -4240282, -10998178]
9963a0998178j449201N841184O500306K156571m50334j494217m660456o662287
9955a1216612j998438M804861M258694j895523k465497M400472P308148o2260
9947C133845q736717q179162m56481N721623P195974N891153K472144k502553
9939D539826n197039k622552K018077K907909o62770l590359j557105L666085
9931d97928N950769K036173l509732l345210K062223L984588j636398p100485
9923b056000m288554L013929N713492L059689Q46988M33847p40357j411548O26787
9914E198273J429802k772785o039199j186849O250173N843125K35221O4364M037806
9905A3059931J587832n953522o234141J031966K380367m470215n449962L479562
$$ y = [-10998178, -12447379, -6606195, -105889, 2050682, 1600348, 106131, -4554325, -11216612, -13215050, -8410189, -4151495, -6047018, -8512515, -4112043, 3196105, 3133845, -5602872, -13782034, -14238515, -8516892, -1320918, 4570235, 7042379, 4539826, -657213, -3279765, -1261688, 1646221, 983451, -2606908, -4164013, -497928, 5452841, 7489014, 3979282, 634072, 2696295, 6680883, 5044485, -2056000, -6344554, -3330625, 2382867, 5442556, 6289544, 6723391, 5983034, 4571486, 5198273, 6628075, 3855290, -2183909, -3370758, 2879415, 8722540, 8957761, 9022125, 13059931, 14647763, 8694241, 2460100, 3492066, 5872433, 1402218, -4047744, -568182]
9897e68182O533953m814229j5225130r613367L558988Q193065M863202L486471
9889c585229M211577J482131k581191k960585j472746o13010K328634N613916
9881B423497J001262q567031o640332Q008297J1268118p748887j9818574L627942
9873a6445708L9751452M0663901K936942k7601439k2080240k394639J124659p728303
9865H226625q926906j303785K209178r48078k948962j311623L33617J145573J855241
9856a669120L10791l559300m436025j61L950564K731444J88977J250043L956163
9847B723376M287652K387145n52751m855788q017963n231933K062862N930513
9839a266887L569986P04654L31689j740830n908203m630861M148515J0069069
$$ y = [-568182, 5965771, 1151542, -14073588, -23686955, -20127967, -11934902, -7071700, -3585229, 626348, 2108479, -472712, -3433297, -4906043, -5519053, -3190419, 2423497, 3424759, -5142272, -11782604, -3774307, 7493811, -255076, -20073650, -16445708, 23305744, 63969645, 66906587, 39305148, 17224908, 14830269, 15954928, 8226625, -700281, -2004066, 205112, -742966, -3691928, -5003551, -4669934, -3524361, -1669120, -1358329, -4917629, -9353654, -9353815, -5403251, -2671807, -2482830, -1232787, 2723376, 7011028, 9398173, 8845422, 3989634, -4028329, -9260262, -7197400, -1266887, 2303099, 3007753, 3339442, 1598612, -4309591, -8940452, -4791937, 5277132]
9831E277132N081877l978261o319943k704190q12068j888489j610826N87667J831156
9822d535945J964733K413269K259370R14289N39982J278532m97965m790259n584513
9813f038507q37163K795342R54191j112114R93758K238776j508230l919251O29589
9804e803609N140954J395638m580920k295186M379338L500586m148093o779576
9796i190868j984882J129682L6394K108741P566538O079193m108104r384762j501577
9787i249645Q256576O014195m085280p868207k497339K168779P1102l995463l602390
9778a4787672R48281M845393M818989J895564n9143J083431K525685N25368k844615
9769a048719j960141K713145L970155o53564m116616j127123K991925J237929
$$ y = [5277132, 10359009, 6380748, 60805, -2643385, -3455453, -5343942, -6954768, -6367101, -4535945, -2571212, -157943, 2101427, 3015716, 3555698, 4834230, 4336265, -453994, -6038507, -6875670, -4080328, -3126137, -4238251, -3244493, -1005717, -2513947, -6433198, -5803609, -662655, 732983, -3847937, -6143123, -1763785, 1736801, -2411292, -9190868, -11175750, -10046068, -10009674, -7900933, -334395, 5744798, 1636694, -7748068, -9249645, -993069, 5021126, 935846, -6932361, -9429700, -7260921, -7189819, -11185282, -14787672, -13839391, -8993998, -4175009, -2279445, -2338588, -1255157, 1270528, 1795896, -1048719, -3008860, -295715, 3674440, 3020876, -1095740, -2222863, 769062, 2006991]
9761B006991l408441l447125M93795J660299p89840j407330O03728q8546l957804
9752h334273l569472M471820J2181650J0394137J017855o586240p642258m647759
9744b714540q63138K579368M099280K253656n48271o1850K870759K369128l332152
9735F652240p673035m671852J817586L319683q16521k801941J310402N432889
9727B569451K782173l877204o550197l561971q33224k246342m362758k286788
9719a8366860L240943P075494N874188J155461k711388k537723P61792L024083
9711b484010J691673p60564l17230K347305K560152j001520l683064j669982K033077
9702a284163J884394j947231l529281Q05658P443332R503225M395311l554342
$$ y = [2006991, -1401450, -4848575, -4354780, -2694481, -3484321, -4891651, -4287923, -4376469, -8334273, -11903745, -7431925, 4749725, 15143862, 16161717, 9575477, 1933219, -2714540, -3577678, -998310, 3100970, 5354626, 4806355, 4744505, 7615264, 9984392, 6652240, -1020795, -5692647, -3875061, -555378, -1371899, -4173840, -2863438, 2569451, 5351624, 1474420, -5075777, -8637748, -9470972, -11717314, -16080072, -18366860, -15125917, -8050423, -2176235, -1020774, -3732162, -6269885, -5508093, -2484010, -792337, -1552901, -1870131, 477174, 3037326, 2035806, -1647258, -3317240, -1284163, 600231, -1347000, -4876281, -4070623, 3372709, 12875934, 17271245, 13716903]
9694A3716903p702393n896192k130025r95429j853639p32387K822871M500825
9686A730534J712540k367706l450551j817265n59055m93753l4800J316949K282586
9677a680521J848508Q7811j907559j763251K042313O312705N139539j599610o235151
9668B244784l908881k17787k096042n915772l585642K745757L335475k187419
9660i585527k894639N309900J1727743P392067j038299k733660N47413j06960
9652H618038m611485n128900n96603J696628j089643l325483j153617K006790
9644c584275K323091N99247j398556l042438k108635K967884P109838L096271
9636E962427o100349q688295j219060N390217K566575k997156j483392L664706
$$ y = [13716903, 6014510, 118318, -2011707, -3007136, -4860775, -5593162, -2770291, 1730534, 3443074, 1075368, -2375183, -4192448, -4751503, -5245256, -5280056, -3963107, -1680521, 167987, 255798, -1651761, -3415012, -1372699, 4940006, 10079545, 8479935, 2244784, -1664097, -1881884, -3977926, -9893698, -13479340, -10733583, -7398108, -9585527, -12480166, -7170266, 4557477, 11949544, 10911245, 8177585, 8724998, 8618038, 4006553, -1122347, -1718950, -22322, -1111965, -4437448, -5591065, -3584275, -1261184, -661937, -2060493, -5102931, -7211566, -4243682, 2866156, 5962427, -137922, -8826217, -10045277, -4655060, -2088485, -5085641, -6569033, -2904327]
9628b904327K751805k697746k559042L995509O435489J41018o160206m424700
9620e422200J025932J866666j548493k828263j16254K821057L537494L039582
9612B375521K175969P36683l25249K75342J229899j40319l536117n273126k758848
9603e240245K418621O159454N457953P36253m158538m906635j078395L050659
9595B439127L338886M92956j635420j291884p0294L18738j44621j062252k038901
9586C46335j663693J113301M006526K907333k189686n753282l523381J710822
9578c045725M022828K058075o03717j360174q22330K14387J584332J413883k097694
9569A363865n551197k721820N251407Q199519O55986q120895n650429N462987
$$ y = [-2904327, -152522, -2850268, -5409310, -1413801, 5021688, 5162706, -997500, -5422200, -4396268, -2529602, -4078095, -6906358, -7022612, -4201555, -664061, 2375521, 4551490, 5288173, 4962924, 5238266, 6468165, 6327846, 2791729, -2481397, -5240245, -2821624, 3337830, 8795783, 9532036, 5373498, 466863, -611532, 2439127, 5778013, 6270969, 4635549, 3343665, 3273371, 3592109, 3447488, 2385236, 346335, -1317358, -204057, 3802469, 6709802, 4520116, -1233166, -4756547, -3045725, 977103, 3035178, 2431461, 1071287, 248957, 463344, 2047676, 3461559, 1363865, -4187332, -6909152, -1657745, 6541774, 7197760, -923135, -6573564, -1110577]
9561a110577J0232410K096079q782592j0668851m578015J522175M745876O328419
9553b15076M810724j041218n979433l640181L381415O659614M071577R61966n8712
9544H950676j699536l843534k244547K219235K305840l448782o301304q69096
9536d931048N220099L062064l197782l393010K289197M695108R97043k256271
9528B485400j230761K77491l65610k31684J861779J942470j376465l080879j73915
9519A07826K624716P53987k321969j047352K862758L306586p71287m590979m506979
9510c582693j169569K733695M207901J480119k902835l378356P88022K933428
9502A109712j108550n133546j322172O834118Q814668K566450l164841k187581
$$ y = [-1110577, 9121833, 11217912, 2435320, -8233531, -12811546, -11289371, -6543495, -215076, 4595648, 3554430, -2425003, -6065184, -2683769, 3975845, 8047422, 9009388, 8950676, 7251140, 3407606, 1163059, 3382294, 5688134, 2239352, -4061952, -4931048, 289051, 3351115, 153333, -3239677, -950480, 3744628, 4741671, 2485400, 1254639, 1532130, 1166520, 934836, 2796615, 4739085, 3362620, 281741, 107826, 2732542, 3486529, 1164560, 117208, 2979966, 6286552, 5515265, 924286, -3582693, -4752262, -2018567, 2189334, 3669453, 766618, -2611738, -1823716, 1109712, 1162, -5132384, -6454556, 379562, 9194230, 11760680, 8595839, 6408258]
9494F408258J907981L407696J642564j855082o350675r156447o223715J231688
9486h987732O198511M919598J151398j097981k872557n057037m471192J95008
9478a0021984M326888M222284K636881K580869J440848k724301m876639n13911
9470b929065N274662M611637q91905l347729j321343n8911o31636J166834M858687
9461F731231M081436k419132p178101m668945J542577N578507O633634O044529
9453A6345736L199988j292113l556901k103772j184684m054642o862585m250650
9445c759623J998749N216580L042372o07616k140812k269799k732582k732749
9437c985480o54059K460271L375205P31963k797848l568565j378480J062755K627850
$$ y = [6408258, 8316239, 11723935, 13366499, 11511417, 5160742, -3995705, -10219420, -8987732, -2789221, 2130377, 3281775, 2183794, -688763, -5745800, -10216992, -10021984, -5695096, -1472812, 1164069, 3744938, 5185786, 2461485, -2415154, -2929065, 2345597, 6957234, 6065329, 2717600, 1396257, 1337346, 705710, 1872544, 6731231, 10812667, 8393535, 1215434, -3453511, -1910934, 3667573, 10301207, 16345736, 19545724, 18253611, 14696710, 12592938, 11408254, 7353612, 491027, -3759623, -1760874, 3455706, 6498078, 5890462, 3749650, 1479851, -1252731, -3985480, -4639539, -2179268, 1195937, 1927900, -869948, -4438513, -5816993, -4754238, -2126388]
9428b126388M533017O002292L539863k889285p270765n266089p76252K46150j011342
9419e018799N10374M211771N015159K346871J55313r84209l506323n172581j096685
9410c539109N761123O028594j632069p134107l861423K150261K844725m49686
9402A68309k063202j096643N44154K782934M446806K124032k732288k695848L744285
9393E222539P072426R18117o561637m767278K727155M468679r82659m973021l610139
9384d85818j368063r19973K39014K695705L432882J926587Q36356P41805M42622
9375G541117J035370L182035K919123k213953o013278j745870N397905M735505
9367A4837954k804130o046993j962442J50394m826616r496435o579424P01175
$$ y = [-2126388, 2406629, 8408921, 11948784, 9059499, 1788734, -3477355, -4253607, -4007457, -5018799, -4508425, -296654, 4718505, 7065376, 7220689, 6236480, 2730157, -2442424, -3539109, 2222014, 8250608, 6618539, -515568, -4376991, -2226730, 617995, 168309, -1894893, -2991536, -2447382, 335552, 4782358, 6906390, 4174102, 1478254, 5222539, 12294965, 13213082, 6651445, 1884167, 4611322, 9080001, 8097342, 3124321, -485818, -1853881, -2773854, -2534840, 160865, 3593747, 5520334, 6356690, 7098495, 7541117, 8576487, 11758522, 14677645, 12463692, 6450414, 4704544, 10102449, 14837954, 12033824, 5986831, 4024389, 4174783, -651833, -10148268, -16727692, -16026517]
9359a6026517N842022P436847N793784L51049m840303k434800O078352R035103
9351A1235537J520491o071788l970977K101261J744709k780103j896600M193596
9343F076126O325517J756890k876584l443659k842173l105416k319985q81122
9335a310406k398304o087400n763657N42901O391977N913909J692136k35606R56341
9326b98109J503801l74915k650420l061232j426286J109200K919227K367942o30654
9317e41446l461732k815660J482247N590737N656439K405392K72726J371375K198279
9308A2158357j439772p362811q424868j732854O758472Q884311L393835l685767
9300H548903o315168l921731m16152M48790j214815j870378O81231L458474J564563
$$ y = [-16026517, -10184495, -2747648, 3046136, 3397185, -1443118, -3877918, 2200434, 11235537, 12756028, 6684240, 2713263, 4814524, 6559233, 3779130, 1882530, 6076126, 12401643, 14158533, 11281949, 7838290, 4996117, 1890701, -429284, -1310406, -3708710, -9796110, -15559767, -15016866, -8624889, -2710980, -1018844, -1254450, -298109, 1205692, 830777, -1819643, -4880875, -6307161, -5197961, -2278734, 89208, -541446, -4003178, -6818838, -5336591, 254146, 5910585, 8315977, 8588703, 9960078, 12158357, 10718585, 3355774, -5069094, -6801948, -43476, 8840835, 12234670, 8548903, 2233735, -1687996, -2104148, -1655358, -2870173, -4740551, -4059320, -600846, 963717]
9291I63717m415974p643009l559608L741628O654111L479125p81809j943004j104136
9282d608959j214477k402299k480197n94491J449959J611148M74003P23764L346910
9273c694639N454670L641152q93650l183018j228686R15329j022808m815166m352958
9264i179774J513103O519892M911208r14825l535864j30456M501708N083073K384168
9255A1152233J70113j181648l513256n072831j907559M366262O520029K044623
9247A2577966k438988j263823J401236j214386o844895p467407j919867K732492
9239d437672K108994n21839j046486J51125J177084J587955Q99262j237558k483737
9230c802872p2655L874554M285521Q51566j583878r48453l44326j354203j100563
$$ y = [963717, -3452257, -11095266, -14654874, -10913246, -4259135, -780010, -1561819, -3504823, -4608959, -5823436, -8225735, -10705932, -11300423, -9850464, -8239316, -7765313, -7041549, -3694639, 1760031, 5401183, 4507533, 1324515, 95829, 1011158, -11650, -4826816, -9179774, -7666671, -1146779, 3764429, 2849604, -686260, -816716, 3684992, 8768065, 11152233, 11322346, 10140698, 6627442, 1554611, -352948, 4013314, 10533343, 12577966, 10138978, 8875155, 10276391, 9062005, 2217110, -5250297, -7170164, -4437672, -2328678, -2850517, -3897003, -3745878, -2568794, -980839, -81577, -1319135, -3802872, -3875527, -973, 4284548, 5136114, 3552236, 2603783, 2259457, 905254, -195309]
9221a95309J853268M160557K793266q93605l939138m582600j789586L240130N272036
9212E919019O67545n514812n126665O24358K828315p35942k912045n03886Q85632
9203c868481j153986o80002M270818N682548p15419o432118l695171J848639J705115
9194c038057j215184J51959L368642J835862k564511l837504l260570m737925
9186a3297288m294713L148132J1110492R124318j05143m434487r93861K159650
9178B417100J578833J815783L433268J317549l749706m609451o27475R83164j503328
9169A055737j819552J423464J871519j732529k468020J322840K241562j792398
9161A02623k217026M737743R495489M123038m666154o422275k146610L90645o84861
$$ y = [-195309, 1657959, 5818516, 8611782, 7718177, 3779039, -803561, -2593147, 646983, 5919019, 6586564, 1071752, -4054913, -3430555, -602240, -1338182, -4250227, -4754113, -3868481, -5022467, -5702469, -1431651, 4250897, 3535478, -2896640, -6591811, -4743172, -3038057, -4253241, -4101282, -732640, 1103222, -1461289, -5298793, -8559363, -13297288, -17592001, -14443869, -3333377, 5790941, 5685798, 1251311, 257450, 2417100, 3995933, 5811716, 9244984, 10562533, 6812827, 2203376, 1575901, 2559065, 1055737, -763815, 659649, 2531168, 798639, -1669381, -346541, 1895021, 102623, -2114403, 2623340, 12118829, 16241867, 11575713, 5153438, 3006828, 3397473, 2712612]
9152B712612k018280k601373k952927j468499K134971M313808L351081K067296
9144E538689J337329j703162n264839k275612O387431Q699270o39430r743740
9136B335936p005738R93910J352714m052297l974250J713524K926398j745772
9128g455575k680586L602198Q748763O627511J454758j315051k243955k656845
9120D081218q75341K577151L128970j130485o384095q473166o217419M50113R022605
9111c820449J1792719L330826q893541j0938199j371751O226934L217881k317889
9103b773469j5025O339191O156562q17038n262058l103109K80381K37313j207934
9094a65186j070275m08197r51986j397129m9281J831817K081809J034589K88894
$$ y = [2712612, 694332, -1907041, -4859968, -6328467, -4193496, 120312, 3471393, 5538689, 6876018, 5172856, -91983, -2367595, 4019836, 12719106, 12079676, 2335936, -4669802, -3675892, -2323178, -6375475, -10349725, -8636201, -5709803, -7455575, -10136161, -6533963, 2214800, 8842311, 10297069, 8982018, 6738063, 4081218, 3205877, 5783028, 8911998, 7781513, 1397418, -7075748, -13293167, -12843054, -3820449, 7972270, 11303096, 2409555, -8528644, -9900395, -3673461, -455580, -2773469, -2788494, 3550697, 9707259, 8890221, 3628163, 525054, 805435, 1042748, -165186, -1235461, -1643658, -2595644, -3992773, -4042054, -2210237, -128428, 906161, 1195055]
9085A195055n11991k641185m479498k457049K778683M832340j28444o196963m533296
9076a2142348L501942P188126K052288l272839m58971N654579N200278j262335
9068F460720m899471l007334j043078j412915p05627J280633L36075k105899J516293
9059c580603J0963749J4185658M083258r443041j2539082n582893P32390J844694
9051F64130J515801J167756j743467n343435l916270J602562L226528j037186
9043c863581k789593L031534Q120421K554521q595638j0509867K72566J0007622
9035a772015O691377l306552n077480L037971P739232J257368o977315m892940
9027c300354M098329O998509R81613l964447j972875M83930k891942p263332n020731
$$ y = [1195055, 683064, -1958121, -6437619, -8894668, -6115985, -1283645, -1412089, -7609052, -12142348, -8640406, -1452280, 600008, -2672831, -3131802, 2522777, 7723055, 6460720, 1561249, -1446085, -2489163, -3902078, -4607705, -3327072, -2990997, -5096896, -3580603, 7383146, 21568804, 25652062, 16209021, 3669939, -1912954, -1180564, 664130, 2179931, 3347687, 1604220, -3739215, -7655485, -6052923, -2826395, -3863581, -6653174, -3621640, 4498781, 7053302, -1542336, -12052203, -11779637, -1772015, 4919362, 1612810, -3464670, -426699, 7312533, 8569901, 1592586, -3300354, 797975, 7796484, 8778097, 4813650, 2840775, 3324705, 432763, -6830569, -11851300]
9018a1851300J746613N047365L136600J158026J790012K324314N60482k122341
9010A789771l772709l750093j850165J037947K344958J087442O7640J434076K438648
9001H27515j46856l879875l988247p18769K140744L994378O421030P183557K615005
8992A4448482m447069o563952k203611K453611K889479N96383k413934n672236
8984i12847n791641J139085J0112655R557126k238752j1935670q661133J290228
8976g440949M989958J153121j561059K17677J415478r39223l193658j846953J715411
8967e490197M138589L293383r78160n406113m360031L153935R811250Q340554
8959A2503210J165380l832754m322477l564615k143731J929459N903805L998891
$$ y = [-11851300, -10104687, -5057322, -1920722, -762696, 1027316, 3351630, 3912112, 1789771, -1982938, -5733031, -7583196, -6545249, -4200291, -3112849, -3045209, -1611133, 827515, 680659, -3199216, -7187463, -7906232, -5765488, -1771110, 4649920, 11833477, 14448482, 10001413, 3437461, 1233850, 3687461, 6576940, 7173323, 4759389, -912847, -6704488, -5565403, 4547252, 14104378, 11865626, -70044, -8731177, -7440949, -2450991, -1297870, -2858929, -2641252, -1225774, -2164997, -5358655, -7205608, -5490197, -1351608, 1941775, 963615, -4442498, -8802529, -5648594, 4162656, 12503210, 13668590, 9835836, 5513359, 1948744, -194987, 1734472, 7638277, 11637168]
8951A1637168k769454o607053m262413o99376K44083R87210L351347M268121K095674
8942H245307M17834J392581J510563j607264m039099k118473J032753P96162j475883
8933D154481j531510Q22472K648533K613165P66335k792758n321236k235553M929849
8924D053778O822467j191511r915686p778788K454288P713801L288900k586586
8916B860663k974598r70719j386839k439283n94495K557297L437545K163779O06161
8907C259511j562029m442268m754909j13284N519783N765546O76358l006896j061267
8898B80545K818341K682576j542842m419550k360625K115557L964249J634750
8890E173001j746457k518875m86472J519933J328396j82826p56799k58586r01141
$$ y = [11637168, 8867714, 2260661, -2001752, -2701128, -2457045, -1469835, 1881512, 6149633, 8245307, 8663141, 10055722, 11566285, 9959021, 5919922, 3801449, 4834202, 5630364, 4154481, 2622971, 3445443, 6093976, 8707141, 9473476, 6680718, 1359482, -876071, 4053778, 10876245, 9684734, -230952, -8009740, -5555452, 2158349, 5447249, 2860663, -113935, -1084654, -2471493, -4910776, -5505271, -2947974, 489571, 2653350, 3259511, 1697482, -2744786, -7499695, -7612979, -2093196, 3672350, 4348708, 1341812, 280545, 3098886, 5781462, 4238620, -180930, -2541555, -425998, 3538251, 5173001, 3426544, 907669, 421197, 1941130, 3269526, 3086700, 2329901, 2071315, 1170174]
8881A170174l133578l466176N66462M727731K615323l577963l702880N255939
8873D55032J1912592N718579o233183q281736O86530N892362m83191q282791o352245
8864d968051J333394M806092L770726L801865L860582p95002p119038p175182
8856b484614j293018J978367o13649k852774n9880L849727L360140o07484l027084
8847a750269j432108K194341M114469K535894k23522l68668J467813K51891n165362
8838A624479q472924m793845J780317M970858N341663N741258L463461l864551
8830E790716r399826n193966L827655N779522l6506l334578n91123Q94434j864875
8821d128547k092729L180003O688191L394936j558654k673533j719177p37123
$$ y = [1170174, -1963404, -5429580, -4863118, -135387, 2479936, -1098027, -4800907, 455032, 12367624, 18086203, 11853020, 3571284, 4257814, 10150176, 9666985, 1384194, -4968051, -3634657, 1171435, 4942161, 8744026, 12604608, 11809606, 4690568, -2484614, -3777632, -1799265, -2412914, -5265688, -5325568, -1475841, 1884299, 1276815, -1750269, -3182377, -988036, 3126433, 5662327, 5438805, 5070137, 6537950, 6789841, 1624479, -6848445, -11642290, -9861973, -4891115, 450548, 6191806, 9655267, 5790716, -3609110, -8803076, -4975421, 804101, 767595, -2566983, -3158106, -2263672, -4128547, -6221276, -3041273, 3646918, 7041854, 5483200, 2809667, 1090490, 353367]
8813C53367K119393M996069J924231m692200l725426N812384R347934m31459r533458
8804F170835m375852N520173L158038p763988r669874k61273N440243R65008l186947
8795d003637J53287L474410l59074n755797m900619j69049J787010P65313O97044
8786h311112K052091K636923K232872J861865J234486m5032j268179k252074l382055
8777e240215l504699j338243J005131L37172j737749m67329M006303N903788K544164
8768A508323j601146j765446R22535K563953J860099o4498k031205k922703j936080
8759c466168j30689L91694o05869j551732j732806j313586M92916M018402O709350
8750B811512N658906J852349j492164l523535n016043m994964k690756q35392
$$ y = [353367, 2472760, 7468829, 9393060, 4700860, 975434, 6787818, 16135752, 15704293, 6170835, 1794983, 7315156, 10473194, 2709206, -6960668, -7221941, -1781698, -816690, -4003637, -3850350, -375940, -735014, -6490811, -11391430, -11560479, -9773469, -9008156, -8311112, -6259021, -3622098, -1389226, 472639, 1707125, 1662093, 393914, -1858160, -5240215, -8744914, -10083157, -9078026, -8740854, -10478603, -10945932, -6939629, -1035841, 1508323, -92823, -1858269, -935734, 1628219, 3488318, 3423820, 1392615, -1530088, -3466168, -3596857, -3205163, -3811032, -5362764, -7095570, -8409156, -7916240, -3897838, 2811512, 8470418, 10322767, 8830603, 5307068, 291025, -4703939, -7394695, -8230087]
8742h230087j739422k232474J330220N218453L045252l020325m342128Q38817
8734i131694M965029L302551k18028j555561k398657m080898l575292J72267K728978
8725i791305J359631l35374Q33486J982845m02591m303330n359593k029083M836033
8716a3209281J2446507J4574435O657627n220968q660935j715577L791944M73223
8708I136975l610398J39032N394954J870608o156700o126689K210124O618880
8700I476786J803338m297555m965089l217507k628858o77544L627720M768090
8692C889381k12248m891127k706045K560430L003829o91765j004761L662558O388525
8683I998777K906362k158919l481386l190349n521970p885700m594363K372650
$$ y = [-8230087, -9969509, -12201983, -10871763, -5653310, -2608058, -5628383, -9970511, -9131694, -4166665, -864114, -1082142, -2637703, -5036360, -9117258, -12692550, -12520283, -9791305, -8431674, -8767048, -7933562, -5950717, -6353308, -10656638, -16016231, -18045314, -13209281, -762774, 13811661, 20469288, 15248320, 6587385, 4871808, 8663752, 9136975, 5526577, 5665609, 11060563, 12931171, 6774471, 647782, 2857906, 9476786, 11280124, 6982569, 2017480, -1200027, -3828885, -4506429, -878709, 3889381, 3677133, -1213994, -3920039, -1359609, 1644220, 952455, -52306, 3610252, 9998777, 12905139, 10746220, 7264834, 4074485, -1447485, -9333185, -13927548, -11554898]
8675a1554898M706377Q99828n52522M946391R209898L486628o882840r719511
8667e460649m071611j0587j615873j993838K869821O698559M101333l68023m99647
8658c50515J786476J514778m94127l88605J607759K494896J168837k291693p490773
8649b442967j0525117o027262L569287P842630K519982l771711k966668O28517
8641a1173309P5165j084058L720012J0057060Q258974o46700o613439n748901
8633c155196k745981k74476K924164M840593K168641j470220J3612L713881K006575
8624H021593l043958k336778L452223L711540l730331q319615m443195N63391
8616f125130J034260J712137N217314M500405l219987p554132r64162P075743
$$ y = [-11554898, -6848521, -5948693, -6501215, -1554824, 7655074, 11141702, 4258862, -5460649, -9532260, -9542847, -11158720, -13152558, -10282737, -3584178, 517155, 149132, -350515, 1435961, 2950739, 2456612, 2068007, 3675766, 6170662, 7339499, 5047806, -2442967, -12968084, -18995346, -15426059, -7583429, -5063447, -8835158, -11801826, -11173309, -11098144, -12182202, -8462190, 1594870, 9853844, 9207144, 2593705, -3155196, -5901177, -6175653, -3251489, 1589104, 3757745, 2287525, 2301137, 6015018, 8021593, 4977635, 2640857, 6093080, 9804620, 6074289, -2245326, -6688521, -6125130, -5090870, -3378733, 1838581, 6338986, 3118999, -4435133, -5399295, 1676448]
8608A676448M361344m404872n885502M29277L499698Q441j968311J733960N122734
8599D573217L103648j414280m025320m197918k026161K780073O589213M035107
8591I417579k873952n204649j33464L865402O0323n236210k347756N413941N446065
8582H407279m457633j0959853m208928P073663Q084204m02647m393155J069539
8574B12469N267830O40698m818688j986845L658479K279006k727395j392668M014571
8565E147457K676188m477151m971928L414436P780308J441584n635312m537055
8557H38527q29832j496805k058243K445386N535540O87346n270740l131983K584939
8548f95865J894413l215994l449304J136014L101020K131266L600109N664174
$$ y = [1676448, 6037792, 1632920, -4252582, -3823305, -323607, -315166, -2283477, -549517, 4573217, 7676865, 6262585, 2237265, -1960653, -3986814, -1206741, 5382472, 9417579, 6543627, 1338978, 1205514, 5070916, 5131239, -104971, -2452727, 2961214, 8407279, 3949646, -7010207, -11219135, -4145472, 3938732, 3536085, -857070, 212469, 5480299, 6120997, 1302309, -684536, 2973943, 5252949, 2525554, 1132886, 5147457, 7823645, 3346494, -1625434, 1789002, 9569310, 11010894, 5375582, 838527, 8695, -1488110, -3546353, -1100967, 4434573, 5121919, -148821, -3280804, -695865, 1198548, -2017446, -5466750, -4330736, -1229716, 901550, 4501659, 10165833]
8540A0165833J868650n067932n870179m61886K204259k4499k07426L360394L952898
8531I920112k93784k648080m14556O13079k199557l621093j357209o03612l562799
8522d167499m890130k007211K46351l39907Q94471M897208M974334p36078l766355
8513d894816O84472M842038J739046k509453L01219N786706M442838k472528n726581
8504B192941k727896Q31783J307633K56234p78601j343526j07658K139259Q63178
8495B633347m841907p739260k431710M708784L983797k974364o140890k272988
8487a5075191K158398K259236K67043l92724O95636L045012N510217M791352n85420
8478B673559n786656n046967k25398K125361O99752k34638Q42499J192188O6864
$$ y = [10165833, 12034483, 6966551, 1096372, 634486, 2838745, 2814246, 2606820, 5967214, 9920112, 9626328, 6978248, 6563692, 7176771, 4977214, 1356121, -1088, -604700, -4167499, -9057629, -11064840, -10818489, -11158396, -10263925, -5366717, -392383, -1128461, -4894816, -4210344, 631694, 2370740, -138713, 162506, 5949212, 10392050, 7919522, 2192941, -534955, 296828, 1604461, 1860695, 1082094, -261432, -369090, 1770169, 2633347, -2208560, -9947820, -12379530, -7670746, -3686949, -6661313, -12802203, -15075191, -12916793, -10657557, -10390514, -10783238, -10087602, -7042590, -1532373, 3258979, 2673559, -3113097, -8160064, -8385462, -6260101, -5560349, -5794987, -4952488, -3760300, -3693436]
8469c693436l26623K07696J79347P86169L488458M712338M17504n453703n498340
8460e180590q42458P62682j491917n19622M697717N750251o67881n846582k816717
8451f155117K542561J817692k420034k299337J870413L267358N57848p17821K068812
8442E32375M926582M019423O48088j790531k167126j753854j960833k561466j862094
8433a969436M87634J451764j621873n354169l279653M211442Q531174M686719
8425G143602j137928p38919M050878M921604j65671m780398l867305L65867L062687
8416H854417K402003m49375l427936m509471l150074j351184j221225j710591
8408d563436j77896L100705M690029K478955j774930m590400l838771l1832L794822
$$ y = [-3693436, -4020059, -3812363, -3633016, -2846847, 641611, 5353949, 5771453, 317750, -5180590, -6023048, -5260366, -6752283, -7271905, -2574188, 3176063, 2508182, -3338400, -6155117, -3612556, -1794864, -4214898, -6514235, -4643822, -1376464, -818616, -1536437, 532375, 5458957, 9478380, 10126468, 8335937, 6168811, 4414957, 2454124, -107342, -1969436, -1481802, -30038, -1651911, -7006080, -10285733, -6074291, 2456883, 7143602, 6005674, 5266755, 9317633, 14239237, 14073566, 9293168, 5425863, 5791730, 8854417, 11256420, 10807045, 7379109, 2869638, -280436, -1631620, -2852845, -4563436, -4741332, -1640627, 3049402, 5528357, 3753427, -836973, -4675744, -4707576, -912754]
8399i12754M115649O04718k974716l242580j221129K17738R99409K556481L387466
8390C530282N59860m261660n113232J17782N692903N011719q72838m790952k309479
8381b435615L669015O891216M287495j656531n684234m678933o24668J433795
8373A201540q70018m157571l530033N81405K552367l87764l437570q98240M559484
8364d386400M617624k411290p955100m807133K775426N567375K115573j382017
8356e865942j555402p42015N9268K960049O269322L907480m330386r018683l348896
8347a1665205O321025Q834253L183860k245793k900806k407909l809976m258423
8339h948974r87371L144000L707081R02716j561159j798488j176681j285514j609562
$$ y = [-912754, 3202895, 3807613, 832897, -2409683, -3630812, -3413074, -2413665, 142816, 3530282, 4090142, -171518, -5284750, -5166968, 525935, 5537654, 4664816, -126136, -2435615, 1233400, 8124616, 12412111, 10755580, 5071346, 392413, -232255, 1201540, 331522, -3826049, -7356082, -6774677, -4222310, -4610074, -8047644, -8945884, -4386400, 231224, -2180066, -10135166, -14942299, -12166873, -6599498, -4483925, -5865942, -7421344, -8163359, -8104091, -5144042, 1125280, 5032760, 702374, -8316309, -11665205, -5344180, 3490073, 6673933, 4428140, 1527334, -880575, -4690551, -8948974, -9936345, -6792345, -3085264, -2182548, -3743707, -5542195, -6718876, -8004390, -9613952]
8330i613952n31390K058141L793449K335710j134640k665893o64221J841346J707076
8321b874374J08595O771J492637K843870L979052M885803K810445l722673r532193
8312b067p812344m67120L484580R92029j048291K236112N668731L376605j006474
8303E421761j286498k09928m026809q881357m602305P500752J3017372N057713
8295A1990701m652989l084386M860613N231977k936700p547288l488715Q07856
8287A181069q65601k808819O85750M450329K015843k050125L16683O164289N812710
8278A4902128r69441m648665j772541L33188k624139m236651P98461O082082K793632
8269A0658054o014947r121125k837896M788497N602860R67850j973075L94744
$$ y = [-9613952, -10145342, -8087201, -4293752, -1958042, -3092682, -5758575, -6422796, -4581450, -2874374, -2765779, -2759008, -1266371, 1577499, 5556551, 10442354, 13252799, 9530126, -2067, -7814411, -8281531, -4796951, -3804922, -4853213, -2617101, 3051630, 6428235, 5421761, 4135263, 3925335, -101474, -8982831, -13585136, -6084384, 6932988, 11990701, 7337712, 4253326, 9113939, 14345916, 11409216, 3861928, 373213, 1181069, 315468, -2493351, -1807601, 2642728, 4658571, 2608446, 2925129, 9089418, 14902128, 13932687, 9284022, 7511481, 7844669, 5220530, 983879, 1782340, 7864422, 10658054, 4643107, -4478018, -7315914, -2527417, 3075443, 4043293, 2070218, 2464962]
8261B464962M973153O410451L030518j741934l585367k152187n75828p77217j539957
8252F506594j254711J6814J562939K483405J024670l319838o892420n083527Q27902
8243d128172M471362L149274R02066J149989J783203L68686j225835j149277j474857
8234C846439l571286m258546j143656K575466L231044K172475J506260n52820
8226C805376m593789n716666j099026L265063J198007l013620j518285L695597
8218c977343M541502J047485M78430L412118K591932l277997o028345j262335
8210b474553M869736N768423K548375j352042n265079p300721l649209L701156
8202c153914O311877J098032m387712l169571J701878L815992K551119K98327
$$ y = [2464962, 7438115, 13848566, 16879084, 15137150, 11551783, 9399596, 8823768, 8046551, 6506594, 5251883, 5268697, 6831636, 9315041, 10339711, 7019873, 127453, -4956074, -4128172, 343190, 3492464, 4394530, 5544519, 7327722, 7696408, 6470573, 5321296, 3846439, 275153, -3983393, -5127049, -2551583, 679461, 2851936, 4358196, 3805376, -788413, -6505079, -7604105, -4339042, -3141035, -6154655, -7672940, -3977343, 564159, 1611644, 2090074, 5502192, 8094124, 4816127, -1212218, -2474553, 2395183, 8163606, 10711981, 9359939, 4094860, -3205861, -6855070, -3153914, 3157963, 4255995, -131717, -3301288, -1599410, 2216582, 4767701, 5066028]
8194E066028k670897m988315k543522L976070O543159J223726m549152l276306
8186a219209R10178L85080k602323j016083L426647L283971q23069j173686L043251
8177D214757M092041p69548m678062k865221L49796K23923o63172J747542N386533
8168G038589N401476J201276l869969o870666o298722j873042L788667N819176
8160D336785K208435l357335n599084l211004O82325K183052K41171k184216j162072
8151e861943K702410M038100O63059j758975J690246N391439M39021r686102j1421269
8142a3804014j251791P655324M727506k427481j000220O535527P238390j087862
8134F585379o891253l339720K586517K965511L34642M24836J834313K17179l069756
$$ y = [5066028, 2395131, -2593184, -5136706, -1160636, 5382523, 6606249, 2057097, -1219209, -309031, 76049, -2526274, -3542357, -115710, 3168261, 2345192, 1171506, 4214757, 8306798, 7537250, 2859188, -6033, 343763, 567686, -95486, 1652056, 7038589, 12440065, 13641341, 9771372, 2900706, -3398016, -5271058, -1482391, 4336785, 6545220, 3187885, -2411199, -5622203, -4939878, -2756826, -2515655, -4699871, -5861943, -3159533, 878567, 1541626, -217349, 1472897, 6864336, 7303357, -2382745, -13804014, -15055805, -7400481, -2672975, -5100456, -6100676, 434851, 7673241, 6585379, -305874, -3645594, -1059077, 1906434, 2241076, 2665912, 4500225, 4717404, 1647648]
8125A647648m029582l617804m808083n222705p64193N185756M893342j277182
8117g992803m188423L55068N457154M348254K41648l24502K235531L338317K479811
8108E950055J797256J60723l884015o134097j816904M973927N537433q1403l021616
8099C481359J7954J894593k104727n718445k089256M587263N442447K77980l312950
8090B476218j656548J483721K242157J059050o47314k912273n049376m908328
8082g912693j861626J797051L414134K526613P24971J14732J499808L130017K185310
8073E618317j546058m825591m832329k262853M43853K003107K261020J455474
8065a685060P14212J094799J412882o0538j383653J145059N813549O013691N48239
$$ y = [1647648, -2381934, -5999738, -10807821, -16030526, -16794719, -11608963, -6715621, -7992803, -12181226, -11826158, -6369004, -2020750, -1779102, -2103604, 131927, 3470244, 5950055, 7747311, 7908034, 4024019, -2110078, -3926982, 1046945, 6584378, 6502975, 3481359, 3499313, 5393906, 3289179, -2429266, -4518522, 68741, 5511188, 5789168, 2476218, 819670, 2303391, 4545548, 5604598, 4957284, 2045011, -3004365, -7912693, -9774319, -7977268, -4563134, -2036521, -1311550, -1196818, 302990, 3433007, 5618317, 4072259, -753332, -5585661, -7848514, -7404661, -5401554, -3140534, -1685060, -970848, 123951, 1536833, 1476295, 92642, 1237701, 7051250, 13064941, 13613180]
8056A3613180k971182M86299M892106K501040l793364n628197k812238k373548
8048C914096n606362n783395K77045O853452P935651M427678J47437l497561n908393
8039B759648n310261j650500J908000K857512K077346J304135O71741j36236q88132
8030C593253j581850j911280m46783K731925L851514K9838n093480n316918p19547
8021d863328K986512L342283K964609K618545L3279l202119j807272L240585L253294
8012H566388m790673j1051474n974041N133900Q910004K139010n114029l899098
8004f080013L247286P581083M629919k613261p822414o895733j041824M551484
7996d443473N632485K490817j389908l049616j833178R46217K926078K367576
$$ y = [13613180, 10641998, 11128297, 16020403, 18521443, 14728079, 9099882, 6287644, 3914096, -1692266, -7475661, -7198616, -345164, 7590487, 12018165, 12165602, 8668041, 2759648, -2550613, -4201113, -2293113, 564399, 2641745, 3945880, 4617621, 4481385, 3593253, 2011403, 100123, -346660, 2385265, 6236779, 6266617, 1173137, -4143781, -4863328, -1876816, 1465467, 4430076, 7048621, 7081900, 3879781, 2072509, 5313094, 8566388, 3775715, -7275759, -13249800, -8115900, 794104, 2933114, -2180915, -6080013, -2832727, 4748356, 9378275, 6765014, -1057400, -7953133, -8994957, -4443473, 1189012, 3679829, 2289921, -759695, -2592873, -1646656, 1279422, 3646998]
7988C646998j46085k385501k858660j422834J601546M652748M318350q40506o194237
7979C71819n280938J165987N226590K467614k330161k888696j58089Q85653l25676
7970h65897J17841L538066O069944L712280k461863o917687n032739J707414O182085
7961F049444K983504m890262r039978n353053K073608O744097O201353K213703
7953F982416j986026l639807k421697r40779j010229o22065J934747L328504J86306
7944A811370l404181j066447M549260M980775L10990p44888L251555L049581m370992
7935H367023q591463l044137K945354k22206n809823k565329N704631O884260
7927C668310P61356k479264k07306J018386k37308J057009L843826J357132m856282
$$ y = [3646998, 3500913, 1115412, -1743248, -3166082, -1564536, 3088212, 7406562, 6566056, 371819, -4909119, -3743132, 1483458, 3951072, 1620911, -1267785, -1425874, -540221, -865897, -748056, 2790010, 8859954, 12572234, 10110371, 3192684, -1840055, -132641, 6049444, 9032948, 4142686, -4897292, -10250345, -8176737, -1432640, 4768713, 6982416, 4996390, 1356583, -1065114, -2005893, -3016122, -3638187, -1703440, 1625064, 1811370, -1592811, -2659258, 1890002, 6870777, 7181767, 6436879, 9688434, 12738015, 8367023, -224440, -3268577, -323223, -545429, -6355252, -8920581, -3215950, 3668310, 4429666, 1950402, 1743096, 2761482, 2524174, 3581183, 7425009, 8782141, 3925859]
7918C925859n006337K491027P568565M680934M0748j085179j975436m445934l329665
$$ y = [3925859, -1080478, 1410549, 8979114, 13660048, 13700796, 12615617, 10640181, 6194247, 2864582]
$$ [...]
##END NTUPLES=NMR SPECTRUM
##END=
