##TITLE=31Pdec_SR52+5xAcCl 1n
 CDCl3, 124 sc
 31.05.2021
##JCAMPDX= 6.0         $$ Bruker NMR JCAMP-DX V2.0
##DATA TYPE= NMR SPECTRUM
##DATA CLASS= NTUPLES
##ORIGIN= UXNMR, Bruker Analytische Messtechnik GmbH
##OWNER= root
$$ XWIN-NMR		Version 3.5
$$ Mon May 31 13:49:15 2021 Russian Standard Time (UT+4h)  she@DPX200
##.OBSERVE FREQUENCY= 81.013821
##.OBSERVE NUCLEUS= ^31P
##.ACQUISITION MODE= SIMULTANEOUS
##.ACQUISITION SCHEME= undefined
##.AVERAGES= 124
##.DIGITISER RES= 16
##SPECTROMETER/DATA SYSTEM= spect
##.PULSE SEQUENCE= zgpg30
##.SOLVENT NAME= D2O
##.SHIFT REFERENCE= (INTERNAL, D2O, 0, 248.564)
##AUDIT TRAIL= $$ (NUMBER, WHEN, WHO, WHERE, WHAT)
$$ ##TITLE= Audit trail, XWIN-NMR		Version 3.5
$$ ##JCAMPDX= 5.01
$$ ##ORIGIN= Bruker BioSpin GmbH
$$ ##OWNER= she
$$ F:/spectra/data/she/nmr/P31/1/pdata/1/auditp.txt
$$ ##AUDIT TRAIL=  $$ (NUMBER, WHEN, WHO, WHERE, WHAT)
(   1,<2021-05-31 13:48:11.53 +0400>,<she>,<DPX200>,
      <continue with go, POWCHK disabled, PULCHK disabled
       configuration hash MD5:
       00 E9 B6 7A A2 85 ED C7 34 08 36 98 17 FE 4E 26
       data hash MD5: 32K
       EE D5 9A 4E F4 5A D0 F4 5A C7 8C 3E B8 D0 9B D4>)
(   2,<2021-05-31 13:48:13.01 +0400>,<she>,<DPX200>,
      <Start of raw data processing
       efp BC_mod = 2 LB = 1 FT_mod = 6 PKNL = 1 PHC0 = -6065.038 PHC1 = 317.6012 SI = 64K 
       data hash MD5: 64K
       2A 7C 27 7E F9 1E 09 72 12 00 FB 9F F0 9D F0 5F>)
(   3,<2021-05-31 13:48:43.29 +0400>,<she>,<DPX200>,
      <pk PHC0 = 2.136265 PHC1 = 25.2 
       data hash MD5: 64K
       81 7E 7F F3 71 61 EC B6 19 1A FF 36 EB 09 8E 70>)
(   4,<2021-05-31 13:48:46.01 +0400>,<she>,<DPX200>,
      <abs ABSG = 5 
       data hash MD5: 64K
       2E EC E3 62 5A 5F CE F7 F1 CC 00 41 20 B5 1A 2F>)
$$ ##END=
$$ 
$$ hash MD5
$$ F4 B3 F0 BB F3 15 7A 82 31 A0 E1 8B FE 76 F6 CA
##$RELAX= 
##$RELAX= 
##$RELAX= 
##$RELAX= 
##$RELAX= 
##$RELAX= 
##$RELAX= 
##$RELAX= 
$$ Bruker specific parameters
$$ --------------------------
##$DU= <F:/spectra>
##$EXPNO= 1
##$NAME= <P31>
##$PROCNO= 1
##$TYPE= <nmr>
##$USER= <she>
##$AMP= (0..31)
100 100 100 100 100 100 100 100 100 100 100 100 100 100 100 100 100 100 
100 100 100 100 100 100 100 100 100 100 100 100 100 100 
##$AQSEQ= 0
##$AQ_mod= 1
##$AUNM= <au_zg>
##$AUTOPOS= <>
##$BF1= 81.014009
##$BF2= 200.13
##$BF3= 200.13
##$BF4= 200.13
##$BF5= 200.13
##$BF6= 200.13
##$BF7= 200.13
##$BF8= 200.13
##$BYTORDA= 1
##$CFDGTYP= 0
##$CFRGTYP= 5
##$CHEMSTR= <none>
##$CNST= (0..31)
1 1 145 1 1 1 1 1 1 1 1 1 1 1 1 1 1 1 1 1 1 1 1 1 1 1 1 1 1 1 1 1 
##$CPDPRG= <waltz16>
##$CPDPRG1= <>
##$CPDPRG2= <waltz16>
##$CPDPRG3= <>
##$CPDPRG4= <mlev>
##$CPDPRG5= <mlev>
##$CPDPRG6= <mlev>
##$CPDPRG7= <mlev>
##$CPDPRG8= <mlev>
##$CPDPRGB= <>
##$CPDPRGT= <>
##$D= (0..31)
0 1 0 0 0 0 0 0 0 0 0 0.03 2e-05 3e-06 0 0 0 0 0 0 0 0 0 0 0 0 0 0 0 0 
0 0 
##$DATE= 1622454325
##$DBL= (0..7)
120 120 120 11 120 120 24 19 
##$DBP= (0..7)
150 150 150 150 150 150 150 150 
##$DBP07= 0
##$DBPNAM0= <>
##$DBPNAM1= <>
$$ [...]
##$SUBNAM3= <"">
##$SUBNAM4= <"">
##$SUBNAM5= <"">
##$SUBNAM6= <"">
##$SUBNAM7= <"">
##$SUBNAM8= <"">
##$SUBNAM9= <"">
##$SW= 501.771253377433
##$SWIBOX= (0..15)
0 1 3 0 0 0 0 0 0 0 0 0 0 0 0 0 
##$SW_h= 40650.406504065
##$TD= 32768
##$TD0= 1
##$TE= 0
##$TE2= 300
##$TE3= 300
##$TEG= 300
##$TL= (0..7)
0 120 53 12 22 120 120 120 
##$TP= (0..7)
150 150 150 150 150 150 150 150 
##$TP07= 0
##$TPNAME0= <>
##$TPNAME1= <>
##$TPNAME2= <>
##$TPNAME3= <>
##$TPNAME4= <>
##$TPNAME5= <>
##$TPNAME6= <>
##$TPNAME7= <>
##$TPOAL= (0..7)
0.5 0.5 0.5 0.5 0.5 0.5 0.5 0.5 
##$TPOFFS= (0..7)
0 0 0 0 0 0 0 0 
##$TUNHIN= 0
##$TUNHOUT= 0
##$TUNXOUT= 0
##$USERA1= <user>
##$USERA2= <user>
##$USERA3= <user>
##$USERA4= <user>
##$USERA5= <user>
##$V9= 5
##$VALIST= <valist>
##$VCLIST= <CCCCCCCCCCCCCCC>
##$VD= 0
##$VDLIST= <DDDDDDDDDDDDDDD>
##$VPLIST= <PPPPPPPPPPPPPPP>
##$VTLIST= <TTTTTTTTTTTTTTT>
##$WBST= 1024
##$WBSW= 4
##$XGAIN= (0..3)
0 0 0 0 
##$XL= 0
##$YL= 0
##$YMAX_a= 5289
##$YMIN_a= -18272
##$ZGOPTNS= <>
##$ZL1= 120
##$ZL2= 120
##$ZL3= 120
##$ZL4= 120
##$ABSF1= 248.5645
##$ABSF2= -253.2056
##$ABSG= 5
##$ABSL= 3
##$ALPHA= 0
##$AQORDER= 0
##$ASSFAC= 0
##$ASSFACI= 0
##$ASSFACX= 0
##$ASSWID= 0
##$AUNMP= <proc_1d>
##$AZFE= 0.1
##$AZFW= 0.5
##$BCFW= 0
##$BC_mod= 2
##$BYTORDP= 0
##$COROFFS= 0
##$CY= -3
##$DATMOD= 1
##$DC= 0
##$DFILT= <>
##$DTYPP= 0
##$F1P= 0
##$F2P= 0
##$FCOR= 1
##$FTSIZE= 65536
##$FT_mod= 6
##$GAMMA= 0
##$GB= 0
##$INTBC= 1
##$INTSCL= 5.30512e-09
##$ISEN= 30
##$LB= 1
##$LEV0= 0
##$LPBIN= 0
##$MAXI= 10000
##$MC2= 0
##$MEAN= 0
##$ME_mod= 0
##$MI= 50
##$NCOEF= 0
##$NC_proc= -6
##$NLEV= 6
##$NOISF1= 182.463
##$NOISF2= 159.3651
##$NSP= 0
##$NTH_PI= 0
##$NZP= 0
##$OFFSET= 248.5645
##$PC= 4
##$PHC0= -6062.902
##$PHC1= 342.8012
##$PH_mod= 1
##$PKNL= yes
##$PPARMOD= 0
##$PSCAL= 0
##$PSIGN= 0
##$REVERSE= no
##$SF= 81.014009
##$SI= 65536
##$SIGF1= 159.3651
##$SIGF2= -187.1042
##$SINO= 113.3802
##$SIOLD= 16384
##$SREGLST= <1H.CDCl3>
##$SSB= 0
##$STSI= 65536
##$STSR= 0
##$SW_p= 40650.406504065
##$SYMM= 0
##$S_DEV= 0
##$TDeff= 32768
##$TDoff= 0
##$TI= <>
##$TILT= no
##$TM1= 0
##$TM2= 0
##$TOPLEV= 0
##$USERP1= <user>
##$USERP2= <user>
##$USERP3= <user>
##$USERP4= <user>
##$USERP5= <user>
##$WDW= 1
##$XDIM= 65536
##$YMAX_p= 426309606
##$YMIN_p= -40336070
$$ End of Bruker specific parameters
$$ ---------------------------------
##NTUPLES= NMR SPECTRUM
##VAR_NAME=  FREQUENCY,     SPECTRUM/REAL,   SPECTRUM/IMAG
##SYMBOL=    X,             R,               I
##VAR_TYPE=  INDEPENDENT,   DEPENDENT,       DEPENDENT
##VAR_FORM=  AFFN,          ASDF,            ASDF
##VAR_DIM=   65536,         65536,           65536
##UNITS=     HZ,            ARBITRARY UNITS, ARBITRARY UNITS
##FACTOR=    0.620285442955139, 1,           1
##FIRST=     20137.2065510759, 0,            0
##LAST=      -20513.1999529892, 0,           0
##MIN=       -20513.1999529892, -40336070,   0
##MAX=       20137.2065510759, 426309606,    0
$$ Real data points
##PAGE= N=1
##DATA TABLE= (X++(R..R)), XYDATA
$$ [...]
13004h393848P720932K843694l570615l746826R90643L049631K21482j642508
12996b527415J566904N403990L513442k394703m489152j53172M022485J652202
12988F594581m492688o945980l891256K28669K758371N085915O745135M315561
12980A0398308j464343m102161p59757K629300M86959l700386l787842j045122
12972a345044n57560j702300n49867J281903o19754l693881j281517N166198P009845
12963C708023K443157q92026N71160J103053k253160l540574K81833K078845k829789
12954F70522o451084o35882Q174700Q420878J719334j128366J294341K45494o117835
12945F192102q719117l146005K982485K912134O21789J764974L511696Q62310
$$ plain form
13004 -8393848 -672916 2170778 -1399837 -5146663 -4156020 -1106389 -884907 -2527415
12996 -2527415 -960511 4443479 7956921 5562218 1073066 919894 4942379 6594581
12988 6594581 2101893 -4844087 -8735343 -8506674 -5748303 -662388 6082747 10398308
12980 10398308 8933965 4831804 4072047 6701347 7188306 3487920 -299922 -1345044
12972 -1345044 -1902604 -3604904 -4154771 -2872868 -3492622 -7186503 -8468020 -3301822 3708023
12963 3708023 6151180 5259154 5830314 6933367 4680207 1139633 1421466 3500311 670522
12954 670522 -5780562 -6416444 1758256 10179134 11898468 10770102 12064443 12309937 6192102
12945 6192102 -2527015 -5673020 -2690535 221599 843388 2608362 6120058 6982368
12937F982368l357975k825237J850157M288025J742923k742654o008684p141501
12929g212578n304785m04675M452963N656081M057679L247650L348014J215335
12921I055684k847498l722438J060308O558353O268586K78505n495886o753537
12913D402077m615671k606839k355121k605895j145952K451718N548383M849799
12905C922499Q59805j831863m65013J700760K08518l189390k614255K494842N493395
12896F579298K187348k709348k667467J093329K236576r87821m215542m085324
12888b568951j649355J037829K863011K268082j153407l610532r92534L853938
12880D8081L782595j601123m384865m05894M210426K866090j698252l178950j727280
$$ plain form
12937 6982368 3624393 799156 2649313 6937338 8680261 5937607 -71077 -7212578
12929 -7212578 -12517363 -12922038 -8469075 -2812994 1244685 4492335 7840349 9055684
12921 9055684 6208186 2485748 3546056 10104409 16372995 16651500 11155614 4402077
12913 4402077 -213594 -2820433 -5175554 -7781449 -8927401 -6475683 -927300 3922499
12905 3922499 4782304 2950441 2485428 4186188 4394706 1205316 -1408939 1085903 6579298
12896 6579298 8766646 6057298 3389831 4483160 6719736 5731915 1516373 -2568951
12888 -2568951 -4218306 -3180477 -317466 1950616 797209 -2813323 -3805857 48081
12880 48081 3830676 2229553 -2155312 -2561206 1649220 4515310 2817058 -361892 -2089172
12871b089172j300111j323739J318638M719960M054656j76221k982948k797982
12863e76919j805512J65683M388958O795308J655050p490101r631594j612866
12855h111993O769930O718440J609078p44623P1928n96559l429394n068276m036405
12846f817874j423030J724417L578014J417835l659688n829451k588597Q38913
12838a2759461Q1405p99588K949705O740384L354573l962813n419110l176L825392
12829e992689K692994K284588M858064M371251j350804m386728L14816M911315
12821G702807N54615p737698q461530j483062K530033q24011l914013k19660N708089
12812f144430N767278o2576m647937l486223P15277K777602J549319L90685J722157
$$ plain form
12871 -2089172 -3389283 -4713022 -3394384 1325576 5380232 5204011 2221063 -576919
12863 -576919 -2382431 -2216748 2172210 8967518 10622568 3132467 -6499127 -8111993
12855 -8111993 -1342063 5376377 6985455 6240832 6312760 5716201 2286807 -2781469 -6817874
12846 -6817874 -8240904 -6516487 -2938473 -1520638 -5180326 -11009777 -13598374 -12759461
12838 -12759461 -12678056 -13477644 -10527939 -3787555 -432982 -4395795 -9814905 -9818081 -5992689
12829 -5992689 -3299695 -1015107 3842957 8214208 6863404 2476676 2791492 7702807
12821 7702807 8257422 519724 -7941806 -9424868 -6894835 -7718846 -11632859 -11852519 -6144430
12812 -6144430 -377152 -439728 -5087665 -8573888 -7858611 -5081009 -3531690 -3141005 -1418848
12803a418848L142441J247895j969644j199921L069556L599889k267641o766652
12795b562925k994548L758761M119632m37678j015005K852248K740917k791595
12787C669807m479721J684227O471805J986673n641381o351496j076554K402976
12779a333664K243598J670249J92656m311456p883789m656347K970799P145391
12771c962563N962640L519715P55251l936391o583076j557599O244820N347328
12763E790125m083669q475348j493006O199422M550339o50059K04208L784965
12755E826977J437085m077378l314541K612199L623602j720679l811653J381063
12747A956675N858297L508613o40796o70824J94922k945366o482306m108944J626390
$$ plain form
12803 -1418848 1723593 2971488 1001844 -198077 2871479 6471368 4203727 -2562925
12795 -2562925 -5557473 -1798712 2320920 1883242 868237 3720485 6461402 3669807
12787 3669807 -809914 874313 7346118 9332791 3691410 -2660086 -3736640 -1333664
12779 -1333664 909934 2580183 2772839 -1538617 -9422406 -14078753 -11107954 -3962563
12771 -3962563 2000077 5519792 6275043 2338652 -4244424 -5802023 442797 5790125
12763 5790125 1706456 -6768892 -8261898 -2062476 2487863 1837804 2042012 5826977
12755 5826977 7264062 3186684 -127857 2484342 6107944 4387265 575612 1956675
12747 1956675 7814972 11323585 10682789 10011965 10206887 7261521 779215 -3329729 -1703339
12738a703339K322366l229314o807366k558251M914513O958444J991229l011279
12730a122997j517380M458236O888734K037395m419342m760857M29155L512454
12722E505398P83704l159104l453878j878724k131298k686896L39352N529082
12714a152364O891838K080327m360194o533017l102041K536033N573938L418403
12706E352923j720788m195654j008126M268784N979212L326952l99923l710312
12698G893068p013777p791204k390483N897286P550841l70988q070961n518020
12690i814238L433561O854318J986737k159266L23048L921641J935122k642715
12682C838208k820567P92997J679972j475909l061685k27844K714542J880034
$$ plain form
12738 -1703339 619027 -2610287 -9417653 -11975904 -7061391 -102947 1888282 -1122997
12730 -1122997 -2640377 1817859 8706593 10743988 6324646 1563789 1992944 5505398
12722 5505398 6289102 3129998 -323880 -2202604 -4333902 -7020798 -6681446 -1152364
12714 -1152364 5739474 7819801 3459607 -3073410 -6175451 -3639418 1934520 5352923
12706 5352923 3632135 -563519 -1571645 2697139 8676351 12003303 11603380 7893068
12698 7893068 879291 -6911913 -9302396 -3405110 4145731 3774743 -4296218 -9814238
12690 -9814238 -6380677 473641 2460378 301112 624160 4545801 6480923 3838208
12682 3838208 1017641 1810638 3490610 2014701 -1046984 -1274828 1439714 3319748
12674C319748j12673N70782K139305M81534l514645n131328k977715l7525J876621
12665c385896L603642M319993J446163l229601l043219L929103R400619M780141
12657A7820945o191183j1319775n821502K387094M501390J508518l15373N85877
12649C155991O66611j790935m424458m741352k630231N99978K799919J557072
12641d807405k711935n331106k603419K447203L718004P97704q85579J092840
12633h283693K946638K069534J648160M210872N798515J937442m173305n581261
12625E72902j810127R87206l71682k293153j090191J791213L156443K476230O59462
12616D078303k090317m652304m153570K15643M468704L990602l85070l115226
$$ plain form
12674 3319748 3207075 3777857 5917162 6398696 2884051 -2247277 -5224992 -5262517 -3385896
12665 -3385896 217746 4537739 5983902 2754301 -288918 3640185 13040804 17820945
12657 17820945 11629762 309987 -5511515 -3124421 1376969 2885487 2570114 3155991
12649 3155991 3822602 2031667 -2392791 -7134143 -9764374 -9164396 -6364477 -4807405
12641 -4807405 -7519340 -12850446 -15453865 -13006662 -9288658 -8490954 -9376533 -8283693
12633 -8283693 -5337055 -3267521 -1619361 2591511 8390026 10327468 6154163 572902
12625 572902 -1237225 -250019 -621701 -2914854 -4005045 -2213832 942611 3418841 4078303
12616 4078303 1987986 -2664318 -6817888 -6602245 -2133541 1857061 1471991 -1643235
12608a643235p72306L872487N314827J858993k467560k958219k55265O74921k080293
12599A544350m080722j037513M116881M862189L11142m211553n425080n291262
12591i211568n095838k441656L178601P328299O966308N103241M792768L182475
12583A3802630k707318q269170o764331m36861J845322j929204l863277J125331
12575g196878O877354N099388k163773n382220r51535M181962K344578m571417
12567a762541p724679k949981L804067M403733o53221l560347r23407J649203
12559g717173o89033l588584o93418N031329N204087n62879l990384j277166K010486
12550f272735J474576N12925K295814L418598J376411Q51779N213744Q341283
$$ plain form
12608 -1643235 -2415541 1456946 6771773 8630766 6163206 3204987 2949722 3624643 1544350
12599 1544350 -2536372 -3573885 542996 5405185 5716327 1504774 -3920306 -9211568
12591 -9211568 -14307406 -16749062 -13570461 -6242162 724146 5827387 10620155 13802630
12583 13802630 11095312 2826142 -3938189 -4375050 -2529728 -4458932 -8322209 -7196878
12575 -7196878 -319524 4779864 2616091 -2766129 -3717664 464298 2808876 -1762541
12567 -1762541 -9487220 -12437201 -8633134 -4229401 -4882622 -8442969 -9366376 -7717173
12559 -7717173 -8406206 -11994790 -12688208 -7656879 -2452792 -3015671 -7006055 -8283221 -6272735
12550 -6272735 -4798159 -4285234 -1989420 1429178 2805589 3657368 8871112 17212395
12542A7212395L776443l313996l559234J087779Q76220m497873n077929J709237
12534H213042N659064M92937n944599n094423r28624r85692k938497p70700K381098
12525H3606k08910m707142j482614P276647Q483382j298809r379523o101974J276750
12516f058587J665541k624861j988203L696722N910363K230408q22952L45400
12508B353831J483114o41316k803790k005730p21225j488478j913758M22413K702721
12499b612218J520286q05855j0991K489475J610039k780303n055208k186373K196609
12490e634539L644003K459313J196239K64095r24887j130039P89980K582626Q44312
12481D091103l772117o731990n314410j502847J339513K170773J773589R78285
$$ plain form
12542 17212395 20988838 17674842 14115608 15203387 16079607 11581734 6503805 8213042
12534 8213042 13872106 14365043 8420444 3326021 2397397 1411705 -1526792 -2297492 83606
12525 83606 -125304 -4832446 -6315060 961587 9444969 8146160 -1233363 -7335337 -6058587
12516 -6058587 -4393046 -7017907 -9006110 -5309388 600975 2831383 2008431 2353831
12508 2353831 3836945 3195629 391839 -1613891 -2335116 -3823594 -5737352 -5314939 -2612218
12499 -2612218 -1091932 -1897787 -1908778 580697 2190736 -589567 -5644775 -7831148 -5634539
12490 -5634539 -1990536 468777 1665016 1929111 1004224 -125815 664165 3246791 4091103
12481 4091103 318986 -6413004 -11727414 -13230261 -11890748 -9719975 -7946386 -6968101
12473f968101P24398J785215K940731J596916j923402l161756N57214N173397
12465G24612M796872J86241k476999j011501J01922k132026m070714j832110J792004
12456c921699J593343j954230m001098k847667r54565M99731K586329M210087
12448d789769K402617j681064k433623J912466N290428J962003m647241o030363
12440h014546j15556O022673N504734r3963l844877k526574M54135J032092K41016
12431a340866J626544M494362L775154k283745q029203p089382p69841M003142
12423e613835L756571J351724K71244M18614L77454O5839k93845j029637j669650
12414b365521j118814J19885L16594n25677o47679M80981J936566L589948N094160
$$ plain form
12473 -6968101 -6243703 -4458488 -1517757 79159 -1844243 -5005999 -4448785 724612
12465 724612 5521484 5707725 3230726 2219225 2321147 189121 -3881593 -5713703 -3921699
12456 -3921699 -2328356 -4282586 -8283684 -11131351 -12085916 -11586185 -8999856 -4789769
12448 -4789769 -2387152 -4068216 -6501839 -4589373 701055 2663058 -1984183 -8014546
12440 -8014546 -8130102 -2107429 3397305 3303342 -541535 -3068109 -2613974 -1581882 -1340866
12431 -1340866 285678 4780040 8555194 6271449 -1757754 -8847136 -9616977 -5613835
12423 -5613835 -1857264 -505540 -234296 184318 561772 627611 333766 -695871 -2365521
12414 -2365521 -3484335 -3364450 -3047856 -3573533 -4221212 -3740231 -1803665 1786283 6880443
12405F880443L664949k168955p369787n514172N82825J297583m734294o979438
12397a4340846Q45034R751410Q172599j248775o692836m170049K34221K120370
12389e328872K772778K499224m32503l731000k499092K234130M183139J962843
12381A660647N34980J196276r29531o370840p283328O54031R661098R852919K590659
12372A1566911k915787k637421n93628p56597k362870k996930j736300R95133
12364a437489L740905M472542K798145O94788n23492j915345l778792l747435
12356C03827q72685J313075m25591l581828l496977n15773J187886P28093J174570
12347d185403L127655K982072q85012m664118m271062p16839K154344K711591
$$ plain form
12405 6880443 10545392 8376437 1006650 -4507522 -3924697 -2627114 -7361408 -14340846
12397 -14340846 -13495812 -3744402 4428197 3179422 -3513414 -7683463 -7449242 -5328872
12389 -5328872 -2556094 -56870 -489373 -4220373 -6719465 -4485335 -302196 1660647
12381 1660647 2195627 3391903 2462372 -3908468 -11191796 -10537765 -876667 8976252 11566911
12372 11566911 8651124 6013703 5420075 4663478 2300608 -696322 -2432622 -1437489
12364 -1437489 2303416 6775958 9574103 10268891 9745399 7830054 4051262 303827
12356 303827 -568858 744217 318626 -3263202 -6760179 -7275952 -6088066 -5359973 -4185403
12347 -4185403 -1057748 1924324 1039312 -3624806 -7895868 -8612707 -6458363 -3746772
12339c746772J737364k28072k633031l334528o79341L073629L683535Q93851p42957
12330a976322J362967L357465M50369n175233o483789j425045M047993M226968
12322a614627N88639k119021k799544l145554k857061m62999K717665M015685
12314e676817L809686M211340M483731K476663m02684j063142q60912l512498
12306C465367o842023m124689M469022R504713N221149k081662l781131j027867
12298D802879o15302l350989l988375m46902L700184N105419L650802L96100k859341
12289F394475l138613J33392K580836M20323l368953l526706r49766l28654j165556
12280b949222J039616M971714L643061l676569q137188l973885K812164L934277
$$ plain form
12339 -3746772 -2009408 -2237480 -4870511 -8205039 -8884380 -5810751 -2127216 -1233365 -1976322
12330 -1976322 -613355 2744110 3194479 -1980754 -8464543 -9889588 -5841595 -1614627
12322 -1614627 -1025988 -3145009 -5944553 -9090107 -11947168 -12410167 -9692502 -5676817
12314 -5676817 -1867131 2344209 6827940 9304603 8901919 7838777 6977865 3465367
12306 3465367 -3376656 -7501345 -3032323 6472390 11693539 9611877 5830746 4802879
12298 4802879 4187577 836588 -3151787 -3598689 101495 5206914 8857716 9253816 6394475
12289 6394475 3255862 3389254 5970090 6390413 3021460 -505246 -1455012 -1783666 -2949222
12280 -2949222 -1909606 3062108 6705169 3028600 -5108588 -9082473 -6270309 -2336032
12272b336032R66789J134030M986516N997968J249553m315205n094794j298892
12264A289933L024645M681995K801124j348227m622313m359017j591576j5656
12256a39092r83899j749599R8162K748128K888573P94265j30086J343715K251614
12247G121781q9981l645966l926742j03822L444836K504373j607314l640476j005070
12238i48381K939797L076576r87178m436074l570500n01252M91200l38201R40148
12229c333865M252261L977498j822300n577004K29624J0450740J2148910K183591
12221B2509455q190263q800365k889007O60964M34201Q44131K337992J492732
12213H399840j430151k826462k689570l917213n094247j699684M567712N602000
$$ plain form
12272 -2336032 -1369243 -235213 4751303 10749271 11998824 7683619 2588825 1289933
12264 1289933 4314578 8996573 11797697 10449470 5827157 1468140 -123436 -139092
12256 -139092 -1122991 -2872590 -2774428 -26300 2862273 3656538 3526452 4870167 7121781
12247 7121781 7031800 3385834 -540908 -644730 2800106 5304479 3697165 56689 -948381
12238 -948381 1991416 5067992 4080814 -355260 -3925760 -4427012 -3935812 -4274013 -3333865
12229 -3333865 918396 4895894 3073594 -2503410 -2273786 8176954 20325864 22509455
12221 22509455 14319192 5518827 2629820 3290784 3724985 4569116 6907108 8399840
12213 8399840 6969689 4143227 1453657 -2463556 -7557803 -9257487 -4689775 912225
12205I12225j076127p094215m500455L132759O201123K125365k625886k129670
12197e054881K127798M417223K061561j551566j118937L398359N491991N63049
12189A0334597o192190n582067K048066N894597j61307q253304p475638J177820
12181h209426P492517O293899J711875j422331l061581m026863k917816O28241
12173c511485L803837M138106K352244J98507j901028l654827l798506j793044
12165d166196J073890L347801M616990M440231J954782k405195o102745o319871
12157c560313k249345L833023O977340K961512o138176j1507131o704014L594940
12149a2792164Q595467M954623k36217r45191J17482j281270k613020K66002M329730
$$ plain form
12205 912225 -163902 -7258117 -11758572 -8625813 -2424690 -299325 -2925211 -5054881
12197 -5054881 -2927083 1490140 3551701 2000135 881198 4279557 9771548 10334597
12189 10334597 4142407 -1439660 608406 6503003 6341696 -1911608 -9387246 -8209426
12181 -8209426 -716909 5576990 7288865 5866534 2804953 -1221910 -4139726 -3511485
12173 -3511485 292352 4430458 6782702 6981209 5080181 1425354 -2373152 -4166196
12165 -4166196 -3092306 255495 4872485 9312716 11267498 8862303 2759558 -3560313
12157 -3560313 -5809658 -1976635 5000705 7962217 1824041 -9683090 -16387104 -12792164
12149 -12792164 -4196697 757926 521709 -423482 -306000 -1587270 -4200290 -3934288 395442
12140C95442L459731r55084j605837K711310M706510J54092n531814o013262l108827
12131e787739k030487k374090k09259L697936M521433J447901j068855o13731
12123b416891K22988m47333m56973J492539K238394o80401l746006k019876K957946
12114b855613M762609J231715k616735j893879J795910L516746J854392k80525
12106E514620n35192L4359p13143k764773m066570l119715o28825J282447J043747
12097c953045j066105l135753l087025m24531L154079N187276M745069K954443
12089D374408J142533n87788k278759k885584j749919m78298j154462k905276
12081f523145k692771J75662K895310L281781K451663K243807K526516K455417
$$ plain form
12140 395442 3855173 2900089 1294252 4005562 8712072 8866164 3334350 -2678912 -5787739
12131 -5787739 -7818226 -10192316 -10401575 -6703639 -2182206 -734305 -1803160 -2416891
12123 -2416891 -2193903 -2641236 -3098209 -1605670 632724 -47677 -3793683 -5813559 -2855613
12114 -2855613 1906996 3138711 521976 -1371903 424007 3940753 5795145 5514620
12106 5514620 4979428 5013787 4300644 1535871 -2530699 -5650414 -6279239 -4996792 -3953045
12097 -3953045 -5019150 -8154903 -11241928 -11666459 -8512380 -3325104 1419965 4374408
12089 4374408 5516941 4929153 2650394 -235190 -1985109 -2463407 -3617869 -6523145
12081 -6523145 -9215916 -9040254 -6144944 -2863163 -411500 1832307 4358823 6814240
12073F814240J807634k65225m480350p636514m086296N406174J0886406N009176
12065A3455245n866889r451282m120605N95068m97870j887039J264689M729388
12057a779295L339103l238q230J873101J095817j228142n83027K422272K907999
12048H036360o1677k536580k462674j660001j277913n85551o1613o19202k97521
12039a526372K798627M927242O42794p403087r780821l257755M348172N240642
12031d010558J368875p53865M52548J928857J762297K96122j639238k363356l13336
12022c271654K223707O12652m250357n057108J019705O650516N107731N85174
12014C620366L80237K376702j20729n075960m477808J203420L148747n39607j678875
$$ plain form
12073 6814240 8621874 8356649 3876299 -3760215 -7846511 -2440337 8446069 13455245
12065 13455245 7588356 -1862926 -5983531 -5388463 -5886333 -7773372 -6508683 -1779295
12057 -1779295 1559808 1556570 1548340 3421441 4517258 3289116 2706089 5128361 8036360
12048 8036360 7974683 5438103 2975429 1315428 37515 -548036 -609649 -1228851 -1526372
12039 -1526372 1272255 6199497 6842291 -560796 -10341617 -13599372 -9251200 -4010558
12031 -4010558 -2641683 -3395548 -2943000 -1014143 748154 1044276 -594962 -2958318 -3271654
12022 -3271654 -1047947 -435295 -4685652 -9742760 -8723055 -2072539 3035192 3620366
12014 3620366 4000603 6377305 6256576 1180616 -3297192 -2093772 1054975 515368 -1163507
12005a163507K913126M974871r24009p210744n236645J166726L053035N22077
11997a905070l39601M08830j730954m751574k075380M927805O977679J268270
11989B780005l653095r38401M612427M562555j176626n823960n353534j633767
11981f624396J835384L277620K849949K053383J967612J122110k572083o993692
11973c084113o668986n68022M764267L196824k863114o097976l707464Q71481
11965a4157103M039455N358553N185931L175221J14440j599621o72110J316648
11957B761414J633677o68717l560575l800341q70615J258703j111820m835916
11949i194190k593552N822825J0325728L669189o699669p465511J993058Q646020
$$ plain form
12005 -1163507 1749619 6724490 5800481 -1410263 -6646908 -5480182 -2427147 -1905070
11997 -1905070 -2244671 -1835841 -3566795 -8318369 -10393749 -5465944 1511735 2780005
11989 2780005 -873090 -1811491 2800936 7363491 6186865 362905 -4990629 -6624396
11981 -6624396 -4789012 -1511392 1338557 3391940 5359552 6481662 3909579 -3084113
11973 -3084113 -9753099 -10321121 -5556854 -2360030 -5223144 -11321120 -15028584 -14157103
11965 -14157103 -10117648 -4759095 426836 3602057 3716497 2116876 1444766 2761414
11957 2761414 4395091 3726374 165799 -3634542 -4505157 -3246454 -4358274 -9194190
11949 -9194190 -11787742 -5964917 4360811 8030000 1330331 -6135180 -4142122 4503898
11941D503898M140288m643654o814797j760695L249469M209326K612721p0051
11933E426505l566239n858636m697095j600619Q4927L64305J521879K948825K051470
11924c324678k31388k98527J571218J334045j273493j535224J888921L867794
11916A998668J437864q75263P18703J918682j851912n466538j141516P399646
11908D138334Q395099j54251o864799m169294J028465k16258m563369l189221
11900e595294K997048N193671J344088j226567J566698M329531J554772l842830
11892F321117n632781l003311K15922J716934J931454J290842L1276n61643K55195
11883B565005Q98998j55712j370039k45982K432088L355417J400527j194725k557750
$$ plain form
11941 4503898 8644186 4000532 -2814265 -4574960 -1325491 2883835 5496556 5426505
11933 5426505 1860266 -3998370 -8695465 -10296084 -10211157 -9846852 -8324973 -5376148 -3324678
11924 -3324678 -3556066 -3854593 -2283375 -949330 -2222823 -3758047 -1869126 1998668
11916 1998668 3436532 2561269 3279972 5198654 3346742 -2119796 -3261312 4138334
11908 4138334 12533433 12379182 5514383 1345089 2373554 2157296 -2406073 -5595294
11900 -5595294 -2598246 2595425 3939513 2712946 4279644 8609175 10163947 6321117
11892 6321117 688336 -2314975 -2099053 -382119 1549335 2840177 2871453 2309810 2565005
11883 2565005 3464003 3308291 1938252 1692270 4124358 7479775 8880302 7685577 5127827
11874E127827l361414m344126m071835j140731K647417L650922J078393j563348
11866a976895p93153K312766L679138J827807m37984n49927J23296j034127l394640
11857b43719l970833j863613Q45165K216418J949051J57055k528787l727293j244571
11848h411127L268306N430563L563633L70533j280710j293810m73736R29260J736005
11839C838917L00953k130859j938773J375951L788654K804743J066842J297138
11831A0403566J518259j158440n204596o920783n385487j783931L131975P151744
11823A752307N787878j514150p358527m729305K618963M747704m14306m763626
11815c873062k393657K802140M355158K114841K21881L63688J033927J128204
$$ plain form
11874 5127827 1766413 -2577713 -6649548 -7790279 -5142862 -1491940 -413547 -1976895
11866 -1976895 -2770048 -457282 3221856 5049663 4611679 4061752 4185048 3150921 -243719
11857 -243719 -4214552 -6078165 -5233000 -3016582 -1067531 -910476 -3439263 -7166556 -8411127
11848 -8411127 -5142821 287742 3851375 4221908 2941198 1647388 1173652 2102912 3838917
11839 3838917 4139870 2009011 70238 1446189 5234843 8039586 9106428 10403566
11831 10403566 11921825 10763385 5558789 -1361994 -6747481 -8531412 -5399437 1752307
11823 1752307 7540185 6026035 -1332492 -6061797 -3442834 1304870 890564 -3873062
11815 -3873062 -6266719 -3464579 890579 3005420 3227301 3590989 4624916 5753120
11807E753120R08415M97544l63473j614393k897004l564066k646340j18234K143216
11798a901215K415753J609434J608024J960097R14867r73810j455501m15901J48784
11789C910532k50271k43431M67050J153025K369343M414780M422123k19903o044276
11780I978972o652305j951109J595848P67761p01399P8598L59515k022215l696106
11771b242440j325215K598076L733707J865382n78615k169853j763143J427962
11763A545861M263801J575769n093267p062159j322123L414451o0230n436584
11755h174481l096925L746854M490773r17849k285156K974287N241911r44195
11747A035219p409327n107479K394129N380391K054768j146127k6211L036586
$$ plain form
11807 5753120 6661535 7159079 6795606 5181213 2284209 -1279857 -3926197 -4044431 -1901215
11798 -1901215 514538 2123972 3731996 5692093 6606960 5633150 4177649 3761748 3910532
11789 3910532 3660261 3416830 3883880 5036905 7406248 11821028 16243151 16023248 9978972
11780 9978972 3326667 1375558 2971406 3739167 3037768 3116366 3475881 1453666 -2242440
11771 -2242440 -3567655 -969579 2764128 4629510 4050895 1881042 117899 1545861
11763 1545861 5809662 7385431 2292164 -4769995 -6092118 -2677667 -2737897 -8174481
11755 -8174481 -11271406 -7524552 -3033779 -3951628 -6236784 -3262497 1979414 1035219
11747 1035219 -6374108 -11481587 -9087458 -3707067 -1652299 -2798426 -2824637 211949
11739B11949M095263K287964m32229j597081n10073P26589k68604k275603j665073
11730E73102J804044L660278Q68076l721112n306457l188226o31384l43525j917212
11721h202416k647228j9274N259315Q624041O183223j69853m852711n556566m638463
11712f019932l742016j655517J569179L164453K072039N27329k73141j390034
11704e747640j740526J500986N936618M574249k710406o114163k59495O215037
11696A654660L822871k228003j011694M878767L257256o057208r094913k60487
11688e038751P689161L373613n776162n922701K311673P042361L803538p03372
11680F779360j316967j94691J06900K70066j05915k794623n649100m059859Q31554
$$ plain form
11739 211949 4307212 6595176 6162947 4565866 4055793 4782382 4513778 2238175 573102
11730 573102 2377146 6037424 6905500 3184388 -2122069 -5310295 -5941679 -6285204 -8202416
11721 -8202416 -10849644 -10868918 -5609603 3014438 9197661 9027808 4175097 -1381469 -6019932
11712 -6019932 -9761948 -11417465 -9848286 -6683833 -4611794 -4084465 -4357606 -5747640
11704 -5747640 -7488166 -5987180 -50562 4523687 1813281 -4300882 -4560377 1654660
11696 1654660 5477531 3249528 2237834 7116601 10373857 4316649 -4778264 -5038751
11688 -5038751 2650410 6024023 247861 -5674840 -3363167 3679194 7482732 6779360
11680 6779360 5462393 5267702 5374602 5644668 5538753 2744130 -2904970 -6964829 -6133275
11671f133275K291513j602495m532823j813563K769084L821260K282666J943374
11663i74259K864308L145260L222965L573001J839560k760809n758647l566552
11655A584827Q9078j71416k524016j654814J407930J293195j427241r39345K815783
11646D73981L250309j077973l188141M91222M083347K803135Q02655K173385K390337
11637A2202257k908969p580523l641040M456684N412518j328353m926493k04528
11629A481553N480215M732470M087k780866k720478j786870m41177N66350o63694
11620C871590k890383j975460J602730J783763k781910m592709R14822O327530
11612B259973K904704n059761o136109P83760N195714J267764m239988l167777
$$ plain form
11671 -6133275 -3841762 -5444257 -9977080 -11790643 -9021559 -5200299 -2917633 -974259
11663 -974259 1890049 5035309 8258274 11831275 13670835 10910026 5151379 1584827
11655 1584827 1673905 1502489 -1021527 -2676341 -1268411 24784 -1402457 -2341802 473981
11646 473981 3724290 2646317 -541824 -50602 4032745 6835880 7638535 9811920 12202257
11637 12202257 9293288 1712765 -1928275 2528409 7940927 6612574 1686081 1481553
11629 1481553 6961768 11694238 11698325 8917459 6196981 4410111 3968934 4535284 3871590
11620 3871590 981207 -994253 608477 2392240 -389670 -4982379 -4067557 2259973
11612 2259973 5164677 104916 -6031193 -5247433 -51719 1216045 -3023943 -6191720
11604f191720K697500N983168M166178P47533r98038j047715o49590o05678j331368
11595B770270k635367l351988k273133K95448K205294J183831k321763m357705
11587h485113j495999M020681O115645L177295P11814K798701N068204J331215
11579A3242443n966401q682976m937501p52653L19595J362699M008721M066709
11571B660636o18014m538729k366643K428542K898251q34479k700347m67612J868866
11562a669529J228955m75172m25463R70715J532510L64277j648299k838394j835114
11553d795514J141842M024456M734741K881215n86789l929515m573201j214011
11545b316776K960581K523703k623377n637939j975095L500863L521166m03098
$$ plain form
11604 -6191720 -3494220 2488948 6655126 7402659 6404621 5356906 4707316 4101638 2770270
11595 2770270 134903 -3217085 -5490218 -5194770 -2989476 -1805645 -4127408 -8485113
11587 -8485113 -9981112 -5960431 155214 3332509 4044323 6843024 11911228 13242443
11579 13242443 7276042 -1406934 -6344435 -7097088 -6777493 -5414794 -1406073 2660636
11571 2660636 2042622 -2496107 -4862750 -2434208 464043 -370436 -3070783 -3538395 -1669529
11562 -1669529 -440574 -915746 -1341209 -370494 1162016 1526293 -122006 -2960400 -4795514
11553 -4795514 -3653672 370784 5105525 7986740 7399951 3470436 -1102765 -2316776
11545 -2316776 643805 3167508 544131 -5093808 -7068903 -3568040 -46874 -449972
11537d49972k79685N633998R179804L415615p420845j2324576n989019N262063
11529b972617R783232K786872p852931r972924j864434N480211L471624k271156
11521c412123j400502M579372M914651k543920p147508j915000N692404N301646
11513D069020j461469m941001j727349K619915L151434J064965n34350j368341
11505H72824k867160m829431m833424j060400M288387N816359J390728l586166
11497d808283k331590L587268N977200J785560l185515l994612k992376l135813
11489i098161j890449K839940O616554M765505L08473q88612Q63896J371927L70407
11480E259480K61984J85307j577815k187372J166225L949041P1877o941591p886891
$$ plain form
11537 -449972 -729657 4904341 14084145 17499760 10078915 -2245661 -8234680 -2972617
11529 -2972617 6810615 9597487 1744556 -8228368 -10092802 -4612591 -1140967 -3412123
11521 -3412123 -4812625 -233253 4681398 2137478 -5010030 -6925030 -1232626 4069020
11513 4069020 2607551 -2333450 -4060799 -1440884 1710550 2775515 2241165 872824
11505 872824 -1994336 -6823767 -11657191 -12717591 -8429204 -2612845 -1222117 -4808283
11497 -4808283 -7139873 -3552605 2424595 4210155 1024640 -2969972 -5962348 -9098161
11489 -9098161 -10988610 -8148670 -1532116 3233389 3541862 2653250 3517146 4889073 5259480
11480 5259480 5521464 5706771 4128956 1941584 3107809 7056850 7128727 187136 -7699755
11471g699755k148074J794574M51682m70559K082033L024554m66838k862630k95350
11462f590363J940441j150248m629389j576909M858112O119371J497901j873974
11454a405058o13220J344236O23808j214658k249478l284212m512549l648735
11446a4959866K57532M151237M412747J489810n33279J237681M619818M068624
11438D744304k306154q231183n492053M452925J0004471L872396o635634r117210
11430h708138k352192L832586L184539m07209j529296o45240r0366P72170K375166
11421c567980K198092l28346p66092L360221O638991L076561l740841n145625
11413A724981n04246K348866J24810j278839J897847L793233j308858q243532
$$ plain form
11471 -7699755 -9847829 -8053255 -7601573 -8072132 -5990099 -2965545 -3432383 -6295013 -6590363
11462 -6590363 -4649922 -5800170 -10429559 -12006468 -7148356 -1028985 468916 -1405058
11454 -1405058 -2018278 -674042 -50234 -1264892 -3514370 -6798582 -11311131 -14959866
11446 -14959866 -14702334 -10551097 -6138350 -4648540 -5181819 -3944138 675680 4744304
11438 4744304 2438150 -5793033 -11285086 -6832161 3172310 7044706 409072 -8708138
11430 -8708138 -11060330 -7227744 -4043205 -4450414 -5979710 -6624950 -6715316 -5943146 -3567980
11421 -3567980 -1369888 -1698234 -2464326 895895 7534886 10611447 6870606 1724981
11413 1724981 1220735 3569601 3694411 2415572 4313419 8106652 6797794 -1445738
11405a445738p819247n85274M453114L182274L90636M34050J612222J552453J437525
11396C212015K042239J073516k318576m805832l681238o04218J931027L891297
11388G40230N042025L394030o23427k600383j56930L200237L337830P04708k615249
11379A0423071o321256q858837o304310J045683O128918M515314J203212K000276
11371C832071L711029P14853l699799k296515K943560L174302k651630n763486
11363c5615j435465M161119L568222k491093p874489q058576k855764L636089
11355a1385572N600911K002844r25813J740220N613662L890345j356753l081951
11347B097893j278664j263616k465782j56735L126792L93260n660967m738542
$$ plain form
11405 -1445738 -9264985 -9850259 -5397145 -2214871 -1824235 -1390185 222037 1774490 3212015
11396 3212015 5254254 6327770 4009194 -796638 -4477876 -5082094 -3151067 740230
11388 740230 5782255 9176285 8552858 5952475 5795545 8995782 12333612 13038320 10423071
11379 10423071 4101815 -4757022 -11061332 -10015649 -3886731 628583 1831795 3832071
11371 3832071 7543100 8257953 4558154 2261639 5205199 8379501 5727871 -35615
11363 -35615 -1471080 2690039 6258261 3767168 -4107321 -12165897 -15021661 -11385572
11355 -11385572 -5784661 -3781817 -4707630 -2967410 2646252 6536597 5179844 2097893
11347 2097893 819229 -444387 -2910169 -3066904 59888 453148 -5207819 -9946361
11339i946361L235917O359724L47742m177150L04571O208001M530933j062162
11331E801215k573742n50585P793j151286j973626k900381l353591n81773L559644
11322c716332L182544o62398j48705M497415L479724m050756n392027L722946
11314I12411R071600J323567o952322k453531N983192L457873n309919o357456
11306c24585j648605k398398n770603r04676P673558N863262m121132o655714
11298h286893M3209K681286j015299J078968R822683R821205l259647j2652617
11290a767105p029064K633285L253608r64961r83867P43507j193979l128148p09925
11281i146649J501583m64486j055284M154314Q536126N058582j874533m384230
$$ plain form
11339 -9946361 -6710444 -350720 -2978 -4180128 -3875557 2332444 6863377 5801215
11331 5801215 3227473 2676888 2684681 1533395 -440231 -3340612 -6694203 -7275976 -3716332
11322 -3716332 -533788 -1196186 -1344891 3152524 6632248 2581492 -2810535 912411
11314 912411 9984011 11307578 4355256 1901725 7884917 11342790 6032871 -324585
11306 -324585 -1973190 -4371588 -10142191 -11046867 -3373309 2489953 -1631179 -8286893
11298 -8286893 -8243684 -5562398 -6577697 -5498729 4323954 14145159 10885512 -1767105
11290 -1767105 -8796169 -6162884 -2909276 -3874237 -4858104 -4114597 -5308576 -8436724 -9146649
11281 -9146649 -7645066 -8109552 -9164836 -5010522 3525604 8584186 6709653 2325423
11273B325423k591988M7L675432P025607L873937n631940j0365720l848005M770082
11264g67125M767953n84401k630729j879532k617970k072387K552380M356519
11256A124708k495653r308573m420069P249589J0923429M369898j274783q13631
11248E354915j09546j984853j441322K599760L237282k707618q571002p444862
11240a1067246o81987N962263Q553844N718670r75013o180221n544544j668317
11232e882551l58813j766835j058559K897679N857305N071492K091179j029308
11224E821589l087910k236515J475944L429228m65m884347m897047j070581N81126
11215d868978n61960L41865M006061N516839K919630j20449j120701j511351j855011
$$ plain form
11273 2325423 -266565 -266518 3408914 10434521 14308458 8676518 -1689202 -5537207 -767125
11264 -767125 4000828 3416427 785698 -1093834 -3711804 -5784191 -3231811 1124708
11256 1124708 -1370945 -10679518 -15099587 -7849998 3073431 7443329 6168546 5354915
11248 5354915 5245369 3260516 1819194 4418954 7656236 4948618 -3622384 -11067246
11240 -11067246 -11749233 -5786970 2766874 8485544 7510531 1330310 -4214234 -5882551
11232 -5882551 -6241364 -8008199 -9066758 -6169079 -311774 4759718 6850897 5821589
11224 5821589 2733679 497164 1973108 5402336 5401871 517524 -4379523 -5450104 -4868978
11215 -4868978 -5430938 -5089073 -1083012 4433827 7353457 7233008 6112307 4600956 2745945
11206B745945q43716L19580j093417l595724l216823j053734j901871m898502
11198a3538262l424925M012437J0378225J0009177N109054k4904m408808p076357
11190A035637n049393J384713O485463N782766J031466l738952o674479o905408
11182f648187m015132n95343k09283j322895Q95499N418897N394816j23746k818338
11173d023712J865484O411347K705860m972583o723043j935926J546067M45173
11165d681333p48770R95743K908438K396983Q89141l938r85968j937110o91414
11156a858228K897670N079290K672423k731535o621469o079525j710469L218999
11148e132844N070916L038120L72154N67603K382516J311602l526133p196144
$$ plain form
11206 2745945 1902229 2221809 1128392 -2467332 -5684155 -6737889 -8639760 -13538262
11198 -13538262 -16963187 -12950750 -2572525 7436652 12545706 12520802 8111994 1035637
11190 1035637 -4013756 -2629043 3856420 9639186 10670652 6931700 257221 -6648187
11182 -6648187 -10663319 -11258662 -11467945 -12790840 -11895341 -6476444 -1081628 -1205374 -4023712
11173 -4023712 -2158228 4253119 6958979 1986396 -4736647 -6672573 -5126506 -4681333
11165 -4681333 -5430103 -4434360 -1525922 871061 1760202 1756264 770296 -1166814 -1858228
11156 -1858228 1039442 6118732 8791155 6059620 -561849 -6641374 -8351843 -5132844
11148 -5132844 -61928 2976192 3348346 3915949 6298465 7610067 4083934 -3112210
11140c112210n310557K35184M334366N140985M273473K316354j574679n781729
11132E21187o515241l473185j248237k649912m200985j751502K574225L812998
11124a2930652K376653K907457N588239N309437Q51573j839938J012100M290487
11116G565356J696259m263903o193577k962806k51360q53144j087827J996981
11108d354021N418666M836360O82655k968765l518922j734618R0366L18523q24253
11099b054009j352878L86292L328002M365463J858321k310472m551969l009045
11091c340295Q43047L673015L475122J329775l89880j093744j930186k967989
11083d01135k620888m75031J417103J094820j101339l492013m430324k578288
$$ plain form
11140 -3112210 -8422767 -8187583 -3853217 1287768 5561241 7877595 6302916 521187
11132 521187 -5994054 -9467239 -10715476 -13365388 -17566373 -19317875 -16743650 -12930652
11124 -12930652 -10553999 -7646542 -2058303 3251134 4102707 2262769 3274869 7565356
11116 7565356 9261615 4997712 -1195865 -4158671 -4410031 -5263175 -6351002 -4354021
11108 -4354021 1064645 5901005 6583660 3614895 95973 -1638645 -1548279 -1229756 -2054009
11099 -2054009 -3406887 -3020595 307407 4672870 6531191 4220719 -331250 -3340295
11091 -3340295 -2497248 1175767 4650889 5980664 5590784 4497040 2566854 -401135
11083 -401135 -3022023 -3497054 -2079951 -985131 -2086470 -5578483 -10008807 -12587095
11075a2587095J640480M739353L624668O43535R79292M293878M357698r50925
11067F740884n240363k933655K526232M643937L068691J212808o71462l337195
11059F009877l375693K015210P563115N345556l243921q556365n642743P96263
11051I11299M538386M101867M53431m658629p006255l125569L226211M167694
11043B608435j024082m158223j35767N555099N018619j419685o859360o583213
11035f998177j660735L634235N381027L006708J45153M06996K275572J621275
11027G812054j077722j132241K105411L279747n47935n064293n336020k395511
11019b356510J85057J759709K794505J709328j944558m251815j541502L710657
$$ plain form
11075 -12587095 -10946615 -6207262 -2582594 -1939059 -959767 3334111 7691809 6740884
11067 6740884 1500521 -1433134 1093098 5737035 8805726 10018534 9347072 6009877
11059 6009877 2634184 4649394 12212509 17558065 14314144 5757779 115036 911299
11051 911299 5449685 9551552 10004983 5346354 -1659901 -4785470 -1559259 2608435
11043 2608435 1584353 -2573870 -2709637 2845462 7864081 6444396 -414964 -6998177
11035 -6998177 -8658912 -5024677 356350 3363058 3508211 3915207 6190779 7812054
11027 7812054 6734332 5602091 7707502 10987249 10439314 5375021 39001 -2356510
11019 -2356510 -2171453 -411744 2382761 4092089 2147531 -2104284 -3645786 64871
11011F4871N678495K563142k233607n075201n014695k684293O31264K979487L132850
11002D2313K171305K228729L554999L771108N35936m874270p245546k665083N381230
10993B900721Q363386L333432k626974k467537O18698o41223m980774n040341
10985e40612n97501J156248r77432P8920N679457P022345L96042m583943m45767
10976G187757M722701M87232p569084o291277L226896P045181M08964o002940
10968C215430m005225R06592J109492j325965j105382L71716p31355k309918l7980
10959c912595L988488L664328j523845n514666m101539N88241M357254N484500
10951C030166M128648P91093k840386l927162j583750J117038L44999l283970
$$ plain form
11011 64871 5743366 8306508 6072901 997700 -4016995 -6701288 -6070024 -3090537 42313
11002 42313 2213618 4442347 7997346 11768454 12304390 7430120 184574 -2480509 2900721
10993 2900721 11264107 14597539 11970565 9503028 10121726 9480503 4499729 -540612
10985 -540612 -1138113 18135 -959297 -880377 4799080 11821425 12217467 7633524 7187757
10976 7187757 11910458 12397690 4828606 -1462671 1764225 8809406 9218370 3215430
10968 3215430 -789795 116797 1226289 -99676 -1205058 -833342 -1564697 -3874615 -3912595
10959 -3912595 75893 3740221 2216376 -3298290 -7399829 -6811588 -2454334 3030166
10951 3030166 7158814 7949907 5109521 1182359 -401391 715647 1060646 -2223324
10943b223324m608092j65806O768314R505436N888822J62832l518243n688404
10935F121535p478391o133494L42791O629543N013133l030161p124162k072638
10927g731844M889911M969390O0079j951493J80703Q76921j537569k074223J848891
10918d69234N558237M199604m78977l547241l122931l48738L136797M785031J882801
10909A1595349l924613o333633k385882K545846K068500k167026l892113j934385
10901d427957l36451n27040j40277Q96418J5917j702515K47355N679879Q269730
10892G975059M646349q91289l417747l449621k937083j026930K112585K527182
10884E538505j588866n406479l788289J349651M475623L927473J668964r99642
$$ plain form
10943 -2223324 -6831416 -6997222 -228908 9276528 15165350 15328182 11809939 6121535
10935 6121535 -1356856 -7490350 -7147559 -518016 4495117 1464956 -5659206 -7731844
10927 -7731844 -2841933 2127457 2187536 236043 416746 1293667 -243902 -2318125 -469234
10918 -469234 5089003 9288607 8809630 5262389 2139458 1790720 4927517 9712548 11595349
10909 11595349 7670736 1337103 -1048779 1497067 3565567 1398541 -2493572 -4427957
10901 -4427957 -4764408 -5291448 -5431725 -4535307 -4519390 -6221905 -5974550 -294671 7975059
10892 7975059 12621408 11730119 8312372 4862751 1925668 898738 3011323 5538505
10884 5538505 3949639 -1456840 -5245129 -3895478 580145 4507618 6176582 5176940
10876E176940k980337j922765K157167M850170L184871J2149j503426l070006
10868E904763n814799n205738J341019O814164L591910l678778m373427J349671
10860g1215L434976r22084l268206O48709L380858r42870o055834l806522K531331
10851e070857L693378j409675n176120k950995J809590L853124K404737K80895
10843b565923o2340J354240K500832J746215j1442o66518k68365r28108k992515
10834a893924l896294j878606J432414L331196L021037J370943m28954j156678
10826i8866k95485Q72262N98875o03337m84999J487508L378147L864542L755277
10817A2473924L547913J571641l681851j0019898j1996515o270807L236885P623178
$$ plain form
10876 5176940 2196603 273838 2431005 7281175 10466046 10478195 8974769 5904763
10868 5904763 89964 -5115774 -3774755 3039409 6631319 2952541 -1420886 -71215
10860 -71215 3363761 2441677 -826529 -177820 3203038 2260168 -3795666 -7602188 -5070857
10851 -5070857 -1377479 -2787154 -7963274 -10914269 -9104679 -5251555 -2846818 -2565923
10843 -2565923 -2628263 -1274023 1226809 2973024 2961582 2295064 2026699 1098591 -1893924
10834 -1893924 -5790218 -7668824 -6236410 -2905214 115823 1486766 1057812 -98866
10826 -98866 -394351 477911 1076786 473449 -11550 1475958 4854105 8718647 12473924
10817 12473924 16021837 17593478 13911627 3891729 -8104786 -14375593 -11138708 -3515530
10809c515530K854699m374090m733530J102454M096919J058151j106359K098685
10801b518601N115532K646879r67141k19057J425319j047305l523536j55534M349320
10792E105876J804108m454699m497694J282799L727911J558913K038675N219847
10784A1785736K773985n347177q162155j832610L510550P70877l476170k201690
10776b178654M90387q82035k624089Q9209L636685L082345J126321J879005K864766
10767G483940Q40639j291379o75044p83302m317623o565361l087617K424638M843120
10758a127989N357416N784781K794211m396398q233515l556850K940738L102010
10750B664404J23034J091592L674198J653829k021287j68186M638755L578899
$$ plain form
10809 -3515530 -660831 -5034921 -9768451 -8665997 -4569078 -3510927 -4617286 -2518601
10801 -2518601 2596931 5243810 4276669 4057612 5482931 4435626 912090 756556 5105876
10792 5105876 6909984 2455285 -2042409 -759610 2968301 4527214 6565889 11785736
10784 11785736 14559721 9212544 1050389 -782221 2728329 3499206 23036 -2178654
10776 -2178654 -1688267 -2570302 -5194391 -5105182 -1468497 1613848 2740169 4619174 7483940
10767 7483940 8324579 7033200 6358156 5574854 1257231 -5308130 -8395747 -5971109 -1127989
10758 -1127989 4229427 10014208 12808419 8412021 178506 -3378344 -437606 2664404
10750 2664404 2787438 3879030 7553228 9207057 7185770 7017584 11656339 15235238
10742A5235238l180174o753167l973793m19908N07445R63311J161716j337433
10734B203235m369248k792829J928778L004077j37272r85188K190479L304762
10726D346794m30086l658983k441161j22813J97716J039852L740297L734471j572232
10717D833855o327286m117647K123738M619024J992708n11640j27366P80915P84366
10708D050667J588580K791768N27709n291433p506059j033331P531380O891466
10700I550747k889583r357049m996987K633921L487115J31318J508968O864707
10692F933157P106288N22360m312396k568382M22964k40989j598270k89671R27215
10683F902276p20038k423261j480000m47729j653669k263750J80957K506731J141128
$$ plain form
10742 15235238 12055064 5301897 1328104 908196 1415641 2378952 3540668 2203235
10734 2203235 -2166013 -4958842 -3030064 -25987 -163259 -1148447 1042032 4346794
10726 4346794 3916708 257725 -2183436 -2306249 -2108533 -1068681 2671616 6406087 4833855
10717 4833855 -1493431 -5611078 -3487340 1131684 3124392 2612752 2485386 3266301 4050667
10708 4050667 5639247 8431015 8958724 3667291 -3838768 -4872099 2659281 9550747
10700 9550747 6661164 -2695885 -7692872 -5058951 -1571836 -1440518 68450 6933157
10692 6933157 14039445 14561805 10249409 7681027 8103991 7863002 6264732 5975061 6902276
10683 6902276 6182238 3758977 2278977 1831248 177579 -2086171 -1905214 601517 1742645
10674A742645j890522k668722j072713Q73302K354954K628573P99646j200639
10666A566524k42811K160819J540485j304758j190429J537564R67874k994021
10658B041247l518721L65533J312900k225452j832970N304632R377857M059892
10650A4884918k590248k257122K99091j809915m417934j558418J974573m19745
10642D105200m106860j483466M037714M305130J02375k754545m334099o571488
10634f700039n363818J923603P923632N606725J70641n21907O69082j635273k593024
10625e20378L495716R412106N838841j471020j348301K870593K66497o716927
10617A1827127o683714n82080K49502m829787n205602R43194L843652K41306k211216
$$ plain form
10674 1742645 -147877 -2816599 -3889312 -3016010 -661056 1967517 2767163 1566524
10666 1566524 1323713 3484532 5025017 3720259 2529830 4067394 5035268 2041247
10658 2041247 -1477474 -1111941 200959 -2024493 -3857463 1447169 10825026 14884918
10650 14884918 12294670 10037548 10336639 8526724 4108790 2550372 4524945 4105200
10642 4105200 -1660 -1485126 2552588 6857718 6960093 4205548 -128551 -6700039
10634 -6700039 -12063857 -10140254 -2216622 3390103 3560744 3038837 3707919 2072646 -520378
10625 -520378 2975338 12387444 18226285 16755265 15406964 18277557 18544054 11827127
10617 11827127 5143413 4561333 4810835 -18952 -5224554 -4281360 -437708 -196402 -2407618
10608b407618j44057J188148J16577P56812K153168o96811m694880k001421M325582
10599a404500L288431m743767p476634j240892L723326J563232j021676P40920
10591f571560J481005k396074n000510j250989M884759P285992N031746L61526
10583C825895l542270k636308K593471M024021k937255r108804l810960P017185
10575d575025Q778233Q56315l992752q17437K841595K612125J852323O18258m477963
10566C695672r133477n181182M214646P789287L950400M74408j539772o669864
10558b399882j0176900k955434Q947732R508976j448800p367754j927547L200065
10550d619544R45218r38167K473277M171138K44488k407246N77839M198928M644814
$$ plain form
10608 -2407618 -2551675 -1363527 -1246950 -490138 1663030 966219 -3728661 -5730082 -1404500
10599 -1404500 1883931 -2859836 -10336470 -11577362 -7854036 -6290804 -7312480 -6571560
10591 -6571560 -5090555 -7486629 -12487139 -13738128 -8853369 -1567377 3464369 3825895
10583 3825895 283625 -2352683 240788 4264809 1327554 -7781250 -11592210 -4575025
10575 -4575025 4203208 5059523 1066771 249334 3090929 5703054 7555377 8173635 3695672
10566 3695672 -5437805 -10618987 -6404341 1384946 5335346 5809754 4269982 -2399882
10558 -2399882 -12576782 -15532216 -6584484 2924492 1475692 -5892062 -7819609 -4619544
10550 -4619544 -3674326 -4612493 -2139216 2031922 2276410 -130836 447003 4645931 9290745
10541I290745L406495m07508p820879j1061396k766460Q114790P334030j029175
10533E060642j993916L213700P67638p883264p504634K183904N579040l15406
10525h92296k653260J334521J742816p13135L487761Q560609R12671j1022976
10517G56711p150354O235645N112273p455554o018510Q132915Q110034n852722
10509A870438m651306J2456950J2326777r658314j7729445j209232O563556o668984
10501f699560r605122P475268J0484093q549316r604925J5166193J7022689j3834078
10493A855242j6239804K5131095L1476481k3041204k4547093J00038955K10105538
10486C04779210J21530396j02575536k12051524j14337618K0547663L2132930
$$ plain form
10541 9290745 12697240 12289732 4468853 -6592543 -9359003 -1244213 6089817 5060642
10533 5060642 3066726 6280426 7048064 -835200 -8339834 -6155930 -576890 -892296
10525 -892296 -3545556 -2211035 -468219 -1181354 2306407 10867016 11779687 756711
10517 756711 -6393643 -157998 4954275 -2501279 -8519789 -386874 7723160 1870438
10509 1870438 -2780868 9676082 22002859 12344545 -5384900 -6594132 -30576 -6699560
10501 -6699560 -16304682 -8829414 1654679 -6894637 -16499562 -1333369 15689320 1855242
10493 1855242 -14384562 10746533 42223014 19181810 -5365283 94673672 304779210
10486 304779210 426309606 323734070 111682546 -2655072 17892591 50025521
10480E0025521k6356996l1758995R054233J5333194j2712486j5384756Q636718
10473c163567J2159494o567585r003897O233271O793400p686838q633414M206349
10465e662787N859412l222279j162993R192523N760862q011899q085973N484658
10457A51524R594683K60697l935243J619650K343505m851691o807614l98965L389253
10448A365799J377359P66743J824118q19001l418133N30698M905256J019773m548458
10439C004154j489917M055787J106061m441985j327130M090284m23613p911249
10431c337608l652916O658184O061801k799503k607792O799939Q202064k324952
10423A2999217r625984n796501K52066J801983K560377L478893l9185n326928
$$ plain form
10480 50025521 23668525 -8090470 963763 16296957 3584471 -11800285 -3163567
10473 -3163567 8995927 2428342 -6575555 -342284 6451116 -1235722 -9869136 -5662787
10465 -5662787 196625 -3025654 -4188647 5003876 10764738 2752839 -5333134 151524
10457 151524 9746207 10006904 6071661 7691311 10034816 5183125 -1624489 -2023454 1365799
10448 1365799 2743158 3509901 5334019 4515018 1096885 1627583 6532839 7552612 3004154
10439 3004154 1514237 5570024 6676085 2234100 906970 4997254 4573641 -3337608
10431 -3337608 -6990524 -332340 5729461 2929958 322166 7122105 15324169 12999217
10423 12999217 3373233 -2423268 -2171202 -369219 2191158 5670051 5630866 303938
10415C03938l763076L167755M781746o14544l496391j5348L351870K952552K162425
10406H830927J749506j312071n075806m285674l90520P28737o81119k53452R66261
10397B76789m82436j863397O77132L204996R91197j625726J96606Q91845m770034
10388b503028q346124o39463R671841P689887l420296p777006j750119M386757
10380b687551N877357O509126N424832j097230p318335n054325L1759k906221
10372a220588q720634l673654Q867756J1808966K620668l861696j824969j125135
10364B870714m803854k932184N566912P080437k716144r295731l109272N400515
10356a938607M797354k10180j536611k173571o032767o836659L56106P436900
$$ plain form
10415 303938 -3459138 -291383 4490363 3875819 379428 364080 3715950 6668502 8830927
10406 8830927 10580433 9268362 4192556 -93118 -483638 245099 -436020 -689472 276789
10397 276789 -205647 -2069044 -1391912 1813084 2804281 1178555 1375161 2267006 -2503028
10388 -2503028 -10849152 -11488615 -1816774 5873113 2452817 -5324189 -7074308 -2687551
10380 -2687551 3189806 9698932 15123764 14026534 6708199 1653874 1685633 -1220588
10372 -1220588 -9941222 -13614876 -4747120 7061846 9682514 5820818 3995849 2870714
10364 2870714 -1933140 -4865324 701588 7782025 5065881 -4229850 -7339122 -1938607
10356 -1938607 2858747 2648567 1111956 -1061615 -7094382 -13931041 -13574935 -6138035
10348f138035N066873k422366m642423m38589L817138M956812L835030P90135
10340D824575k909017l783598j314131L93246o04598j304667j22319N43963J02885
10331d173661J041468K865700K279035L06922J043874L032986J137600l089788
10323D444136l307982l31082m71851k463292L08342M539458O8862r942515r730318
10314a6886242L472928J2756114P696918p47188r68427J370785j718475m229868
10306G46545N10423M472220r93200p779566m621634K363703O90279n453722k484823
10297a2549775P736459J0112351J484892n097527k433125J349751j158515n533134
10289f088623n530728k732555p23262J459216M943988O818901M542356k25430
$$ plain form
10348 -6138035 -1071162 -3493528 -8135951 -8574540 -4757402 199410 4034440 4824575
10340 4824575 1915558 -1868040 -3182171 -2788925 -3393523 -4698190 -4820509 -4276546 -4173661
10331 -4173661 -3132193 -266493 2012542 2319464 3363338 6396324 7533924 4444136
10323 4444136 1136154 805072 333221 -2130071 -1821729 2717729 2786591 -7155924 -16886242
10314 -16886242 -13413314 -657200 7039718 6292530 5324103 6694888 4976413 746545
10306 746545 1256968 5729188 4735988 -3043578 -7665212 -5301509 -4611230 -10064952 -12549775
10297 -12549775 -4813316 5299035 6783927 1686400 -746725 603026 -555489 -6088623
10289 -6088623 -11619351 -14351906 -15075168 -13615952 -8671964 -1853063 2689293 2463863
10281B463863m556140o746071n235326l6623M539760M026156P71205J022371M984367
10272A233562O271514K215092j876984r51514K947443M821695L191424k81181
10264A7571051l921599o184391n627319l100469j654288k403451k668750j09602
10256h098818L243905L434579J87996k211776k26491M120336N330201J356503
10248G136435l552590m321496j326369J415615K348336K563288J415552k307416
10240C371355n188620k201575L772248L429093m526275q859067j900875P545250
10232d558466O386613l296517p931825k878722K718628K152573O20659M231762
10224b555295R038342P776090J314895l757893n153898n527505n244966j618022
$$ plain form
10281 2463863 -2092277 -8838348 -14073674 -14110297 -9570537 -5544381 -4773176 -3750805 1233562
10272 1233562 7505076 9720168 7843184 6891670 9839113 14660808 17852232 17571051
10264 17571051 13649452 7465061 1837742 -1262727 -2917015 -5320466 -7989216 -8098818
10256 -8098818 -4854913 -1420334 -1232338 -3444114 -3670605 449731 5779932 7136435
10248 7136435 3583845 -737651 -2064020 -648405 1699931 4263219 5678771 3371355
10240 3371355 -1817265 -4018840 -246592 3182501 -1343774 -10202841 -12103716 -4558466
10232 -4558466 1828147 -1468370 -9400195 -12278917 -9560289 -7407716 -6787057 -2555295
10224 -2555295 6483047 14259137 15574032 11816139 6662241 1134736 -4110230 -5728252
10216e728252M440571P256978M056289q19367k304261j605987k801238m914692
10208b419959k926468L249089O547255K338856m234349n055465k71993K899253
10200A26219J357562m02837J014032K239477l60680l633212k210552K799280N137106
10191F066395K373684j396420k137523q34116l98941r24752m76741J026451J334482
10182D632519n82211k242223l62993M266253O366762K226119m769391p269536
10174B265299k871554K989368M300647J587504p47268j491962k943622n293837
10166b205425n397008k018824J578232K155025N88021p13099j672518k864533
10158a0550129k287876K081578P407518Q020328K906691k547400l450952p40287
$$ plain form
10216 -5728252 -1287681 5969297 10025586 9206219 6901958 5295971 2494733 -2419959
10208 -2419959 -5346427 -2097338 4449917 6788773 2554424 -2501041 -2773034 126219
10200 126219 1483781 1080944 2094976 4334453 3973773 340561 -1869991 929289 6066395
10191 6066395 8440079 7043659 4906136 4072020 3673079 2748327 2271586 3298037 4632519
10182 4632519 4050308 1808085 1445092 5711345 12078107 14304226 9534835 2265299
10174 2265299 -606255 2383113 6683760 8271264 7523996 6032034 3088412 -2205425
10166 -2205425 -7602433 -9621257 -8043025 -5888000 -5299979 -6013078 -7685596 -10550129
10158 -10550129 -12838005 -10756427 -3348909 4671419 7578110 5030710 1579758 839471
10150H39471J701659J851113k67333l632530n210077j685009M859290P144132
10142E600716K511393j955206L96816M975817K968141m161721o811193k747841
10134G76922Q9634k359657m014429j88841M211381L535469M48264M9218J570534
10125D118495J861073J160469l8762l579774p693309n735025K692118P236537
10117B1822J519439n537654l143233L947169L754554k834942m465527J107986
10109e630386M537588J857848j99748K005065K883969r54988m446570l639333
10101c586555j633198p35146J748675N401361M010018l415008p926413l565962
10093i702228K958158K883751j274421j401713K440106L093221j295781m435557
$$ plain form
10150 839471 2541130 4392243 4124910 492380 -4717697 -6402706 -1543416 5600716
10142 5600716 8112109 6156903 6553719 11529536 14497677 10335956 3524763 776922
10134 776922 866556 -1493101 -5507530 -5696371 -1484990 2050479 2498743 2547961 4118495
10125 4118495 5979568 7140037 7101275 3521501 -4171808 -9906833 -7214715 21822
10117 21822 1541261 -3996393 -7139626 -3192457 562097 -2272845 -6738372 -5630386
10109 -5630386 -1092798 765050 565302 2570367 5454336 4499348 52778 -3586555
10101 -3586555 -5219753 -5954899 -4206224 1195137 5205155 1790147 -6136266 -9702228
10093 -9702228 -6744070 -3860319 -5134740 -6536453 -4096347 -1003126 -2298907 -6734464
10085f734464j646287L836546N911216L277136J99378P48954L468050L039681
10077A2100210k012174n925953l315177K188097K264607m102432r037122o469752
10069a4309696J284195Q164505R989734N210468l715922r161862n128667L960689
10061c706556P862141M187138j84461j490397l159840n798091m040277K399011
10053c931332N037341j68801n559657m310614p66854n11170L98507O324469J0425309
10044F937198M204475o756361r216384j803653L827503R47901m014881k874749
10036h748951L494727Q635830Q676211M376705j046806m460944n263156n096994
10028E66622m057193j63308N282177O534261J607788l274584k645578j96417j839812
$$ plain form
10085 -6734464 -8380751 -4544205 1367011 4644147 4843525 5592479 9060529 12100210
10077 12100210 10088036 4162083 846906 3035003 5299610 1197178 -7839944 -14309696
10069 -14309696 -13025501 -4860996 5128738 10339206 6623284 -2538578 -7667245 -3706556
10061 -3706556 4155585 8342723 8158262 6667865 3508025 -2290066 -6330343 -3931332
10053 -3931332 1106009 937208 -4622449 -8933063 -9699917 -10211087 -9812580 -3488111 6937198
10044 6937198 11141673 4385312 -4831072 -6634725 -2807222 -1859321 -5874202 -8748951
10036 -8748951 -5254224 3381606 12057817 16434522 15387716 10926772 5663616 566622
10028 566622 -3490571 -3653879 1628298 8162559 9770347 6495763 3850185 3653768 1813956
10019A813956n360253m873118j425139k43674o76137J483013M075617J619104
10011c586631k871489n85920P669253J0353845K645968n693248m904793J497168
10003D524153M188751J340254k206826l467134k675642l39467J722268K89792
9995C376149l721597m111954J449866O269744M506203Q12026K311082N612450
9987A6503969J972192o895396r742186l462188J730151j194550n255113k174997
9979h518118L465746K810531j384468J64868N742811M103969n820126j0704017
9971a0138804l261139N755250M451945j832825o76581O209441N874875m321417
9963B060745j1791489p049781M119091J0190796P040056j580546r134947r072799
$$ plain form
10019 1813956 -3546297 -8419415 -9844554 -10088228 -10764365 -9281352 -5205735 -3586631
10011 -3586631 -6458120 -7044040 625213 10979058 13625026 7931778 3026985 4524153
10003 4524153 8712904 10053158 7846332 4379198 1703556 1364089 3086357 3376149
9995 3376149 -345448 -4457402 -3007536 3262208 7768411 8580437 10891519 16503969
9987 16503969 18476161 11580765 1838579 -1623609 106542 -1088008 -6343121 -8518118
9979 -8518118 -5052372 -2241841 -3626309 -3461441 2281370 6385339 565213 -10138804
9971 -10138804 -13399943 -7644693 -3192748 -5025573 -5702154 507287 6382162 2060745
9963 2060745 -9730744 -16780525 -12661434 -2470638 4569418 2988872 -6146075 -15218874
9955a5218874P6205R611643Q334588j856402o799086m36302N808832J061445p441870
9946f859821n749115M579121Q876104J896155n055936j815752O379537P677611
9938I927904q620p599375p034656J59840O268663O147871J317648l429166n385145
9929C64964m962189l205884q39409J039174K141236M047686O856078O448651K07214
9920A2097521o082601m399600K596696L904382k701744o254064n926P256279N118710
9911A1529653k478101n238027l084183l074487n024817k893620K222898L084425
9903d956259l88867o78318L871845O384482L714232N99431n37100l106355o650251
9894a747160m725341K801888O056142J76100n798647k990121L247667L043205
$$ plain form
9955 -15218874 -15142669 -5531026 2803562 947160 -5851926 -6288228 -479396 582049 -6859821
9946 -6859821 -12608936 -8029815 846289 2742444 -2313492 -4129244 2250293 9927904
9938 9927904 9919284 2319909 -4714747 -4554907 1713756 7861627 9179275 5750109 364964
9929 364964 -4597225 -7803109 -8642518 -7603344 -5462108 -1414422 5441656 11890307 12097521
9920 12097521 6014920 1615320 4212016 8116398 5414654 -839410 -845336 6410943 11529653
9911 11529653 9051552 3813525 729342 -2345145 -7369962 -10263582 -8040684 -4956259
9903 -4956259 -5345126 -6023444 -2151599 4232883 7947115 8546546 8009446 4903091 -1747160
9894 -1747160 -6472501 -3670613 2385529 2561629 -3237018 -6227139 -2979472 63733
9886F3733j484720r87447M409531N620032M89255k880892k07955K500014M27481
9877G949032j506571K317573P614792N979041k736821j0740741j2791156j0196289
9869a4111140n794823j157575J547686Q49866l81891J859689N363229L895577
9861g929382j949598l684069J898840O449474K934836k643542j044635M619111
9853a348965M168543k053714l483992K732543O786214K326824l995309m430701
9845G01443j521624q76695j193112P51485K304425M34445r26456K336619N517581
9836G528111K180600l796013l438911K452352M349661l91011l626852l06472L453939
9827H405404P92521m937101n844191j442971J744426O58675n22155J950416M916145
$$ plain form
9886 63733 -1420987 -2408434 2001097 7621129 8110384 5229492 5021537 7521551 7949032
9877 7949032 6442461 8760034 16374826 22353867 19617046 8876305 -3914851 -14111140
9869 -14111140 -19905963 -21063538 -19515852 -18665986 -19047877 -17188188 -11824959 -7929382
9861 -7929382 -9878980 -13563049 -11664209 -5214735 -2279899 -4923441 -5968076 -1348965
9853 -1348965 2819578 765864 -2718128 14415 6800629 9127453 5132144 701443
9845 701443 -820181 -1696876 -2889988 -2138503 165922 600367 -326089 2010530 7528111
9836 7528111 9708711 5912698 2473787 4926139 9275800 8884789 5257937 4951465 8405404
9827 8405404 9197925 4260824 -1583367 -3026338 -1281912 -623237 -1145392 805024 5721169
9818E721169L021720k533242m869699j387673K369377J597902k37112J806173
9810E488615M369981J068551n067561m698495K180095M772473j619965q182145
9802a688451o936966k134259o67239p04610J886702M083873J860564j066308J17599
9793e249095K062434r2951k733922k49758L947434L194588m72948p29515J122229
9784G98496l80140l454911k496368N79649n4680k494418j003392J823620k43481
9775f925625l387552O81366P580396M948954n556001q065704K579670J2144669
9767D000173Q804037j166761o482869o435209n396096l078894J236969L691707
9759d826943K300874P01773L63689k095599n429859k396536O434398R163231N42315
$$ plain form
9818 5721169 8742889 6209647 1339948 -47725 2321652 3919554 3682442 5488615
9810 5488615 9858596 10927147 5859586 1161091 3341186 8113659 6493694 -1688451
9802 -1688451 -8625417 -10759676 -11426915 -12131525 -10244823 -6160950 -4300386 -5366694 -5249095
9793 -5249095 -3186661 -3279612 -6013534 -6263292 -2315858 878730 405782 -323733 798496
9784 798496 418356 -3036555 -5532923 -4953274 -5007954 -7502372 -8505764 -6682144 -6925625
9775 -6925625 -10313177 -9631811 -2051415 2897539 -2658462 -10724166 -8144496 4000173
9767 4000173 12804210 11637449 5154580 -1280629 -6676725 -9755619 -8518650 -4826943
9759 -4826943 -2526069 -1824296 -1460607 -3556206 -8986065 -11382601 -4948203 4215028 4757343
9750D757343p874403n022048K752416L270721j967664k713717J864598L229413
9742a703341j329755n330312m078813K60725M114469N685179L628124j240478
9734E798m296279k417105J251909K454234K194523K854037K376438j287311m075103
9725i38859j417912L345031L589187k06942k162962r52991m36082j673624j891480
9716b746634j046572k266491n144658m990600k27028M596941N001857K058012
9708d765173j1609P74220K570166K501132M61354l53380K078262M621784K689789
9699A0566545k611280n543049m000223j313970N00697K520425K984887j922860
9691A181172q694032p432929K878901R715126M694682l365138k416218M142754
$$ plain form
9750 4757343 -3117060 -8139108 -5386692 -2115971 -4083635 -6797352 -4932754 -1703341
9742 -1703341 -3033096 -8363408 -12442221 -12181496 -8067027 -2381848 1246276 5798
9734 5798 -4290481 -6707586 -5455677 -3001443 -806920 2047117 4423555 3136244 -938859
9725 -938859 -2356771 988260 4577447 4370505 2207543 1254552 818470 -855154 -2746634
9716 -2746634 -3793206 -6059697 -11204355 -16194955 -16421983 -11825042 -6823185 -4765173
9708 -4765173 -4776782 -4002562 -1432396 1068736 1530090 1176710 3254972 7876756 10566545
9699 10566545 7955265 2412216 -1588007 -2901977 -2401280 119145 3104032 1181172
9691 1181172 -7512860 -14945789 -12066888 -2351762 2342920 -1022218 -3438436 704318
9683G04318M533848j670114m243223o4688K996520L61730k667192j079319K304778
9674A176658K760522L46312k208067l306342k361171J32503J716355O93281p30020
9665a779969L85485K754930L066539J351498k5282n99664q84439p1101J090442
9656E288439q66741n405789n406045J935545P503206K689796n903940n571194
9648e736723K564680N915958J077250k306514M10909J512107l813099p866289
9640h241721l281273M735968O967910L401977L50238J50447N65577J52929j241527
9631C560525l671021m970468j938650L209398L346576k760213o563678j836502
9623a1624033N469466N973803M57795k717904m91242K203519J400435q69534j034508
$$ plain form
9683 704318 5238166 3568052 -675171 -739859 2256661 2618391 -48801 -1128120 1176658
9674 1176658 3937180 4283492 2075425 -1230917 -3592088 -3459585 -1743230 -1049949 -1779969
9665 -1779969 -1394484 1360446 4426985 5778483 5753201 5153537 4269098 4197997 5288439
9656 5288439 4421698 -984091 -6390136 -4454591 3048615 5738411 -165529 -5736723
9648 -5736723 -3172043 2743915 3821165 1514651 1925560 3437667 -375432 -8241721
9640 -8241721 -11522994 -6787026 180884 3582861 3933099 4083546 4649123 4802052 3560525
9631 3560525 -110496 -5080964 -7019614 -3810216 -463640 -3223853 -9787531 -11624033
9623 -11624033 -6154567 -180764 277031 -2440873 -2932115 -728596 671839 -197695 -1232203
9614a232203J073840K719323J505801j877728l534802q04376K973984J895971
9606B719810l444006n592308j209094L688637L493094J703316L627956N868698
9598A0856103J535350p088123j0205165m392921L353783O313962N300150L429340
9590I102479P71418k445580l177962m05162J652163n94363m390677n024733k957289
9581g469706j837692j694675L44314L511658L604683M75204n64641K764818N167266
9572D301229J801423l467284l458859J296812L425040j9060l700599k649627J178736
9563a292189L468766L551587K585701J12167l670173n605264l529124J28216K089763
9554b160550K651249K958659J506068k169748l794164O1830N325044N327069M63488
$$ plain form
9614 -1232203 -158363 2560960 4066761 2189033 -1345769 -2150145 823839 2719810
9606 2719810 -724196 -6316504 -7525598 -3836961 -343867 1359449 4987405 10856103
9598 10856103 12391453 5303330 -4901835 -9294756 -5940973 372989 5673139 9102479
9590 9102479 9873897 7428317 4250355 3845193 5497356 4902993 512316 -4512417 -7469706
9581 -7469706 -9307398 -11002073 -10657759 -7146101 -3541418 -3066214 -3630855 -866037 4301229
9572 4301229 6102652 2635368 -823491 473321 3898361 3879301 178702 -2470925 -1292189
9563 -1292189 2176577 5728164 8313865 8426032 4755859 -849405 -4378529 -4250313 -2160550
9554 -2160550 490699 3449358 4955426 2785678 -1008486 -946656 4378388 9705457 10168945
9545A0168945l128386k966443j853101j285651j96594K23598k205972m342571
9537e586175m97233P135350Q901341J455220o409786n912379J81788L211966O24761
9528C104853l164134m307478k790938l34478J125860N62101k67279J413570M263454
9519c94469L429928j715805n289085l308136O39602J923930J867979L356911M390931
9510D901786K056471j100764j271962o26081l201100o235430l755484K358495
9502f874069L571415k134666o398721k525675N295040Q543421N088944n23056
9494D042633l723832l145427Q5812L061276L015048O98106l45371O71156L72574
9485D731975k413161l187332J155544N583441L358988k870270l835675K125786
$$ plain form
9545 10168945 7040559 4074116 2221015 935364 738770 962368 -1243604 -5586175
9537 -5586175 -6083408 1051942 9953283 11408503 4998717 -913662 -731874 2480092 3104853
9528 3104853 -59281 -4366759 -7157697 -7492175 -6366315 -5804214 -6071493 -4657923 -394469
9519 -394469 3035459 1319654 -3969431 -7277567 -6637965 -4714035 -2846056 510855 4901786
9510 4901786 6958257 5857493 4585531 3959450 758350 -5477080 -9232564 -6874069
9502 -6874069 -3302654 -5437320 -11836041 -14361716 -9066676 -523255 4565689 4042633
9494 4042633 318801 -2826626 -2740814 320462 3335510 4033616 3688245 4359401 4731975
9485 4731975 2318814 -868518 287026 5870467 9229455 6359185 2523510 4649296
9477D649296N500150k89988q126527o939015K159349P425596K899717m711981
9469B566597o863641l641296o2561K083051L771010M282484K582661O22602M70372
9460E811279L33868j873038l373489m63338M267928M942274J589511m52738o2343
9451A0719914j665174n917544p084511k792097J055830l81674l207417k006598
9443a1279271J026930Q97424p95116J060817N398559O320833L056739Q42076J491564
9434H020555N85074l842437o537640k948372K962234L907975k58853k552990Q45684
9425A81230N006180L264495l066009o079612k280969K255615N91491m657573m929769
9416i714921J464474O654155M774731p7044j010887J814219L445154K321190P11981
$$ plain form
9477 4649296 10149446 9859458 1732931 -5206084 -3046735 4378861 7278578 2566597
9469 2566597 -4297044 -7938340 -8000901 -5917850 -2146840 2135644 4718305 5340907 5811279
9460 5811279 6145147 4272109 898620 435282 4703210 9645484 11234995 10782257 10719914
9451 10719914 9054740 3137196 -3947315 -6739412 -5683582 -6065256 -9272673 -11279271
9443 -11279271 -10252341 -9354917 -10150033 -9089216 -3690657 2630176 5686915 6528991 8020555
9434 8020555 8605629 4763192 -1774448 -4722820 -1760586 2147389 1888536 -664454 181230
9425 181230 5187410 8451905 5385896 -693716 -2974685 -719070 -127579 -4785152 -9714921
9416 -9714921 -8250447 -1596292 3178439 3101395 2090508 3904727 7349881 9671071 10383052
9407A0383052l53305j178844m86743K187071K970079j677804q005066q781241
9399d942801l503158J411472K463764K382183K902023J463074k558914m925597
9391e307954l181226n79137Q5870R85817L543021L885561m74949m224035j230530
9382f497562N274191O690411J559733l115543k828468q21902j032712k113284
9374b885136j445136l24995j312647l224388k445444J797279O005241O161887
9366B326661J961744k478714k394911K148760N523734L316634j492398k693796
9358F217714k57087k20526m341377o173547j013217N786168O079462P36357k457420
9349D356527p28894R27062j147535m165082m482458k674998p81617Q38576J667974
$$ plain form
9407 10383052 10029747 8850903 8364160 10551231 13521310 11843506 3838440 -4942801
9399 -4942801 -8445959 -7034487 -4570723 -2188540 713483 2176557 -382357 -5307954
9391 -5307954 -8489180 -9068317 -8982447 -7996630 -4453609 -568048 -1042997 -5267032 -6497562
9382 -6497562 -1223371 5467040 7026773 3911230 1082762 260860 -771852 -2885136
9374 -2885136 -4330272 -4655267 -5967914 -9192302 -11637746 -9840467 -3835226 2326661
9366 2326661 4288405 1809691 -585220 1563540 7087274 10403908 8911510 6217714
9358 6217714 5960627 5740101 1398724 -4774823 -5788040 -1872 6077590 6813947 4356527
9349 4356527 3627633 4554695 3407160 -757922 -5240380 -7915378 -8696995 -7858419 -6190445
9340f190445M71039j143820Q01845N876809P723124K885689l519109n290246l640433
9331b025547k817142j785476K509590O790574M846408j764616m777338j413505
9323d37052K431369K475248J554843K358755K354059k43699k242109j550989j260892
9314E439533l058205k916603J127722L264467j013476n792801l180810L552680
9306b577493M924561M50524j769692K21129n50980o040128p639739J31396R374514
9297c475908R414990J582791m022781k686775J138699K234884L85551j981364
9289B590087l073639k240136l23814N43771l82691j049979N3450J017986k78624
9280c143589k096043j426976R82603K055733J535643J525934J808576L32611j807647
$$ plain form
9340 -6190445 -5719406 -6863226 -6061381 -184572 7538552 10424241 6905132 1614886 -2025547
9331 -2025547 -4842689 -6628165 -4118575 2671999 7518407 5753791 976453 -437052
9323 -437052 1994317 4469565 6024408 8383163 10737222 10493523 8251414 6700425 5439533
9314 5439533 2381328 -535275 592447 3856914 2843438 -2949363 -6130173 -2577493
9306 -2577493 2347068 2797592 1027900 1249029 698049 -5342079 -12981818 -12850422 -3475908
9297 -3475908 5939082 7521873 3499092 812317 1951016 4185900 4571451 2590087
9289 2590087 -483552 -2723688 -3047502 -2503731 -2886422 -3936401 -3882951 -2864965 -3143589
9280 -3143589 -5239632 -6666608 -5684005 -3628272 -2092629 -566695 1241881 1574492 -233155
9271b33155r74164K536894L646438J48348l339798k091363J827260L097572P90737
9262E408769j693464k498692k625248k059135P33084M572890M987749K40781m821438
9253B245296m093616J717411N455919K345132m046942o239041j821057M161113
9245b75785N595966J860372k836977m668412l003008N24274L346153L090187J6333
9236C649103j936547N09217M475250L438676l568814r215513o962304M59522N228686
9227c922724M402239J383000o70645j817734k240051j133854P47529J601329K065922
9218D15011L996584N509628K458485l990807p062673m137749r93642k525968m944834
9209a1275965k610646K281307L702176J928483J922527L601425K081826k624394
$$ plain form
9271 -233155 -1207319 1329575 4976013 5124361 1784563 -306800 1520460 4618032 5408769
9262 5408769 3715305 1216613 -1408635 -3467770 -2734686 1838204 6825953 7066734 2245296
9253 2245296 -1848320 -130909 5325010 7670142 3623200 -2615841 -4436898 -275785
9245 -275785 5320181 7180553 4343576 -324836 -3327844 -2803570 542583 3632770 3649103
9236 3649103 1712556 2221773 6697023 10135699 6566885 -2648628 -9610932 -9151410 -3922724
9227 -3922724 479515 1862515 1191870 -625864 -2865915 -3999769 -3252240 -1650911 415011
9218 415011 4411595 9921223 12379708 8388901 1326228 -2811521 -3805163 -6331131 -11275965
9209 -11275965 -13886611 -11605304 -7903128 -5974645 -4052118 -450693 1631133 -993261
9201i93261m597468k115814o66822k918466l367980K223101Q482383P730400J217745
9192D993818l409394l035032j097058l00033L80787J475436J289964n75348k112830
9183b389690k346341k497989k910495k038076M88777K697330L267700L102479
9175b626305K879513J674312o25411k013373j270592j78366q05008k106410j525309
9166f596949Q21036J972282M28942j332679j8299L592912M873370J372439l025708
9157B087346k539338K326694M711825R05521m110906m071233p88972n79071l482337
9148e540471l294908J430131M247564J455482j561207L47515K889500l93879o324213
9139f744486o276912Q1606M411929K911851P44753J581402J873117o43644j418020
$$ plain form
9201 -993261 -5590729 -7706543 -8373365 -11291831 -14659811 -12436710 -3954327 3776073 4993818
9192 4993818 1584424 -1450608 -2547666 -2847699 -2466912 -991476 298488 -276860 -2389690
9183 -2389690 -4736031 -7234020 -10144515 -12182591 -11693814 -8996484 -5728784 -2626305
9175 -2626305 253208 1927520 1302109 -711264 -1981856 -2160222 -2965230 -5071640 -6596949
9166 -6596949 -5775913 -3803631 -3374689 -4707368 -4725667 -1132755 3740615 5113054 2087346
9157 2087346 -451992 1874702 6586527 7492048 3381142 -690091 -1479063 -2058134 -5540471
9148 -5540471 -8835379 -7405248 -3157684 -1702202 -3263409 -2915894 -26394 -420273 -6744486
9139 -6744486 -13021398 -12939792 -8527863 -5616012 -4871259 -3289857 -1416740 -2060384 -3478404
9130c478404J960708K944048l677534j0540064o802634M757160J0628653O012000
9122A803933K65455P15163K002621k668061q683198o985398J493490P316200O064222
9113A324427K320638Q39470J037229J013701Q24716J59583k163243m700493l933899
9104c277871p7005K078840K46339j788988m65254J873225J367558p50366n98695
9095a392217J559645J965683j43613j549661p20568n3258j412290l167432l203824
9086h117535j765936L32356L324481O247331O030375J832527j964276p94172L333693
9077H458844M160115l7762m294139m474147k611961k412649l245135k363949m55228
9068g276011k89534j106792M84764L808483L750352r33690m048098o02175M889436
$$ plain form
9130 -3478404 -1517696 1426352 -2251182 -12791246 -19593880 -14836720 -4208067 1803933
9122 1803933 2069388 2784551 4787172 2119111 -6564087 -13549485 -12055995 -4739795 1324427
9113 1324427 3645065 4484535 5521764 6535465 7360181 7519764 5356521 656028 -3277871
9104 -3277871 -3354876 -1276036 -1029697 -2818685 -3283939 -1410714 -43156 -793522 -1392217
9095 -1392217 167428 2133111 1989498 439837 -280731 -333989 -1746279 -4913711 -8117535
9086 -8117535 -9883471 -9551115 -6226634 20697 6051072 7883599 5919323 5125151 8458844
9077 8458844 12618959 12581197 8287058 3812911 1200950 -1211699 -4456834 -6820783 -7276011
9068 -7276011 -7565545 -8672337 -8187573 -4379090 -628738 -1562428 -5610526 -6212701 -1323265
9059a323265M245283k189821n532157j092679M927525M462053j303151m543046
9051b349258k080459J400151J423619j41834O72619L250171L659266R37207j741235
9042E030247k032779j195266j242794k289919l710205m974431m075050J294945
9034a3195252Q641620J0661742M333075l387597m297523n34099l69683m127018
9026b274735l568272L346370P154937J415136o201799n225882J621194L390525
9018c42526j838528n149191j602104L137363L006643k4019j264552m09029P87794
9009c698149K645322M960461M517090n7669m051245k277970K856521L938571j021600
9000G811332n383678k764033M133707O744942J752581m653719n230808j324037
$$ plain form
9059 -1323265 2922018 732197 -4799960 -5892639 -965114 3496939 2193788 -2349258
9051 -2349258 -4429717 -3029566 -1605947 -1747781 -1075162 2175009 5834275 6771482 5030247
9042 5030247 2997468 1802202 559408 -1730511 -5440716 -10415147 -14490197 -13195252
9034 -13195252 -4553632 6108110 10441185 7053588 2756065 2221966 1852283 -2274735
9026 -2274735 -5843007 -2496637 4658300 6073436 -128363 -5354245 -3733051 -342526
9018 -342526 -2181054 -7330245 -8932349 -5794986 -2788343 -2812362 -4076914 -4485943 -3698149
9009 -3698149 -1052827 3907634 8424724 8367055 4315810 2037840 4894361 8832932 7811332
9000 7811332 2427654 -336379 3797328 10542270 12294851 7641132 2410324 1086287
8992A086287K1986k899104m423681j648698M60910j730297k966511K184906Q339655
8983a574547O319681j873012n523953j742918J447521l43953j599064J379218
8975c511027L324523J63062l286436k430669j048383k866776l248089J929799
8967a0973996O532900L455113k535037k355693J968212J683121k415847j627364
8959f268591L865898L998545l553202q201300l218880M254572N792510L650192
8951C19744L144145K500795j313022m317840k169971R47770o55715l330486k68046
8942e142626N273264M070592l269903o150272p08225M279051J731322l297649
8934c214446l106072Q15334K523507K054094K984831L731958J94446m752367l508391
$$ plain form
8992 1086287 1108273 -1790831 -6214512 -7863210 -7402300 -9132597 -12099108 -9914202 -1574547
8983 -1574547 4745134 2872122 -2651831 -4394749 -2947228 -3291181 -4890245 -3511027
8975 -3511027 -186504 -23442 -3309878 -5740547 -6788930 -9655706 -12903795 -10973996
8967 -10973996 -4441096 -985983 -3521020 -5876713 -3908501 -2225380 -4641227 -6268591
8959 -6268591 -2402693 1595852 -1957350 -10158650 -13377530 -9122958 -3330448 319744
8951 319744 3463889 5964684 4651662 333822 -1836149 -888379 -1544094 -4874580 -5142626
8942 -5142626 130638 4201230 931327 -5218945 -5927170 -1648119 83203 -3214446
8934 -3214446 -6320518 -5505184 -2981677 -927583 2057248 5789206 5983652 1231285 -2277106
8925b277106L939982Q429882M803650r69210j922868m47850k403912o130810n239014
8916b217256K4990K347481j388117n423441l751982J984209N861492M909998N33945
8907B881319l961411n095075j571418L064785L218074j393349m590179k206572
8899i653826K135629L006435J251105J491281L978857M259985M95485l530283
8891C434668l675798n65257J945571J705842L12298M11444J723094J215747j846500
8882D661109l466557p80020J983749q49722o007796m584935L205855O191873p07875
8873c54319p443143m150863L491117M365739P811k7607L944448K851053l657592
8864i73356n594195j71262L072501j143135m986658j429335M361969N208019L648034
$$ plain form
8925 -2277106 1662876 10092758 14896408 13927198 12004330 11556480 9152568 3021758 -2217256
8916 -2217256 -2192266 155215 -1232902 -6656343 -10408325 -8424116 -2562624 2347374 2881319
8907 2881319 -1080092 -6175167 -7746585 -4681800 -1463726 -2857075 -7447254 -9653826
8899 -9653826 -7518197 -4511762 -3260657 -1769376 2209481 6469466 6964951 3434668
8891 3434668 -241130 -806387 1139184 2845026 3157324 3568768 5291862 6507609 4661109
8882 4661109 1194552 414532 2398281 1548559 -4459237 -9044172 -5838317 353556 -354319
8873 -354319 -7797462 -11948325 -8457208 -4091469 -4083658 -4111265 -166817 2684236 -973356
8864 -973356 -6567551 -6738813 -3666312 -4809447 -9796105 -11225440 -6863471 -1655452 1992582
8855A992582M656550M925311n65141p356269p260863j471722J809841M36158k38483
8846c072036K086807L282031N06604l646264n745817m950358j413361L960974
8838h991420P925248P274541K922644j636881m735458n978221l818063J358550
8830e679060M167997N71104m311985j941834O452358J0180014L953653m936240
8822H456007p241418l245232L79143M25842o43137L31944L563561O252642M624396
8813A2903748j975031q421628q359817k163378L232854L247845J54090k373823
8805c755140l970056m589456k284920K357769M379055J468361j346473J057473
8797f683387N717191O269434K783505O24589J424742J731875l8865j543667j567609
$$ plain form
8855 1992582 6649132 11574443 11009302 3653033 -3607830 -5079552 -3269711 -2833553 -3072036
8846 -3072036 -985229 2296802 2803406 -842858 -6588675 -11539033 -12952394 -8991420
8838 -8991420 -1066172 6208369 9131013 7494132 2758674 -3219547 -7037610 -5679060
8830 -5679060 -1511063 -939959 -5251944 -7193778 -741420 9438594 13392247 8456007
8822 8456007 1214589 -2030643 -1651500 -1225658 -1868795 -1536851 2026710 8279352 12903748
8813 12903748 10928717 2507089 -5852728 -8016106 -4783252 -1535407 -1381317 -3755140
8805 -3755140 -7725196 -12314652 -14599572 -12241803 -7862748 -6394387 -7740860 -6683387
8797 -6683387 -966196 5303238 8086743 8711332 10136074 11867949 11829084 10285417 8717808
8788H717808j552687j699521q18170k83815k458951m759947j792405N213646Q051807
8779H617765L282910k620046l736817l307362o259046r494088p148917r73286
8771b1638887K767847L645938N745380Q058183N533928o76403l515970j622231
8763a702215j157959l794779k891880L875431P909011K782194m406450l727222
8755c113869K014691K750599k176189m198250o78796J675563m74217j815447R51208
8746e064707K776118k76762l171755j27659N064195M405271j823751n250385j449519
8737d918954M251120M382048j092775n165367k650263L265561M866838K76278
8729C214486l289891L16521O083888M354872l870799o911941K26299P636975N189887
$$ plain form
8788 8717808 7165121 5465600 4647430 4363615 1904664 -2855283 -4647688 565958 8617765
8779 8617765 11900675 9280629 5543812 2236450 -4022596 -13516684 -20665601 -21638887
8771 -21638887 -18871040 -15225102 -9479722 -1421539 4112389 3435986 -79984 -1702215
8763 -1702215 -2860174 -6654953 -9546833 -5671402 2237609 5019803 613353 -3113869
8755 -3113869 -1099178 1651421 -524768 -4723018 -5401814 -3726251 -4200468 -6015915 -5064707
8746 -5064707 -2288589 -2565351 -5737106 -5864765 -800570 3604701 1780950 -3469435 -4918954
8737 -4918954 -667834 3714214 2621439 -2543928 -5194191 -1928630 2938208 3214486
8729 3214486 -75405 241116 6325004 10679876 6809077 -102864 123435 7760410 12950297
8720A2950297k572134m511376j08838J590031k407154n135406k017807K337475
8712A25088K572062K94881n43047k16723q00355j325871K15231K565479K731093
8703E617838N47473j086763m2314K478958K950370q89548o525120p926806k632636
8694g508548L915241M783495R90859n56455J991646L106485k75137l634777k853568
8685d0759q23117j382246k294407r6143K623439J359047k278050l425903k228960
8676h587099k133245k004755K040847P601884P251029Q9805n745912m581000k03032
8667f271478J732240J622998K074154K068899K00867r02834J061514K806492J01114
8658D493966m931382o597878l828335l99082J574863L178668M525156M002779
$$ plain form
8720 12950297 10378163 5866787 5757949 7347980 4940826 -194580 -2212387 125088
8712 125088 2697150 2992031 2448984 2232261 1431906 106035 321266 2886745 5617838
8703 5617838 6165311 5078548 5036234 7515192 10465562 9576014 3050894 -4875912 -7508548
8694 -7508548 -3593307 1190188 2181047 1624592 3616238 6722723 6447586 2812809 -40759
8685 -40759 -863876 -2246122 -4540529 -4636672 -2013233 -654186 -2932236 -6358139 -8587099
8676 -8587099 -10720344 -12725099 -10684252 -3082368 4168661 4258466 -1487446 -6068446 -6271478
8667 -6271478 -4539238 -2916240 -842086 1226813 1427680 524846 1586360 4392852 4493966
8658 4493966 -437416 -7035294 -10863629 -11262711 -9687848 -6509180 -1984024 2018755
8650B018755J650606p06208k334087l089324j374819L052605N719520K324589
8642G261637l815112n208878r27032K620546K140645J361209K627442K357421
8634H417878j392966m099105k641009j401227m097100n532121K73447Q135221
8626b336982P616067r44426o280754k729342K538976J711701k546975l138485
8618f110220N11944L588300M154650M199963M187130K144229j777198m317877
8610F580921l878367k997796m080648m837048j091538N998435R032423L368073
8602H094455n080312n797280K302430Q400315M194755m708696p303011k671045
8594b568389Q34897l48329j090765J528038K761330p43121m299060k758573J479983
$$ plain form
8650 2018755 3669361 2963153 629066 -2460258 -3835077 -782472 4937048 7261637
8642 7261637 3446525 -1762353 -2689385 -68839 2071806 3433015 6060457 8417878
8634 8417878 7024912 2925807 284798 -1116429 -5213529 -10745650 -10472203 -2336982
8626 -2336982 5279085 4334659 -1946095 -4675437 -2136461 -424760 -2971735 -6110220
8618 -6110220 -5598276 -2009976 2144674 6344637 10531767 12675996 10898798 6580921
8610 6580921 2702554 -295242 -4375890 -9212938 -10304476 -4306041 4726382 8094455
8602 8094455 3014143 -2783137 -480707 7919608 12114363 7405667 102656 -2568389
8594 -2568389 -1733492 -2081821 -3172586 -1644548 1116782 373661 -3925399 -6683972 -5203989
8585e203989L570079L884618M551693L348431j795019o173686m198053P93298
8577a222628J118291k479351k023313L666428O250912J844724k049657J067528
8569F172934N710672L431175l257452n084556q38362J676306j000447l119655
8561C690615n76024J744093j521996o524607n755241J36634L338231Q63782j425029
8552f029542J649687O852448P611234K780753l368008p017814o888002k911096
8544g320340K743470M935157P30622n288981n837756j011412J851066p01707l245315
8535a3145196l49347N088525O744620L982803J051469m7158q06579j971872k627185
8526b079920k516791j584930J261528N243400N857007O50416n367112n795357
$$ plain form
8585 -5203989 -1633910 2250708 6802401 10150832 8355813 2182127 -2015926 -1222628
8577 -1222628 -104337 -2583688 -4607001 -940573 5310339 7155063 5105406 6172934
8569 6172934 11883606 15314781 12057329 6972773 6134411 7810717 6810270 3690615
8561 3690615 3114591 4858684 3336688 -3187919 -8943160 -8806526 -5468295 -4604513 -6029542
8552 -6029542 -4379855 2472593 10083827 12864580 9496572 2478758 -4409244 -7320340
8544 -7320340 -4576870 358287 1088909 -4200072 -10037828 -11049240 -9198174 -9899881 -13145196
8535 -13145196 -13494543 -8406018 -1661398 2321405 3372874 3325716 2519137 547265 -2079920
8526 -2079920 -4596711 -6181641 -4920113 323287 6180294 6830710 1463598 -4331759
8518d331759k394404j640475l037140L17243Q459837J1463764L863152o070403
8510F629815p751210k588376M77559r59208j545957J191001L222476J434724j712779
8501a601955k406708j14143K911791L734336O59210l978808m409007J338788O728148
8492B861652M453696k713734n321770q47706L623085L144496J067214O41407j172577
8483E735763o229257q731005l479133M424812N967743J124890k432216j511136
8475e129539j89709r22926r21790J209637K250880L12501j606040p43526J349060
8466d391452K369467K707620K970659K111274L54117m2842P65827n80885m332880
8457A930905n385564j021251L854984L846224J080278N98424J572618k74090m081817
$$ plain form
8518 -4331759 -6726163 -8366638 -11403778 -11086535 -2626698 8837066 12700218 6629815
8510 6629815 -1121395 -3709771 -3232212 -4191420 -5737377 -4546376 -1323900 110824 -1601955
8501 -1601955 -4008663 -4122806 -1211015 2523321 3182531 -796277 -5205284 -3866496 2861652
8492 2861652 7315348 4601614 -720156 -1567862 2055223 5199719 6266933 6908340 5735763
8483 5735763 -493494 -9224499 -12703632 -8278820 -2311077 -1186187 -3618403 -5129539
8475 -5129539 -5319248 -6242174 -7163964 -5954327 -3703447 -3390946 -4996986 -5740512 -4391452
8466 -4391452 -2021985 685635 3656294 5767568 6121685 6078843 6844670 6263785 1930905
8457 1930905 -3454659 -4475910 -620926 3225298 4305576 4904000 6476618 6202528 2120711
8448B120711m781077j460412J797884K837454K850244J521041k286670n045193
8440b446018j470291N843298P513358O29702o557973o651794k524130k97883J991
8431e959740J019952J590009L95000P10027M221751N100962j323063q150788n125478
8422g521368N012410R042812K114597o302529p051037k080507K484966M831640
8414E30984M574610o0315o403616o246745K507997R493609N079223n127340p787588
8405c439181n13931O326421N246538j93772l753729m558151l888908q56605M298232
8396a333086P087367L684791l049398o107793k463525L472746M814498p2386n529228
8387E03986n329595p69546J189156j601962l104138O26721L768060j90853o584600
$$ plain form
8448 2120711 -2660366 -4120778 -2322894 514560 3364804 4885845 2599175 -2446018
8440 -2446018 -3916309 1926989 9440347 10070049 3512076 -3139718 -5663848 -5961731 -5959740
8431 -5959740 -4939788 -3349779 -2954779 -2244752 1976999 7077961 5754898 -2395890 -7521368
8422 -7521368 -2508958 6533854 8648451 2345922 -4705115 -6785622 -4300656 530984
8414 530984 5105594 5045279 -1358337 -7605082 -5097085 4396524 9475747 4348407 -3439181
8405 -3439181 -3953112 2373309 7619847 7426075 3672346 -885805 -4774713 -5631318 -1333086
8396 -1333086 5754281 9439072 6389674 281881 -2181644 1291102 6105600 6033214 503986
8387 503986 -4825609 -5595155 -4405999 -6007961 -9112099 -8485378 -4717318 -4908171 -11492771
8378a1492771n794139J475397N545540L592829K660256N392925M965536j427895
8370D917678n786821k749439Q38171j833177n540896l244653P56664k78811j507917
8361a4429201M543993J1266896O658112m561784n619722M954857R209044k048518
8353I973677j4318950j1704957L80167O541798M422777L070988N271226M956039
8345H592765k98949n200744n133711j207775K924122M278518J815031j840041
8337C929216k421445l57817n08051k984677j407093N194699P450971M5519p556182
8328A385140m875781K531141K101394n264743p681670k097938K841929K928175
8320h132353L002845M389362J834396m056054m763185J318890M551134L8375m019867
$$ plain form
8378 -11492771 -17286910 -15811513 -10265973 -6673144 -4012888 1380037 6345573 4917678
8370 4917678 -869143 -3618582 -2780411 -4613588 -10154484 -13399137 -12642473 -12921284 -14429201
8361 -14429201 -9885208 1381688 8039800 3478016 -2141706 2813151 12022195 9973677
8353 9973677 -4345273 -16050230 -15670063 -9128265 -4705488 -1634500 3636726 8592765
8345 8592765 8293816 3093072 -2040639 -3248414 -324292 3954226 5769257 3929216
8337 3929216 1507771 1149954 641903 -2342774 -3749867 1444832 8895803 8941322 1385140
8328 1385140 -3490641 -959500 1141894 -4122849 -11804519 -13902457 -11060528 -8132353
8320 -8132353 -5129508 -740146 1094250 -2961804 -7724989 -6406099 -1854965 -1816590 -5836457
8311e836457o93926M270448L602111Q74892K170745L964341J3661n972495n418771
8302c025451J303466N874536M227930m91479m655019o356061l591592K531046
8294d182624N614078K077549j985952K31315M474782K196459m199225m518942
8286b92560J880199M655897J68755k347516K589864N996234q26674j0083780p771232
8277f030813M544056J0649656K444107r177130r973055o58679O646089N305655
8269C749886J42494k031375p88846O55807J191034J499813J404177R36003J561254
8260H320247L069513J938320l147740o884491l879535K467891M228815Q98723
8252G011743q03026Q17845k16306n345754o530842P28481Q134069O354535p83540
$$ plain form
8311 -5836457 -6530383 -2259935 1342176 2217068 4387813 8352154 8365815 2393320 -3025451
8302 -3025451 -1721985 4152551 8380481 7889002 3233983 -3122078 -6713670 -4182624
8294 -4182624 1431454 3509003 1523051 1754366 6229148 8425607 4226382 -292560
8286 -292560 1587639 6243536 6412291 4064775 6654639 12650873 11824199 1740419 -6030813
8277 -6030813 -1486757 9162899 11607006 2429876 -7543179 -8201858 -1555769 3749886
8269 3749886 3892380 1861005 1072159 1727966 2919000 4418813 5822990 6758993 8320247
8260 8320247 11389760 13328080 10180340 3295849 -583686 1884205 6113020 7011743
8252 7011743 6208717 7026562 6810256 1464502 -5066340 -4337859 3796210 10150745 9367205
8243I367205l136100j14335P29057k028027j975680K774633N955039L771266K57837
8234A5600895q76900j945804n123527p292074n410683j766906L30860J531364
8226d952775L030896K669819p44262l069506m86218L215384J511732l853053m070192
8217f748175L048319P755597J582494r250377j1113413j960610N640626K671860
8209h373679l676962j868191O048347Q236595J932158k954308k69039L538008
8201B612929J579842k221418j094050L024506M090778K358941J613154N27112
8193A2491794m145354q917809p392101j031766K614087J401354q2312J87973k31609
8184e105743j072416P99445L710288K266151k490644k972106K524103O034785
$$ plain form
8243 9367205 6231105 6116770 6845827 4817800 2842120 5616753 11571792 15343058 15600895
8234 15600895 14723995 12778191 7654664 362590 -5048093 -6814999 -6484139 -4952775
8226 -4952775 -1921879 747940 3678 -3065828 -3552046 -336662 1175070 -2677983 -6748175
8217 -6748175 -3699856 4055741 5638235 -3612142 -14725555 -16686165 -11045539 -8373679
8209 -8373679 -12050641 -13918832 -7870485 366110 2298268 -656040 -925079 2612929
8201 2612929 4192771 1971353 877303 3901809 7992587 10351528 11964682 12491794
8193 12491794 8346440 -571369 -7963470 -8995236 -6381149 -4979795 -5062107 -4874134 -5105743
8184 -5105743 -6178159 -5378714 -1668426 597725 -1892919 -4865025 -2340922 3693863
8176C693863K103528m265794o041111l408846j15302K842556N015004L926635
8168C750533j39462j869761J543930N129812L234225k295987n737393n335749
8160a719852k897144N44040L705207L261215j634004n757853l851344J834327
8152f515408M655493K403598j417419l602556m075558l363543j171195K045358
8144a1041230M301899L509645m24149m293555l657667J372523M337799Q12794
8136e081941l682030j199253M825360L511280m797192o428828L900262J2226332
8128C273990N859092o401483p827020N81858L759469k250515n682385j56203N438785
8119c404412K714442l508528m813961j614945R75773K006298K620070J306399
$$ plain form
8176 3693863 5797391 1531597 -4509514 -7918360 -8033662 -5191106 -176102 3750533
8168 3750533 3611071 1741310 3285240 8415052 11649277 9353290 3615897 -1719852
8160 -1719852 -4616996 -4072956 -367749 2893466 1259462 -4498391 -8349735 -6515408
8152 -6515408 -1859915 543683 -873736 -4476292 -8551850 -11915393 -13086588 -11041230
8144 -11041230 -6739331 -3229686 -3653835 -7947390 -11605057 -10232534 -5894735 -5081941
8136 -5081941 -8763971 -9963224 -5137864 -1626584 -6423776 -12852604 -8952342 3273990
8128 3273990 9133082 2731599 -5095421 -4513563 -754094 -3004609 -8686994 -8843197 -3404412
8119 -3404412 -689970 -4198498 -9012459 -10627404 -9651631 -7645333 -5025263 -3718864
8111c718864k166140l033179J816719P366218O782375J168378k883703l092578
8103B239226k776661l537686k662283J416848N530029N432393Q91199l969807
8095B563258m547111j53899M738145M626466p18989n527677m916909p73558J302502
8086c407772m40370k106358K35372N358314Q092753M948580j883438o299306m616060
8077a18285J48558J785296j297276m083373j883019L084357M440735j26779n908023
8068c957809o562695r33281N862869P510699K776172l106577m056961j33777K802243
8059B00883Q69576k976539l632760p81647K012520L256078M346855N061280K992575
8050A1348821j504651m193352k813454k47648O32150J307328L250085L200308
$$ plain form
8111 -3718864 -5885004 -8918183 -7101464 264754 7047129 8215507 5331804 2239226
8103 2239226 -537435 -4075121 -6737404 -5320556 209473 5641866 6533065 2563258
8095 2563258 -1983853 -2137752 2600393 7226859 6507870 980193 -3936716 -4710274 -3407772
8086 -3407772 -3848142 -5954500 -5719128 -360814 7731939 12680519 10797081 4497775 -118285
8077 -118285 30273 1815569 518293 -3565080 -5448099 -2363742 2076993 1950214 -3957809
8068 -3957809 -10520504 -11453785 -5590916 1919783 4695955 1589378 -2467583 -2601360 200883
8059 200883 1070459 -1906080 -5538840 -6320487 -4307967 -1051889 3294966 8356246 11348821
8050 11348821 9844170 5650818 2837364 2589716 3221866 4529194 7779279 10979587
8042A0979587j788683p357952o622252q74340J842538o61692j638119K444672
8034c676241N027876L48739n862143m552882K430057N310816J300237k623397
8026b296938j633492R97979J352452M59374Q068p17900j053495J361480M528117
8017C005645K805040l026289m240134K372114P570019L293152m210003m298651
8009C270893R43433J145810m073291m376924L329901R025030N477647j096001
8001A3646498k333978m04379j619243m565491l678264o2343N86634j512149q81855
7992h24570K671524L001539j686879n225984l307404L16265J264132J414736L053365
7983F76724K237762m444074j0564323o505969N489714J2070154O369004l281191
$$ plain form
8042 10979587 9190904 1832952 -4789300 -5663640 -3821102 -4482794 -6120913 -3676241
8034 -3676241 1351635 1700374 -4161769 -8714651 -6284594 -973778 326459 -2296938
8026 -2296938 -3930430 -2932451 -1579999 -1120625 -1112557 -1830457 -2883952 -1522472 3005645
8017 3005645 5810685 2784396 -1455738 916376 8486395 11779547 7569544 3270893
8009 3270893 4214326 5360136 1286845 -3090079 239822 9264852 14742499 13646498
8001 13646498 11312520 10908141 9288898 4723407 1045143 982800 1569434 57285 -824570
7992 -824570 1846954 4848493 3161614 -2064370 -5371774 -5055509 -3791377 -2376641 676724
7983 676724 2914486 -1529588 -12093911 -18599880 -13110166 -1040012 5328992 2047801
7975B047801n872478j755572J404405J101492J211641L563508N331839M353910
7967A1386546J661013j205412l163922k592413L70163J650674j745997n754888
7959F05764m202895R63078J631822l437792n532391P59944Q504435Q168193J166491
7950H626649k915282Q6781M403549L063007l507987q630330o999965n02702L513059
7941b863221N53694n406531p138770l622323J74944J953563L944546N747727L504440
7932c151931j227541p15305N914136P972857q28709j0072601o746926M617036
7924d238984Q447482J325458m921615l039629N16329m93926j603097K450728P048795
7915E491541N066559j518213n355159m813368l883440l737842j718669K050165
$$ plain form
7975 2047801 -3824677 -5580249 -4175844 -3074352 -1862711 1700797 7032636 11386546
7967 11386546 13047559 11842147 8678225 6085812 6455975 8106649 6360652 605764
7959 605764 -3597131 -2634053 -1002231 -4440023 -9972414 -9212470 -708035 7460158 8626649
7950 8626649 5711367 5798148 10201697 13264704 9756717 1126387 -5873578 -6376280 -2863221
7941 -2863221 -2309527 -7716058 -14854828 -18477151 -18302207 -16348644 -12404098 -6656371 -3151931
7932 -3151931 -4379472 -5094777 819359 8792216 7963507 -2109094 -8856020 -4238984
7924 -4238984 4208498 5533956 612341 -2427288 -1910959 -2404885 -4007982 -1557254 5491541
7915 5491541 10558100 9039887 3684728 -1128640 -5012080 -8749922 -10468591 -8418426
$$ [...]
##END NTUPLES=NMR SPECTRUM
##END=
