##TITLE=31Pdec_SR50_rmt
 , 24 sc
 30.03.2021
##JCAMPDX= 6.0         $$ Bruker NMR JCAMP-DX V2.0
##DATA TYPE= NMR SPECTRUM
##DATA CLASS= NTUPLES
##ORIGIN= UXNMR, Bruker Analytische Messtechnik GmbH
##OWNER= root
$$ XWIN-NMR		Version 3.5
$$ Tue Mar 30 11:45:08 2021 Russian Standard Time (UT+4h)  she@DPX200
##.OBSERVE FREQUENCY= 81.013821
##.OBSERVE NUCLEUS= ^31P
##.ACQUISITION MODE= SIMULTANEOUS
##.ACQUISITION SCHEME= undefined
##.AVERAGES= 24
##.DIGITISER RES= 16
##SPECTROMETER/DATA SYSTEM= spect
##.PULSE SEQUENCE= zgpg30
##.SOLVENT NAME= CDCl3
##.SHIFT REFERENCE= (INTERNAL, CDCl3, 0, 248.564)
##AUDIT TRAIL= $$ (NUMBER, WHEN, WHO, WHERE, WHAT)
$$ ##TITLE= Audit trail, XWIN-NMR		Version 3.5
$$ ##JCAMPDX= 5.01
$$ ##ORIGIN= Bruker BioSpin GmbH
$$ ##OWNER= she
$$ F:/spectra/data/she/nmr/P31/1/pdata/1/auditp.txt
$$ ##AUDIT TRAIL=  $$ (NUMBER, WHEN, WHO, WHERE, WHAT)
(   1,<2021-03-30 11:43:48.89 +0400>,<she>,<DPX200>,
      <created by zg, POWCHK disabled, PULCHK disabled
       configuration hash MD5:
       00 E9 B6 7A A2 85 ED C7 34 08 36 98 17 FE 4E 26
       data hash MD5: 32K
       02 A3 95 C6 DE D1 6C 67 BD B9 D2 DB F2 F1 CE 53>)
(   2,<2021-03-30 11:43:51.15 +0400>,<she>,<DPX200>,
      <Start of raw data processing
       efp BC_mod = 2 LB = 1 FT_mod = 6 PKNL = 1 PHC0 = -4412.293 PHC1 = 106.601 SI = 64K 
       data hash MD5: 64K
       C7 7D E0 91 48 23 53 61 80 6B 9A 71 17 75 CA 89>)
(   3,<2021-03-30 11:44:29.25 +0400>,<she>,<DPX200>,
      <pk PHC0 = 5.934443 PHC1 = -16.4 
       data hash MD5: 64K
       3C 4F A1 6E B7 C8 AD 03 F2 DD 4C 66 6D 8B F9 39>)
(   4,<2021-03-30 11:44:32.07 +0400>,<she>,<DPX200>,
      <abs ABSG = 5 
       data hash MD5: 64K
       AD 48 E7 75 AA CC B8 0D A5 18 5D D0 35 F6 B1 09>)
$$ ##END=
$$ 
$$ hash MD5
$$ 53 6A B9 07 FC B8 F4 04 4B AB D2 C6 FC AD AB 0B
##$RELAX= 
##$RELAX= 
##$RELAX= 
##$RELAX= 
##$RELAX= 
##$RELAX= 
##$RELAX= 
##$RELAX= 
$$ Bruker specific parameters
$$ --------------------------
##$DU= <F:/spectra>
##$EXPNO= 1
##$NAME= <P31>
##$PROCNO= 1
##$TYPE= <nmr>
##$USER= <she>
##$AMP= (0..31)
100 100 100 100 100 100 100 100 100 100 100 100 100 100 100 100 100 100 
100 100 100 100 100 100 100 100 100 100 100 100 100 100 
##$AQSEQ= 0
##$AQ_mod= 1
##$AUNM= <au_zg>
##$AUTOPOS= <>
##$BF1= 81.014009
##$BF2= 200.13
##$BF3= 200.13
##$BF4= 200.13
##$BF5= 200.13
##$BF6= 200.13
##$BF7= 200.13
##$BF8= 200.13
##$BYTORDA= 1
##$CFDGTYP= 0
##$CFRGTYP= 5
##$CHEMSTR= <none>
##$CNST= (0..31)
1 1 145 1 1 1 1 1 1 1 1 1 1 1 1 1 1 1 1 1 1 1 1 1 1 1 1 1 1 1 1 1 
##$CPDPRG= <waltz16>
##$CPDPRG1= <>
##$CPDPRG2= <waltz16>
##$CPDPRG3= <>
##$CPDPRG4= <mlev>
##$CPDPRG5= <mlev>
##$CPDPRG6= <mlev>
##$CPDPRG7= <mlev>
##$CPDPRG8= <mlev>
##$CPDPRGB= <>
##$CPDPRGT= <>
##$D= (0..31)
0 1 0 0 0 0 0 0 0 0 0 0.03 2e-05 3e-06 0 0 0 0 0 0 0 0 0 0 0 0 0 0 0 0 
0 0 
##$DATE= 1617090228
##$DBL= (0..7)
120 120 120 11 120 120 24 19 
##$DBP= (0..7)
150 150 150 150 150 150 150 150 
##$DBP07= 0
##$DBPNAM0= <>
##$DBPNAM1= <>
##$DBPNAM2= <>
$$ [...]
##$SUBNAM3= <"">
##$SUBNAM4= <"">
##$SUBNAM5= <"">
##$SUBNAM6= <"">
##$SUBNAM7= <"">
##$SUBNAM8= <"">
##$SUBNAM9= <"">
##$SW= 501.771253377433
##$SWIBOX= (0..15)
0 1 3 0 0 0 0 0 0 0 0 0 0 0 0 0 
##$SW_h= 40650.406504065
##$TD= 32768
##$TD0= 1
##$TE= 0
##$TE2= 300
##$TE3= 300
##$TEG= 300
##$TL= (0..7)
0 120 53 12 22 120 120 120 
##$TP= (0..7)
150 150 150 150 150 150 150 150 
##$TP07= 0
##$TPNAME0= <>
##$TPNAME1= <>
##$TPNAME2= <>
##$TPNAME3= <>
##$TPNAME4= <>
##$TPNAME5= <>
##$TPNAME6= <>
##$TPNAME7= <>
##$TPOAL= (0..7)
0.5 0.5 0.5 0.5 0.5 0.5 0.5 0.5 
##$TPOFFS= (0..7)
0 0 0 0 0 0 0 0 
##$TUNHIN= 0
##$TUNHOUT= 0
##$TUNXOUT= 0
##$USERA1= <user>
##$USERA2= <user>
##$USERA3= <user>
##$USERA4= <user>
##$USERA5= <user>
##$V9= 5
##$VALIST= <valist>
##$VCLIST= <CCCCCCCCCCCCCCC>
##$VD= 0
##$VDLIST= <DDDDDDDDDDDDDDD>
##$VPLIST= <PPPPPPPPPPPPPPP>
##$VTLIST= <TTTTTTTTTTTTTTT>
##$WBST= 1024
##$WBSW= 4
##$XGAIN= (0..3)
0 0 0 0 
##$XL= 0
##$YL= 0
##$YMAX_a= 32897
##$YMIN_a= -42014
##$ZGOPTNS= <>
##$ZL1= 120
##$ZL2= 120
##$ZL3= 120
##$ZL4= 120
##$ABSF1= 248.5645
##$ABSF2= -253.2056
##$ABSG= 5
##$ABSL= 3
##$ALPHA= 0
##$AQORDER= 0
##$ASSFAC= 0
##$ASSFACI= 0
##$ASSFACX= 0
##$ASSWID= 0
##$AUNMP= <proc_1d>
##$AZFE= 0.1
##$AZFW= 0.5
##$BCFW= 0
##$BC_mod= 2
##$BYTORDP= 0
##$COROFFS= 0
##$CY= -3
##$DATMOD= 1
##$DC= 0
##$DFILT= <>
##$DTYPP= 0
##$F1P= 0
##$F2P= 0
##$FCOR= 1
##$FTSIZE= 65536
##$FT_mod= 6
##$GAMMA= 0
##$GB= 0
##$INTBC= 1
##$INTSCL= 5.30512e-09
##$ISEN= 30
##$LB= 1
##$LEV0= 0
##$LPBIN= 0
##$MAXI= 10000
##$MC2= 0
##$MEAN= 0
##$ME_mod= 0
##$MI= 50
##$NCOEF= 0
##$NC_proc= -3
##$NLEV= 6
##$NOISF1= 182.463
##$NOISF2= 159.3651
##$NSP= 0
##$NTH_PI= 0
##$NZP= 0
##$OFFSET= 248.5645
##$PC= 4
##$PHC0= -4406.358
##$PHC1= 90.201
##$PH_mod= 1
##$PKNL= yes
##$PPARMOD= 0
##$PSCAL= 0
##$PSIGN= 0
##$REVERSE= no
##$SF= 81.014009
##$SI= 65536
##$SIGF1= 159.3651
##$SIGF2= -187.1042
##$SINO= 113.3802
##$SIOLD= 16384
##$SREGLST= <1H.CDCl3>
##$SSB= 0
##$STSI= 65536
##$STSR= 0
##$SW_p= 40650.406504065
##$SYMM= 0
##$S_DEV= 0
##$TDeff= 32768
##$TDoff= 0
##$TI= <>
##$TILT= no
##$TM1= 0
##$TM2= 0
##$TOPLEV= 0
##$USERP1= <user>
##$USERP2= <user>
##$USERP3= <user>
##$USERP4= <user>
##$USERP5= <user>
##$WDW= 1
##$XDIM= 65536
##$YMAX_p= 355337310
##$YMIN_p= -25808950
$$ End of Bruker specific parameters
$$ ---------------------------------
##NTUPLES= NMR SPECTRUM
##VAR_NAME=  FREQUENCY,     SPECTRUM/REAL,   SPECTRUM/IMAG
##SYMBOL=    X,             R,               I
##VAR_TYPE=  INDEPENDENT,   DEPENDENT,       DEPENDENT
##VAR_FORM=  AFFN,          ASDF,            ASDF
##VAR_DIM=   65536,         65536,           65536
##UNITS=     HZ,            ARBITRARY UNITS, ARBITRARY UNITS
##FACTOR=    0.620285442955139, 1,           1
##FIRST=     20137.2065510759, 0,            0
##LAST=      -20513.1999529892, 0,           0
##MIN=       -20513.1999529892, -25808950,   0
##MAX=       20137.2065510759, 355337310,    0
$$ Real data points
##PAGE= N=1
##DATA TABLE= (X++(R..R)), XYDATA
$$ [...]
41417 155332 119907 50085 53931 68578 31761 -3305 31609 141142 282442 358475 264572
41406 264572 54355 -49910 47118 137001 111 -255500 -356639 -254286 -118648 -32108
41396 -32108 62351 150270 128320 -2069 -125013 -191368 -230918 -207219 -59586 114093 121786
41385 121786 -43681 -170894 -124128 -13200 -2500 -77699 -86614 61875 310610 534200
41375 534200 658922 693269 648330 478356 168045 -158747 -338814 -371552 -378736 -366284 -221849
41364 -221849 15444 118178 41 -149234 -184918 -220934 -357108 -445948 -352013 -206330
41354 -206330 -148457 -56805 153672 204943 -169279 -698934 -898720 -826646 -1005940 -1558979
41344 -1558979 -1945197 -1741623 -1230524 -924631 -857050 -701951 -389150 -212385 -360715 -638627
41334 -638627 -721535 -524774 -239489 -77044 -47255 7135 185588 390919 442333 276588
41324 276588 -11052 -267274 -357520 -218303 64279 280765 300380 192148 63360 -112731
41314 -112731 -367699 -548070 -461670 -166271 86811 176011 192388 223766 254665 277595 305003
41303 305003 258482 45215 -227547 -314418 -160625 17337 46572 15769 85600 231558
41293 231558 289341 158124 -133160 -484900 -773134 -892272 -818560 -619155 -395001 -239645
41283 -239645 -208927 -253449 -214638 15662 343356 556337 534877 309852 -26090 -354392
41273 -354392 -525862 -458088 -246491 -93849 -126483 -311608 -498743 -509000 -288293 -26099
41263 -26099 15350 -139658 -176572 39135 213572 47373 -303498 -462547 -368490 -265085
41253 -265085 -258025 -213055 -73653 13939 -73497 -287294 -483458 -504851 -273419 36599 63820
41242 63820 -288576 -636988 -609526 -358166 -265439 -351895 -370569 -299124 -273178 -191373 76555
41231 76555 199761 -284345 -1161979 -1685327 -1579922 -1286730 -1111021 -827668 -349110 -74039
41221 -74039 -196932 -295186 -53986 151874 -89019 -478013 -491145 -225490 -153287 -314787
41211 -314787 -366458 -237991 -139566 -31935 315681 759426 827945 410069 -70681 -279190
41201 -279190 -361452 -563424 -794557 -779799 -451087 -22841 223715 157713 -114748 -347077
41191 -347077 -388243 -298255 -191096 -68678 96758 232170 243735 141020 -14837 -182272
41181 -182272 -289793 -268636 -204083 -251250 -321180 -128210 306347 523164 246460 -165421
41171 -165421 -219481 11359 68831 -187993 -465368 -526748 -425976 -286948 -172829 -150538
41161 -150538 -211158 -173412 71977 292665 169179 -239521 -560323 -584545 -421164 -234131
41151 -234131 -93870 -36419 -19489 111899 376590 485869 197303 -276253 -513814 -426808
41141 -426808 -235405 -47934 149353 201438 -61580 -415368 -436083 -122239 100074 20029
41131 20029 -139439 -194992 -248146 -353767 -371233 -293216 -338178 -562245 -736454 -751111 -779309
41120 -779309 -891601 -887367 -691113 -545352 -595058 -627139 -453681 -228816 -145471 -126209 -56595
41109 -56595 -17707 -32054 108602 471711 735128 629981 370418 308493 400526 370648 194964
41098 194964 51053 -41760 -157228 -186988 -16229 149022 37282 -191153 -137614 163935
41088 163935 223924 -167935 -599341 -611516 -296043 -76127 -101989 -123335 102634 467731
41078 467731 616492 347380 -119164 -338796 -153747 106118 63220 -175972 -152278 312872
41068 312872 864462 1058386 854735 551701 368914 238136 -38486 -513594 -981684 -1140670
41058 -1140670 -903068 -519159 -315738 -339796 -363757 -221292 6549 165689 240718 306472
41048 306472 370085 370760 293826 193700 115257 62937 51188 119868 260872 366526 317976
41037 317976 138419 -4687 1293 70532 56287 -24091 -42849 -22227 -144237 -433831 -636257
41026 -636257 -566827 -414366 -464569 -627506 -540932 -151869 121961 -40475 -385462 -427194
41016 -427194 -134627 31297 -222901 -622802 -739311 -585263 -533055 -715822 -821840 -573524
41006 -573524 -155657 35811 -81184 -243721 -268694 -243929 -271683 -276556 -189371 -132933 -249721
40995 -249721 -441251 -446983 -162807 228686 439081 317791 -59051 -468662 -707746 -719478
40985 -719478 -570098 -330524 -44572 195807 254547 93263 -149922 -278903 -212837 -35714
40975 -35714 76890 -9698 -251598 -425953 -356486 -125225 49153 111105 179186 265854 211967
40964 211967 -21882 -205088 -111155 200160 482550 549573 340493 -84052 -500210 -650931
40954 -650931 -540748 -424424 -400670 -265547 76020 356622 362224 304482 425389 502533
40944 502533 213769 -197322 -180673 249939 486354 239082 -82208 -85190 35441 -57512
40934 -57512 -269829 -313888 -188893 -52598 119138 375193 519758 380699 161479 143803
40924 143803 208510 65098 -187008 -200857 -10818 -402 -216832 -256433 20135 181514
40914 181514 -86890 -439255 -397579 -81847 36203 -116857 -195895 -64404 42211 -2143
40904 -2143 -19095 74683 76987 -90335 -126198 209983 652648 755420 513389 315910 339583
40893 339583 344445 124565 -162718 -272428 -238023 -252346 -323580 -272812 -34499 220537 284754
40882 284754 135176 -55961 -71489 162388 464018 508190 151449 -356402 -574930 -310502
40872 -310502 191371 483164 308978 -195763 -630927 -691197 -462480 -313560 -437893 -613616
40862 -613616 -545319 -310741 -221396 -300527 -228481 118518 399466 278149 -85822 -281609
40852 -281609 -217241 -142454 -181485 -166094 26877 237624 236442 12566 -245711 -351828 -248014
40841 -248014 -37836 70240 -39626 -225478 -245577 -101320 -56927 -255687 -493670 -497621
40831 -497621 -287368 -109033 -99252 -167725 -162641 -25488 182533 311325 235622 34034 -28791
40820 -28791 170969 390909 297403 -85970 -402365 -417275 -236761 -50851 98971 197301
40810 197301 127137 -148703 -425636 -488385 -425205 -496752 -716205 -785380 -511452 -104256
40800 -104256 71058 -64441 -253227 -261101 -149300 -142464 -314346 -499429 -508812 -346336 -154279
40789 -154279 5290 212681 514218 783006 847726 721636 594176 574696 540035 309580
40779 309580 -75696 -344963 -291424 -17359 164444 61155 -211984 -384892 -333306 -177840
40769 -177840 -87855 -56320 59532 285956 421335 262139 -93727 -291782 -125517 196264
40759 196264 300880 124148 -31863 53759 200689 109821 -150355 -181026 199939 669071
40749 669071 787643 540724 306487 341309 485123 417791 61987 -365295 -622320 -651246
40739 -651246 -536875 -366092 -181302 -24601 47371 13837 -81051 -179810 -265702 -319794 -252689
40728 -252689 16946 375700 519463 272700 -142700 -315570 -135811 92049 93592 -8157
40718 -8157 53244 210023 116295 -331472 -815731 -1027200 -1011401 -925388 -702622 -245330 212457
40707 212457 305608 89725 36205 376881 762417 751046 386769 54522 -61313 -98705
40697 -98705 -187853 -272200 -264118 -173269 -47198 72527 125286 87682 42084 60604 51227 -127076
40685 -127076 -422379 -638735 -711386 -732070 -699526 -495031 -177498 -43086 -227284 -450275
40675 -450275 -368898 -46213 155069 68702 -118001 -189240 -162695 -166410 -218183 -230389 -148666
40664 -148666 3840 177200 317315 357943 258367 65340 -105318 -182512 -216041 -302219
40654 -302219 -445663 -545790 -518407 -366454 -130160 133868 300192 237301 53 -177268
40644 -177268 -184191 -169037 -224393 -154721 162302 373720 46554 -580515 -740922 -166212
40634 -166212 497011 555326 151187 -89143 21128 121419 -32318 -264996 -350467 -302193
40624 -302193 -213732 -91156 51628 124714 73230 -65961 -229546 -325787 -214371 126308
40614 126308 438649 406186 48578 -304012 -454016 -540166 -736074 -954809 -986808 -804691
40604 -804691 -593985 -523926 -570806 -567090 -406031 -182102 -74972 -97833 -92368 -21547 -72827
40593 -72827 -326193 -520249 -387662 -69565 90986 54533 58188 153361 133702 -69199 -261572
40582 -261572 -299368 -210693 11552 385764 676735 563470 169704 678 198518 311921
40572 311921 35227 -294223 -279430 -108328 -161506 -322212 -205884 145899 336303 253031
40562 253031 138937 108097 76901 113821 346975 540443 304375 -212193 -384558 -9055
40552 -9055 391772 369305 136015 58782 60070 -68351 -167506 -17456 159207 25511 -236538
40541 -236538 -164513 211350 389630 210511 106629 388872 745118 710582 305679 -79202
40531 -79202 -214126 -182065 -149186 -214958 -400425 -602380 -627885 -411888 -125149 39323
40521 39323 75547 50397 -65476 -277590 -410862 -295857 -37300 122042 150397 203565
40511 203565 283357 200110 -67610 -246477 -150992 4227 -132045 -577388 -989161 -1066023
40501 -1066023 -830723 -523343 -334685 -270905 -205879 -29042 236514 452452 506737 425337
40491 425337 336467 339809 415324 452517 385608 307714 393168 656750 860963 764705 418816
40480 418816 93037 -57769 -108722 -164156 -220948 -261303 -303215 -295280 -130562 147154 308136
40469 308136 213765 -6889 -154818 -186738 -135315 19957 234509 302432 92115 -209145
40459 -209145 -289703 -104819 98671 102086 -101621 -392431 -621529 -656921 -486179 -255588
40449 -255588 -98238 6713 88482 32429 -229274 -488060 -469272 -211252 7164 57847
40439 57847 21014 -80115 -274605 -392322 -192337 192820 320074 79550 -96373 118207
40429 118207 436556 413394 122718 -14413 82536 71012 -220073 -502984 -460125 -186975
40419 -186975 -31614 -144260 -352962 -425859 -322147 -171764 -86440 -52592 -13665 2782
40409 2782 -82297 -247470 -345813 -271910 -84597 79720 154505 162056 146345 135099 125129 74952
40397 74952 -47096 -203489 -332594 -431116 -497127 -426947 -131763 236242 375383 223554
40387 223554 61962 118865 260964 239669 70433 -49844 -82690 -161892 -323419 -454375
40377 -454375 -501456 -520059 -502347 -357511 -111932 43212 -24949 -244515 -456634 -550635
40367 -550635 -455095 -167466 128879 151103 -140001 -415786 -371788 -153335 -180589 -570773
40357 -570773 -957028 -949827 -592226 -224482 -34060 65258 156246 144963 -53399 -302390
40347 -302390 -361324 -175988 61700 156782 132415 160319 307310 423360 323180 43925
40337 43925 -167085 -147757 -4800 75882 94891 164845 252310 217961 100980 103540 231739
40326 231739 224761 -24890 -248926 -205563 -57372 -74140 -170525 -86386 116102 135160 -41110
40315 -41110 -96450 85877 247578 212934 156605 242118 317018 202332 27429 3874 48051
40304 48051 -82418 -374127 -552494 -469387 -267503 -126309 -30182 115446 242772 137173
40294 137173 -274720 -740327 -903403 -711306 -460093 -385897 -395083 -322273 -237287 -258613 -253880
40283 -253880 -57983 145070 58023 -181418 -145784 174067 305243 57540 -153799 20211
40273 20211 342807 464659 485889 630872 708924 386563 -210711 -623629 -650938 -423393
40263 -423393 -46280 393959 587097 255610 -347323 -630176 -393255 10011 250016 336683
40253 336683 309275 85034 -211965 -211398 142689 355915 39643 -487509 -640242 -400824
40243 -400824 -265226 -433716 -531372 -235714 224134 430079 352499 265934 256252 149055
40233 149055 -108890 -315337 -323354 -230208 -158188 -74419 50415 124878 126212 182107 284117
40222 284117 171296 -244498 -586417 -492076 -180397 -126562 -330343 -395179 -249082 -232776
40212 -232776 -442860 -552149 -413951 -305269 -369647 -337426 -64828 137847 35387 -122952
40202 -122952 -70683 24331 -45783 -98685 41051 102642 -178468 -497928 -402638 -9783 233498
40191 233498 285774 438433 667129 645643 350740 116191 88061 98636 80266 158170 316786
40180 316786 379312 332730 314436 302232 167681 -24852 -127879 -213201 -379734 -410153 -85530
40169 -85530 295102 245133 -152982 -393225 -379866 -474261 -702791 -619554 -109592 323501
40159 323501 308392 72602 -87411 -252379 -507122 -628877 -479341 -284075 -220856 -126524
40149 -126524 112568 282360 230753 137646 126961 26974 -199581 -236496 37098 229849
40139 229849 65543 -113717 58815 284838 70397 -418408 -582484 -300281 -13168 31577
40129 31577 49325 180453 194183 -93960 -462423 -551246 -300010 33178 194372 178719
40119 178719 166309 241142 249948 52052 -179025 -158348 31674 16647 -248114 -337984 -19928
40108 -19928 357094 406175 248342 161542 46797 -298137 -642312 -575263 -158540 156946
40098 156946 189683 151623 154198 53845 -159598 -239867 -76661 115685 142019 98095 154447
40087 154447 275473 312224 247483 203545 247273 280312 153910 -109653 -268453 -129423
40077 -129423 169427 305316 190164 30518 -46053 -135759 -242270 -148763 191349 424046
40067 424046 219477 -279713 -670342 -754573 -583608 -263033 42020 118173 -36888 -163679
40057 -163679 -142369 -172418 -340019 -367577 -105678 105779 -27655 -232147 -165277 -69999
40047 -69999 -315135 -587295 -288940 402954 667267 252428 -187317 -114069 213540 312340
40037 312340 135678 -112770 -326903 -390474 -165790 160498 144046 -269437 -593178 -533386
40027 -533386 -405489 -513688 -592548 -287990 191770 379745 232690 62107 -580 -35734
40017 -35734 -11611 129387 183522 -77640 -448023 -488015 -175208 52342 -48198 -215273
40007 -215273 -159597 -10296 -63500 -307327 -446757 -308697 -17193 214196 303740 288554
39997 288554 220773 161913 203555 364687 479654 337948 -12281 -257410 -224813 -127777
39987 -127777 -213261 -324839 -124989 311303 496892 203467 -200501 -247905 56189 364503
39977 364503 476315 458078 409031 344744 276031 242372 273221 376426 500198 485612 205086
39966 205086 -196581 -384173 -251130 -61964 -54622 -122861 -74679 18713 -10326 -87935 -28704
39955 -28704 114838 146988 94218 138332 215349 50904 -347735 -596304 -472825 -239030
39945 -239030 -229437 -395646 -506900 -564953 -694363 -773305 -552548 -115759 140498 56289
39935 56289 -79734 5666 187776 219665 129108 66764 -42534 -350456 -685689 -679976 -308679
39924 -308679 39504 108184 60249 93755 105133 -41285 -189417 -137690 -22378 -133015
39914 -133015 -440239 -609792 -464633 -186413 -49266 -136976 -319781 -375951 -185132 85085
39904 85085 103755 -176276 -389430 -290265 -171834 -399238 -737801 -640555 -119600 223313
39894 223313 84305 -182594 -252431 -319011 -591937 -789826 -565319 -95289 200240 282671
39884 282671 392684 514109 423162 185296 119206 244906 213787 -104276 -364729 -274566
39874 -274566 -50620 -78871 -327547 -416800 -199841 35356 12931 -125849 -51308 245103
39864 245103 422785 292933 92702 106284 223448 143900 -100900 -172894 34297 242089
39854 242089 259701 253344 365586 406024 199441 -37750 -22531 87129 -94236 -551015
39844 -551015 -847341 -735441 -424183 -190794 -65181 -11611 -108956 -351924 -495686 -328082
39834 -328082 19973 229256 192642 96083 125748 242669 283108 187795 57321 -662 -2267
39823 -2267 -13252 2240 139806 357551 472034 416959 346928 367097 328474 80711 -218561
39812 -218561 -305129 -228730 -272749 -473044 -530809 -263435 141256 411283 465635 306175
39802 306175 -63268 -437797 -432346 24065 439851 327615 -127449 -303772 33197 495850
39792 495850 656811 515431 301924 135189 43935 90462 262339 376363 272395 21746
39782 21746 -189900 -298283 -347246 -327753 -190014 23610 201365 307512 392399 468644
39772 468644 483630 416792 314673 223246 153675 107478 71199 4032 -102700 -178139 -152798
39761 -152798 -55622 39761 116770 176671 162958 52869 -25684 73934 286159 391890 301228
39750 301228 117510 -63618 -215253 -232404 22924 445251 691635 594295 358250 213715
39740 213715 111285 -39864 -76758 170063 495566 532766 278373 68848 42819 -28158
39730 -28158 -298651 -552338 -504741 -188637 123284 231956 113988 -161142 -472395 -672391
39720 -672391 -671912 -471923 -108287 332038 637986 592316 248414 -48698 -27804 215208
39710 215208 376519 302167 92260 -72599 -108540 -75574 -115497 -306683 -549196 -649612
39700 -649612 -537793 -334203 -209081 -264439 -514021 -817270 -859659 -442553 152882 356962
39690 356962 4888 -404641 -337474 113289 448190 458577 374043 403233 476898 474687 420005
39679 420005 372106 340833 376955 554379 792927 874488 708455 428586 176636 -36852
39669 -36852 -199308 -224813 -121059 -46985 -78805 -86024 21962 102380 18806 -77979 55685
39658 55685 372340 587438 575890 478112 417953 353144 246956 172806 173726 194499 221819
39647 221819 319843 457897 489823 397446 361910 470806 550567 450289 299140 275432 299489
39636 299489 215905 130302 244159 444189 419162 178261 79719 271406 469045 441082
39626 441082 368058 480095 623717 505845 188335 5911 69877 160415 111566 39262
39616 39262 116266 301232 395861 307825 198568 340692 765591 1082302 832715 95305
39606 95305 -484621 -431581 -10747 159105 -113067 -486186 -638769 -574363 -400028 -150913
39596 -150913 83803 137036 -16444 -204944 -295906 -310268 -264957 -115679 79404 153815
39586 153815 76474 552 -14761 -108604 -323139 -430962 -247270 54326 152464 3664
39576 3664 -141325 -90273 100125 270261 344097 342924 302244 218623 76112 -69068 -75370
39565 -75370 125161 379884 459973 358257 289202 363009 444702 415880 380117 459065 544202
39554 544202 451127 230731 120069 204453 306393 241070 56577 -36486 82208 300133
39544 300133 381285 229958 28384 44387 302023 547240 571805 444918 347992 308668
39534 308668 230919 100540 -267 -51383 -116751 -201922 -225779 -175153 -171664 -304200 -468539
39523 -468539 -480174 -329996 -215304 -271080 -370194 -304419 -106575 -17783 -114444 -175071 -41962
39512 -41962 73137 -126604 -531594 -688576 -364934 180057 542533 594373 477796 358800
39502 358800 306636 306173 284938 192785 99233 120670 221870 218418 38319 -141756 -108253
39491 -108253 131020 376152 446359 299601 18728 -248988 -382588 -367646 -276171 -192956
39481 -192956 -208866 -409790 -739905 -928169 -734909 -278018 61262 86317 -23209 3397
39471 3397 217722 465474 547257 330451 -127430 -524746 -563760 -307700 -122750 -226288
39461 -226288 -478946 -652318 -668147 -512442 -181889 156715 203207 -103183 -435696 -461565
39451 -461565 -204625 92914 264981 241427 9574 -253440 -229110 132953 434100 288633
39441 288633 -188608 -582609 -704999 -665883 -558736 -364038 -104790 144683 359853 490337
39431 490337 387148 27422 -294105 -260292 43799 247820 176621 -36355 -242903 -387207
39421 -387207 -354363 -49675 329627 427416 226848 103495 240581 315386 22655 -357827
39411 -357827 -295814 197258 525653 325549 -45571 -51097 269618 423572 207909 -64216
39401 -64216 -108268 -49573 -94494 -159366 -97694 -30678 -114992 -181014 10733 283232 234296
39390 234296 -142156 -448243 -478946 -388597 -247682 71896 462998 539015 233798 -1871
39380 -1871 145740 414207 453745 355181 367424 450255 462590 481136 575791 558502 309217
39369 309217 65531 27972 -23805 -324199 -630125 -590091 -347005 -285769 -392112 -370177
39359 -370177 -227783 -216359 -304097 -238772 -70769 -96197 -300437 -354211 -175373 -26447
39349 -26447 -25623 -12076 58126 20381 -125551 -154570 -2567 147798 207573 246028 205766
39338 205766 -45242 -349985 -371524 -124932 8054 -142310 -354611 -479070 -635094 -841272
39328 -841272 -891953 -748611 -637245 -607371 -418129 -34560 197294 89405 -87710 -92464
39318 -92464 -101475 -315214 -534847 -477338 -234216 -77767 -27331 76298 236445 324600 303526
39307 303526 194990 -32917 -328869 -447168 -197683 273390 611221 591737 261075 -128124
39297 -128124 -258302 -4453 376213 497342 332277 219168 339940 500792 524931 518126
39287 518126 570805 534290 337704 229924 407972 633803 540714 173479 -75970 7767
39277 7767 250572 360620 233060 6877 -73636 111398 427135 649235 718840 679811
39267 679811 450490 -43682 -535082 -595610 -231848 86096 110213 106579 271771 325116
39257 325116 29597 -277007 -135142 296911 431875 76255 -353517 -425386 -172352 59639
39247 59639 19448 -236846 -422749 -314369 -4229 225672 282396 323101 426421 481315
39237 481315 467107 513102 564049 366022 -27245 -148788 191008 506721 317254 -119419
39227 -119419 -211558 83390 286334 161915 -42209 -90464 -59878 -86029 -115189 10885
39217 10885 369303 829142 1045501 768321 256098 75883 316252 399943 -23158 -457297
39207 -457297 -310749 156240 269756 22099 -26063 241079 375234 253879 288232 579631
39197 579631 616409 127287 -392088 -405771 -94265 38264 -84711 -199343 -245942 -367770
39187 -367770 -522661 -499378 -274802 -60383 -3324 -39495 -25685 114491 339140 495283
39177 495283 437978 196746 -55012 -207129 -262741 -195377 35537 287902 292576 14580
39167 14580 -236863 -178563 132147 450608 626282 609919 367696 -38185 -401191 -551065
39157 -551065 -504899 -355540 -135373 108203 239091 176186 26133 -42686 9379 109526
39147 109526 190681 209144 134091 9264 -51988 -11489 33359 7835 -11315 79569 229158
39136 229158 285261 207243 134811 225741 458725 627632 562998 351449 247481 329063 375100
39125 375100 202651 -19449 -8392 178648 212800 2090 -178250 -137826 -48040 -100157
39115 -100157 -145684 69907 468683 705110 620028 402468 291012 303785 323487 307314
39105 307314 299880 289647 170604 -103646 -383754 -440983 -238921 7064 100151 86114 98055
39094 98055 88832 -80924 -323840 -333692 17004 475787 719600 722696 681916 684772 627047
39083 627047 435170 209324 91613 89756 115774 153335 272771 454139 518095 352645
39073 352645 133049 133786 332359 419585 265032 132234 280053 566897 675690 567437
39063 567437 449822 420273 440338 588556 994789 1503490 1725990 1520137 1155185 903859
39053 903859 730577 519816 363586 408086 569259 610514 426633 101773 -232199 -451145
39043 -451145 -435182 -186585 71749 79823 -143172 -285076 -105856 260728 456378 321643
39033 321643 70064 6506 167284 338212 364026 286741 191297 99379 62853 174440 391437
39022 391437 524481 519332 569479 796579 1000768 930114 647774 410120 306853 252370
39012 252370 219738 238515 255000 233460 292748 491471 601372 397151 67125 -8969 175877
39001 175877 282004 185293 127245 273774 493701 647037 762995 861457 907383 993055
38991 993055 1252466 1573845 1754866 1960049 2596374 3666362 4702052 5443916 6072876
38982 6072876 6601068 6626015 6041076 5459891 5455232 5778773 5841518 5621556 5510535 5487779
38972 5487779 5086728 4156824 3124241 2419823 2042832 1761512 1423933 1007056 610527
38963 610527 427229 514366 640423 580325 460815 527065 671188 560985 208116 16572
38953 16572 199540 489606 538931 322103 23673 -218730 -321527 -217506 40568 278915
38943 278915 403663 484771 598705 738938 915971 1164315 1392596 1413579 1212758 1026216
38933 1026216 1053498 1225543 1339892 1293780 1101183 817924 557747 464989 545603 604559
38923 604559 472774 248991 201770 440009 773659 930601 856636 738497 727489 727071 556629
38912 556629 283558 209825 464573 787260 852319 663004 446501 289120 116228 -31452
38902 -31452 28439 338550 699467 895380 868412 661494 367299 156940 172039 329132
38892 329132 379033 206075 -58526 -226591 -204793 24491 364375 533547 282256 -245856
38882 -245856 -592091 -515108 -227549 -8967 154510 377239 573676 601735 536395 541731
38872 541731 584721 523303 391443 348741 406198 449114 495551 673532 936245 1054411 944388
38861 944388 779420 704121 654704 566556 551647 699182 843901 740444 423632 213363
38851 213363 325440 594385 664381 421793 145095 164122 430905 582020 450494 298603
38841 298603 386275 529419 400252 128940 166094 528433 674558 330316 -30294 110441
38831 110441 516154 596989 340104 239517 399372 364294 -51209 -380454 -235113 77467
38821 77467 52220 -261538 -433465 -333855 -205922 -193178 -209150 -229844 -341786 -476315 -407808
38810 -407808 -83116 272161 422928 327263 74247 -195311 -311905 -201226 16011 185688
38800 185688 314028 436902 427079 196080 -19163 84256 366596 378422 45493 -172612
38790 -172612 50838 435507 504257 206284 -103578 -135060 84204 305006 276166 -15663
38780 -15663 -259483 -131690 271646 534625 487864 380618 403849 392212 184761 -47467
38770 -47467 -83652 13556 99954 216945 389954 438370 295965 244168 461888 606168 280381
38759 280381 -286121 -515801 -305954 -58669 44598 245697 636114 903307 808487 499065
38749 499065 184922 -117486 -356167 -335050 -47104 198185 187123 61966 -5013 -78964
38739 -78964 -187633 -114384 226390 481927 292725 -152684 -361188 -215347 -42404 -52213
38729 -52213 -74804 84424 332877 469005 477834 501505 605204 683716 591842 336603 126818
38718 126818 183024 475830 728434 725581 530112 330794 194343 85354 31255 105621
38708 105621 283367 447508 527091 529306 464120 336944 190536 65135 -53066 -167633
38698 -167633 -208527 -120934 38893 186249 314906 419396 404080 217459 3746 -47990
38688 -47990 47563 146537 235018 394662 550324 525584 377611 382851 584205 643363 335638
38677 335638 -64727 -169359 -58163 -129233 -443379 -601305 -346437 42568 142730 -68354
38667 -68354 -288757 -357130 -374346 -418914 -413824 -328254 -294562 -414393 -604347 -760591 -939716
38656 -939716 -1197466 -1339479 -1079636 -478123 5412 28412 -221465 -309606 -148966 -65364
38646 -65364 -255936 -444950 -252052 249455 584270 468014 127200 -46536 23533 117209
38636 117209 94321 37747 27992 -14594 -162057 -285776 -175343 185411 570789 746031
38626 746031 680741 526263 436306 434155 443169 430752 474996 623616 720497 520148 32130
38615 32130 -395874 -462470 -258866 -72055 33223 186459 328639 189910 -264070 -660282
38605 -660282 -677293 -452863 -310245 -260518 -67622 282269 498353 410089 216113 199500
38595 199500 361158 452462 280872 -96371 -428108 -489702 -304302 -129787 -144693 -205931
38585 -205931 -75984 159988 159321 -147774 -374714 -195236 185101 322787 152374 14226
38575 14226 119077 290230 300192 210149 235246 443433 757898 1159667 1690207 2239705
38565 2239705 2491967 2198396 1481200 772857 420060 399885 463177 471929 477002 515864 527269
38554 527269 513260 606041 876068 1236312 1654381 2258589 3011514 3441531 3035106 1895937
38544 1895937 731875 125770 43909 121298 176372 284947 507895 727511 729147 402706
38534 402706 -82882 -349397 -202806 90823 155057 96370 389832 1073975 1473028 1024996
38524 1024996 85239 -491135 -391134 -46230 116849 149728 228846 271544 158234 50501
38514 50501 171925 400470 383012 55257 -209370 -75861 303191 496894 380670 278717
38504 278717 464963 756733 812183 677324 727810 1092527 1463490 1554903 1437017 1269214
38494 1269214 1013160 645238 384729 405622 515616 440066 266401 261011 370277 298460
38484 298460 34627 -101680 27685 197941 235999 268691 418000 543709 465288 226881
38474 226881 -7135 -151954 -198157 -175513 -184439 -279130 -290392 -6954 426648 592638 373182
38463 373182 119263 102856 147959 39167 -39841 179892 542373 657278 464813 243658
38453 243658 137209 36836 -83371 -76552 66762 122706 -32133 -218758 -216527 -53960
38443 -53960 90529 152691 216972 355142 534632 666281 688655 612750 493825 351036
38433 351036 157731 -37242 -46792 261967 713155 908338 649121 188186 -36905 122055
38423 122055 415070 549965 536173 598143 826336 1056228 1105096 989104 826615 640355
38413 640355 384372 98739 -109166 -210705 -250156 -219469 -90539 38704 11207 -137119
38403 -137119 -165806 45137 298429 316032 75087 -202831 -337662 -355286 -369079 -375770 -237571
38392 -237571 95909 401229 368535 27064 -199841 -13893 357851 506553 422635 409492
38382 409492 519820 495332 295274 251394 532395 819653 753581 422516 152782 34118
38372 34118 -77186 -233436 -322906 -240909 29896 411663 692520 654925 370578 181701
38362 181701 244352 310009 152348 -30477 75615 371624 464732 241489 2633 15213
38352 15213 185069 237825 69985 -130873 -53119 417249 991461 1201011 913995 503977
38342 503977 398740 609690 847424 941367 947578 957473 1011330 1142837 1338475 1495444 1545527
38331 1545527 1560645 1630482 1708291 1669624 1458443 1135624 872251 863905 1076941 1143967 797658
38320 797658 351908 341161 688581 778540 462275 326447 664071 890586 516194 47637
38310 47637 182247 618643 563346 89552 -2290 432264 651711 297727 -53187 81980
38300 81980 328494 167293 -220625 -319930 -37766 355421 691976 918435 932792 766540
38290 766540 691545 848985 996689 878299 603498 415513 328641 257183 268541 424487
38280 424487 561689 508591 377334 392755 544562 620954 498719 241848 3967 -59288
38270 -59288 100447 324200 397708 343600 364369 468627 432843 211560 71217 177768
38260 177768 360309 455111 565771 755886 791727 495092 131952 138771 587460 1154650
38250 1154650 1506361 1546313 1438138 1520663 1992389 2540964 2565700 1963892 1374142 1350970
38240 1350970 1613378 1502055 929095 404328 259374 336529 428631 568286 786620 945806
38230 945806 949159 865647 745411 534597 265616 123550 205358 366327 414037 339909 263846
38219 263846 240421 221648 173439 142358 182426 247129 212917 47946 -99007 -67808 97292
38208 97292 226273 279752 353221 441946 426479 325979 317552 420199 418362 233939 116761
38197 116761 273581 534005 609904 493984 360243 245632 110425 83730 336261 747861
38187 747861 974862 870051 638521 553042 661026 790109 746433 510491 279482 257432
38177 257432 391749 454848 404202 434122 588920 609661 351964 84760 106610 291829
38167 291829 337121 283299 424787 787262 1055857 1019377 786949 543894 347198 194210
38157 194210 85249 -9760 -95780 -93505 19240 94874 32488 891 206291 524468 639898
38146 639898 503801 368324 375718 401028 341646 303349 415600 647732 871659 972700
38136 972700 889408 674818 493169 430735 387857 304612 350377 655833 995891 1049406 882531
38125 882531 829138 947484 982269 865617 834724 962945 982424 747516 524050 594606
38115 594606 854283 1024836 1034447 956481 786027 546633 475834 815741 1436372 1869903
38105 1869903 1766547 1242943 763742 677486 843970 786706 304636 -191271 -161749 344156
38095 344156 771529 823214 745672 779585 767494 547029 357254 492867 790980 837704
38085 837704 561183 281312 229532 314668 348531 258557 77419 -81707 -56667 178059
38075 178059 390022 332934 77453 -82642 -17066 139390 238391 259681 207490 83011
38065 83011 -7695 85994 342070 576878 705593 807871 894375 829941 596153 423552
38055 423552 489657 632882 566136 283398 38887 -46003 -125847 -321569 -462859 -299030
38045 -299030 113483 409355 330795 24977 -154895 -67194 122600 236567 304990 416546
38035 416546 495666 400540 185447 72465 137558 196525 82135 -100704 -109787 126844 444049
38024 444049 627952 587037 388158 202429 166556 234255 235748 141469 138453 331772 523895
38013 523895 489730 343618 362199 519891 537230 399504 452624 856007 1280671 1357411
38003 1357411 1140795 892058 666904 409984 233824 261180 340570 257229 113933 170475
37993 170475 409304 609121 749801 955227 1120164 1053816 968040 1297428 1948716 2269704
37983 2269704 1972933 1587784 1686278 2096995 2273176 2088761 1832331 1660848 1507485 1386814
37973 1386814 1388485 1455492 1507866 1679606 2077605 2396601 2175257 1446298 785047 654007
37963 654007 973660 1378239 1614786 1611782 1407598 1151193 1030744 1098464 1235922 1314224
37953 1314224 1320117 1349527 1546573 1974408 2454039 2643054 2408350 2009194 1770438 1716921
37943 1716921 1704556 1739761 1917487 2169712 2338586 2399645 2377177 2190769 1873484 1763554
37933 1763554 2097074 2546333 2601758 2316537 2173257 2263457 2198833 1912771 1890838 2328682
37923 2328682 2656057 2333421 1664877 1312677 1337403 1278429 994088 840097 1022358 1266747
37913 1266747 1243441 966226 644000 397230 242445 167556 123776 71794 69176 174205
37903 174205 269168 173459 -34954 -21943 382526 934151 1260787 1264679 1113894 956852
37893 956852 818445 720740 724446 834113 994166 1197359 1463273 1675529 1606666 1219101
37883 1219101 810061 693950 826533 928687 911586 932400 1040190 1063416 938042 861227
37873 861227 959247 1075135 1111613 1316551 1889746 2494994 2579179 2119273 1652119 1544427
37863 1544427 1621101 1599754 1504999 1460963 1387301 1159444 873378 713604 686117 676668 664844
37852 664844 698910 741191 708350 623268 603190 728782 995359 1327477 1582417 1637606 1557684
37841 1557684 1588486 1906148 2444236 3008679 3446530 3649617 3546344 3204400 2836717 2609151
37831 2609151 2526756 2547916 2657799 2779787 2842053 3056794 3859704 5294647 6646380 7063601
37821 7063601 6543530 5986868 6195440 7038833 7699653 7542223 6604736 5382834 4327936
37812 4327936 3563726 2967552 2422518 1946057 1604552 1405566 1328778 1374954 1487339 1498433
37802 1498433 1303295 1074824 1156504 1683526 2394777 2869155 2897163 2607453 2307409 2234903
37792 2234903 2388768 2537676 2437935 2097322 1787088 1736869 1858850 1860375 1612658 1292881
37782 1292881 1127638 1120811 1140119 1177414 1353385 1685576 2032019 2299530 2531954 2718180
37772 2718180 2695265 2377062 1928578 1552673 1240453 922426 728668 835486 1126619 1292377
37762 1292377 1250761 1187869 1169861 1032670 743471 560428 665944 890138 981763 933056
37752 933056 839476 660324 380237 235794 465228 900088 1099307 896916 581384 500417
37742 500417 684488 906373 947037 743697 403922 138965 105379 272386 482030 614678
37732 614678 636594 543638 362950 174188 32700 -83431 -163575 -95516 157075 408661
37722 408661 472967 448676 557569 766595 855913 831794 918131 1081114 956310 431287
37712 431287 -62109 -114114 114115 247907 324521 610526 978862 1009065 686115 464829
37702 464829 542873 584545 364270 181721 303719 426598 151534 -305858 -392381 -35414
37692 -35414 324201 441313 496909 601212 575270 369036 255101 385624 509769 379208
37682 379208 147912 109975 272294 448948 591888 763507 916767 946785 866944 741299
37672 741299 553071 321533 214617 334785 512472 536114 484973 595713 870802 1057968
37662 1057968 984629 709549 383091 152978 161224 420721 708885 770331 612052 438151
37652 438151 341926 253822 154887 128936 202365 317746 469972 700393 957664 1121502
37642 1121502 1155043 1092315 919013 635028 390014 362920 523821 684993 748578 725556
37632 725556 577196 270423 -44228 -156221 -93023 -65267 -127937 -147904 -104978 -136840 -236028
37621 -236028 -190817 67474 307603 317253 176614 93252 141776 279452 457139 604181
37611 604181 641897 603332 614659 698354 735121 668087 585049 547816 510158 455598 426032
37600 426032 348021 44909 -463669 -868063 -920981 -732991 -573402 -510602 -411424 -207189
37590 -207189 3626 96996 64241 10012 43360 150841 188398 54008 -165269 -310575
37580 -310575 -373148 -463499 -581611 -583604 -405015 -175900 -63436 -90182 -131234 -33944 225314
37569 225314 442884 344823 -49895 -354513 -266966 39535 186467 106645 24254 45202
37559 45202 89578 153130 293817 400291 317929 175018 225460 393695 370435 153517 54281
37548 54281 133341 116389 -21354 104342 651283 1214451 1389530 1274027 1137835 984970
37538 984970 752845 588706 583390 536655 323272 192612 350147 543719 480537 389009
37528 389009 678432 1207365 1404049 1075626 639572 514520 674294 884556 1033944 1090308
37518 1090308 986900 717098 396304 121391 -118324 -312830 -327147 -40280 445050 828644
37508 828644 891107 709085 526626 431730 296752 82002 -7953 157853 354030 306738
37498 306738 145392 208048 477117 596220 438119 250362 184502 88205 -124623 -282971
37488 -282971 -284342 -263859 -295677 -259636 -132504 -63097 -36116 158523 487026 614202 445318
37477 445318 292936 318876 277275 46528 -74591 94126 251132 130972 -70228 -151360
37467 -151360 -320235 -728750 -1044149 -959192 -724501 -686612 -692886 -466652 -173382 -53917
37457 -53917 108762 527044 785041 399974 -268276 -427376 3267 402351 472187 485546
37447 485546 556067 447292 186014 142631 346258 362875 41618 -200369 -52489 240265
37437 240265 318286 155368 -117723 -420722 -583901 -397467 24178 275516 194858 34274
37427 34274 -966 -21199 -144426 -263866 -253362 -122798 98715 356486 447448 231307
37417 231307 -59471 -92354 26903 -70148 -333970 -320563 55848 350551 303133 184306
37407 184306 238790 312289 293041 424728 837707 1177655 1072508 670284 388139 373800
37397 373800 488118 585598 565283 363591 107836 51334 174650 113748 -309964 -750625
37387 -750625 -765000 -361028 100123 353518 378951 282309 221814 310634 463309 490964 407595
37376 407595 403767 448858 240036 -293786 -746118 -721950 -340918 -27598 17575 -60946 -32804
37365 -32804 196004 494156 557550 219940 -247292 -378873 -103621 195565 267453 287548
37355 287548 443774 604436 612388 569540 565893 424184 16740 -396653 -455870 -164861 188329
37344 188329 422015 526103 482080 285998 86269 82762 292192 515432 513891 212336
37334 212336 -181148 -307475 -81135 105393 -123599 -524866 -533970 -125559 144649 36217
37324 36217 -22349 294965 664384 706710 621449 767430 1035103 1147810 1232847 1531763
37314 1531763 1812478 1657437 1161025 771616 571350 293130 -31515 -70196 135531 110253
37304 110253 -289452 -598939 -464644 -158470 -80394 -159672 -118168 -18930 -125848 -376694
37294 -376694 -408923 -93375 284238 425116 353023 272322 290798 389840 514818 563942 403003
37283 403003 47500 -243549 -231983 -25761 53250 -74556 -156732 -40859 63042 -81840
37273 -81840 -361282 -489643 -392762 -175040 117904 411058 436661 31237 -485939 -618308
37263 -618308 -351888 -133517 -204904 -372027 -458202 -520053 -510721 -220981 228320 294410 -265808
37252 -265808 -938792 -1066562 -645023 -179399 20113 43415 45768 57102 65028 42632 -55286
37241 -55286 -175511 -168666 -39159 -7628 -164864 -280421 -158187 38216 58585 -39384 -44189
37230 -44189 32995 30642 -44641 -65473 -56694 -141128 -274181 -288217 -161418 -20921 77868
37219 77868 167300 207130 113057 -72281 -202708 -201307 -79894 161786 518103 894771 1150491
37208 1150491 1190290 985136 614361 331207 406929 807265 1186721 1299152 1229299 1128304
37198 1128304 971079 738181 588018 619810 660651 519375 288451 178432 209816 271411
37188 271411 316610 301005 114083 -202030 -356489 -182088 70414 66618 -148109 -279372
37178 -279372 -213989 -50099 140559 296050 264362 19676 -158709 -22379 264756 377174
37168 377174 302823 231999 132001 -157224 -493347 -531279 -250949 -666 9444 -97768
37158 -97768 -202594 -354285 -529944 -567230 -448748 -368509 -404115 -374301 -132000 218870
37148 218870 490957 597747 506095 226695 -59268 -79154 197297 460692 416126 116835
37138 116835 -152238 -227704 -207461 -274209 -439583 -499444 -295949 9585 93473 -66329
37128 -66329 -127349 84954 267814 116782 -164286 -199321 -67615 -125124 -322178 -243429
37118 -243429 156970 411121 268590 58112 83657 139812 -20632 -142528 140996 627236
37108 627236 756000 408143 29442 -48205 22475 13144 854 111734 180363 -17127 -339197
37097 -339197 -416631 -187969 3003 -91979 -294054 -307450 -140653 -9287 23718 56087
37087 56087 82050 701 -122501 -79005 142299 285373 196294 50809 90345 300723 475479
37076 475479 462885 253168 -50557 -274930 -321999 -307863 -389796 -460174 -280046 46894
37066 46894 92222 -254733 -532628 -360291 -13085 9090 -264034 -373845 -151836 84694
37056 84694 34551 -239852 -491318 -539148 -324004 49398 309901 265822 52932 -42207
37046 -42207 31415 76557 -21442 -167157 -242326 -224420 -130011 -11363 19208 -79252 -175036
37035 -175036 -149621 -86520 -85452 -23931 220665 416010 195513 -364984 -735884 -588595
37025 -588595 -182832 16208 -121836 -361885 -425667 -211356 169387 451859 412501 96787
37015 96787 -211876 -293692 -182590 -36238 65378 135633 197007 260261 332734 389065 373090
37004 373090 277298 192540 223570 345799 390905 232554 -17229 -84678 142730 461088
36994 461088 606485 567915 515136 526850 584908 738660 1010672 1192243 1043188 706086
36984 706086 604762 875085 1207314 1327900 1310666 1298652 1249000 1113527 979640 877011
36974 877011 719339 560313 601081 827645 983236 1011722 1124899 1301863 1212419 842738
36964 842738 649847 786994 749969 223589 -280560 -184975 254257 453807 478082 760482
36954 760482 1158885 1105969 575717 133896 39359 -13657 -215285 -338317 -215118 24043
36944 24043 275660 543295 650512 367371 -119565 -338694 -192168 -30222 -37949 -31327
36934 -31327 82899 136834 82692 88349 169122 166201 143633 320744 543712 366695 -199324
36923 -199324 -566263 -418555 -165097 -242666 -431324 -259716 230012 539283 388287 14873
36913 14873 -161138 10692 293780 352846 166052 43217 147797 227225 51671 -141037
36903 -141037 -22048 230739 206422 -14517 27523 390056 644747 602798 552833 689917
36893 689917 851721 939550 1087202 1295531 1410519 1572388 2144269 3056682 3764640 3991115
36883 3991115 3941981 3665917 2904127 1829354 1198534 1346772 1667977 1566267 1309838
36874 1309838 1378549 1538910 1282050 780387 646026 940822 1130870 958162 739212 766941
36864 766941 933380 1045808 1118238 1215868 1277294 1209055 1021362 838982 842524 1118272 1488317
36853 1488317 1625747 1431108 1129760 914132 722527 498619 397116 522211 689982
36844 689982 681447 549990 467595 438138 370308 288104 284669 387458 589219 861368 1054709
36833 1054709 989913 727918 522274 447349 363839 301590 478522 802911 801747 303316
36823 303316 -205513 -218412 139190 430938 555243 685999 832569 871063 847234 888616
36813 888616 944224 912507 887971 1000128 1150491 1174233 1117156 1104388 1092768 997504 898773
36802 898773 880149 831500 651587 470945 433267 432778 310672 141714 92755 157289 229109
36791 229109 263858 215831 52973 -33614 225589 650523 660062 124165 -309839 -142002
36781 -142002 212805 121989 -241580 -268690 8879 17757 -301313 -365883 37044 366473
36771 366473 193580 -169857 -232764 -29436 95146 50371 -5364 -3543 12837 69676 219750
36760 219750 394419 459676 372478 201612 59188 41951 142835 205293 82103 -146936
36750 -146936 -235792 -62063 254648 515990 605830 503631 275960 67204 -11214 4962
36740 4962 -2309 -82473 -189106 -237475 -132312 146776 409736 373648 54049 -148762 35641
36729 35641 324677 263912 -93503 -248581 15017 329217 280743 -39794 -219146 -68372
36719 -68372 225897 422892 500302 568501 645229 636693 523597 429883 426764 382108 159984
36708 159984 -104955 -149207 15544 83062 -112381 -381407 -492984 -470433 -442021 -406665
36698 -406665 -312027 -202553 -141670 -122535 -152541 -253436 -300071 -98954 253589 364422
36688 364422 69450 -303174 -402531 -306880 -254452 -220264 -103652 -78665 -329720 -600649
36678 -600649 -461429 40368 424828 463708 395549 413996 377957 190881 88469 282556
36668 282556 571250 599281 372073 226354 329456 476872 448660 332467 315466 306749
36658 306749 49771 -390251 -569286 -262793 143449 148003 -163688 -279578 -34830 199836
36648 199836 136895 -45400 -86314 -39190 -65460 -121462 -93376 -35065 -52850 -112089 -126863
36637 -126863 -91817 -500 196607 447501 595878 599239 540188 388635 51782 -284556
36627 -284556 -244112 179566 545414 615203 644521 796023 764236 365709 34079 204273
36617 204273 560826 500155 107975 25653 417420 710687 469475 -258 -134758 160210
36607 160210 504628 557452 332999 84107 -14620 -46706 -184813 -371983 -357317 -117071
36597 -117071 12129 -188255 -432660 -294761 198132 621255 702625 535366 299378 55721
36587 55721 -156144 -231893 -98138 176462 390729 355550 120408 18140 295110 714024
36577 714024 796656 489456 245397 342362 508491 432309 268260 323811 534684 590816
36567 590816 385131 47826 -285708 -489717 -422120 -123614 139669 224536 273755 363183
36557 363183 309457 71621 -10659 280316 606491 524877 127114 -147868 -129690 16581
36547 16581 148402 224651 193854 99304 105623 173033 -11147 -484265 -736845 -379408 242615
36536 242615 549843 551098 659166 922160 990865 730816 371886 116622 1659 42284
36526 42284 148978 61172 -265966 -426464 -132045 236958 156004 -187940 -147684 403011
36516 403011 926022 1015012 797014 545545 385918 394224 543305 555078 221655 -168498
36506 -168498 -150427 227484 473961 357903 86462 -161207 -387336 -480613 -268243 91545
36496 91545 214068 37335 -128776 -117397 -68997 -70950 -31335 68715 162953 323392 628811
36485 628811 865725 765114 479528 393202 513715 516181 349233 292994 407980 433711
36475 433711 287375 181610 181921 117204 2122 75466 325925 448348 383730 433553 693600
36464 693600 842301 695032 543353 692292 1006891 1171775 1124362 999517 874150 784509
36454 784509 824042 1025860 1237607 1238873 954560 542321 302078 412917 692333 770094
36444 770094 590761 494977 644125 704815 403944 49589 63636 281541 245646 1289
36434 1289 17707 388773 680958 609464 369827 217300 142320 74142 71996 205231 456565
36423 456565 756714 957894 885902 598559 397728 382045 277496 -23883 -139040 200187
36413 200187 603154 580131 299072 230895 363041 374810 303895 379863 440364 197350 -122067
36402 -122067 -89942 161519 192062 62665 146089 320550 163646 -187114 -211548 44367
36392 44367 57926 -186464 -199580 25057 -46912 -473311 -669553 -412454 -142494 -92793
36382 -92793 24794 267711 258175 -28215 -102772 153063 269853 110016 141148 485036
36372 485036 592884 276407 178581 693637 1220680 1091372 551205 206043 101485 -19202
36362 -19202 -62741 164037 433939 398933 126785 -100756 -240674 -373637 -430878 -357948
36352 -357948 -277898 -257132 -208578 -177854 -341542 -587491 -548151 -199437 54630 34978 -299
36341 -299 63067 -8981 -234173 -256961 6524 165620 41148 -56147 16074 -58568 -391115
36330 -391115 -586579 -449216 -350099 -522961 -623247 -384408 -98291 -30901 28881 212616
36320 212616 196199 -138483 -283114 109753 579842 575599 307071 279214 425362 343952
36310 343952 52826 -104084 -49609 56747 211983 453752 565385 347254 8015 -115107
36300 -115107 -76529 -203893 -562440 -828737 -663359 -71741 553364 766351 586083 545383
36290 545383 966404 1419263 1335236 901355 732326 866208 843470 644035 666694 812604
36280 812604 551483 -17657 -170430 203956 392803 145119 95407 525168 785907 479711
36270 479711 179069 341771 484848 162380 -127839 184072 731713 886797 777888 849040
36260 849040 989673 862567 592237 451140 344520 188743 260704 613896 741617 388100
36250 388100 65939 190414 380933 250906 173077 533836 907268 759670 365541 230714
36240 230714 186081 -126612 -401737 -146274 423886 734666 705353 583721 393541 195925
36230 195925 377960 997308 1376181 1045108 529643 480521 627080 390461 -56440 -202979
36220 -202979 -132686 -170461 -120354 250223 472853 65906 -496846 -465659 -53417 -20547
36210 -20547 -378452 -493525 -209033 85486 279810 546577 732618 594522 429145 655979
36200 655979 997858 876789 388224 86527 42435 -90760 -310606 -356757 -337803 -494148
36190 -494148 -575727 -230660 224263 198615 -226269 -493718 -481757 -485142 -533631 -452522 -355196
36179 -355196 -387137 -276920 176802 541868 401506 144952 316059 627170 524593 304085
36169 304085 637566 1304762 1459576 970928 485213 294954 134286 -2791 170483 474384
36159 474384 404274 59174 71813 565828 973911 950638 745180 618015 542298 520270
36149 520270 625578 743361 749010 815781 1081220 1254278 1066152 805067 845417 990789
36139 990789 884524 699503 770928 913800 774340 493709 367287 253431 -6607 -39784
36129 -39784 458232 1032283 1128815 983867 1095180 1313822 1262851 1138001 1247138 1280901
36119 1280901 910967 559256 666165 793600 440404 122352 531406 1196279 1178757 622327
36109 622327 393019 603636 719017 741722 1044834 1354764 1142913 743910 868010 1284670
36099 1284670 1213565 745696 622142 845138 787106 491910 589248 1034393 1166136 937140
36089 937140 914359 1134516 1085192 743106 563785 555706 387869 235441 494578 884738
36079 884738 863059 657984 849470 1241713 1226616 924302 874406 973636 827415 726969
36069 726969 1119764 1560626 1382823 943338 994260 1337356 1347605 1246315 1530010 1760991
36059 1760991 1340465 845738 1110870 1637036 1488000 1079790 1389089 2058175 2103913 1886331
36049 1886331 2445882 3417422 3585370 3064386 2945952 3213878 3036303 2697322 3128273
36040 3128273 3910945 3946995 3792991 5026202 7419469 8983342 8788593 7669434 6272846
36031 6272846 4557579 3105962 2769421 3056036 2847662 2444337 2859412 3568478 3244764
36022 3244764 2260378 2045151 2446275 2254123 1809635 2358935 3328123 3134343 2237807
36013 2237807 2360072 3141965 2811199 1746579 1920687 3096905 3194432 2250642 2274873
36004 2274873 3263589 3262614 2383480 2693383 4012823 4039588 2853338 2940628 4471552 5069540
35994 5069540 4577117 5305731 7208209 7814235 7340650 8553074 11198545 12335964 12540891
35985 12540891 15422178 20587043 24202922 27030295 33823895 44184517 53462421 63425229
35977 63425229 80237160 100663880 116702504 139142642 194906645 283918142 355337310
35970 355337310 352377066 276366810 184416138 125027141 98062131 79796415 61346774
35963 61346774 48531304 41678934 34460671 26207418 21396011 19768394 16995274 12905127
35955 12905127 10855330 10705065 9381125 6974438 6166414 6745636 6103806 4279080 3674416
35946 3674416 4446993 4492529 3494305 3122925 3589596 3453289 2592504 2325256 2785989 2847147
35936 2847147 2406376 2380128 2721845 2610417 2271818 2599300 3292417 3244841 2488182 2046836
35926 2046836 2144220 2112335 1818977 1757303 1927525 1867805 1595595 1487824 1495458 1361523
35916 1361523 1265334 1452895 1642203 1534934 1466611 1836777 2327018 2359130 1977112 1713099
35906 1713099 1860019 2270507 2625131 2695086 2586312 2702561 3167240 3553278 3636900 3940499
35896 3940499 4842255 5726985 5953286 6092194 7070688 8540526 9281179 8855690 7768987
35887 7768987 6434786 5091859 4235934 4044499 3927269 3571197 3579302 4159486 4402229
35878 4402229 3949455 3900552 4815139 5569636 5606855 6227761 8000563 9348931 9671498
35869 9671498 11012253 14331827 17469572 19559545 23475819 30503176 37420693 43240431
35861 43240431 52909575 68571176 85231246 104826672 145023796 215438767 287494936
35854 287494936 310174709 264225494 185105231 122604266 91776544 75211180 58795163
35847 58795163 45227300 37951863 32092097 24426838 18768477 17262499 15940004 12283941
35839 12283941 9264210 8841042 8352113 6168898 4804140 5652238 6105578 4542753 3257686
35830 3257686 3875704 4345761 3004998 1579560 1700627 2084751 1487880 1127162 1967603
35821 1967603 2637438 2085035 1523123 1906771 2160174 1591076 1435026 2379004 3100435
35812 3100435 2810850 2745339 3649335 4310799 4065936 4207363 5374266 6165371 6053225
35803 6053225 7027090 10246506 13398684 13679984 11522152 9185708 7379485 5518362
35795 5518362 3887543 3225047 3058594 2417620 1517898 1172757 1252911 1120310 868192
35786 868192 882807 897972 608216 483895 958566 1564433 1794092 1994041 2500614 2749481
35776 2749481 2188431 1308313 900242 1001788 1299672 1771383 2218129 2014650 1076586
35767 1076586 286499 266995 522142 434121 259465 443809 753266 792240 682944 623424
35757 623424 445259 116742 -2279 180791 298766 284409 489068 807520 672153 191406
35747 191406 191265 773781 1010798 513855 88377 281390 513957 315936 209710 591852
35737 591852 872797 577908 267835 493704 798771 643218 424422 667752 1002711 842970
35727 842970 391386 141325 19369 -221185 -376904 -261601 -187386 -353286 -387129 -75718
35717 -75718 129795 -86602 -308763 -168105 4661 -111521 -212918 -62427 -36397 -353354
35707 -353354 -511223 -146017 287551 348865 368548 676432 828411 385746 -197847 -259389
35697 -259389 74335 300384 396927 560117 619151 408682 236984 351868 435406 209734
35687 209734 -393 111226 239155 107740 96641 549395 1031436 997570 692397 668016
35677 668016 861901 866381 715603 716120 828848 835761 805118 845891 739722 334859 -35831
35666 -35831 -12723 252851 433273 512983 562197 463032 242669 210517 399386 393935 81076
35655 81076 -30469 332820 664283 486652 92318 -59271 -77372 -198224 -199425 112546
35645 112546 357078 164274 -154855 -126204 137473 270596 293690 366824 358416 210047
35635 210047 272878 723396 1094742 943218 535007 333633 284282 175397 219595 635178
35625 635178 1063186 1035543 690405 469430 437834 400294 334362 254853 37694 -214140
35615 -214140 -94558 410934 690608 397237 -19001 -126184 -182558 -443101 -518176 -115681
35605 -115681 248801 57697 -293271 -186414 174869 250816 161679 309789 473685 205132
35595 205132 -252404 -352224 -209268 -273609 -366892 1956 604930 744431 388414 138869
35585 138869 165534 71742 -204642 -227853 125016 444994 486564 452678 522903 648390 821114
35574 821114 1042215 1089830 817901 556731 694288 1032197 1120004 1025805 1138510 1380842
35564 1380842 1315546 941515 707255 777203 915732 1045575 1281970 1447033 1203169 694705
35554 694705 446962 577948 677508 521091 350583 359774 408892 372917 358971 472621 683760
35543 683760 945725 1178589 1216966 1057070 994227 1195668 1361182 1190977 934976 1015168
35533 1015168 1335962 1476434 1367714 1257785 1181631 998663 805859 792998 825457 663217
35523 663217 429998 377274 390190 249934 151294 377519 686536 649838 397801 361365
35513 361365 458786 264896 -138940 -247387 -19742 61224 -159951 -311644 -205007 -75516
35503 -75516 -41788 41427 117377 -62547 -384270 -433788 -190251 -54836 -121513 -47224 256289
35492 256289 441168 371611 334650 445196 448903 301049 340750 663370 883553 767316
35482 767316 572483 515357 414094 130979 -114840 -159171 -172495 -253646 -177749 152172
35472 152172 404637 300716 64338 69463 301646 464260 415411 253411 127828 145830
35462 145830 326087 531875 586483 495919 394247 291926 107204 -87138 -126094 -45224
35452 -45224 -27517 -74626 -17567 167713 334351 405196 371221 166548 -142793 -218092 103420
35441 103420 394476 151406 -428801 -720078 -582640 -404004 -328364 -138635 107625 75065
35431 75065 -118025 76101 669907 936362 487190 -113647 -203344 101948 307499 294590
35421 294590 210393 39077 -235293 -359443 -137702 213010 370862 327420 222307 41491
35411 41491 -237994 -468596 -551048 -571507 -527604 -250986 189077 393380 209190 6487
35401 6487 76538 161641 -45992 -321512 -262839 80330 376597 546637 682441 676060 406382
35390 406382 116680 129080 306797 262650 16765 -19199 301557 646614 683943 421191
35380 421191 35100 -306396 -416816 -213564 62333 44495 -252267 -393373 -102372 366977
35370 366977 580028 443388 207458 84660 52884 -3143 -99637 -133326 -9889 214753
35360 214753 335074 196449 -95726 -255739 -161225 -26335 -117118 -362665 -448064 -311265
35350 -311265 -283043 -561068 -797515 -554288 -23173 172381 -101914 -302387 -116977 -1477
35340 -1477 -403462 -925084 -857979 -279769 40691 -249873 -696093 -783660 -518447 -145194
35330 -145194 192405 328167 70599 -435994 -715741 -559977 -307453 -317526 -479563 -490730
35320 -490730 -342019 -241813 -242844 -209896 -62885 124695 206844 79430 -177776 -279507
35310 -279507 -45940 288619 348971 191645 247589 629074 896171 691611 249589 31477
35300 31477 141108 347143 447604 375381 138269 -138027 -270797 -259729 -267819 -284051 -110798
35289 -110798 185187 189009 -252351 -689229 -653806 -285955 -29893 25501 108337 267569
35279 267569 333596 267455 180574 81595 -67065 -121129 75336 333857 265261 -211215 -767869
35268 -767869 -1072800 -1057931 -817109 -496601 -284797 -274572 -325240 -252150 -116583 -112852 -217235
35257 -217235 -208567 -30852 124484 128643 71990 64097 89936 117139 148303 110651 -113511
35246 -113511 -471217 -721428 -713638 -546392 -386629 -270092 -146766 7941 200410 422622
35236 422622 586309 569183 394036 247742 243156 266793 153498 -80075 -281850 -375464
35226 -375464 -410039 -431852 -413524 -313680 -133064 91363 286022 336027 158524 -183429
35216 -183429 -490891 -601005 -530950 -421781 -366186 -335481 -261566 -137296 -25182 4322
35206 4322 -51470 -88366 26008 265439 385587 181971 -200960 -383840 -216155 54282
35196 54282 158572 146843 192286 258755 219229 165692 284275 472630 415804 78921 -191713
35185 -191713 -158630 2700 34972 -32515 -55045 -93003 -291036 -563064 -677687 -618078 -598358
35174 -598358 -692850 -680905 -372067 67285 264826 69935 -291744 -487892 -399001 -138504
35164 -138504 135545 322610 355232 227806 67204 36224 123491 166201 127914 168604 334334
35153 334334 390741 165882 -117654 -118839 129073 293610 242731 154847 144946 111224 9248
35142 9248 -30610 34471 47655 -73985 -188181 -170680 -89863 -28718 29734 17369 -245051
35131 -245051 -699181 -933893 -678831 -217032 -20552 -120081 -148036 69204 290509 258429
35121 258429 44532 -103820 -75622 69181 268860 522284 779109 865101 626464 179640
35111 179640 -99850 21135 309797 341287 67886 -142729 -74351 42290 -50940 -219971
35101 -219971 -189594 7190 124517 99166 57410 40062 22043 118756 445124 809081 886639
35090 886639 714442 665858 878137 1054499 964264 799608 820258 926635 864852 658242
35080 658242 532221 523235 461443 308305 243070 379926 600694 719529 670679 503518
35070 503518 317573 221246 238331 246250 116053 -98620 -233071 -238177 -180295 -57348 167386
35059 167386 357799 306878 109848 138149 495820 796478 713719 486738 553174 870494
35049 870494 991265 730720 367557 172731 102514 34388 -13284 -18064 -52098 -123528 -130364
35038 -130364 -58564 -12686 15601 164891 413146 537926 472052 418593 475106 434606 149923
35027 149923 -166547 -223605 -16359 275699 533346 668793 604223 457873 473137 589511
35017 589511 447128 53135 -7969 578032 1234320 1259115 852306 725688 947244 931432
35007 931432 494668 140843 203016 405755 470547 523804 657249 663479 507352 537125 892893
34996 892893 1177006 1067618 819778 773527 787565 608064 422835 527803 722911 598387
34986 598387 257231 199925 543998 868551 869997 725045 702442 792992 880369 990502 1183992
34975 1183992 1373543 1409313 1274091 1112610 1094202 1243429 1383862 1326087 1152767 1164100
34965 1164100 1431767 1602679 1357619 897573 683007 790007 864116 706633 561925 716479
34955 716479 1082869 1342740 1332313 1143047 954459 885031 935661 997675 957903 818810
34945 818810 663234 529626 424030 414705 555588 723798 717128 543359 427802 483197
34935 483197 573214 591812 661994 895210 1133040 1151581 1026943 1070271 1412577 1826234
34925 1826234 1974444 1731560 1272709 932930 924447 1103106 1107796 840572 646276 807815
34915 807815 1047017 892237 452786 349882 797816 1251458 1213899 939606 939783 1156073
34905 1156073 1156543 946280 987427 1418892 1796474 1742379 1426026 1220285 1220853 1298921 1361234
34894 1361234 1376423 1345996 1367689 1533087 1716725 1727126 1691842 1933618 2383663 2547083
34884 2547083 2237790 1910795 1978400 2207796 2174730 1954929 1899979 1986543 1894611 1594962
34874 1594962 1381566 1370490 1383908 1329580 1349427 1581171 2034204 2645257 3200701 3320514
34864 3320514 2842327 2145418 1787648 1898194 2205900 2516447 2806291 2986106 2988753 3010531
34854 3010531 3261773 3556834 3555922 3309133 3113446 2953629 2619159 2282111 2330330 2630126
34844 2630126 2627098 2262709 2085805 2277410 2305479 1864094 1434991 1462144 1621807 1476734
34834 1476734 1281443 1458071 1718276 1473419 854903 561454 798584 1088525 1140119 1222626
34824 1222626 1529775 1769851 1661820 1407792 1366744 1536544 1637619 1554931 1483448 1695820
34814 1695820 2262311 2946460 3367321 3355441 3120265 2946997 2803561 2452958 1913991 1541448
34804 1541448 1581838 1866897 2054663 2018363 1900332 1913761 2184123 2664331 3099491 3177138
34794 3177138 2842676 2413685 2258866 2385245 2471422 2329613 2182435 2345540 2719709 2827727
34784 2827727 2418531 1813391 1473722 1410010 1309051 1135866 1206136 1610067 1982179 2054558
34774 2054558 2087159 2432397 2942170 3207533 3228337 3390507 3787621 3999275 3675762 3014310
34764 3014310 2472226 2243030 2198152 2159503 2038886 1843762 1723783 1900472 2372731 2782673
34754 2782673 2761415 2353303 1925928 1720453 1692442 1752308 1898316 2063674 2094721 2021228
34744 2021228 2139966 2638672 3282542 3678511 3739914 3665293 3547434 3292113 2925691 2679871
34734 2679871 2650731 2601135 2271124 1742487 1337044 1249457 1418625 1679431 1892180 1960521
34724 1960521 1858385 1659589 1484472 1420578 1504429 1711549 1922368 1975765 1831923 1647147
34714 1647147 1642635 1930993 2485871 3224712 4098693 5140533 6406111 7806396 9039754
34705 9039754 9789623 9950594 9568045 8671857 7376801 6062270 5150995 4668107 4261238
34696 4261238 3695828 3086990 2607467 2253674 1993994 1878024 1870408 1804130 1617627 1441883
34686 1441883 1379315 1404486 1511228 1696751 1784425 1581438 1241383 1113563 1208478 1236089
34676 1236089 1205320 1453838 1968960 2279085 2243622 2326713 2755214 3031960 2735241 2221071
34666 2221071 1997177 1925123 1641606 1298472 1222467 1239958 1042714 904619 1314044 2132721
34656 2132721 2822753 3309356 3903077 4504489 4612957 4103360 3373608 2737506 2215627
34647 2215627 1862019 1751524 1702079 1508563 1340102 1417232 1493550 1227308 859080 875657
34637 875657 1173242 1235225 1002520 868546 929573 962659 1046162 1444746 1940886 2050240
34627 2050240 1866277 1915971 2209006 2246419 1967486 1823162 1860145 1629730 1123329 886682
34617 886682 1019634 976988 612391 496670 859544 1122214 925600 774994 1124629 1568062
34607 1568062 1537725 1198540 1049585 1122606 1122752 980533 804532 610067 441444 440352 546631
34596 546631 498856 308630 294995 502892 610919 575283 765785 1240010 1508277 1313898
34586 1313898 1048412 1067316 1169421 1103819 1045744 1198631 1411913 1529591 1652368 1766208
34576 1766208 1605447 1175727 917397 1057753 1281564 1311789 1324814 1522168 1770496 1917167
34566 1917167 2008965 2017912 1838781 1681317 1899762 2322427 2392070 2098088 2050441 2443035
34556 2443035 2705797 2454620 2050901 1916339 1989705 2136815 2381251 2470809 1992753 1215005
34546 1215005 1004182 1569403 2115740 2124852 2109717 2603672 3222232 3319634 2897992 2317071
34536 2317071 1717971 1234413 1184309 1560739 1831977 1628827 1166738 769443 530861 583838
34526 583838 1035412 1513429 1499351 1182602 1190562 1479052 1442193 1109136 1113823 1426084 1353285
34515 1353285 936638 1014636 1674459 2031029 1839565 1869255 2303555 2309017 1695319 1449453
34505 1449453 2007156 2509516 2418427 2337716 2557812 2376904 1638323 1359654 1989917 2561965
34495 2561965 2400944 2177407 2521412 3146921 3980584 5392028 6662487 6234763 4293367
34486 4293367 3001803 3295726 3667554 3077736 2597981 2969042 3101417 2443416 2283557
34477 2283557 3149893 3508362 2661316 2234702 3095193 3666960 3104874 3037055 4213204
34468 4213204 4790560 4079363 4302544 6268629 7390336 6702777 7276443 10486329 13021453
34459 13021453 13358033 15382914 20993863 25829493 28185404 34219741 46388929 56407605
34451 56407605 62232518 82136862 131391753 187893045 204948501 165344382 103492728
34444 103492728 63566575 52518218 48010414 37161157 26882857 22975519 20187855
34437 20187855 14592174 10320560 10026093 9693479 6722700 4438900 5085245 5640476 3878452
34428 3878452 2320860 3036842 3913783 3039345 2070604 2500804 2766747 1647719 800155
34419 800155 1498345 2208726 1621056 1008800 1523202 2026411 1554558 1215841 1790516 2039515
34409 2039515 1200593 667496 1380913 1959727 1308501 793729 1789910 3121538 3171690
34400 3171690 2898450 4447756 7753598 10468752 10724666 8618600 5559790 3195408
34392 3195408 2407301 2597976 2484042 1840706 1537939 1774700 1683450 1003786 609567 854248
34382 854248 916419 406277 109725 432989 591815 129834 -184895 184640 550861 326039
34372 326039 52461 236962 385767 81984 -143309 118738 349888 219353 360147 1129352
34362 1129352 1697494 1349681 698852 616077 852114 708964 285247 82130 39515 -141834
34352 -141834 -292236 -167356 -21248 -121189 -213527 -38384 168629 175288 169406 250920 143465
34341 143465 -188209 -308576 -80388 40378 -164784 -295548 -124596 21177 17023 239196
34331 239196 737612 972964 765419 618011 708546 520979 -64713 -321232 121519 579769
34321 579769 438955 52425 -120518 -343079 -835283 -1056904 -587625 3258 -8860 -400875
34311 -400875 -486598 -166471 200858 489908 743205 849814 809559 887849 1113124 1130342
34301 1130342 876101 767802 892644 746209 177950 -187508 40687 350388 192237
34292 192237 -206499 -412557 -459452 -449108 -212246 140093 95679 -327966 -359958 275371
34282 275371 777110 563047 215947 377918 617968 318794 -115904 40891 576050 777170
34272 777170 612033 512305 458811 227696 117141 475514 861536 609341 -56393 -363612
34262 -363612 -198304 -86915 -180694 -146918 34010 24073 -104073 181303 1027243 1890774
34252 1890774 2209702 1960061 1488304 1127791 1001330 959224 745731 354568 52859 -37241
34242 -37241 -85006 -175278 -173228 -96725 -168539 -336932 -257392 61593 164982 -85139 -283883
34231 -283883 -263264 -381311 -713308 -736260 -259723 108323 -51021 -287667 -185430 -159839
34221 -159839 -629930 -1110024 -947489 -376422 -31000 45740 106747 -28471 -522822 -821986
34211 -821986 -352990 422392 568537 34601 -410005 -385009 -198406 -77030 93319 293369
34201 293369 312176 155537 2113 -140012 -288969 -228693 136079 439266 354901 134310
34191 134310 157719 311331 327083 333575 494809 527200 207705 -61109 128644 421442
34181 421442 269463 -135149 -268194 -219279 -387971 -572888 -273246 320537 531016 261890
34171 261890 41047 99691 185954 208169 323699 459494 416468 335996 432219 469742 184596
34160 184596 -44317 281863 840504 907294 502957 249400 288167 288555 364549 929533 1672318
34149 1672318 1756791 1145658 699860 799450 890215 643243 520557 785249 925811 626237
34139 626237 487523 1118487 2102634 2513041 2057814 1193120 428311 -11227 -69103 172948
34129 172948 488172 673788 657247 427213 56053 -247981 -366552 -464285 -661942 -690471
34119 -690471 -291171 216064 298448 26386 -59465 178013 361009 339436 382204 563049
34109 563049 593512 383116 184551 88464 -48330 -112623 187555 667028 769489 476710
34099 476710 409387 814059 1173772 1129221 1075944 1423826 1880029 1952860 1675394 1362425
34089 1362425 1072166 757230 576294 611565 578856 222264 -253946 -484809 -424049 -227405
34079 -227405 62823 395027 526229 308788 -13921 -90527 91188 260446 233186 49741
34069 49741 -131561 -162008 -53042 -30059 -243920 -454919 -304140 107056 289489 69353
34059 69353 -196030 -209731 -103557 -44773 84924 360757 541308 416558 138980 -49550
34049 -49550 -156011 -268806 -314029 -216519 -77897 13387 131977 298820 349284 199039
34039 199039 20028 -15160 46464 104393 158445 179907 81599 -75558 -118043 -90799 -229817
34028 -229817 -499350 -531514 -187751 203741 365237 417221 466662 293466 -181849 -509244
34018 -509244 -271149 216273 262337 -253885 -746757 -706227 -243299 174978 244186 20961
34008 20961 -198131 -154822 104623 275456 188219 33121 56189 185616 175835 14541 -73093
33997 -73093 1435 62138 -30271 -146428 -79837 130581 212974 7151 -311011 -438714 -324255
33986 -324255 -187163 -159112 -117932 17363 60459 -151773 -428524 -477741 -363095 -372650 -500314
33975 -500314 -433877 -83549 232483 222392 -48071 -344735 -517274 -479382 -204036 154621
33965 154621 362646 412913 509856 695779 751680 549948 248636 38174 -68867 -115501
33955 -115501 -110523 -128593 -241844 -298730 -76890 271335 289550 -115895 -443341 -259867
33945 -259867 218331 479598 380064 151499 -34744 -174303 -221098 -82098 206533 498337
33935 498337 691862 740005 611587 382945 239147 234477 198957 49652 12939 291062
33925 291062 654420 682038 358537 111820 217701 460964 506763 359038 247788 221755
33915 221755 109069 -150434 -366231 -348453 -133304 109754 237653 123624 -300546 -818743
33905 -818743 -958581 -534290 -17121 -10706 -444140 -698095 -496929 -182966 -50676 27020
33895 27020 120598 -21795 -428447 -631390 -363188 -29606 -10125 -8712 289182 429239
33885 429239 -121781 -863170 -796646 57398 644061 422247 -1342 9566 242947 250302
33875 250302 106902 96782 178633 195293 193517 189989 16839 -307711 -463957 -350689 -277181
33864 -277181 -367384 -275146 162598 512045 437820 329113 657466 1087392 902156 130998
33854 130998 -418773 -265637 172561 249121 -84321 -346573 -203307 140226 206471 -169204
33844 -169204 -597425 -577097 -127528 233614 165617 -106235 -180640 1095 193541 191014
33834 191014 -44555 -422531 -726645 -737828 -497395 -299656 -316774 -409119 -406917 -363697 -392341
33823 -392341 -450796 -443130 -369231 -256893 -111029 -11890 -67456 -201273 -218257 -138437 -176324
33812 -176324 -305233 -194193 246483 598252 468121 20165 -293022 -307576 -190959 -98310
33802 -98310 -67193 -130604 -278080 -366481 -263751 -48795 54951 -77915 -335329 -424640
33792 -424640 -127685 376438 563944 177438 -344064 -384203 15275 281441 200095 113392
33782 113392 188057 133907 -135147 -191923 190370 557970 444681 60671 -153561 -246342
33772 -246342 -492482 -738849 -604551 -164123 109585 19286 -178925 -227216 -122982 38908
33762 38908 162738 127754 -72094 -228131 -176985 -49548 -44097 -104535 -74592 -19191 -112754
33751 -112754 -320064 -446505 -415134 -281342 -82482 134157 256255 243622 178003 64491
33741 64491 -187415 -463702 -447081 -115122 111040 -24392 -219030 -152479 -40892 -227079
33731 -227079 -547713 -607877 -438748 -365870 -413569 -367893 -284332 -377673 -487950 -230837 302204
33720 302204 538190 223468 -237434 -392266 -289996 -239828 -348796 -506204 -611255 -642833
33710 -642833 -625995 -612991 -604640 -497044 -227697 75253 241576 290401 344545 398090 368451
33699 368451 303099 316573 373389 339164 207660 95587 56427 55773 69668 73410 21550 -48897
33687 -48897 -28426 53326 27135 -84247 -4247 340056 593886 463224 141152 -42489
33677 -42489 -98444 -166714 -136381 109870 342730 328301 272497 436995 563810 261856 -222103
33666 -222103 -272267 134684 399089 242206 23621 14298 -6727 -221934 -408368 -370587
33656 -370587 -267262 -234642 -113756 158180 277173 24011 -323144 -356296 -87632 153225
33646 153225 174938 21039 -208510 -378425 -302847 48410 416011 517003 378687 260001
33636 260001 307496 419422 409542 218702 -9392 -46407 157750 343327 195383 -260090
33626 -260090 -646725 -650387 -325269 24366 144238 -6766 -274137 -444634 -417401 -235318
33616 -235318 49383 409090 689392 643150 290909 44518 218785 577959 652238 373410
33606 373410 80806 -857 57268 170311 348093 524793 595142 617573 691158 673238 355009
33595 355009 -110693 -323572 -180124 64942 281771 587784 930157 993279 673834 263590
33585 263590 3578 -173468 -305771 -223486 64406 200597 -4567 -228964 -138909 79588
33575 79588 72819 -64926 11224 241961 208379 -176234 -484865 -407461 -178419 -163821 -316398
33564 -316398 -331379 -173491 -115130 -274957 -432693 -397593 -294429 -299436 -312051 -160762 19684
33553 19684 -35823 -242998 -266681 -110402 -152337 -474193 -644094 -418764 -179771 -293200
33543 -293200 -481960 -337833 -76277 -152557 -388271 -202066 379448 672585 366058 -76300
33533 -76300 -217082 -229790 -404303 -600603 -563698 -399167 -365117 -441597 -409348 -181612 151237
33522 151237 442640 524906 323785 32659 -62625 -952 -94905 -385889 -510858 -263456
33512 -263456 77580 195683 172644 216591 256687 119089 -112926 -213221 -134534 21897
33502 21897 205330 370135 392926 255828 174434 335042 618364 759087 668362 457050
33492 457050 268220 207698 288802 339357 151422 -169179 -241030 55622 343862 266364
33482 266364 -19174 -143304 -109487 -222811 -541026 -752876 -618436 -259008 50384 183255
33472 183255 187325 142863 78861 -17713 -155502 -304978 -410930 -419871 -288854 -39285 158587
33461 158587 89062 -203779 -368870 -196960 45388 -647 -225569 -238037 -1471 158802
33451 158802 149295 212339 379866 343816 33020 -177564 -73544 34274 -159890 -462870
33441 -462870 -531347 -360933 -117839 180759 499952 618002 443936 213252 92426 -66732
33431 -66732 -298123 -280587 91877 348499 141594 -110595 132492 615393 695327 388579
33421 388579 243705 329512 174840 -270589 -429019 -39192 391269 364841 55205 -123951
33411 -123951 -139368 -202917 -381519 -620001 -849393 -875955 -497956 83443 340910 120204
33401 120204 -119277 -6444 204114 120345 -143077 -224377 -125806 -108939 -174763 -108315 65584
33390 65584 111931 36042 96501 339670 484089 346258 75266 -133603 -290391 -456345
33380 -456345 -568348 -563920 -517188 -520981 -561436 -606622 -677929 -725775 -591631 -257198 -3341
33369 -3341 -96635 -365634 -339781 129662 608029 593199 150201 -186901 -100251 172240 251249
33358 251249 135538 104494 231844 267209 17865 -380060 -661257 -730651 -654086 -500346
33348 -500346 -332946 -235858 -184178 3914 389012 672877 497609 -33924 -415161 -366034
33338 -366034 -124596 4277 89371 330105 615740 651154 403161 111938 -76086 -187098
33328 -187098 -181542 26276 292964 321429 79602 -158227 -251963 -341516 -459179 -386721 -87811
33317 -87811 103007 -5537 -118419 36686 195169 -23454 -455478 -647502 -577886 -589849
33307 -589849 -715094 -632256 -295569 -49045 -33610 -5365 122710 78461 -219319 -400424
33297 -400424 -229641 -29694 -167220 -468863 -544969 -428788 -471344 -756044 -1016097 -1076727
33287 -1076727 -1048235 -1075194 -1139966 -1146949 -1053446 -901947 -775494 -666636 -407505 85311
33277 85311 495367 346566 -324944 -875329 -838343 -477396 -278212 -237703 -70304 150873
33267 150873 88377 -228884 -385880 -211500 24938 119256 208400 398939 501950 358459
33257 358459 140311 82836 124727 58491 -100407 -137338 30332 254037 382419 423963
33247 423963 441038 402257 233300 -17807 -158751 -48324 220475 401393 355234 159970
33237 159970 -33192 -149297 -173968 -115751 -51333 -97335 -255577 -386808 -415875 -442894 -547259
33226 -547259 -609646 -479145 -225684 -61435 -57322 -78590 23542 261505 517665 624126
33216 624126 503565 304197 293164 522477 724655 662933 449081 349529 404437 448260
33206 448260 418532 412230 469541 517088 531258 580270 685078 774417 787141 719548 592412
33195 592412 450540 336185 198988 -44344 -280696 -237719 82336 245175 -58284 -503105
33185 -503105 -548467 -218730 -20859 -132181 -166532 160065 598404 807562 845683 949262
33175 949262 1098307 1074646 768346 213207 -501109 -1156751 -1442818 -1289747 -1015011 -930711
33165 -930711 -966832 -892577 -719939 -606268 -508386 -270492 15265 79910 -86958 -191977
33155 -191977 -82895 57096 57702 23172 84157 128698 9140 -141516 -60664 237426 449287
33144 449287 389535 201157 92626 45010 -86498 -291094 -390406 -286038 -78080 83985
33134 83985 150880 135251 45946 -57702 -54036 74104 141083 -14988 -256993 -294966 -104454
33123 -104454 26387 -73068 -223451 -233280 -225248 -375645 -509156 -290272 244021 685211
33113 685211 807548 793773 834237 839505 712983 603361 656827 766116 809964 902547 1117510
33102 1117510 1199205 919722 544340 506722 720740 690219 297403 4126 187878 715207
33092 715207 1279479 1737774 2028560 2264346 3027270 4892217 7278567 8445583 7301032
33083 7301032 4804877 2885808 2265167 2100594 1563402 837271 433766 362549 376602
33074 376602 470749 700543 865568 748928 441838 159421 -63404 -279919 -435973 -462419
33064 -462419 -403547 -318973 -219349 -173680 -267440 -388986 -312143 -67865 49901 -56078 -131355
33053 -131355 -5617 135288 91173 -31945 -44521 38500 123163 215012 306205 319271 294473
33042 294473 362046 419040 186478 -256553 -408349 -62204 318674 267274 -23688 -83865
33032 -83865 127575 321736 400138 427033 321348 37050 -144394 36942 342633 367332
33022 367332 193730 229254 506422 663769 574234 481550 507744 521830 544927 792799 1201666
33011 1201666 1375689 1198930 1117809 1576604 2427902 3096740 3153716 2622658 1904205 1463331
33001 1463331 1414898 1393196 1016217 437806 165958 347715 571950 458796 127166 -72074
32991 -72074 -39648 35440 -23781 -188758 -275784 -150652 81456 167736 72434 84484 381673
32980 381673 685811 640572 360570 237233 323597 335740 198154 123764 147469 54293 -159813
32969 -159813 -220893 -83827 -45580 -190886 -182748 166437 541771 623715 551906 566354 534089
32958 534089 230548 -156285 -227380 40296 273186 223060 15997 -111158 -85249 22163
32948 22163 128228 204204 263551 295517 237954 89162 -4774 82149 247065 300376 255000
32937 255000 228755 126342 -236605 -692935 -802896 -458960 -29424 213309 395735 608428
32927 608428 610792 250584 -192100 -391246 -396959 -391394 -355665 -290350 -418159 -784494 -967961
32916 -967961 -615639 -7400 343868 404386 467110 527301 354567 41072 -78439 10921
32906 10921 40678 4780 132072 330988 233647 -140207 -324234 -143415 24766 -85367
32896 -85367 -217746 -103163 93864 148885 191770 404113 637881 674925 578352 469482
32886 469482 249724 -115744 -331388 -183321 35810 -52199 -277697 -198283 130780 195324
32876 195324 -181292 -587684 -657049 -505022 -391120 -333734 -262482 -242841 -327402 -405655 -386468
32865 -386468 -346289 -351387 -317146 -176012 -4961 124092 219063 195803 -106907 -587317 -834114
32854 -834114 -641076 -312665 -197479 -177450 36309 322717 310946 25001 -95515 145653
32844 145653 431140 434893 257422 185660 268054 315812 184835 -72150 -253325 -179295 85246
32833 85246 233518 101702 -46624 120792 456187 505153 198830 -63746 -85883 -139245
32823 -139245 -374235 -453592 -109670 332704 409102 198874 108138 172887 52023 -363914
32813 -363914 -766315 -864004 -676854 -377162 -110927 8197 -44734 -146885 -187317 -222580
32803 -222580 -313174 -343294 -227702 -145450 -281611 -466342 -395298 -111923 71019 54795
32793 54795 1060 -45712 -189968 -350901 -297328 -53633 110539 142146 255841 445425
32783 445425 375514 -72480 -538882 -689159 -640316 -647111 -670501 -535531 -279825 -70583
32773 -70583 48284 97664 28066 -136988 -190768 839 275725 404915 396087 379054 358768
32762 358768 297603 277393 342145 340906 196505 178173 574712 1180155 1456537 1200395 718692
32751 718692 326194 32345 -171294 -96518 305792 663685 580618 196733 25224 250422
32741 250422 503002 401793 34344 -256273 -334240 -301838 -227935 -109849 -34002 -108486
32731 -108486 -235642 -187385 63971 302324 382178 362917 291917 105599 -171041 -366824
32721 -366824 -402277 -355811 -228970 55654 330741 236396 -215210 -519651 -393516 -204745
32711 -204745 -329218 -489013 -241863 199585 264323 -43283 -162509 113931 381012 341625
32701 341625 211140 247519 360368 376983 313660 224239 106070 55620 193362 383064
32691 383064 378664 267597 351583 559330 465861 -4993 -397709 -402419 -233399 -146572 -66622
32680 -66622 70861 77137 -111920 -246097 -226468 -331709 -682155 -912324 -724629 -369653
32670 -369653 -212590 -204496 -160508 -173843 -323557 -332781 2741 354111 328214 133359 245739
32659 245739 608761 714125 380056 -59705 -301592 -351356 -270721 -60354 178540 307364
32649 307364 387938 566611 748343 683935 364782 52946 -72598 -61970 -21634 -19379 -113771
32638 -113771 -273555 -333719 -215153 -88479 -144813 -339643 -534288 -701146 -794512 -659385
32628 -659385 -320402 -109172 -215362 -376919 -335258 -284989 -460214 -592413 -312481 149169
32618 149169 259114 18716 -113225 -34267 -71064 -251959 -201236 130506 296872 124743
32608 124743 36212 311718 585375 440104 43332 -211420 -314549 -461614 -558893 -367050
32598 -367050 13878 205584 51395 -228990 -351524 -234229 -5196 102956 -58432 -355107
32588 -355107 -468798 -292589 -69735 -23128 -48030 44493 167942 91927 -186604 -458863
32578 -458863 -625389 -749953 -806368 -622730 -157457 339677 552282 404347 77404 -206319
32568 -206319 -340255 -320338 -183668 4259 163057 262011 350370 464177 523549 410920
32558 410920 157830 -46519 -68878 33882 125963 137976 67326 -44437 -86178 31618
32548 31618 199158 188884 5702 -42941 217799 515779 473951 129426 -136580 -109807
32538 -109807 54913 114611 19134 -91377 -37844 217671 456304 378912 11643 -238074
32528 -238074 -115682 78119 -109547 -617621 -926487 -715614 -166295 354218 615457 548313
32518 548313 250667 2329 16383 144735 66735 -223712 -387160 -230653 39936 141987
32508 141987 57079 -52826 -84433 -45693 4601 11702 8940 120398 350957 448905 187457
32497 187457 -262623 -488479 -361239 -156873 -120284 -160332 -69808 147311 285650 179300
32487 179300 -112541 -305420 -137244 277439 456350 94467 -509699 -796879 -611989 -264419
32477 -264419 -25185 104474 154762 67508 -126466 -282745 -351975 -397554 -411856 -354252 -343339
32466 -343339 -535213 -823013 -933377 -803122 -588803 -367548 -152754 -116516 -376270 -608414
32456 -608414 -368560 173046 348908 -33434 -380284 -194324 245755 398453 200757 -72563
32446 -72563 -310139 -513249 -534238 -280778 15946 94315 44940 75867 92791 -121428 -460644
32435 -460644 -613632 -546717 -503333 -548813 -462217 -134437 202418 250589 -4856 -294667
32425 -294667 -322868 -4558 481303 858336 980119 865910 570801 170054 -149745 -208466
32415 -208466 -96421 -96844 -260803 -302670 -50757 246307 261829 41889 -105641 -27994 173947
32404 173947 350248 411562 315408 103818 -102092 -241150 -356860 -445432 -409921 -245440
32394 -245440 -99671 -55799 -32419 14431 -369 -77838 -64620 68754 110216 -87989 -413359
32383 -413359 -726108 -1009706 -1152905 -937654 -468989 -242405 -470016 -705171 -529873 -252584
32373 -252584 -400827 -809366 -856816 -473199 -221292 -344823 -418834 -150041 91888 -87932
32363 -87932 -406339 -307465 191826 528714 375508 -3954 -201412 -144551 -11495 109718
32353 109718 275910 474168 546513 397045 167989 90917 196342 296821 261865 170146
32343 170146 143351 163275 130730 -1081 -214461 -434002 -503732 -320324 -51562 -18513
32333 -18513 -258635 -441401 -366986 -270212 -382534 -474240 -213902 205858 261272 -136578
32323 -136578 -514508 -515238 -288452 -104419 22977 141119 131340 -65138 -237146 -181268 -22364
32312 -22364 -22902 -209458 -413986 -568631 -717178 -804674 -700400 -422258 -138843 57204
32302 57204 203248 295134 255758 115558 41316 107845 199133 228276 294717 483832 652093
32291 652093 609310 431173 362699 428818 381190 90934 -222495 -273057 -55310 218027
32281 218027 383378 387590 211559 -87068 -325251 -343685 -159910 118637 414548 594714
32271 594714 453042 8123 -339152 -247424 65576 103385 -186569 -362871 -187684 47844
32261 47844 39094 -76323 -22181 149039 177869 2872 -212649 -338381 -352006 -251127 -61076
32250 -61076 142086 319912 473997 498272 223646 -275658 -636279 -635019 -474757 -467437 -626632
32239 -626632 -769340 -814216 -736339 -426588 93741 458609 304838 -208304 -532074 -381462
32229 -381462 1522 236799 203555 19244 -142588 -144266 31474 229875 280753 205512
32219 205512 123704 -9091 -345645 -802655 -1019553 -791688 -369874 -163196 -249663 -357752
32209 -357752 -287695 -157840 -178587 -334313 -428228 -374203 -272277 -191390 -73151 66044
32199 66044 43454 -200433 -391553 -253115 69623 208468 121168 103250 273155 421300
32189 421300 419281 391871 380204 235656 7888 20775 327951 506747 302814 74941
32179 74941 199927 412778 251607 -134276 -226428 -24996 -43642 -421984 -680294 -511209
32169 -511209 -253515 -302926 -500082 -459997 -199286 -49326 -111361 -161360 -57868 58056
32159 58056 33871 -32518 61680 296863 396330 163791 -239315 -473367 -442781 -370106 -414898
32148 -414898 -420601 -173804 245926 554538 593181 401234 74876 -244828 -338620 -108043
32138 -108043 221885 322583 182344 99755 244723 438827 437765 259081 128402 200280
32128 200280 415017 582553 563077 389284 219394 160907 174724 167696 111609 31306 -54855
32117 -54855 -136499 -213003 -312010 -426754 -444884 -270417 -14494 101974 44398 -32791 -85878
32106 -85878 -227129 -422303 -438985 -206383 60202 213399 336380 413274 217685 -236756
32096 -236756 -513841 -337874 -19804 49102 -8206 112778 279674 149873 -184977 -305158
32086 -305158 -110379 111211 185229 178183 89340 -146522 -389806 -436381 -376882 -427237 -494794
32075 -494794 -351821 -149919 -257383 -607658 -721877 -422462 -53104 67319 -33725 -244997
32065 -244997 -497786 -581232 -297334 132967 272054 116324 54952 148369 33250 -338247
32055 -338247 -495920 -226480 41201 -56838 -265321 -230032 -83367 -91892 -140266 -18461
32045 -18461 111591 -17992 -306280 -470729 -479305 -443959 -326070 -100210 32211 -45225
32035 -45225 -80400 135802 314411 69787 -401583 -528722 -181780 180449 197994 35720
32025 35720 17897 155543 213920 90763 -31835 82017 372671 455603 81170 -440862
32015 -440862 -550559 -191395 95358 -54942 -357406 -410038 -300814 -322371 -409367 -307935
32005 -307935 -85732 -7441 -36385 81216 301622 295612 -23518 -375703 -546777 -596188
31995 -596188 -601090 -531865 -437527 -440417 -479613 -354491 -91170 34479 -66585 -133313 35114
31984 35114 272896 327108 224956 165294 205779 255625 266828 242554 126937 -126045 -389173
31973 -389173 -434240 -215444 32433 68031 -31929 60130 484323 922878 911438 404980
31963 404980 -139788 -307391 -173374 -80616 -132950 -148071 -48728 -24746 -230252 -517604
31953 -517604 -608751 -432548 -172411 -30402 -47815 -135007 -172375 -62197 221548 558735
31943 558735 714420 557089 249517 110958 248005 430098 399176 186754 12601 -24926
31933 -24926 -4785 -9491 -74026 -260709 -589755 -898052 -947569 -703239 -373212 -178571 -204465
31922 -204465 -419421 -663340 -672952 -344375 50813 136509 -102238 -360560 -477307 -556916
31912 -556916 -643223 -630775 -558354 -620739 -771305 -681051 -269257 71960 7187 -295121 -486219
31901 -486219 -518934 -531982 -509046 -362003 -169160 -49546 44515 166873 185969 7944
31891 7944 -179209 -151489 7170 59884 -27490 -130555 -215478 -294029 -282823 -162640 -119720
31880 -119720 -265349 -389331 -284781 -134871 -233133 -480532 -550860 -439449 -423435 -532060
31870 -532060 -498747 -267307 -128251 -251097 -433843 -445562 -325577 -214511 -139273 -87790
31860 -87790 -79690 -55523 103028 342665 419091 215729 -78582 -208473 -133288 7535 79614
31849 79614 25541 -142581 -350455 -520461 -638566 -708915 -692700 -597233 -558605 -675872 -800970
31838 -800970 -674693 -278352 104965 198033 -21521 -371847 -642813 -723268 -650858 -526405
31828 -526405 -343624 -14137 373502 518379 298621 -1300 -92552 -112309 -326631 -570430
31818 -570430 -422621 92875 431880 250180 -180475 -417141 -373651 -227689 -92597 -6602
31808 -6602 -38041 -173395 -232850 -85585 139604 198635 15456 -269317 -448595 -385847 -115132
31797 -115132 125232 73398 -264399 -600404 -698106 -605651 -503288 -454395 -404196 -319845 -217777
31786 -217777 -105129 17783 119421 154021 109252 22363 -49073 -93046 -171766 -307835 -346319
31775 -346319 -98360 302667 401467 -32654 -632165 -852348 -631174 -340334 -189707 -46370
31765 -46370 172248 315924 309944 315193 425747 466506 264278 -72442 -300725 -328412 -242016
31754 -242016 -180829 -256614 -458566 -589633 -456058 -151273 36137 18293 -21024 14876
31744 14876 -1510 -96850 -45281 258779 527973 426783 19973 -341742 -443338 -318816
31734 -318816 -90834 92820 90229 -54201 -74002 159595 359307 161556 -328422 -616088
31724 -616088 -442353 -60782 165785 196008 208552 265267 277634 235047 269544 452638 648426
31713 648426 656130 457687 244254 197935 312615 441455 450647 301374 62728 -107734
31703 -107734 -81634 74292 134780 -3120 -169731 -147168 61512 302554 490432 604677
31693 604677 584960 412056 193122 -10898 -300529 -656077 -730277 -279962 321062 447360
31683 447360 82088 -161482 44338 292482 105787 -387834 -732576 -746011 -530805 -183057
31673 -183057 167298 256157 -15113 -324932 -289441 40838 313105 368496 322551 268080
31663 268080 196833 141823 123392 22880 -224990 -392465 -209317 185308 348815 117738
31653 117738 -182595 -169814 165501 521485 615447 415488 165154 168410 436979 618354
31643 618354 423372 26722 -165469 -55000 101988 128831 103476 90393 5934 -163296
31633 -163296 -263476 -205459 -94928 -45304 -48803 -100706 -244130 -410144 -432214 -325860 -328703
31622 -328703 -515413 -591841 -285665 212049 436614 217333 -149439 -284176 -122501 96537
31612 96537 142165 41293 12888 151766 260505 124696 -106722 -56182 328595 628016
31602 628016 502996 146980 -34188 13230 35502 -55367 -85705 32936 162962 179079
31592 179079 104618 -16915 -155880 -188167 -14623 174755 52590 -339573 -549055 -331166
31582 -331166 2478 79063 -3707 31668 87873 -124962 -493747 -588401 -348334 -199410
31572 -199410 -365693 -517135 -337394 -57665 -94300 -427137 -699695 -756465 -710565 -588697
31562 -588697 -298339 65892 247661 222748 252606 446010 561809 404310 156324 98446
31552 98446 183352 145715 -64332 -216193 -151454 22168 130222 140879 93998 -31853 -252945
31541 -252945 -458590 -495921 -371084 -256126 -268330 -333871 -326231 -263785 -275154 -402660 -548207
31530 -548207 -619288 -621524 -569953 -414906 -138572 143371 273029 215945 62601 -106269
31520 -106269 -274713 -425255 -503845 -477323 -385668 -322435 -371187 -526526 -643733 -521923
31510 -521923 -126195 289550 392481 149748 -87660 26053 395666 569685 303369 -104258
31500 -104258 -188661 55955 187723 -20374 -241216 -108109 206428 259404 19943 -114583
31490 -114583 68042 371641 600792 776036 855916 677736 345648 258554 509335 648402
31480 648402 342835 -98353 -211450 -53901 12059 -82534 -177389 -294955 -509430 -605537
31470 -605537 -365942 -38430 -11676 -174216 -134836 59913 45104 -110579 34333 450463
31460 450463 569956 213017 -107160 -42701 91615 1762 -43377 215137 466955 348895
31450 348895 69482 -1125 20869 -158145 -366895 -215999 213987 477582 429160 286939
31440 286939 140623 -103870 -332045 -260551 81077 306787 192394 -67981 -178588 -58526
31430 -58526 183855 361636 290023 -31686 -335093 -373008 -241978 -211269 -309033 -324148 -173035
31419 -173035 -19626 -34077 -214021 -420158 -461197 -244555 22839 -45739 -514485 -947677
31409 -947677 -962977 -723755 -584186 -506976 -244010 112866 248843 177243 182946 282826 242765
31398 242765 99275 130638 280103 162067 -252018 -505863 -396555 -306883 -540069 -815199
31388 -815199 -761632 -495251 -322953 -223493 -32002 133466 58798 -131995 -128826 86462
31378 86462 260730 286094 275829 274437 188331 4773 -150499 -181581 -90058 84054 246152
31367 246152 254418 104666 14566 144503 326027 264506 -63161 -410896 -592397 -597627 -438160
31356 -438160 -114941 251173 458801 442690 325397 246897 253383 329930 418314 422931 309745
31345 309745 164285 55038 -80950 -289292 -437378 -380632 -207838 -117894 -115671 -51609
31335 -51609 87413 177227 219490 327173 437444 348272 113446 78386 363847 604547
31325 604547 433893 4465 -244986 -187503 -87381 -161923 -337145 -434392 -387435 -261945
31315 -261945 -213221 -394173 -743614 -924608 -683774 -233321 -29451 -175155 -323907 -227265
31305 -227265 -67208 -96247 -231870 -249161 -176294 -221911 -415498 -571281 -555494 -384924
31295 -384924 -120765 137535 224968 95410 -35607 27285 109169 -101004 -502691 -640340
31285 -640340 -370020 -89769 -145001 -359817 -407032 -332229 -372953 -478811 -402184 -164321
31275 -164321 -52734 -163097 -276101 -233880 -146773 -145825 -188511 -221862 -306651 -424026 -350170
31264 -350170 57869 535034 588014 54168 -632311 -829523 -350396 320889 542559 222591
31254 222591 -115258 -10448 371937 519508 264914 -67979 -172089 -117332 -125077 -230089
31244 -230089 -320744 -353807 -366999 -373664 -377195 -417318 -492537 -506398 -392376 -221223 -80382
31233 -80382 76063 322719 556598 551896 241460 -168436 -410854 -427753 -393180 -492725 -699668
31222 -699668 -789611 -617229 -354885 -335803 -613484 -827350 -650253 -254994 -112929 -357969
31212 -357969 -606072 -483918 -109016 122164 72951 -9235 153659 565415 990031 1173866
31202 1173866 1065190 905759 1026648 1450601 1854237 2119624 2696346 3978088 5392593
31193 5392593 5704074 4453445 2620568 1500395 1315324 1374967 1229086 1012769 821419
31184 821419 487178 90127 59219 493684 860971 682020 151657 -228480 -318911 -317482
31174 -317482 -320108 -254664 -105995 73809 268195 409682 349130 104126 -51118 45180
31164 45180 181339 101305 -119956 -274494 -362671 -449854 -416776 -194345 -36252 -171499
31154 -171499 -364626 -249794 34320 15045 -372614 -694842 -681479 -520783 -420913 -304787
31144 -304787 -76875 155032 264619 244153 87794 -184388 -360029 -221607 56364 47755
31134 47755 -325335 -693168 -800224 -759720 -650857 -330204 145988 356767 82695 -315729
31124 -315729 -408140 -280155 -272829 -398525 -386367 -138416 193515 464402 592449 488468
31114 488468 192619 -39391 -33258 43980 -46234 -232525 -289564 -242816 -310289 -503454 -576781
31103 -576781 -380023 -49152 160962 98664 -179799 -412171 -337519 -20512 172884 47307
31093 47307 -177604 -260445 -309071 -485854 -607312 -431479 -161745 -206315 -517252 -642408
31083 -642408 -441508 -277890 -401330 -587478 -573620 -458523 -417767 -347421 -97328 174026
31073 174026 204441 53519 20250 199965 395499 454143 440385 432151 370670 222690 125528
31062 125528 205660 328961 211575 -202097 -621494 -745365 -592995 -377271 -158831 153919
31052 153919 484434 545291 237648 -123602 -177350 29276 153500 20424 -241166 -455009
31042 -455009 -552465 -495636 -290901 -110171 -164577 -378803 -410214 -125745 130648 -47817
31032 -47817 -557039 -865854 -678652 -286406 -143098 -267474 -289945 -39131 205320 162688
31022 162688 6653 105228 429105 549837 242231 -223320 -486286 -507195 -418431 -235831
31012 -235831 39009 225034 147850 -87917 -251371 -313140 -378190 -380752 -137375 296701
31002 296701 583480 479618 91339 -282880 -428304 -328735 -149862 -125438 -345602 -648043
30992 -648043 -788677 -674894 -367951 24245 335376 367849 121482 -116725 -108997 18414
30982 18414 2084 -158676 -287979 -372475 -481608 -464237 -133692 275092 272545 -191796 -607544
30971 -607544 -594150 -331250 -144088 -42573 88894 166344 62297 -138790 -304113 -482423
30961 -482423 -722438 -834373 -602233 -130894 247381 343618 222237 38187 -71874 -32652
30951 -32652 77830 67632 -105924 -224335 -99675 137800 198960 -10996 -335382 -570002
30941 -570002 -606413 -474164 -345252 -381668 -497805 -436361 -167861 3622 -128932 -378299
30931 -378299 -484548 -485829 -521102 -504642 -316913 -123589 -136415 -196591 4288 370982 498877
30920 498877 311192 161057 214409 165059 -223239 -637478 -588996 -89379 338499 284606
30910 284606 -115594 -393312 -268230 105935 388921 462268 484940 552675 497294 162140
30900 162140 -271138 -439398 -222512 158351 411196 395095 159627 -73081 -65085 131844
30890 131844 166368 -125617 -426246 -405301 -252347 -333172 -511810 -352723 89701 296128
30880 296128 129248 7913 88514 -33075 -482018 -648729 -103388 577819 562243 -30396
30870 -30396 -377080 -194896 5829 -121996 -272486 -122471 126170 126793 -88185 -248948
30860 -248948 -245484 -148745 -39907 -13852 -182849 -499458 -704482 -603867 -310199 -103506
30850 -103506 -129348 -304571 -440250 -402033 -219110 -64740 -68735 -163024 -189972 -112183 1152
30839 1152 126843 260786 296771 137187 -99495 -192214 -126403 -72031 -68203 14022 182809
30828 182809 288235 327109 473086 692505 658736 249270 -164502 -195267 18867 60871
30818 60871 -138619 -268099 -161482 -9162 -3608 -69281 -58570 4321 27445 52481 179660
30807 179660 355240 396946 242734 50165 -6049 55816 101489 94972 99273 91206 -40344
30796 -40344 -262495 -356414 -225117 -68538 -87703 -180946 -153415 -80686 -179196 -403753 -486274
30785 -486274 -348483 -180770 -123625 -167009 -343831 -678528 -934781 -798837 -376002 -115683
30775 -115683 -160229 -192969 -50986 -2313 -197570 -340846 -219177 -90993 -165531 -151777
30765 -151777 198965 516122 345693 -67688 -162782 21028 -15218 -322045 -443061 -230223
30755 -230223 -21348 55292 274737 663868 803463 528590 252547 286869 344394 72859
30745 72859 -346583 -521944 -440938 -366753 -395005 -443917 -481385 -482570 -349762 -106680 28117
30734 28117 -34055 -81826 43920 187942 187698 155452 190883 99563 -279636 -704998 -824904
30723 -824904 -644663 -391860 -130890 148858 273153 102032 -153054 -223020 -242446 -495763
30713 -495763 -833893 -834638 -503864 -304546 -419223 -470065 -147525 292241 405660 147350
30703 147350 -165804 -274376 -151815 82965 239628 152814 -135822 -360206 -308638 -68874
30693 -68874 80699 -20988 -267429 -407389 -295442 -27428 207178 390298 639400 860688
30683 860688 704275 92190 -448044 -356702 169617 398445 59642 -346094 -349382 -150612
30673 -150612 -184259 -423315 -505786 -341040 -190569 -207753 -233868 -90587 158289 312374
30663 312374 275875 145762 113322 265362 450616 413765 112745 -196481 -265447 -130891
30653 -130891 5680 43743 -8788 -168140 -421795 -611283 -564435 -325594 -93121 44084
30643 44084 139493 190973 119396 -35899 -109641 -62896 -54619 -175359 -292362 -276687 -208144
30632 -208144 -197933 -171212 -31905 92340 29045 -105149 -57898 101467 46648 -207791
30622 -207791 -181096 360042 915576 864277 337460 30550 240814 574646 642285 555765
30612 555765 555257 556650 360518 22947 -276123 -517051 -715085 -714034 -422559 -115915 -177717
30601 -177717 -612926 -1095587 -1422779 -1631384 -1726315 -1612111 -1303792 -939001 -575484 -219903
30591 -219903 -24102 -154010 -458439 -580720 -440186 -292525 -262977 -175407 37742 129248
30581 129248 -37189 -172638 30510 402763 525143 313687 66886 -7347 -20907 -137984
30571 -137984 -303480 -329644 -150415 84330 164727 70838 23955 202075 451596 459301 212186
30560 212186 50736 187880 425251 498794 468941 539825 668626 623250 341874 7320
30550 7320 -180227 -126347 169256 545069 684733 421872 -2775 -191898 -57063 159421
$$ [...]
##END NTUPLES=NMR SPECTRUM
##END=
