##TITLE=31Pdec_SR50_rmo
 , 24 sc
 30.03.2021
##JCAMPDX= 6.0         $$ Bruker NMR JCAMP-DX V2.0
##DATA TYPE= NMR SPECTRUM
##DATA CLASS= NTUPLES
##ORIGIN= UXNMR, Bruker Analytische Messtechnik GmbH
##OWNER= root
$$ XWIN-NMR		Version 3.5
$$ Tue Mar 30 11:18:35 2021 Russian Standard Time (UT+4h)  she@DPX200
##.OBSERVE FREQUENCY= 81.013821
##.OBSERVE NUCLEUS= ^31P
##.ACQUISITION MODE= SIMULTANEOUS
##.ACQUISITION SCHEME= undefined
##.AVERAGES= 24
##.DIGITISER RES= 16
##SPECTROMETER/DATA SYSTEM= spect
##.PULSE SEQUENCE= zgpg30
##.SOLVENT NAME= CDCl3
##.SHIFT REFERENCE= (INTERNAL, CDCl3, 0, 248.564)
##AUDIT TRAIL= $$ (NUMBER, WHEN, WHO, WHERE, WHAT)
$$ ##TITLE= Audit trail, XWIN-NMR		Version 3.5
$$ ##JCAMPDX= 5.01
$$ ##ORIGIN= Bruker BioSpin GmbH
$$ ##OWNER= she
$$ F:/spectra/data/she/nmr/P31/1/pdata/1/auditp.txt
$$ ##AUDIT TRAIL=  $$ (NUMBER, WHEN, WHO, WHERE, WHAT)
(   1,<2021-03-30 11:17:12.23 +0400>,<she>,<DPX200>,
      <created by zg, POWCHK disabled, PULCHK disabled
       configuration hash MD5:
       00 E9 B6 7A A2 85 ED C7 34 08 36 98 17 FE 4E 26
       data hash MD5: 32K
       49 5B 34 9F 63 4D 86 68 AC 5A F1 98 9A F8 AF 73>)
(   2,<2021-03-30 11:17:14.62 +0400>,<she>,<DPX200>,
      <Start of raw data processing
       efp BC_mod = 2 LB = 1 FT_mod = 6 PKNL = 1 PHC0 = -4774.733 PHC1 = 911.8012 SI = 64K 
       data hash MD5: 64K
       28 E7 57 F8 19 A9 E6 B7 F0 AD 4E 0E 8E 2D DE 91>)
(   3,<2021-03-30 11:17:55.73 +0400>,<she>,<DPX200>,
      <pk PHC0 = 362.4398 PHC1 = -805.2002 
       data hash MD5: 64K
       CA BA 90 FD 89 D3 9C D6 A1 8B 9B 58 D9 97 30 9D>)
(   4,<2021-03-30 11:17:58.84 +0400>,<she>,<DPX200>,
      <abs ABSG = 5 
       data hash MD5: 64K
       D4 48 DE 34 77 CE 39 C5 73 AF B6 51 E4 87 F3 6E>)
$$ ##END=
$$ 
$$ hash MD5
$$ B2 F9 3A FA 43 28 24 E5 CE 3C 87 16 BB BE 2F 9D
##$RELAX= 
##$RELAX= 
##$RELAX= 
##$RELAX= 
##$RELAX= 
##$RELAX= 
##$RELAX= 
##$RELAX= 
$$ Bruker specific parameters
$$ --------------------------
##$DU= <F:/spectra>
##$EXPNO= 1
##$NAME= <P31>
##$PROCNO= 1
##$TYPE= <nmr>
##$USER= <she>
##$AMP= (0..31)
100 100 100 100 100 100 100 100 100 100 100 100 100 100 100 100 100 100 
100 100 100 100 100 100 100 100 100 100 100 100 100 100 
##$AQSEQ= 0
##$AQ_mod= 1
##$AUNM= <au_zg>
##$AUTOPOS= <>
##$BF1= 81.014009
##$BF2= 200.13
##$BF3= 200.13
##$BF4= 200.13
##$BF5= 200.13
##$BF6= 200.13
##$BF7= 200.13
##$BF8= 200.13
##$BYTORDA= 1
##$CFDGTYP= 0
##$CFRGTYP= 5
##$CHEMSTR= <none>
##$CNST= (0..31)
1 1 145 1 1 1 1 1 1 1 1 1 1 1 1 1 1 1 1 1 1 1 1 1 1 1 1 1 1 1 1 1 
##$CPDPRG= <waltz16>
##$CPDPRG1= <>
##$CPDPRG2= <waltz16>
##$CPDPRG3= <>
##$CPDPRG4= <mlev>
##$CPDPRG5= <mlev>
##$CPDPRG6= <mlev>
##$CPDPRG7= <mlev>
##$CPDPRG8= <mlev>
##$CPDPRGB= <>
##$CPDPRGT= <>
##$D= (0..31)
0 1 0 0 0 0 0 0 0 0 0 0.03 2e-05 3e-06 0 0 0 0 0 0 0 0 0 0 0 0 0 0 0 0 
0 0 
##$DATE= 1617088631
##$DBL= (0..7)
120 120 120 11 120 120 24 19 
##$DBP= (0..7)
150 150 150 150 150 150 150 150 
##$DBP07= 0
##$DBPNAM0= <>
##$DBPNAM1= <>
##$DBPNAM2= <>
$$ [...]
##$SUBNAM3= <"">
##$SUBNAM4= <"">
##$SUBNAM5= <"">
##$SUBNAM6= <"">
##$SUBNAM7= <"">
##$SUBNAM8= <"">
##$SUBNAM9= <"">
##$SW= 501.771253377433
##$SWIBOX= (0..15)
0 1 3 0 0 0 0 0 0 0 0 0 0 0 0 0 
##$SW_h= 40650.406504065
##$TD= 32768
##$TD0= 1
##$TE= 0
##$TE2= 300
##$TE3= 300
##$TEG= 300
##$TL= (0..7)
0 120 53 12 22 120 120 120 
##$TP= (0..7)
150 150 150 150 150 150 150 150 
##$TP07= 0
##$TPNAME0= <>
##$TPNAME1= <>
##$TPNAME2= <>
##$TPNAME3= <>
##$TPNAME4= <>
##$TPNAME5= <>
##$TPNAME6= <>
##$TPNAME7= <>
##$TPOAL= (0..7)
0.5 0.5 0.5 0.5 0.5 0.5 0.5 0.5 
##$TPOFFS= (0..7)
0 0 0 0 0 0 0 0 
##$TUNHIN= 0
##$TUNHOUT= 0
##$TUNXOUT= 0
##$USERA1= <user>
##$USERA2= <user>
##$USERA3= <user>
##$USERA4= <user>
##$USERA5= <user>
##$V9= 5
##$VALIST= <valist>
##$VCLIST= <CCCCCCCCCCCCCCC>
##$VD= 0
##$VDLIST= <DDDDDDDDDDDDDDD>
##$VPLIST= <PPPPPPPPPPPPPPP>
##$VTLIST= <TTTTTTTTTTTTTTT>
##$WBST= 1024
##$WBSW= 4
##$XGAIN= (0..3)
0 0 0 0 
##$XL= 0
##$YL= 0
##$YMAX_a= 33797
##$YMIN_a= -38557
##$ZGOPTNS= <>
##$ZL1= 120
##$ZL2= 120
##$ZL3= 120
##$ZL4= 120
##$ABSF1= 248.5645
##$ABSF2= -253.2056
##$ABSG= 5
##$ABSL= 3
##$ALPHA= 0
##$AQORDER= 0
##$ASSFAC= 0
##$ASSFACI= 0
##$ASSFACX= 0
##$ASSWID= 0
##$AUNMP= <proc_1d>
##$AZFE= 0.1
##$AZFW= 0.5
##$BCFW= 0
##$BC_mod= 2
##$BYTORDP= 0
##$COROFFS= 0
##$CY= -3
##$DATMOD= 1
##$DC= 0
##$DFILT= <>
##$DTYPP= 0
##$F1P= 0
##$F2P= 0
##$FCOR= 1
##$FTSIZE= 65536
##$FT_mod= 6
##$GAMMA= 0
##$GB= 0
##$INTBC= 1
##$INTSCL= 5.30512e-09
##$ISEN= 30
##$LB= 1
##$LEV0= 0
##$LPBIN= 0
##$MAXI= 10000
##$MC2= 0
##$MEAN= 0
##$ME_mod= 0
##$MI= 50
##$NCOEF= 0
##$NC_proc= -3
##$NLEV= 6
##$NOISF1= 182.463
##$NOISF2= 159.3651
##$NSP= 0
##$NTH_PI= 0
##$NZP= 0
##$OFFSET= 248.5645
##$PC= 4
##$PHC0= -4412.293
##$PHC1= 106.601
##$PH_mod= 1
##$PKNL= yes
##$PPARMOD= 0
##$PSCAL= 0
##$PSIGN= 0
##$REVERSE= no
##$SF= 81.014009
##$SI= 65536
##$SIGF1= 159.3651
##$SIGF2= -187.1042
##$SINO= 113.3802
##$SIOLD= 16384
##$SREGLST= <1H.CDCl3>
##$SSB= 0
##$STSI= 65536
##$STSR= 0
##$SW_p= 40650.406504065
##$SYMM= 0
##$S_DEV= 0
##$TDeff= 32768
##$TDoff= 0
##$TI= <>
##$TILT= no
##$TM1= 0
##$TM2= 0
##$TOPLEV= 0
##$USERP1= <user>
##$USERP2= <user>
##$USERP3= <user>
##$USERP4= <user>
##$USERP5= <user>
##$WDW= 1
##$XDIM= 65536
##$YMAX_p= 527144206
##$YMIN_p= -29737860
$$ End of Bruker specific parameters
$$ ---------------------------------
##NTUPLES= NMR SPECTRUM
##VAR_NAME=  FREQUENCY,     SPECTRUM/REAL,   SPECTRUM/IMAG
##SYMBOL=    X,             R,               I
##VAR_TYPE=  INDEPENDENT,   DEPENDENT,       DEPENDENT
##VAR_FORM=  AFFN,          ASDF,            ASDF
##VAR_DIM=   65536,         65536,           65536
##UNITS=     HZ,            ARBITRARY UNITS, ARBITRARY UNITS
##FACTOR=    0.620285442955139, 1,           1
##FIRST=     20137.2065510759, 0,            0
##LAST=      -20513.1999529892, 0,           0
##MIN=       -20513.1999529892, -29737860,   0
##MAX=       20137.2065510759, 527144206,    0
$$ Real data points
##PAGE= N=1
##DATA TABLE= (X++(R..R)), XYDATA
$$ [...]
##PAGE= N=2
##DATA TABLE= (X++(I..I)), XYDATA
38602B244748j38339k41115j9700Q4795j38220l27408j90619K6964M7161N2143
38592A400410K42902L36309L8547l23064k48845R6340J42400j40231k38692n143
38582A300933J29420n0476j78743N1819M12360N41171L95408J04197k24858l89167
38572B092064k03011J12450R5599k30461k98284J03843M05030Q4065n38927p73695
38562H48673m55805M9213M14872N10835K87246p5186j56481J66005M38361K71343
38552B299076o1773j16585r196p9486j44373J75362N48008J87315q93585j647562
38542B57201j300465l09774L29959K96459P4245J69261N55531Q06417N77748R383
38532A465965l40564j11332L66725M62464Q4133k39753j48619J07466J58169L9933
$$ y = [2244748, 2106409, 1865294, 1845594, 1930389, 1792169, 1464761, 1274142, 1301106, 1348267, 1400410, 1643312, 1979621, 2018168, 1695104, 1446259, 1542599, 1684999, 1544768, 1306076, 1300933, 1430353, 1379877, 1201134, 1252953, 1665313, 2206484, 2601892, 2706089, 2481231, 2092064, 1889053, 2001503, 2097102, 1866641, 1568357, 1672200, 2077230, 2161295, 1622368, 848673, 392868, 442081, 856953, 1367788, 1655034, 1579848, 1423367, 1589372, 2027733, 2299076, 2237303, 2120718, 2111522, 2032036, 1887663, 2063025, 2611033, 2798348, 1904763, 257201, -1043264, -1353038, -1023079, -726620, -652375, -483114, 72417, 878834, 1456582, 1465965, 1125401, 1014069, 1380794, 1843258, 1927391, 1687638, 1539019, 1646485, 1804654, 1844587]
38522A844587j4371O238l2163j30095k02100k37951k25920q7772J38937K39611
38512A299001J16710m0523m8921O234j5669m7511J5213P5475J1853o9656j1491
38501A290715J14679J56441J63655K43302K68671O3414k12817k29704k3360P415
38491A842411k86419n49745m40612j08418O7743Q049n5714K3121J54799K31048
38481H86263K69797K94146K31485L3035j85482k27599m7300J56418J23276j72363
38471A361676m43641l76998J90L30183L47913J77054R1899J09651M5696q3473
38461A560150l9138J74936J82474j85351m96054k97372J31487J35693k87592m35850
38451D43383N973M55006L46311o316J4122L15608L12816p4838l33267k18312n0561
$$ y = [1844587, 1830216, 1836454, 1804291, 1674196, 1472096, 1234145, 1008225, 920453, 1059390, 1299001, 1415711, 1375188, 1326267, 1332501, 1316832, 1269321, 1284534, 1360009, 1371862, 1302206, 1290715, 1405394, 1561835, 1725490, 1968792, 2237463, 2300877, 2088060, 1858356, 1834996, 1842411, 1555992, 1006247, 565635, 457217, 524960, 533009, 477295, 500416, 655215, 886263, 1156060, 1450206, 1681691, 1714726, 1529244, 1301645, 1254345, 1410763, 1534039, 1361676, 918035, 541037, 541227, 871410, 1219323, 1396377, 1488276, 1597927, 1643623, 1560150, 1521012, 1695948, 1878422, 1693071, 1197017, 899645, 1031132, 1166825, 879233, 443383, 449356, 904362, 1250673, 1244357, 1258479, 1574087, 1886903, 1812065, 1478798, 1260486, 1209925]
38440A209925n2347k851K26849L31700Q8264k09136j95439L44K0919j24156j33539
38429A160533M7045J54846N7613o4280m0468M1528J7130r3643j29073j8036J29825
38418A263020J64701P3455k2295l2367J970J414l7369q2991j36607j68413q7450
38407I37068J02181K19034J28819n2265j36610j11415k1623J94471M75040M66526
38397B201226o77m48431k94508K32127L44427j12038m26159j67218J68217M4897
38387A541863k43360j62662J28793J13800j66540k30727m290J20902P678n9031
38377A046426N6130J46215J12885J26341K27819K02280j3720j66009p8981Q5561
38367A744947J12663K6917l1818k6283j0408m4040j55282k58888j60882J74773
$$ y = [1209925, 1157578, 1154727, 1381576, 1713276, 1801540, 1592404, 1396965, 1397309, 1418228, 1294072, 1160533, 1207578, 1362424, 1420037, 1355757, 1315289, 1356817, 1373947, 1280304, 1151231, 1133195, 1263020, 1427721, 1501176, 1478881, 1446514, 1448484, 1449898, 1412529, 1329538, 1192931, 1024518, 937068, 1039249, 1258283, 1387102, 1334837, 1198227, 1086812, 1065189, 1259660, 1734700, 2201226, 2200549, 1752118, 1457610, 1689737, 2034164, 1922126, 1495967, 1328749, 1496966, 1541863, 1298503, 1135841, 1264634, 1378434, 1211894, 981167, 976877, 1097779, 1105457, 1046426, 1102556, 1248771, 1361656, 1487997, 1715816, 1918096, 1904376, 1738367, 1659386, 1744947, 1857610, 1884527, 1852709, 1826426, 1816018, 1771978, 1616696, 1357808, 1196926, 1371699]
38357A371699M47042L46234r096k27085j60442J8802J71559K70165J96564j28398
38347B297044m27586l11346J21464L57454K06823J0410J0354K1237q1258o6700
38337B137896J48576J88427j84527n56237m26057J2871J68083p6290k97070k41781
38327H73891r0560j4195N7609J46408J08870n5124j07254O0219K23484J54760
38317A358108n9141j78500j23912R357J12282J18075J8736p5463j9228J32717
38307A293031J25138j33430l58479k34095J32320L31153J97572m119M356J41384
38297A494831J52041J1287o7950J8226J12973L9317j54366k75844k28809q4296
38287A017410L5768O6011J5869n0886o2409o424O2267J04305J41998J84076J61852
$$ y = [1371699, 1818741, 2164975, 2155879, 1928794, 1768352, 1787154, 1958713, 2228878, 2425442, 2297044, 1869458, 1558112, 1679576, 2037030, 2243853, 2254263, 2264617, 2285854, 2204596, 2137896, 2286472, 2474899, 2290372, 1734135, 1308078, 1320949, 1489032, 1412742, 1115672, 873891, 783331, 769136, 826745, 973153, 1082023, 1026899, 919645, 979864, 1203348, 1358108, 1298967, 1120467, 996555, 1005912, 1118194, 1236269, 1255005, 1179542, 1160314, 1293031, 1418169, 1284739, 926260, 692165, 824485, 1155638, 1353210, 1349091, 1353447, 1494831, 1646872, 1658159, 1590209, 1608435, 1721408, 1760725, 1606359, 1330515, 1101706, 1017410, 1053178, 1119189, 1135058, 1084172, 1021763, 1015339, 1077606, 1181911, 1323909, 1507985, 1669837]
38276A669837J5544j84515k79488j83539L9029K36388K72045J18823q0632j02721
38266A520771J05588L04027K19364q4162k58821j40778K0949n8534k45761j60254
38256A222389K31442M89590K97795o9004j33689R3208J78295k1438j47390K9160
38246B170358J96452J2520l39037m96329n13155o08906n74604o9046N92003O66795
38236A037051R7518l23790j28474J86565O0155k48664k08990Q5102J87040P5259
38226H18772L3699N6774j7431l8828J78120L43376R0884l16132l40880m9307P6877
38215H35924L6646K17741M98409L32786k11062m07796n7032J82396o3575k84102
38205A080335n3409K25451R9938j33908m5664J34051J1407j92275o6088J97021
$$ y = [1669837, 1685381, 1500866, 1221378, 1037839, 1076868, 1313256, 1585301, 1704124, 1623492, 1520771, 1626359, 1930386, 2149750, 2065588, 1806767, 1665989, 1686938, 1628404, 1382643, 1222389, 1453831, 1943421, 2241216, 2172212, 2038523, 2131731, 2310026, 2288588, 2141198, 2170358, 2366810, 2379330, 2040293, 1543964, 1030809, 421903, -152701, -221747, 370256, 1037051, 1134569, 810779, 682305, 868870, 929025, 680361, 471371, 556473, 743513, 818772, 852471, 909245, 891814, 852986, 1031106, 1374482, 1465366, 1149234, 808354, 759047, 835924, 872570, 1090311, 1588720, 1921506, 1710444, 1302648, 1245616, 1428012, 1364437, 1080335, 1026926, 1252377, 1352315, 1218407, 1172743, 1306794, 1318201, 1125926, 1059838, 1256859]
38195A256859J34873j74195l03112k09303j41138o3817J81775L71584K00815r4173
38185A160168o8403J47433P5778k33347k87331m6216K6220j64925j84772R1795
38175E16400K21704K240j56692J7999J76459L409j96345l9384K58989K61907L5834
38164A102520k4200J21134J59969K0700k0372J51647K71835J10233j73675k60482
38154A459309r8086P3346P0165k3015m0424n877n9689j62337j03583J26847K31077
38143A467733L8253j85447j19516J11605J46585m0504j44736m3788P2314Q7684
38133A390183J13556J99217K11733Q3437q5076k15333k97816k57681o2680O3811
38123A143351j09783l70252k64467J93009M58615K33211j32527j96176N557J74390
$$ y = [1256859, 1391732, 1217537, 914425, 705122, 563984, 500167, 681942, 1053526, 1254341, 1160168, 1091765, 1239198, 1314976, 1081629, 794298, 748082, 774302, 609377, 424605, 516400, 738104, 740344, 583652, 601651, 778110, 781519, 585174, 545790, 804779, 1066686, 1102520, 1078320, 1199454, 1359423, 1380123, 1359751, 1511398, 1783233, 1893466, 1719791, 1459309, 1361223, 1434569, 1504734, 1481719, 1441295, 1435418, 1375729, 1213392, 1109809, 1236656, 1467733, 1505986, 1320539, 1201023, 1312628, 1459213, 1418709, 1273973, 1230185, 1302499, 1390183, 1503739, 1702956, 1914689, 1998126, 1913050, 1697717, 1399901, 1142220, 1079540, 1143351, 1033568, 663316, 398849, 591858, 1050473, 1283684, 1151157, 954981, 960538, 1134928]
38113A134928J95411J20480l025p0919L9739K03279J25029j60742k54938m7790
38103A281452M6184j94642l33270J3728M17930K09803m33247o44784r5043N50213
38093H18324N54576L5014l02606r0426L18718L57202l5781l27115q1839M05983
38083A652050M58478l8979m55984l31539j2841m1650l00161k67221J14663L77869
38073A154685K59651m60j13317p8075j0870K7489k0140j50525j77361O0404L76201
38062A327682M14529J53705o5838l1126J18406J84550J41274K2165j55896k91528
38052A817923k48719n7565J25884K50314L43466L06037K2073l33870m16547j80167
38042A628829O6299J22960J09973J35996Q0782j31827l10221k44765p169J71566
$$ y = [1134928, 1330339, 1450819, 1447794, 1376875, 1416614, 1619893, 1744922, 1584180, 1329242, 1281452, 1327636, 1132994, 799724, 813452, 1231382, 1441185, 1007938, 363154, 268111, 818324, 1372900, 1407914, 1105308, 1014882, 1333600, 1690802, 1655021, 1327906, 1246067, 1652050, 2110528, 2071549, 1615565, 1284026, 1271185, 1229535, 929374, 662153, 776816, 1154685, 1414336, 1413876, 1300559, 1222484, 1211614, 1239103, 1218963, 1068438, 891077, 951481, 1327682, 1742211, 1895916, 1830078, 1798952, 1917358, 2101908, 2243182, 2265347, 2109451, 1817923, 1569204, 1511639, 1637523, 1887837, 2231303, 2537340, 2559413, 2225543, 1808996, 1628829, 1695128, 1818088, 1928061, 2064057, 2144839, 2013012, 1702791, 1458026, 1450857, 1622423]
38032A622423J97297J43415P4780k8407j84238l06430k34706N8667L15091K30729
38022A888621r7284k28479j4530J55052j1760k06705n7251J88294O8217k62443
38012A421732k69097M3299J65847O14j5160K29347L05699P7865k2033J65613J75448
38001B279174j92633l72242L4010M74688K76038k68152l70452M2934L38764J85397
37991B427526j26081k72137k23303l2758K09422K69351L9943j88892j33850j5341
37981A953880j87204m61727l64341N7490K82743J43878L543N9516O9887q9773
37971A467892j54065J8751J42194N48j39293M4906L65609L52006p1170m38981
37961A588397l15543J63849M37456K00087j95022j98303J53684K82669l1572k80609
$$ y = [1622423, 1819720, 1963135, 2037915, 2009508, 1825270, 1518840, 1284134, 1342801, 1657892, 1888621, 1791337, 1562858, 1548328, 1703380, 1691620, 1484915, 1427664, 1615958, 1684175, 1421732, 1152635, 1195934, 1361781, 1362395, 1347235, 1576582, 1882281, 1960146, 1938113, 2103726, 2279174, 2086541, 1714299, 1748309, 2222997, 2499035, 2230883, 1860431, 1903365, 2242129, 2427526, 2301445, 2029308, 1806005, 1773247, 1982669, 2252020, 2291963, 2103071, 1969221, 1953880, 1766676, 1304949, 940608, 998098, 1280841, 1424719, 1428262, 1487778, 1557665, 1467892, 1313827, 1332578, 1474772, 1475320, 1336027, 1380933, 1746542, 2098548, 2027378, 1588397, 1272854, 1436703, 1874159, 2074246, 1879224, 1680921, 1834605, 2117274, 2085702, 1805093]
37951A805093n6478K38485M2404l85880l41695J62709L90495N0386k88168j49892
37941A467459J48547R7142k28505l85300k15940O8952K36745K01976K5997r0311
37931A326762P986J74582J22487j25339k44622j08241P0718J47512K03586K11380
37921A786811j7247l91313m89564j67753J84645K27595J16089J08175J27899L4502
37911A519839l0726Q0659J96562J17484j5945J8068J20727N6638j44717k68333
37901A650256k41288j37965j3280P6027O2601K7397J37099L09700K60024P262
37891B137833o8808J31552K01716p5276l04592j43513R9138J6833j82569q7754
37881A724560J67869J89044M0367L4146N9896j73451m26074k18412K61287L25646
$$ y = [1805093, 1748615, 1987100, 2029504, 1643624, 1301929, 1464638, 1855133, 1905519, 1617351, 1467459, 1616006, 1713148, 1484643, 1099343, 883403, 952355, 1189100, 1391076, 1417073, 1326762, 1334748, 1509330, 1631817, 1506478, 1261856, 1153615, 1224333, 1371845, 1575431, 1786811, 1769564, 1378251, 888687, 720934, 905579, 1133174, 1249263, 1357438, 1485337, 1519839, 1489113, 1569772, 1766334, 1883818, 1867873, 1885941, 2006668, 2063306, 1918589, 1650256, 1408968, 1271003, 1257723, 1333750, 1396351, 1423748, 1560847, 1870547, 2130571, 2137833, 2069025, 2200577, 2402293, 2327017, 2022425, 1878912, 1978050, 1994883, 1812314, 1724560, 1892429, 2081473, 2121840, 2155986, 2215882, 2042431, 1616357, 1397945, 1659232, 1984878]
37871A984878j10650l71625j05724K03298P9969k30422k61857m1446R9152P7777
37861A323350N2293P2892M3613p5224j91344j45107J44827M75224M29415q4168
37851B045771n30754l78323J19100K73864J470j24277J29634L14042J46768r307
37841A987988J18506J46058k71625o79012l95197M22575R04718N79672j28681
37832B685002n23049l79054j638K16707J81728R4429R8754N3968j67731l08494
37822A950622m3707L73743L19247k46423o12626l69606k0003j18840l77797k33678
37812F20932J43131J51249j94316k99648l408J94280l435k51749j76344J13819
37802B94511L42384M44661M15393J80560j50639k60170p4663P7052k3714j46444
$$ y = [1984878, 1874228, 1502603, 1396879, 1600177, 1680146, 1449724, 1187867, 1146421, 1245573, 1323350, 1375643, 1448535, 1492148, 1416924, 1225580, 1080473, 1225300, 1700524, 2129939, 2045771, 1515017, 1136694, 1255794, 1529658, 1531128, 1406851, 1536485, 1850527, 1997295, 1987988, 2106494, 2252552, 1980927, 1301915, 906718, 1329293, 2234011, 2813683, 2685002, 2161953, 1782899, 1781261, 1997968, 2179696, 2274125, 2372879, 2426847, 2259116, 1950622, 1906915, 2280658, 2599905, 2353482, 1740856, 1371250, 1351247, 1232407, 854610, 620932, 764063, 915312, 720996, 421348, 417940, 612220, 608785, 357036, 180692, 294511, 636895, 1081556, 1496949, 1677509, 1526870, 1266700, 1192037, 1269089, 1245375, 1098931]
37792A098931l9420J27476P5763q8629p5016P3056N8682j41764k17883j5911K35037
37781A090322K68545R4547j26123k90844l19752j21961K29745M41079L08857L170
37771A577585j47963q6807k9273p8300r3460L501N9609k5697p9589N5644J91860
37760A347110N0011k50405k98222M746K83221K30020j70j06375p8870q0379r1463
37749A009224L2777K43874L11940J50600p3758j70705j13271K688N6378l0951
37739A418796k07231k83406j28433J49924L20960K89913J36408m4418j99973k66258
37729A186282k10625j05464k1545J06178L38206N06180L60206m1437l24874k62731
37719A530376l9927M9255j9471p1925l1374M0420J00290J36489Q1411j01365k59681
$$ y = [1098931, 1059511, 1186987, 1262750, 1174121, 1099105, 1172161, 1230843, 1089079, 871196, 855285, 1090322, 1358867, 1453414, 1327291, 1036447, 716695, 594734, 824479, 1265558, 1574415, 1577585, 1429622, 1342815, 1313542, 1235242, 1141782, 1145283, 1204892, 1179195, 1099606, 1155250, 1347110, 1397121, 1146716, 848494, 853240, 1136461, 1366481, 1366311, 1259936, 1181066, 1100687, 1009224, 1042001, 1285875, 1597815, 1748415, 1674657, 1503952, 1390681, 1393369, 1449747, 1418796, 1211565, 928159, 799726, 949650, 1270610, 1560523, 1696931, 1652513, 1452540, 1186282, 975657, 870193, 848648, 954826, 1293032, 1799212, 2159418, 2117981, 1793107, 1530376, 1490449, 1539704, 1520233, 1448308, 1416934, 1457354, 1557644, 1694133, 1775544, 1674179, 1414498]
37708A414498j75802J07365K54279M1460l19092m10827j29647J87417J92430m9943
37698A112138j88261n8078J44230J80967Q8833N7708J19728J39202O5699L015
37688A665181N082j3162q9259j04674J6975J37570Q6442p7519j55930j00333k6180
37677A344193K2298J02623J63333N0832j88588k51877J3990L36298L48993O5397
37667B007492j90830k16756o8004J36827K87550K21039j14242m37648l84755j8745
37657A221928K06641O6067j70828k04620j02159m0321K4713J70262K55343J50280
37647A577306M201n883J5094p1718j01181J13596L47590K42105j07903k99413
37637A713794k74600l33055n02993m37778m9793K59383K08190L9951O9191J98892
$$ y = [1414498, 1238696, 1346061, 1600340, 1641800, 1322708, 911881, 782234, 969651, 1162081, 1112138, 923877, 865799, 1010029, 1190996, 1279829, 1337537, 1457265, 1596467, 1662166, 1665181, 1670263, 1657101, 1567842, 1463168, 1480143, 1617713, 1704155, 1626636, 1470706, 1370373, 1344193, 1366491, 1469114, 1632447, 1683279, 1494691, 1242814, 1256804, 1593102, 1942095, 2007492, 1816662, 1599906, 1531902, 1668729, 1956279, 2177318, 2063076, 1625428, 1240673, 1221928, 1428569, 1494636, 1323808, 1119188, 1017029, 976708, 1001421, 1171683, 1427026, 1577306, 1581507, 1575624, 1590718, 1519000, 1417819, 1531415, 1879005, 2121110, 2013207, 1713794, 1439194, 1106139, 603146, 165368, 115575, 374958, 583148, 623099, 692290, 891182]
37627H91182J74803J5608j00044j32785j09890K0823K18550K52344K9819j82071
37617A078339j20635Q2947J41179N2463K1743R2958J48068J52276J33347L5099
37607A817784j47616k19455n5585J07516k0849k88197k80618L3259K34856Q9339
37597A270434j26436p7678J53065K54219J35185m0822j48825k03554k07749r3953
37587I13886J33080L14136K88469R9581l6527N806J05664P3810p4823j50205o7927
37576A604950M5219N0475l5321j16964j44673j13896m6640J351J5911Q3581K34409
37565A578402K92680J15155q3193K8756L36947L71641L6568k16624j26637l2605
37555B301090k23383l70448r4986K98230K50848j48177l27860j53373k3930r2786
$$ y = [891182, 1065985, 1081593, 981549, 848764, 738874, 759697, 978247, 1230591, 1260410, 1078339, 957704, 1040651, 1181830, 1234293, 1256036, 1348994, 1497062, 1649338, 1782685, 1817784, 1670168, 1450713, 1395128, 1502644, 1481795, 1193598, 912980, 946239, 1181095, 1270434, 1143998, 1066320, 1219385, 1473604, 1608789, 1567967, 1419142, 1215588, 1007839, 913886, 1046966, 1361102, 1649571, 1749152, 1712625, 1718431, 1824095, 1897905, 1823082, 1672877, 1604950, 1650169, 1700644, 1665323, 1548359, 1403686, 1289790, 1243150, 1244501, 1260412, 1343993, 1578402, 1871082, 1986237, 1903044, 1931800, 2268747, 2640388, 2676956, 2460332, 2333695, 2301090, 2077707, 1707259, 1612273, 1910503, 2161351, 2013174, 1685314, 1531941, 1508011, 1415225]
37545A415225n5772J88231K91093P7399j24573l9517J23950R0095l7184o1142
37535A867805p1459j87550k26457j7203J87576M0587k99940l38648J8201L12760
37525A285672K09479m5838l8578K02556K87844N8640j94401j63944M3352P8219
37515A723001j55315l83014l40476q3272J44150J95875R8087k9155l6299J36470
37505A270052L22411K67451n549j72233o8587O9351J7481o2004M7876J70938K2395
37494A879582k38322k04698J07343K67220J09450o9363o3114l7945j20066j46254
37484A483833l7378j9866k05005k93423k1915L58847L98813P3808k24116k26018
37474A287580l6633J11104J20602M6284k108M3645J37179J67495J06771K7026
$$ y = [1415225, 1359453, 1547684, 1838777, 1916176, 1791603, 1752086, 1876036, 1966131, 1928947, 1867805, 1796346, 1608796, 1382339, 1365136, 1552712, 1593299, 1293359, 954711, 972912, 1285672, 1495151, 1449313, 1410735, 1613291, 1901135, 1959775, 1765374, 1601430, 1644782, 1723001, 1567686, 1184672, 844196, 760924, 905074, 1100949, 1199036, 1169881, 1133582, 1270052, 1592463, 1859914, 1854365, 1682132, 1613545, 1682896, 1700377, 1638373, 1686249, 1857187, 1879582, 1641260, 1436562, 1543905, 1811125, 1920575, 1851212, 1788098, 1750153, 1630087, 1483833, 1446455, 1426589, 1221584, 928161, 906246, 1265093, 1663906, 1737714, 1513598, 1287580, 1250947, 1362051, 1482653, 1528937, 1526829, 1570474, 1707653, 1875148, 1981919, 2008945]
37464B008945m4552j54545k71418k58202o5155J80951L33471L44316K05500n6904
37454B222407k92860l15746j34619O4523J84406K59010K34037n144l20884l55581
37444A539549k9454K66678J66253k02083m19891k71852J21327M82529N52306K66493
37434B471855j14142k31562p1280M8123j6263n1869O4743J15960n2437k29028
37424A934100k04939j12449j00202r410K63856M04088J19075k98577l36498k6153
37414A632891J46819P07j61273j13558K088R501n2237r1971q9169j0622J42594
37403A415770K10717N8386j48792j32335O9218J61086N9763j8961N3391J50980
37393A879223J42919L9256j21855k77654k60615N464K75334K58564O8990M1608
$$ y = [2008945, 1964393, 1809848, 1538430, 1280228, 1215073, 1396024, 1729495, 2073811, 2279311, 2222407, 1929547, 1613801, 1479182, 1543705, 1728111, 1987121, 2221158, 2216014, 1895130, 1539549, 1510095, 1776773, 1943026, 1740943, 1321052, 1049200, 1170527, 1653056, 2205362, 2471855, 2357713, 2126151, 2054871, 2102994, 2086731, 2034862, 2099605, 2215565, 2163128, 1934100, 1729161, 1616712, 1516510, 1507100, 1770956, 2175044, 2294119, 1995542, 1659044, 1632891, 1779710, 1780417, 1619144, 1505586, 1507674, 1517175, 1464938, 1372967, 1283798, 1273176, 1415770, 1626487, 1684873, 1536081, 1403746, 1472964, 1634050, 1693813, 1674852, 1728243, 1879223, 2022142, 2061398, 1939543, 1661889, 1401274, 1406738, 1682072, 1940636, 2009626, 2051234]
37383B051234J55540P2230k39492l89741j90147N2373M3473q2627o7738P0195
37373A475300J56694J30183K6103q9098p7643J26510K99182J72220q2447l2889
37363B104115K87353L38221p9341m64876l75431l5561J46087J85521K43987J94452
37353B544527n5910k02285j2631J83150P986k81318k13773P6058R5020j46927
37343A993897k04699p949Q9307K3475R0219K70506J80453j95317l81778j92600
37333A665514l111m2058l2946J95033L39754J97649N1445J28717J88854K8203
37323B717054j07204k4144M720k10256l13885k4694K69493J52157m5127J58012
37313B576126M09215K3969p61510r98488m60080P8449J19429O7314K74183L54309
$$ y = [2051234, 2206774, 2279004, 2039512, 1649771, 1459624, 1511997, 1555470, 1472843, 1405105, 1475300, 1631994, 1762177, 1788280, 1699182, 1621539, 1748049, 2047231, 2219451, 2137004, 2104115, 2391468, 2729689, 2650348, 2185472, 1810041, 1774480, 1920567, 2106088, 2350075, 2544527, 2488617, 2286332, 2273701, 2456851, 2464837, 2183519, 1969746, 2045804, 2140824, 1993897, 1789198, 1781249, 1870556, 1894031, 1984250, 2254756, 2435209, 2239892, 1858114, 1665514, 1662403, 1620345, 1587399, 1782432, 2122186, 2319835, 2371280, 2499997, 2688851, 2717054, 2609850, 2585706, 2590426, 2380170, 2066285, 2041591, 2311084, 2463241, 2418114, 2576126, 2985341, 3009310, 2247800, 1249312, 789232, 867681, 987110, 1054424, 1328607, 1682916]
37303A682916l1445m29736k69642K28260M45344K83572Q6375m4291k26087l12663
37293A412603p1117K65294K34778q7763j56740J57449L37618N6925k90361k13435
37283A645251J27949K06005p9738l02795j48798J81227K79457M3296k41574k68051
37273A442229n8123J01505M1705r0537q3761K0709L6285k5917L7307K62177M04380
37262B087959K71146k0939k21295k23769p9305J09602K02494Q9332j27057j66272
37252A921896O7638K99572K22225j04822l70709m05528k59990j9982K06849K16037
37242A773186p4898l61800k38369K15316M67472K65095k0600J4931K05649J38412
37232B384394j52453k44861j7536J49785m0352l58250l77937m6123K85269L06079
$$ y = [1682916, 1651471, 1221735, 952093, 1180353, 1625697, 1909269, 1995644, 1951353, 1725266, 1412603, 1341486, 1606780, 1841558, 1753795, 1597055, 1754504, 2092122, 2149047, 1858686, 1645251, 1773200, 1979205, 1899467, 1596672, 1447874, 1629101, 1908558, 1951854, 1710280, 1442229, 1384106, 1485611, 1527316, 1436779, 1353018, 1373727, 1410012, 1384095, 1421402, 1683579, 2087959, 2359105, 2338166, 2116871, 1893102, 1813797, 1923399, 2125893, 2215225, 2088168, 1921896, 1989534, 2289106, 2511331, 2406509, 2035800, 1630272, 1370282, 1350300, 1557149, 1773186, 1698288, 1336488, 1098119, 1313435, 1780907, 2046002, 2025402, 2040333, 2245982, 2384394, 2231941, 1987080, 1969544, 2119329, 2078977, 1720727, 1342790, 1296667, 1581936, 1888015]
37222A888015P2262r9052J4198K88579L79218J37375j75444k20469m0524M1922
37212B286080n5724p3652J04821K08108K2265k02607r2688K80229M93585L54540
37202C324957Q0114q2803j33403j66633j78655j23320l7251l4283k11322n28743
37192A908658p40721n62504k7427M43945M92510K25133l785p3147j18459j95459
37182A348744k12669j44130m0528J17745L18182L59193J09830j66270j22029J10659
37172A678727J12732r8552o4760L19409N66965L58255J5084p8005m7951j61092
37162B600812k94252k06438j1673N4856P4402K18103L23161J47152j44999k04625
37152B556499o1149o599m5335N6391K40567J83701j23072k94658j50604K4506
$$ y = [1888015, 1960277, 1861225, 1875423, 2164002, 2543220, 2680595, 2505151, 2284682, 2244158, 2286080, 2230356, 2156704, 2261525, 2469633, 2491898, 2289291, 2196603, 2476832, 2970417, 3324957, 3405071, 3322268, 3188865, 3022232, 2843577, 2720257, 2683006, 2648723, 2437401, 1908658, 1167937, 605433, 578006, 1021951, 1514461, 1739594, 1735809, 1662662, 1544203, 1348744, 1136075, 991945, 951417, 1069162, 1387344, 1746537, 1856367, 1690097, 1568068, 1678727, 1791459, 1692907, 1628147, 1947556, 2514521, 2872776, 2887860, 2809855, 2761904, 2600812, 2306560, 2100122, 2088449, 2143305, 2217707, 2435810, 2758971, 2906123, 2761124, 2556499, 2495350, 2488751, 2443416, 2499807, 2740374, 2924075, 2801003, 2506345, 2355741, 2380247]
37142B380247l5393j91361j82725k1920R1413P1289M89n085J05864K74333L49721
37131B836872K33169q410k37795l78608l69885j49219J60443K35988l0457k74444
37121B017654j24729K20951K59344o6353k99318j60865J06253J80904Q3779L374
37111B220994m016K7994R5791J55289J07063l3550j05943l1557P3872Q7873M5273
37100B639083M6544J09381J63714J30203q92j34919j79174j99787l14083l98299
37090A861771j88811K08010K94158o6014k93876O6668N57962M56722r1056l19616
37080B485918o2775R9856q1472j65045P4881J98346q1030l38288j62562J50900
37070B118729J48152l1329L123J81900J66625j5367n9466O6571J29433O5336N344
$$ y = [2380247, 2344854, 2153493, 1970768, 1948848, 2040261, 2111550, 2112039, 2106954, 2212818, 2487151, 2836872, 3070041, 3061631, 2823836, 2445228, 2075343, 1926124, 2086567, 2322555, 2292098, 2017654, 1892925, 2113876, 2373220, 2306867, 2007549, 1846684, 1952937, 2133841, 2217620, 2220994, 2216978, 2244972, 2340763, 2496052, 2603115, 2569565, 2463622, 2432065, 2505937, 2593810, 2639083, 2685627, 2795008, 2958722, 3088925, 3088033, 2953114, 2773940, 2574153, 2260070, 1861771, 1672960, 1880970, 2175128, 2109114, 1815238, 1881906, 2439868, 2896590, 2805534, 2485918, 2423143, 2522999, 2441527, 2276482, 2351363, 2549709, 2468679, 2130391, 1967829, 2118729, 2266881, 2235552, 2238675, 2420575, 2587200, 2571833, 2512367, 2578938, 2708371, 2773707, 2779051]
37059B779051l0774j09152j48619m1200Q5387L3155j17793j17717N0155J40070
37049B522563L602k15562k49647J5779L77446M30033K2734m19025l34602J81707
37039B335028M45690J57068j85377r8392J70566J55297n6495r4108J491n2938
37029B777830j59333j447L06710L45852J08503j568J07263Q3376j83770l19191
37019C064225r9887J55918J02344j25160k00251r4005J5211P7671J33159J12207
37009C141432n1786k23137k14592o7597K3503J6508M4342J37259J30912n9524
36999B877320k24828r0565K78202M89286L12603p800r2360N1867J01647m4969
36989C650403j33657k4094N4971q0556k08927o0231J88518J51427j45925k84328
$$ y = [2779051, 2748277, 2639125, 2490506, 2449306, 2534693, 2567848, 2450055, 2332338, 2382493, 2522563, 2526165, 2310603, 2060956, 2076735, 2454181, 2884214, 2906948, 2487923, 2153321, 2335028, 2780718, 2937786, 2752409, 2654017, 2824583, 2979880, 2923385, 2829277, 2830768, 2777830, 2618497, 2617050, 2923760, 3269612, 3378115, 3376547, 3483810, 3567186, 3383416, 3064225, 2964338, 3120256, 3222600, 3097440, 2897189, 2803184, 2818395, 2896066, 3029225, 3141432, 3089646, 2866509, 2651917, 2584320, 2607823, 2624331, 2668673, 2805932, 2936844, 2877320, 2652492, 2561927, 2840129, 3329415, 3642018, 3634218, 3541858, 3593725, 3695372, 3650403, 3516746, 3492652, 3547623, 3467067, 3258140, 3197909, 3386427, 3537854, 3391929, 3107601]
36979C107601r3952J03005J2295j89323j46714J46067L65190L10107R0109j32883
36969C571502l40886n01531m33867o2251L08756K75368r8329l14721j51588J3377
36959B265830j72150m26927k60649K22499M45351J98789j39633k35168j53946
36950A743996k1022J89615L75556K77090o5078k31663k6457K24770K02919M0394
36940B710120j5471l471j8999N7545K69612L40669P8643k41973k53679k5402J11751
36929C009345O2447k1777m4455L082J31721K42913J38048j49544k87695j18200
36919B965885J06345J70576K06720K93359J79760k17025m61247k01963K33692
36910C276102L27836J16771m1761j02498j89101j42356J80771M26892K01185k16859
$$ y = [3107601, 3013649, 3116654, 3128949, 2939626, 2792912, 2938979, 3304169, 3614276, 3704385, 3571502, 3230616, 2729085, 2295218, 2232967, 2541723, 2817091, 2718762, 2404041, 2252453, 2265830, 2093680, 1666753, 1406104, 1628603, 2073954, 2272743, 2133110, 1897942, 1743996, 1722974, 1912589, 2288145, 2565235, 2500157, 2268494, 2242037, 2466807, 2669726, 2710120, 2694649, 2691178, 2672179, 2729724, 2999336, 3340005, 3418648, 3176675, 2922996, 2897594, 3009345, 3071792, 3050015, 3005560, 3008642, 3140363, 3383276, 3521324, 3371780, 3084085, 2965885, 3072230, 3242806, 3449526, 3742885, 3922645, 3705620, 3244373, 3042410, 3276102, 3603938, 3720709, 3678948, 3576450, 3387349, 3244993, 3425764, 3852656, 4053841, 3836982]
36900C836982k52494P1998K87698L21587M49372N50813K24717l86048p05979p03793
36890C694853r08442j318290j203567l29480M71864M64560M7224J9774L63844
36881A302340M58279J69228m946K08727M71724M03327J06398n3131N4277K24865
36871C341088K27250N7582j28663k42175l03270k89401j27340J01546J66034K7922
36861B830573n2376O1717J23616o2579k32367o9725K12438J75784j15820j99601
36851B671660J5648J28760n5766k24646r9461J41736J79335k3088k71545l84718
36841B077915k85566n0733R7976M1774l6993P4266K50435K21977L1667m3535N3597
36830B432780J38980J43973J32678N2322j47652k45568j7795L14383L56204J62729
$$ y = [3836982, 3584488, 3656486, 3944184, 4265771, 4715143, 5265956, 5490673, 5104625, 4398646, 3694853, 2786411, 1468121, 264554, -64926, 406938, 871498, 918722, 938496, 1302340, 1760619, 1929847, 1924901, 2133628, 2605352, 3008679, 3115077, 3061946, 3116223, 3341088, 3568338, 3625920, 3497257, 3255082, 2951812, 2662411, 2535071, 2636617, 2802651, 2830573, 2778197, 2839914, 2963530, 2900951, 2668584, 2598859, 2811297, 2987081, 2871261, 2671660, 2687308, 2816068, 2760302, 2535656, 2436195, 2577931, 2757266, 2734178, 2462633, 2077915, 1792349, 1741616, 1839592, 1881366, 1844373, 1918639, 2169074, 2391051, 2422718, 2379183, 2432780, 2571760, 2715733, 2848411, 2900733, 2753081, 2507513, 2489718, 2804101, 3160305, 3323034]
36820C323034J04721K04671J52767o8960j66920j37882k81563n62009n75087k60113
36810A732659l8095r5770j27174L3898J17717j5166p2137J33295L36102K81715
36800B287044R4127m3545j48614j93920m6552J88571K23019R9400J34325K64036
36790B857891Q7324l01566k77209K50071N27835J42014k78062j03288K67500J39586
36780C312096l04346l75792k5381J96058Q4738n5135o9325j05280j61747o4551
36770B431335J24502J59787M9718K2852J07321J35925J00730J17820J12446p4740
36760C287696l24224l52973j53712K6039R7911J78055K52162J58778o6003j60769
36750B942960l7240O6108n5377k58696k40846N9112L69720L97370J56477p9536
$$ y = [3323034, 3427755, 3632426, 3785193, 3716233, 3549313, 3411431, 3129868, 2567859, 1992772, 1732659, 1694564, 1598794, 1471620, 1505518, 1623235, 1608069, 1535932, 1669227, 2005329, 2287044, 2381171, 2337626, 2189012, 1995092, 1948540, 2137111, 2360130, 2459530, 2593855, 2857891, 2945215, 2643649, 2366440, 2616511, 3144346, 3286360, 3008298, 2905010, 3172510, 3312096, 3007750, 2631958, 2606577, 2802635, 2887373, 2832238, 2762913, 2657633, 2495886, 2431335, 2555837, 2715624, 2765342, 2788194, 2895515, 3031440, 3132170, 3249990, 3362436, 3287696, 2963472, 2610499, 2456787, 2482826, 2580737, 2758792, 3010954, 3169732, 3103729, 2942960, 2905720, 2971828, 2916451, 2657755, 2416909, 2476021, 2845741, 3243111, 3399588, 3320052]
36740C320052j41860j36236j78549j64939j441J39416Q8531K6721J86109L69276
36730C507080K32023q2802j48834j4038j05343l73517k78282K26854M71896J31793
36720C566830k29512r0819K31549K22056j0424j10710j46774k98152l30188q956
36710B794900L24049K10277j80968l37032j77310j6383M392m4552j63858k91920
36700B121595j73939J96220L59326R5695q1978K65583O52209L77171k70157m04630
36690C137095M4850K60054j19010m72084k34340K99633N30381L52404P3201o8395
36680C803789l7062O7455N5039j54780l42233k48799R039R6931k6772j14918q7384
36669C020305q1297p6449R6562L48703L57346P7291j50776j00457O1494R2006
$$ y = [3320052, 3178192, 3041956, 2863407, 2698468, 2697027, 2836443, 2924974, 2951695, 3137804, 3507080, 3739103, 3656301, 3507467, 3493429, 3388086, 3014569, 2736287, 2963141, 3435037, 3566830, 3337318, 3246499, 3478048, 3700104, 3689680, 3578970, 3432196, 3134044, 2803856, 2794900, 3118949, 3329226, 3148258, 2811226, 2633916, 2617533, 2621925, 2577373, 2413515, 2121595, 1947656, 2143876, 2503202, 2598897, 2516919, 2782502, 3434711, 3811882, 3541725, 3137095, 3181945, 3441999, 3322989, 2850905, 2616565, 2916198, 3446579, 3798983, 3872184, 3803789, 3766727, 3834182, 3889221, 3734441, 3392208, 3143409, 3152448, 3249379, 3222607, 3107689, 3020305, 2939008, 2862559, 2959121, 3307824, 3665170, 3742461, 3591685, 3491228, 3552722, 3644728]
36659C644728k2392j62501k30058j44311R3929L04491K93187J09689m1444q9464
36649C755854j02019r6671o8618r7177j93985j75718O8215L33185L77879K60757
36639D061702J31144o7211l41687l79872P638M00586K59543k39796m22501r8911
36629C310635K30781J73463q8139k14057j39286K6101J64505J47022k8460j08149
36619C474416Q5207K78894J12088k31088k47567P3455K22126o317k21182j08601
36609C431431J24995J83334J08700N7269J9778k2602J9087J23929J06119q6032
36599D066008k74281l31203k86804j34583J42719L47067K45039q314m2837J10656
36589C833467O1858k24942l12913l5390K20785K08369K08366L90738L72789r9681
$$ y = [3644728, 3622336, 3459835, 3229777, 3085466, 3179395, 3483886, 3777073, 3886762, 3845318, 3755854, 3653835, 3557164, 3488546, 3391369, 3197384, 3021666, 3089881, 3423066, 3800945, 4061702, 4192846, 4125635, 3783948, 3404076, 3411714, 3812300, 4071843, 3832047, 3409546, 3310635, 3541416, 3714879, 3626740, 3412683, 3273397, 3299498, 3464003, 3611025, 3582565, 3474416, 3559623, 3838517, 3950605, 3719517, 3471950, 3545405, 3767531, 3761214, 3540032, 3431431, 3556426, 3739760, 3848460, 3905729, 3925507, 3902905, 3921992, 4045921, 4152040, 4066008, 3791727, 3460524, 3173720, 3039137, 3181856, 3528923, 3773962, 3765648, 3722811, 3833467, 3895325, 3670383, 3357470, 3322080, 3542865, 3751234, 3959600, 4350338, 4723127, 4623446]
36579D623446n28863l25304K54560M67059J61163j42509j49923j16662k24266
36570D018701k47427m8008R8745l2394k02950r8130J46228J76038M639l5219J33004
36559C913227K09643M1224j15523l3297J01860K0584j58700j33506N8687J04058
36549D008257n7529j56588o5363L7682M7655J00686K34178K40212L4264j53384
36539D270070j42247n2846j4210N5371J79163J79183K7852j7666J19751J36819
36529D741240q8461j80746Q6548K80264k7524m71057l99850J00196L70263J94034
36519D604907l2629o5907o7117q4055O1769K76965J95170j73930l45312r2528
36509D277333K19815K37950Q2609j6728j06938k52312k70688m0793K10173K12688
$$ y = [4623446, 4094583, 3769279, 4023839, 4490898, 4652061, 4509552, 4359629, 4242967, 4018701, 3771274, 3723266, 3822011, 3789617, 3586667, 3488537, 3634765, 3810803, 3815442, 3780223, 3913227, 4122870, 4164094, 4048571, 4015274, 4117134, 4137718, 3979018, 3845512, 3904199, 4008257, 3950728, 3794140, 3728777, 3766459, 3814114, 3914800, 4148978, 4389190, 4423454, 4270070, 4127823, 4074977, 4060767, 4116138, 4295301, 4474484, 4502336, 4484670, 4604421, 4741240, 4652779, 4472033, 4558581, 4838845, 4811321, 4340264, 3940414, 4040610, 4410873, 4604907, 4572278, 4506371, 4439254, 4355199, 4416968, 4693933, 4889103, 4715173, 4369861, 4277333, 4497148, 4735098, 4817707, 4800979, 4694041, 4441729, 4171041, 4130248, 4340421, 4553109]
36499D553109L1261j00183j15945p4835L0516J95515K76948J52643p9693k13833
36489D655503j68046m648J80012K78400J86749p2768k96647k82014o1735J16482
36479D531288O9554j08579j77895q4845l1076j25849j46133J23697M48714M01952
36469D900828L2027j58898K2482J88981M9148j22446n964J94358J12492j64321
36459E048687k74494j51789j7045K3468J5929m6048j52568j62617j8585J12341
36449D377279J17800R9064P1849j12326l30029j67743L39555N17477N1635m10428
36439D554133k38110J89711J96588l9886O5431L54337K33770j53878j37275K43846
36429E268667K86420r3870k13062J17798K48054j16205l82560j53333Q2975j28366
$$ y = [4553109, 4584370, 4484187, 4368242, 4293407, 4323923, 4519438, 4796386, 4949029, 4869336, 4655503, 4487457, 4482809, 4662821, 4941221, 5127970, 5055202, 4758555, 4476541, 4414806, 4531288, 4600842, 4492263, 4314368, 4229523, 4198447, 4072598, 3926465, 4050162, 4498876, 4900828, 4932855, 4773957, 4796439, 4985420, 5034568, 4912122, 4906158, 5100516, 5213008, 5048687, 4774193, 4622404, 4605359, 4628827, 4644756, 4598708, 4446140, 4283523, 4264938, 4377279, 4495079, 4594143, 4665992, 4553666, 4223637, 4055894, 4395449, 4912926, 4964561, 4554133, 4316023, 4505734, 4702322, 4662436, 4727867, 5082204, 5315974, 5162096, 5024821, 5268667, 5555087, 5461217, 5248155, 5365953, 5614007, 5497802, 5115242, 4961909, 5044884, 4916518]
36419D916518l95202k09996J46664J10258k16971k80338M2457L50277L65358K07755
36409E036780Q5306M6228L0524k2091r8320r5770K5954J10969J1512j28791o0886
36398D941415J46680J91783L1470n7955N7631J86717J49684N896j07326j16742
36388E429253M354J68365J60325o3042k03763m7832J39765K7530j94401j26535
36378E294019J21908J03518j73618k34161P5023L65145L49839J83315N1870r4181
36368F042677k70047l19524j74156M4525K11257K37465K9626k97910l58658j0132
36358E135123L03215J61038j55725j28842J39578J63061p5758j94212j36690j21494
36348E089294m6020K96073N72442L09970j91571k17389J73428K49720j16937k71558
$$ y = [4916518, 4521316, 4311320, 4457984, 4568242, 4351271, 4070933, 4113390, 4463667, 4829025, 5036780, 5122086, 5168314, 5198838, 5176747, 5078427, 4982657, 5008611, 5119580, 5131092, 5002301, 4941415, 5088095, 5279878, 5311348, 5253393, 5311024, 5497741, 5647425, 5653321, 5545995, 5429253, 5433607, 5601972, 5762297, 5699255, 5495492, 5447660, 5587425, 5614955, 5420554, 5294019, 5415927, 5519445, 5345827, 5111666, 5186689, 5551834, 5901673, 6084988, 6136858, 6042677, 5772630, 5453106, 5278950, 5323475, 5534732, 5772197, 5801823, 5503913, 5145255, 5135123, 5438338, 5599376, 5443651, 5314809, 5454387, 5617448, 5541690, 5347478, 5210788, 5089294, 5043274, 5339347, 5911789, 6221759, 6030188, 5812799, 5986227, 6235947, 6119010, 5847452]
36338E847452L3130K63486J29129J8252J28452Q9282j99733k43964J17611K97782
36328F480879m1046l46545r0439L44032L03458j12625k78364K7040M17289M56792
36318G160471J01052l06984l61169m5045K11665J44653O7580K77272M06369J0492
36308G666356n17235m41950J09998L52031J19636j9724J04759N9886k08830k25488
36298F999439M5681R7696r1513J8656L86911K92857l12021n09667Q2850O27005
36288G637894M37730J0831K3150K30062Q3849l00170m84797m19335k56594j4334
36278F948286J74262O3236j56843R96L96970L16037k83404n27036k8172M44925
36268G349257K18549l01896m69168l38433j82223R6876M60039M39625m0401l11005
$$ y = [5847452, 5880582, 6144068, 6273197, 6291449, 6419901, 6509183, 6309450, 6065486, 6183097, 6480879, 6439833, 6093288, 6002849, 6346881, 6650339, 6537714, 6259350, 6286390, 6703679, 7160471, 7261523, 6954539, 6593370, 6548325, 6759990, 6904643, 6972223, 7249495, 7655864, 7666356, 7149121, 6707171, 6817169, 7169200, 7288836, 7269112, 7373871, 7433757, 7224927, 6999439, 7045120, 7142816, 7051303, 7069959, 7456870, 7749727, 7437706, 6928039, 7010889, 7637894, 8075624, 8086455, 8109605, 8339667, 8423516, 8123346, 7638549, 7219214, 6962620, 6948286, 7122548, 7185784, 7028941, 7029937, 7426907, 7742944, 7459540, 6932504, 6904332, 7349257, 7567806, 7265910, 6796742, 6458309, 6276086, 6372962, 6833001, 7272626, 7232225, 6921220]
36258F921220M863L61965K43275m4799p5530m698k1557J00553L68466L12124j11510
36247H054372k34207J71652M00343M5714k80344j10938M7086k03476l09994J14897
36237G695105L83683o7552n42629k30020L90497M22495N4415J1016J82993J1771
36227H311774l03679j72538K32286K85207K3252o0013R496j11126k33171M9859
36217H031347M74411M49371O8009o4353J73026L52307K58103M8278j61006l06744
36207I322749k14512R0570K23985K7467j00040J16115L24744J98819K5251J19954
36197A0135102K18446Q829k62900k60765j13689k6867J03304K63436J49989j74152
36187A0040733j74117K01073K84751j39078l62590J0945L44859J33346j03581
$$ y = [6921220, 6926083, 7288048, 7531323, 7486524, 7410994, 7406296, 7384739, 7485292, 7853758, 8165882, 8054372, 7820165, 7991817, 8392160, 8437874, 8157530, 8046592, 8093678, 7890202, 7580208, 7695105, 8078788, 8011236, 7468607, 7238587, 7629084, 8051579, 8105994, 8117010, 8300003, 8311774, 8008095, 7835557, 8067843, 8353050, 8376302, 8316289, 8325785, 8214659, 7981488, 8031347, 8505758, 8955129, 9023138, 8958785, 9131811, 9484118, 9742221, 9790499, 9629493, 9322749, 9108237, 9198807, 9422792, 9450259, 9350219, 9466334, 9791078, 9989897, 10015148, 10135102, 10353548, 10362377, 10099477, 9838712, 9725023, 9698156, 9801460, 10064896, 10214885, 10040733, 9866616, 10067689, 10352440, 10213362, 9850772, 9861717, 10206576, 10339922, 10236341]
36178A0236341J55991M68674L03187k467J0596O7740j32454k08316R8788K66276
36168A1264356n7285l15836n6343K40636J40477Q2138L78798M29696j30615n35997
36158A1440025j58534L34462J51666k76893k12161R2401R5640L4905K11964J81235
36148A1894710k77828m10705J82607N75935O6953m68441r7146M75893K21229l23888
36138A1839319j07923M80190M11682p5870q2484J93940O171l07020N3608O64384
36128A3075997N10412j86530m00400j12228r2664k86643j0723N48807N61099N0980
36118A3658107k01555l1381Q6919Q4359J99321K09799j18874k81669J73136O50110
36108A4428272M17653j08733j36526J27396O3862r3007J75714N08068L10279o9477
$$ y = [10236341, 10392332, 10861006, 11164193, 11161726, 11172322, 11240062, 11107608, 10899292, 10998080, 11264356, 11207071, 10891235, 10834892, 11075528, 11216005, 11298143, 11676941, 12106637, 11976022, 11440025, 11281491, 11615953, 11767619, 11490726, 11278565, 11370966, 11466606, 11501511, 11713475, 11894710, 11616882, 11206177, 11388784, 11964719, 12031672, 11563231, 11466085, 11941978, 12163207, 11839319, 11731396, 12211586, 12623268, 12547398, 12464914, 12658854, 12665025, 12358005, 12411613, 13075997, 13586409, 13399879, 12999479, 12887251, 12794587, 12507944, 12497221, 13046028, 13607127, 13658107, 13456552, 13425171, 13512090, 13596449, 13795770, 14005569, 13886695, 13605026, 13778162, 14428272, 14845925, 14737192, 14600666, 14728062, 14791924, 14698917, 14874631, 15382699, 15692978, 15623501]
36098A5623501r957K08452M8703j84752k3965J56098q2962k80490L1250L67325
36088A5853203K54244J46491L73443L33255k22441m10852J72592N19245O0721
36079A7079901j60877M95775Q47420K8633p29214k21155N71620L41879k13812
36070A8040170P7860O37179M73751J76141N16890O75299q7396o41018K7694P76794
36060B0673364L99916r4061M54442R68348K44407n31808L0391Q06824L25167l49881
36050B2927109K65009J080902N43496k65677K64925J047540L76638p13618m40698
36041B5085626L49747J05812k20636O85891J395284M26725l14745J158160K511010
36032C1182874M91336l239663m350761k335282k41895O01604J133104J239941
$$ y = [15623501, 15613544, 15821996, 15870699, 15685947, 15661982, 15818080, 15735118, 15454628, 15485878, 15853203, 16107447, 16253938, 16627381, 16960636, 16738195, 16327343, 16499935, 17019180, 17079901, 16919024, 17414799, 18262219, 18290852, 17561638, 17340483, 17912103, 18253982, 18040170, 18118030, 18755209, 19228960, 19405101, 19921991, 20597290, 20509894, 19868876, 19896570, 20673364, 21073280, 20979219, 21433661, 22402009, 22646416, 22114608, 22144999, 22951823, 23276990, 22927109, 23192118, 24273020, 24816516, 24550839, 24815764, 25863304, 26239942, 25526324, 25085626, 25435373, 25541185, 25320549, 26006440, 27401724, 27828449, 27513704, 28671864, 31182874, 31674210, 28434547, 24083786, 21748504, 21506609, 22108213, 23241317, 24481258]
36024B4481258K95280k93007Q40463J934478R95924k66384N05146J762616J018849
36015C1274623k51356M93768J763960R56688l78386M51973J869141J177855R1697
36006C7449963J271276K606447J145600p19787M55468K378550J438543o3131J485291
35997D7448220L448313J964416k7851J663373L833035K004705j77965K228410
35989F2384656N133579L020118M63461L664792P463053M748957J288749N315498
35981I3482863J0460720P214342K682285P882983J4691526J0242413M351570J2614064
35973A63622766K2619649J4823456P168702K7468202M2641818j7454313j42758917
35966A18131363k16762665j55673880k3046502N3075289L9512344P748047R802519
$$ y = [24481258, 24776538, 24483531, 25323994, 27258472, 28254396, 27988012, 28493158, 30255774, 31274623, 31023267, 31517035, 33280995, 34237683, 33859297, 34311270, 36180411, 37358266, 37449963, 38721239, 41327686, 42473286, 41753499, 42208967, 44587517, 46026060, 45962929, 47448220, 50896533, 52860949, 52833098, 54496471, 58329506, 60334211, 60156246, 62384656, 67518235, 70538353, 71001814, 74666606, 82129659, 86878616, 88167365, 93482863, 103943583, 111157925, 113840210, 121723193, 136414719, 146657132, 151008702, 163622766, 186242415, 201065871, 208234573, 235702775, 278344593, 260890280, 118131363, -98631302, -254305182, -277351684, -224276395, -184764051, -177016004, -167213485]
35959a67213485K2328711J5338937M040178Q771543J6323589J0112828J565748
35952h8731951N136687J1082712O603485O3001K852061P673751M409513l58737
35944e1269478K371092O325302L198755j005014J554271N185778K437273j302886
35936c2504907J078837M470458K050193j349224P76733L802987J551799j404737
35928b1527861R23117L942465J588322j762420J3475K982195J278404j434763
35920a3997066L61532L046151J303838j269484M99055L047009J331338j118212
35912f795839N65706K763100P02564j791826K36954L008568J410644j029810O33008
35903b96931K879500R05254j573747L98319L108909J457038j020429O74536L007995
$$ y = [-167213485, -144884774, -129545837, -125505659, -116734116, -100410527, -90297699, -88731951, -83595264, -72512552, -65909067, -65846066, -62994005, -55320254, -50910741, -51269478, -48898386, -42573084, -39374329, -40379343, -38825072, -33639294, -31202021, -32504907, -31426070, -26955612, -24905419, -26254643, -25477910, -21674923, -20123124, -21527861, -20604744, -16662279, -15073957, -16836377, -16822902, -13840707, -12562303, -13997066, -13635534, -10589383, -9285545, -10555029, -10055974, -7008965, -5677627, -6795839, -6230133, -3467033, -2764469, -4556295, -4319341, -1310773, 99871, -929939, -296931, 2582569, 3487823, 1914076, 2312395, 5421304, 6878342, 5857913, 6532449, 9540444]
35894I540444J101113j353960N16511K801578N20991k092040M47275L972102K363538
35885A7817552j159262j011158J14171j776930k466709J927733N335117K158163
35877B0938677j469305J243360M826486K379400o77459K560123O199874K960603
35869C8961759p09620L141799P604521L990453k15585M628817J0399037O225753
35861G4026934Q60857O552080J3730599Q590301K143971J0372033J9795526J1274031
35853A47346332M001722K5053077M1691074j1265982j22069112j85244370j30707225
35846b31194484j8058317M4142314L2325861P156246Q864082J7746046J1890594
35839a27127658L985228P986397J2953190P891511K118307M928566Q483431M832820
$$ y = [9540444, 10641557, 9287597, 9804108, 12605686, 13126677, 11034637, 11481912, 15454014, 17817552, 16658290, 15647132, 15761303, 13984373, 11517664, 13445397, 18780514, 20938677, 19469372, 20712732, 25539218, 27918618, 27241159, 29801282, 36001156, 38961759, 38252139, 41393938, 48998459, 52988912, 52773327, 57402144, 67801181, 74026934, 74887791, 81439871, 95170470, 103760771, 105904742, 116276775, 136072301, 147346332, 151348054, 176401131, 218092205, 206826223, 84757111, -100487259, -231194484, -249252801, -205110487, -172784626, -165628380, -156764298, -139018252, -127127658, -123142430, -115156033, -102202843, -94311332, -92193025, -87264459, -78781028, -73948208]
35831g3948208P26001L115260O116969L517525L85151K198983M482433K365401
35823e1040485j29640J399389L366151J815239m8751J259668K775027J414508
35815c9188894K80J280052K449772R02943o02098N84386J980151R83050k93567
35806c1903925N55370J756187J213859M36120J091534J724702R84368L19470R03711
35797b2918604J528264J413026J230876J22559l631590p720506o975493j299847
35789c8251315L036122K310745R0393L83753J636698J079473J6120O35856J613926
35780b7448229R70059j8288N12550J382155Q28778j21264P4507M22032l63791
35771b3761491j030168j47996R90999O69223j93142L9189P38534N38997l7385
$$ y = [-73948208, -73222207, -70106947, -63989978, -60472453, -60087302, -57888319, -53405886, -51040485, -51170125, -49770736, -46404585, -44589346, -44638097, -43378429, -40603402, -39188894, -39188614, -37908562, -35458790, -34555847, -35157945, -34573559, -32593408, -31610358, -31903925, -31348555, -29592368, -28378509, -27942389, -26850855, -25126153, -24141785, -23822315, -22918604, -21390340, -19977314, -18746438, -18623879, -22255469, -29975975, -36951468, -38251315, -35215193, -32904448, -32814055, -32430302, -30793604, -29714131, -29698011, -29062155, -27448229, -26478170, -26496458, -25983908, -24601753, -23772975, -23894239, -23819732, -23397700, -23761491, -24791659, -24939655, -23948656, -23279433, -23472575, -23433386, -22694852, -22155855, -22193240]
35762b2193240P8558L12014j18212l18289N27508J240293O29968k65782j9922
35753b0127104P13695O28967J30218K30760N16907J86429j97451J43907N59485
35744a7214187K24512k14867O6670M14333K916m55200j6151O63899N05056o9000
35734a6092019l7120L76846L59572Q6977J34985J90044k06075m79836k121N82711
35724a5086036L80142j84856j72749K30633K25015r2196l9120L22347L68025L9126
35714a4009669k10184k27362j25286J24317M02496L10906r3107j29779L72389
35705a3585279O20469J57506l12713j37289K02112O8624j80996J7484L15671J35323
35695a2699088k04444n4446M03493N06107J98273n7670j02345r9143o7939J8199
$$ y = [-22193240, -22114682, -21802668, -21920880, -22239169, -21711661, -20471368, -19841400, -20107182, -20127104, -19413409, -18784442, -18654224, -18423464, -17906557, -17720128, -17917579, -17773672, -17214187, -16989675, -17204542, -17137872, -16723539, -16720623, -17175823, -17191974, -16528075, -16023019, -16092019, -16129139, -15752293, -15392721, -15305744, -15170759, -14980715, -15186790, -15666626, -15668747, -15086036, -14705894, -14890750, -15063499, -14832866, -14607851, -14700047, -14739167, -14416820, -14048795, -14009669, -14219853, -14447215, -14572501, -14448184, -14045688, -13734782, -13827889, -13957668, -13585279, -12964810, -12807304, -13120017, -13257306, -13055194, -12986570, -13167566, -13150082, -12834411, -12699088, -12903532, -12957978, -12554485, -12048378, -11850105, -11907775, -12010120, -12109263, -12177202, -12159003]
35685a2159003J8391m3236J33821N19308N76013R7126l60167l02563J8126J60199
35675a1341985J32456P7368q1607k76377j68745K41376M63224K78419M5546k804
35665a0633129p1991j78338Q300M12573M59614N0167k00819k6194P1311j75218
35655a0283724k92537j7496J61648o8695k51054l6367J73357L0669j07910Q2386
35645a0609723K74131J79165J17337L22354M11993J29330j04534M1297J92445
35636i046205O217j75415j2283J68532Q317k16730j64725n1052j20346j05398
35626i709088K00982M23890K37511m3841n5682J212j30522k17963l9951J29277
35616i204175O2536L5781K36323L17068O2759j20674O9642K52360Q4742p3551
$$ y = [-12159003, -12140612, -12183848, -12050027, -11530719, -10954706, -10857580, -11217747, -11520310, -11502184, -11341985, -11209529, -11132161, -11213768, -11490145, -11658890, -11417514, -10954290, -10675871, -10630325, -10633129, -10705120, -10883458, -10875158, -10462585, -10002971, -9952804, -10153623, -10179817, -10108506, -10283724, -10576261, -10593757, -10432109, -10500804, -10751858, -10788225, -10614868, -10584199, -10692109, -10609723, -10335592, -10156427, -10039090, -9716736, -9304743, -9175413, -9279947, -9238650, -9046205, -9039988, -9215403, -9227686, -9059154, -9050837, -9267567, -9432292, -9483344, -9603690, -9709088, -9508106, -9084216, -8846705, -8890546, -8946228, -8945016, -9075538, -9293501, -9333452, -9204175, -9141639, -9105858, -8869535, -8552467, -8489708, -8610382, -8540740, -8288380, -8203638, -8277189]
35606h277189J45776L79884J79356j65021j52039O5946N2491j21303j34943o0243
35596h087285r6198o4649J93984L29567L9035k81509j21201K68884K88017k6865
35586g558220j44832M5800J67952P5848J0077Q2970J40782J15974R2095O1586
35576f909968l5312j10525n7742L3439L5022k165J1018M2586Q1112J80330K30248
35565f501957J8666l38400m28643j71636L6434k256J4577K52861L57494P5818
35555f687042k39802j82642Q7386K00377J62136J63012J58208M5100n5968n0118
35545f399353p8246j81766j31030J14287J96416n1208k39496l0906K96792K98028
35535f206482O953k48014l39172l03570j55183l8667j92401m76924l85893J63863
$$ y = [-8277189, -8131413, -7751529, -7572173, -7737194, -7889233, -7823287, -7770796, -7892099, -8027042, -8087285, -8183483, -8248132, -8054148, -7724581, -7685546, -7967055, -8088256, -7819372, -7531355, -7558220, -7703052, -7657252, -7489300, -7413452, -7403375, -7320405, -7179623, -7063649, -6971554, -6909968, -6945280, -7055805, -7113547, -7080108, -7045086, -7047251, -7036233, -6993647, -6912535, -6732205, -6501957, -6483291, -6821691, -7250334, -7421970, -7385536, -7387792, -7373215, -7120354, -6762860, -6687042, -6926844, -7109486, -7022100, -6821723, -6659587, -6496575, -6338367, -6293267, -6349235, -6399353, -6477599, -6659365, -6790395, -6676108, -6479692, -6530900, -6770396, -6801302, -6504510, -6206482, -6199529, -6447543, -6786715, -7090285, -7245468, -7284135, -7476536, -7953460, -8339353, -8175490]
35525h175490N52329L40727p0788j09823J27367K00743P2133M976M8778Q7990
35515f921058J17654J06050p6554k85485j09525M10361O08459J66235l14991k32187
35505f531041J06384J10904r3985m0840J66375J16636o3146N2036L29164K67895
35495e579618r3258k42411r7497q2055k81273k57537J53142M98788L93496N2398
35485e535825j00659q068O8364m4327k38860k68606m6373J89909J41419r9165
35475e942191j32211J17990K32138l5045l26261k46686L3209J45602J40058K53269
35465e760128L58604J76205j58897k52621o1490J07127J11434Q0017Q2000O5212
35455e252537M8509N9225j1498k04810l07934j63860L3034N8639L7723J55240
$$ y = [-8175490, -7623161, -7282434, -7353222, -7463045, -7335678, -7134935, -7062802, -7057826, -7009048, -6921058, -6803404, -6697354, -6773908, -7059393, -7168918, -6758557, -6150098, -5983863, -6298854, -6531041, -6424657, -6313753, -6407738, -6448578, -6282203, -6165567, -6228713, -6176677, -5847513, -5579618, -5672876, -5915287, -6012784, -6094839, -6376112, -6633649, -6480507, -5981719, -5588223, -5535825, -5636484, -5644552, -5576188, -5620515, -5859375, -6127981, -6174354, -5984445, -5843026, -5942191, -6074402, -5956412, -5724274, -5759319, -6085580, -6332266, -6299057, -6153455, -6013397, -5760128, -5401524, -5225319, -5384216, -5636837, -5698327, -5591200, -5479766, -5399749, -5317749, -5252537, -5204028, -5144803, -5156301, -5361111, -5669045, -5832905, -5799871, -5741232, -5703509, -5548269]
35445e548269K54299J31710j9215P0140J97574j3699m18491m91209j14700K70067
35435e681793L12443J17525o5243j37948r4408K3590P9689r342j13485q4531K848
35424e650655L0859Q0727K15574K34936K468j85081J2441L71118L65238l2593
35414d554968l04886j63952R2033J10039k7162l3369J27901K35693J40748m6333
35404d424256r9893J6325N8953j58863m07485k88259J47145L91043K08117m3064
35394d600237l1597L9907j12755l00761j97996P8981J88903J22806R3330Q0481
35384d638938o0504k22758k21141j64043k14994j82784J61922N37976M67283L7691
35374d500290j92871k2264J86250J37424l9072j31386j26581p0475J3717K9383
$$ y = [-5548269, -5293970, -5162260, -5181475, -5111335, -4913761, -4927460, -5345951, -5837160, -5951860, -5681793, -5369350, -5251825, -5317068, -5455016, -5549424, -5525834, -5446145, -5455487, -5568972, -5653503, -5650655, -5619796, -5539069, -5323495, -5088559, -5086091, -5271172, -5258731, -4887613, -4522375, -4554968, -4859854, -5023806, -4931773, -4821734, -4848896, -4882265, -4754364, -4518671, -4377923, -4424256, -4524149, -4507824, -4448871, -4607734, -5015219, -5303478, -5156333, -4765290, -4557173, -4600237, -4631834, -4591927, -4704682, -5005443, -5203439, -5124458, -4935555, -4812749, -4719419, -4638938, -4699442, -4922200, -5143341, -5307384, -5522378, -5705162, -5543240, -5005264, -4537981, -4500290, -4693161, -4715425, -4529175, -4391751, -4430823, -4562209, -4688790, -4759265, -4745548, -4716165]
35364d716165p8387j47459l5541P4840l5501j69685K726L18406K95067q9680l26021
35353d907400j36696J83312K93576K13598P4088j07745k53884k09615m4159j4532
35343d909457j18851o1480K15136L65737J85877n5853m5336J44177K67905K65087
35333c747058J79137n015k16892k42534m3957Q8545n5473k53019j72160J11528
35323d356898K22586L5046j71780j27601P9719J60211J0621j59438q4528K29373
35313d162689M87731M28357J03586k01763k82560j80560p6411p7538j08899j7490
35303d088236J79616K30806j6900l04457k61509L432J3096k84924l28646J65666
35293d692056O13071L63270k73373m39617K2626M24565L05434j6463j01800l595
$$ y = [-4716165, -4794552, -4942011, -4977552, -4902712, -4938213, -5107898, -5105172, -4786766, -4491699, -4581379, -4907400, -5044096, -4860784, -4567208, -4353610, -4279522, -4387267, -4641151, -4850766, -4894925, -4909457, -5028308, -5089788, -4874652, -4508915, -4323038, -4378891, -4424227, -4280050, -4012145, -3747058, -3567921, -3572936, -3789828, -4032362, -4076319, -3987774, -4043247, -4296266, -4468426, -4356898, -4134312, -4099266, -4271046, -4398647, -4318928, -4158717, -4148096, -4307534, -4392062, -4162689, -3674958, -3246601, -3143015, -3344778, -3627338, -3807898, -3884309, -3961847, -4070746, -4088236, -3908620, -3677814, -3694714, -3999171, -4260680, -4257248, -4244152, -4529076, -4857722, -4692056, -4078985, -3715715, -3989088, -4428705, -4406079, -3981514, -3676080, -3692543, -3794343, -3797938]
35283c797938K5436l4934j09054k16096k73255o2965L46647M98212J64665k41393
35273c700675k21922J11202K81057J74597Q7155J45934J44690k5264j81237j89328
35263c373791j65702j97177j54034L0702J50987M3461q5513M9539L20009L27596
35253c053923J2325k48812k17260j03242j43145k18774j53586p0346j08703o1790
35243d367256K66635N55221L54062j24001k12482J76450L78417K7125l63496k35505
35233c544830J53701K23744N595k3982J96885K48061k9704k84281k34313n9292
35223c348416l7587j10061k1766K59669M61623L37427r065k14185j12015J9407
35213b774969j45058m38625l94984K6775L33783K34231K7909L2817Q1193o2318
$$ y = [-3797938, -3772502, -3807436, -3916490, -4132586, -4405841, -4468806, -4122159, -3623947, -3459282, -3700675, -3922597, -3811395, -3530338, -3355741, -3268586, -3122652, -2977962, -3003226, -3184463, -3373791, -3539493, -3736670, -3890704, -3860002, -3709015, -3665554, -3751067, -3701528, -3381519, -3053923, -3041598, -3290410, -3507670, -3610912, -3754057, -3972831, -4126417, -4196763, -4305466, -4367256, -4100621, -3545400, -3191338, -3315339, -3527821, -3351371, -2972954, -2945829, -3309325, -3544830, -3391129, -3167385, -3161790, -3185772, -2988887, -2740826, -2770530, -3054811, -3289124, -3348416, -3386003, -3496064, -3517830, -3258161, -2796538, -2459111, -2468176, -2682361, -2794376, -2774969, -2920027, -3358652, -3753636, -3726861, -3393078, -3158847, -3130938, -3098121, -3016928, -3079246]
35203c079246k01573q0574R2878M133j70579p9408J17855J602k95797k07565L12761
35192c585513O14151L06947j67656k16497R6752K76319J40009l4399m233J02089
35182b472031Q890k77052l93725o7916M31224N22221P7405l30934j78912K78373
35172b402457L71946n7790n03194n02038j45420J53356J28295j33734k90297q7477
35162c468810K88186L79473J14014k8511K29598M35474R5478m46410m54071O2944
35152b792635L59381Q5739k73499k18241J12034L12126K53314L3314k20286l20015
35142b668768j43292R6162O0008j67103j62551J30386K73994N5440j69405p6113
35132b771242J49960K05704J23603M6790o9939k41733k82233j33101l2388q5206
$$ y = [-3079246, -3280819, -3361393, -3268515, -3264382, -3434961, -3514369, -3396514, -3394912, -3690709, -3898274, -3585513, -2971362, -2664415, -2832071, -3048568, -2951816, -2675497, -2535488, -2569887, -2574120, -2472031, -2463141, -2740193, -3133918, -3201834, -2770610, -2248389, -2170984, -2501918, -2680830, -2402457, -2030511, -2088301, -2591495, -3093533, -3238953, -3085597, -2957302, -3091036, -3381333, -3468810, -3180624, -2801151, -2687137, -2715648, -2486050, -2050576, -1955098, -2401508, -2855579, -2792635, -2433254, -2347515, -2621014, -2839255, -2727221, -2415095, -2161781, -2128467, -2348753, -2668768, -2812060, -2715898, -2655890, -2822993, -2985544, -2855158, -2581164, -2525724, -2695129, -2771242, -2621282, -2415578, -2291975, -2245185, -2315124, -2556857, -2839090, -2972191, -3004579, -3089785]
35122c089785k4295K96697N34214L49107l7488j73615j0498J71191K36564K12292
35112a535616M1550k63939l97182j10767L09809L44469m7369m00546m02472j98519
35102b660582k9477O9213J32666J37342J05029J04206Q7470n0100k13684j67084
35092b485001P7563J96644K1675j72556n6280K55625L56977J27227j23976j21574
35082a923676K2681O0378O069M9490J68166J23913j21589k75637j38426Q4973
35072a943658J05820j3931j7777R7837J09396k8211j31019j33655j58378j94254
35062b307830m5942K78376M39693K22147j21446j94272L5905K56544K30444J4523
35052a191858j82251k20007j27027m3719m4952l6053Q1709J91752R5611j36743
$$ y = [-3089785, -3114080, -2817383, -2283169, -1934062, -1971550, -2145165, -2155663, -1984472, -1747908, -1535616, -1494066, -1758005, -2155187, -2265954, -1956145, -1611676, -1659045, -2059591, -2462063, -2660582, -2690059, -2620846, -2488180, -2350838, -2245809, -2141603, -2054133, -2104233, -2317917, -2485001, -2407438, -2210794, -2189119, -2361675, -2417955, -2162330, -1805353, -1678126, -1802102, -1923676, -1900995, -1840617, -1834548, -1785058, -1616892, -1492979, -1614568, -1890205, -2028631, -1943658, -1837838, -1851769, -1869546, -1771709, -1662313, -1690524, -1821543, -1955198, -2113576, -2307830, -2353772, -2075396, -1635703, -1413556, -1535002, -1729274, -1693369, -1436825, -1206381, -1191858, -1374109, -1594116, -1721143, -1764862, -1809814, -1845867, -1764158, -1572406, -1476795, -1613538]
35042a613538j84223Q1639L77738L49863j6305m11040n00424j81068K96892M53149
35032a347317M8826n42301p00223l28658P0846J55324J36136K32032K15773j04469
35022b164031l57050r6724M25171N65245K50598L3234J65357K36238p6751m40708
35012a459421l93165l9085J77452J37329P2513P9735J7934j38135j96376n2697
35002a793916J64693L08738L47124K48749j5119k87367k98651m2347J64322J32783
34992a070991N1474Q4368K6741k94662n33340k31621L84225N82284J68486k16782
34982a049818p5260K22631J05162k51166k34162J71311L24054p7239n23860m32337
34972a820684P8402M31830L40875J8446k03213j98926n5286M7034l9343k83144
$$ y = [-1613538, -1797761, -1716122, -1338384, -988521, -1004826, -1415866, -1916290, -2097358, -1800466, -1347317, -1298491, -1840792, -2541015, -2869673, -2798827, -2643503, -2507367, -2275335, -2059562, -2164031, -2521081, -2617805, -2192634, -1627389, -1376791, -1343557, -1178200, -941962, -1018713, -1459421, -1852586, -1891671, -1714219, -1576890, -1504377, -1424642, -1406708, -1544843, -1741219, -1793916, -1629223, -1320485, -973361, -724612, -739731, -1027098, -1325749, -1368096, -1203774, -1070991, -1019517, -935149, -908408, -1203070, -1736410, -1968031, -1583806, -1001522, -833036, -1049818, -1125078, -902447, -797285, -1048451, -1282613, -1111302, -787248, -864487, -1388347, -1820684, -1742282, -1310452, -969577, -951131, -1154344, -1353270, -1408556, -1361522, -1400865, -1684009]
34962a684009m53897l46530l1568K06948K05802J07326J35009K47673J79704j27782
34952a561324l33590j37419K17875K10576j96638m41002j58088K74667K91439
34943a833504n3005k31616m2614J85401J66380K0055l0406J4093N7420J12550
34933a635246J99908K10482M3333k07462l32295k37055k8205J08500R0637J5913
34923a771490L3255J22861R5540j22283l20927k58544Q121K03187J86906P3328
34913a750046K5806Q4604J87813K45055J98353Q6565J0162j6297p9064j76469
34903a183518j70095k5350Q0300L9059J4233J59107L07673J97137j15534l05869
34893a002857j85885J29106L72496L04758j03790n11908m47536P9909M58401K39372
$$ y = [-1684009, -2137906, -2484436, -2516004, -2309056, -2103254, -1995928, -1860919, -1613246, -1433542, -1561324, -1894914, -2032333, -1814458, -1603882, -1800520, -2241522, -2399610, -2124943, -1833504, -1886509, -2118125, -2160739, -1975338, -1808958, -1788903, -1819309, -1805216, -1747796, -1635246, -1435338, -1224856, -1181523, -1388985, -1721280, -1958335, -1986540, -1878040, -1787403, -1771490, -1738235, -1615374, -1519834, -1642117, -1963044, -2221588, -2213467, -2010280, -1823374, -1750046, -1724240, -1639636, -1451823, -1206768, -1008415, -921850, -911688, -927985, -1007049, -1183518, -1353613, -1378963, -1298663, -1259604, -1245371, -1086264, -778591, -581454, -696988, -1002857, -1188742, -1059636, -687140, -382382, -486172, -998080, -1445616, -1365707, -907306, -667934]
34883f67934k43254l71603r7357J47015J73460J51975J29415p049j28551J0069
34873i03814K19002K6099n04197o83574j74751M54275M95876L3004k92078j75552
34863a505710J03771K29675K38764K88505L04388P0179l82635o91040n97298l21032
34853b262433k42812l08994j44110K28178K97760r5165l89656j55953K05136J52745
34843b715304p0970R9861N15869N29161Q0701k24120r3008J36614J85603J49449
34833a406144P3745j29972k86028j15796J59858M9496l37890l83379J845K25521
34823b148744O6233L3329L85348O14963L33100p3206j53551j14256l03689n35616
34813a896089m59690j61691P1149J85593J89553j6287k85967j90950L03939O32108
$$ y = [-667934, -911188, -1282791, -1380148, -1233133, -1059673, -907698, -778283, -785332, -913883, -903814, -684812, -658713, -1162910, -1846484, -2021235, -1566960, -1071084, -1038080, -1330158, -1505710, -1401939, -1172264, -933500, -644995, -340607, -270428, -653063, -1344103, -1941401, -2262433, -2505245, -2814239, -2958349, -2730171, -2432411, -2527576, -2917232, -3073185, -2868049, -2715304, -2786274, -2686413, -2170544, -1641383, -1560682, -1784802, -1877810, -1741196, -1555593, -1406144, -1332399, -1462371, -1748399, -1864195, -1704337, -1654841, -1992731, -2376110, -2374265, -2148744, -2082511, -2049182, -1663834, -1048871, -715771, -788977, -942528, -1056784, -1360473, -1896089, -2355779, -2517470, -2446321, -2260728, -2071175, -2087462, -2373429, -2564379, -2260440, -1628332]
34803a628332M59229J77751J63596J35799k31742o25041o11149l64723k69204
34794b793816k22957M1159L32114L24437J71720J88124K31729K0557k25888j01422
34784b034243K54149L61549J74858N9746J26248J37348P470r3863r1260p5595
34774a173593j01048j89802l72325m94603k80302J63327L06629j2179k39534K4795
34764b368635L34810J37322k86501l02209M4774K10285Q3863J5301J05287J47799
34754a877904J37334K30307L44961L26755L01457L66437K46486j96286n05508
34745f25961l21306q5665l04396n70720k44026L09372K36146l18503m24785M7180
34735b302664K88175M8916K4212M80617O98058K34576l00821k92204l4964k0147
$$ y = [-1628332, -1169103, -991352, -827756, -691957, -923699, -1548740, -2159889, -2524612, -2793816, -3016773, -2975614, -2643500, -2319063, -2147343, -1959219, -1727490, -1706933, -1932821, -2034243, -1780094, -1418545, -1243687, -1183941, -1057693, -920345, -912875, -1006738, -1097998, -1173593, -1274641, -1464443, -1836768, -2331371, -2611673, -2448346, -2141717, -2153896, -2393430, -2368635, -2033825, -1896503, -2183004, -2485213, -2440439, -2230154, -2146291, -2130990, -2025703, -1877904, -1740570, -1510263, -1165302, -838547, -537090, -170653, 75833, -120453, -625961, -947267, -1032932, -1337328, -1908048, -2152074, -1842702, -1606556, -1925059, -2349844, -2302664, -2014489, -1965573, -1941361, -1460744, -762686, -528110, -828931, -1121135, -1156099, -1176246]
34725a176246q2506J08546L49365L12699J52210J53320K17758J70457J70301L78764
34715G54668N87276N45327L00864p7667o89043j404837j752346j546137j201893
34706d483788j069477r03009l92341K08433M47921L44239K42744K61308K69409
34697e074561K16060J52682J01559J22414K88443M37552K61228j78947l86215
34688d059785j04195L06022M09261K54841J29379J06585J28354K14923L22891
34679b291724K84213J04320J1847M4949l4196k53123l15790j71168j70083l90094
34669c180849l77866O7566M29780K62433q8998q9928J43303K00384J37936K27726
34659b268513L04720N8842l00811l70933l14323n67922r51345q37517j81630L62729
$$ y = [-1176246, -1258752, -1150206, -800841, -488142, -335932, -182612, 35146, 205603, 375904, 754668, 1341944, 1887271, 2188135, 2110468, 1421425, 16588, -1735758, -3281895, -4483788, -5553265, -6456274, -6848615, -6640182, -6192261, -5848022, -5605278, -5343970, -5074561, -4858501, -4705819, -4604260, -4481846, -4193403, -3755851, -3494623, -3673570, -4059785, -4163980, -3857958, -3448697, -3193856, -3064477, -2957892, -2829538, -2614615, -2291724, -2007511, -1903191, -1891344, -1846395, -1880591, -2133714, -2449504, -2620672, -2790755, -3180849, -3558715, -3491149, -3061369, -2798936, -2887934, -2977862, -2834559, -2634175, -2496239, -2268513, -1963793, -1904951, -2205762, -2576695, -2891018, -3458940, -4410285, -5247802, -5429432, -5066703]
34649e066703M27792L47828M48007N50123M18710J71954j0704j60897k70937j68953
34639c313780J19184K48773N4908j45604j9790K89359M22462L28077K16818J52869
34629a646724K7874j17152p6682J42189J89425j99102p69080r63432n81796l3673
34619d028153J69839J6674j02013K3430K06703K29869J34873O6777O8128J30788
34609c083085K28132K11102n9759l73232k90668K02504N26012K76832j66593k05545
34599b734300J00907K16402P430j19442O3567K89104K95484J74525O0055j11362
34589a757630l16584l03481j5386J53894j21504n31904m65276J59079P29294O56194
34579a813304J5192n89713o43341j56158L87158M82060J04422k54236j62055K12575
$$ y = [-5066703, -4638911, -4291083, -3843076, -3292953, -2874243, -2702289, -2712993, -2873890, -3144827, -3313780, -3194596, -2945823, -2890915, -3036519, -3056309, -2766950, -2344488, -2016411, -1799593, -1646724, -1618850, -1736002, -1812684, -1670495, -1481070, -1680172, -2449252, -3412684, -3994480, -4028153, -3858314, -3841640, -3943653, -3920223, -3713520, -3483651, -3348778, -3282001, -3213873, -3083085, -2854953, -2643851, -2703610, -3076842, -3367510, -3165006, -2638994, -2362162, -2528755, -2734300, -2633393, -2416991, -2409561, -2529003, -2465436, -2176332, -1880848, -1706323, -1646268, -1757630, -2074214, -2377695, -2393081, -2239187, -2360691, -2892595, -3357871, -3198792, -2469498, -1813304, -1798112, -2387825, -3031166, -3187324, -2800166, -2318106, -2213684, -2467920, -2629975, -2417400]
34569b417400L50137J24528m3948J24351L22419J84343q1120l9195J98708J15415
34559a161762l40096o22688m56136k37748l09552l81961j08445K28582J57568
34550c232238j63329j61471K58718N89379M56964L5618k81102k63755O3407M00589
34540b297220L34573j60685n45518l93299j8771L3088j28338J2696M11950M81276
34530b270248P0815k90869k55257p5682O093J44398M05838M82417J94796j78173
34520a765872l20406k22270L9448M03253N97864L44127j04609j92285P7482J66200
34510i77068j5602M1875L92800L37643l89728j001100q02792k08127L9710l3988
34500b616377j0473P2884k575l4145J93154L53181J31495j27479k1561J38927
$$ y = [-2417400, -2067263, -1942735, -1986683, -1862332, -1539913, -1355570, -1436690, -1475885, -1277177, -1161762, -1501858, -2124546, -2580682, -2818430, -3127982, -3509943, -3618388, -3389806, -3232238, -3395567, -3557038, -3298320, -2708941, -2251977, -2216359, -2497461, -2761216, -2697809, -2297220, -1962647, -2123332, -2668850, -3062149, -3080920, -3047832, -3176170, -3163474, -2751524, -2270248, -2199433, -2490302, -2745559, -2821241, -2815148, -2670750, -2264912, -1782495, -1587699, -1765872, -2086278, -2308548, -2269100, -1865847, -1267983, -923856, -1028465, -1220750, -1143268, -977068, -992670, -950795, -557995, -220352, -610080, -1611180, -2413972, -2622099, -2582389, -2616377, -2626850, -2553966, -2556541, -2590686, -2397532, -2044351, -1912856, -2040335, -2061896, -1922969]
34490a922969r2595m12825k63227J84604L54527K34274K12211K61126R0521j62316
34480a516669j63856l2440l7253m36K64110L54097m7386l76083o851N99969O15106
34469c47692K44214K55500N27190L57087j08941j28256K09042K12477J8180K83881
34459A522682P00969M74415M6847M28265J021880M58607m33616N28843K440969
34450G189861J182113m357445r071484p685381j847750K237496J910504J16190
34442a0325896j11665O43862P25502L67483M98680P74766M88066L5226Q7313L43601
34432f473062K51430O9034K09140L34017M7722k26798L1690M63019M33466J01214
34422d759128M6335K62604L01116R9357k7346K1939J12715J97875K14615j3525
$$ y = [-1922969, -2015564, -2428389, -2691616, -2507012, -2152485, -1918211, -1706000, -1444874, -1354353, -1516669, -1680525, -1712965, -1750218, -1750654, -1486544, -1132447, -1179833, -1555916, -1562767, -962798, -347692, -103478, 152022, 679212, 1036299, 927358, 799102, 1008144, 1220621, 1238801, 1522682, 2223651, 2698066, 2744913, 3173178, 4195058, 4653665, 4220049, 4748892, 7189861, 8371974, 4014529, -5056955, -12742336, -14590086, -12352590, -10442086, -10325896, -10437561, -9793699, -9068197, -8700714, -8202034, -7427268, -6939202, -6903976, -6816663, -6473062, -6221632, -6152598, -5943458, -5609441, -5561719, -5788517, -5756827, -5293808, -4860342, -4759128, -4712793, -4450189, -4149073, -4049716, -4077062, -4055123, -3942408, -3744533, -3529918, -3543443]
34412c543443l67945l59317J00196L61387P638l91548j66637L35198L36515p9921
34402c767877j87437J29818K86721O6536j31834j26073j60418k11032N0900M45626
34392c605070L12652l61092o84954j61793N20658N34561Q7080r4765O9338R5731
34382c287654j33610k50465q8943J14905J86204J84142J21831o1419k41504j93689
34372c650202M7885K21234K13669J30228M1582m2186j8750J64779K90424J37646
34362b463691r8673n4331J87929J86705j29063l14902j23104J21246Q0953q7624
34352b694555q6329K8112L8970k2827j4732J629p1847q5012J07794K72412Q4634
34341b441751k91289l49325J8466L47350K78604L7145J6388J78667J78654n8998
$$ y = [-3543443, -3911388, -4270705, -4170509, -3809122, -3801484, -4193032, -4359669, -4024471, -3687956, -3767877, -3955314, -3825496, -3538775, -3472239, -3604073, -3730146, -3890564, -4101596, -4050696, -3605070, -3292418, -3653510, -4338464, -4500257, -3979599, -3445038, -3357958, -3452723, -3383385, -3287654, -3421264, -3671729, -3760672, -3645767, -3459563, -3275421, -3153590, -3215009, -3456513, -3650202, -3602317, -3381083, -3167414, -3037186, -2995604, -3037790, -3056540, -2891761, -2601337, -2463691, -2562364, -2616695, -2428766, -2242061, -2371124, -2686026, -2809130, -2687884, -2606931, -2694555, -2780884, -2752772, -2713802, -2736629, -2751361, -2749732, -2821579, -2906591, -2798797, -2526385, -2441751, -2733040, -3082365, -3063899, -2716549, -2437945, -2400800, -2384412, -2205745, -2027091, -2086089]
34331b086089k19490q4072J29411P2575k23329l61170j07955K88527M23474K26859
34321a941259m0856j81271k15441j83294m9765J31785J95462J02642J1201P138
34311b163658k7588j53539j96549k0726J97200J96146K2812l9206J11198K57850
34301a816060J77815o2480j92020o7689J38411J37127r3879k58665j69755m0608
34291b247803j27281k64325j25160J74791K10873l4992j30260N5776J37322o6094
34281b417153k03220p9389m4260k73615k88088K37207P35494N20806j34434m47863
34271b394515l09773k11430k46461n5868L34770M76279L05016K11704K64239J21590
34261a504449k14573l28337j69282j37106k68802j54883J56547N2316n36112p91966
$$ y = [-2086089, -2305579, -2389651, -2260240, -2187665, -2410994, -2772164, -2880119, -2591592, -2168118, -1941259, -1982115, -2163386, -2378827, -2562121, -2611886, -2480101, -2284639, -2181997, -2170796, -2163658, -2191246, -2344785, -2541334, -2562060, -2364860, -2168714, -2145902, -2185108, -2073910, -1816060, -1638245, -1700725, -1892745, -1960434, -1822023, -1684896, -1778775, -2037440, -2207195, -2247803, -2375084, -2639409, -2764569, -2589778, -2378905, -2413897, -2544157, -2488381, -2351059, -2417153, -2620373, -2699762, -2744022, -3017637, -3305725, -3068518, -2333024, -1812218, -1946652, -2394515, -2704288, -2915718, -3162179, -3218047, -2883277, -2406998, -2101982, -1890278, -1626039, -1504449, -1719022, -2047359, -2216641, -2353747, -2622549, -2777432, -2620885, -2568569, -3104681, -3896647]
34251c896647k45220M51598N37078K17534R9388J73542Q0917r3444k8357J59368
34241b544243J19034q6841j16432O4103K14865K39818J56379q5829l57885k64583
34231b661614K46894N66317K29555l19932l69315L875J74958K49j20958m3335
34221b293306r645n9330J8357J61195R8904o4611L9152L27871K97131j39992m44126
34210b068400k53180J18697J90712p7176l61370l58770r891M12594M78546J26591
34200a801647j53841r518J95498N96k76324k7589N05522M98161r3058m15153j11216
34189a688569J72287j7069k17730k0502J61543o6302k74844l814L21463J09675
34179a523862l11313k40222J70908J90377k29947m16930j29800J47807J28945
$$ y = [-3896647, -4141867, -3690269, -3153191, -2935657, -2836269, -2662727, -2581810, -2675254, -2703611, -2544243, -2425209, -2512050, -2628482, -2564379, -2349514, -2109696, -1953317, -2039146, -2397031, -2661614, -2414720, -1848403, -1618848, -1938780, -2308095, -2304220, -2129262, -2129013, -2249971, -2293306, -2302951, -2362281, -2343924, -2182729, -2083825, -2148436, -2109284, -1781413, -1484282, -1624274, -2068400, -2321580, -2202883, -2012171, -2089347, -2450717, -2809487, -2819378, -2406784, -1928238, -1801647, -1955488, -1965006, -1769508, -1768912, -2045236, -2072825, -1567303, -1069142, -1162200, -1577353, -1688569, -1516282, -1533351, -1751081, -1771583, -1610040, -1676342, -1951186, -1955000, -1633537, -1523862, -1835175, -2075397, -1904489, -1714112, -1944059, -2360989, -2490789, -2342982, -2214037]
34170b214037J05686K40808K29725n7825k43259q3861Q2132q7668l45092k41978
34160b615369J77303M58200L40113k1044l13323l27986p4402J83492J26312k29412
34150b296116m75700l08368P0007K37295J14414n726N8828J33817K00k46597l12869
34139c030815j15015R8383Q3050o6496n6332J75956L53142K37882m9680k22530
34129b592455j99972j13614l4474Q5696K21680K42400J19250k898r845L7156K2927
34118b224149o4890j54163j63696k4011K54053M76324L76282m9753m22830l59930
34108b356763O0032L71447K91946N5978N5452K58042K23559k39732o77056m98075
34098b455170K10854P16288N46706M8151j72577p3486q7843l64529n53624m01427
$$ y = [-2214037, -2108351, -1867543, -1637818, -1695643, -1938902, -2022763, -1940631, -2028299, -2373391, -2615369, -2438066, -1979866, -1639753, -1660797, -1974120, -2302106, -2376508, -2193016, -2066704, -2296116, -2771816, -3080184, -3010177, -2772882, -2658468, -2664194, -2605366, -2471549, -2471349, -2717946, -3030815, -3145830, -3047447, -2964397, -3030893, -3087225, -2911269, -2558127, -2320245, -2369925, -2592455, -2792427, -2906041, -2940515, -2854819, -2633139, -2390739, -2271489, -2274387, -2284232, -2247076, -2224149, -2289039, -2443202, -2606898, -2630909, -2376856, -1900532, -1524250, -1574003, -1996833, -2356763, -2296731, -1925284, -1633338, -1577360, -1521908, -1263866, -1040307, -1280039, -1957095, -2455170, -2244316, -1528028, -981322, -933171, -1105748, -1179234, -1267077, -1631606, -2185230, -2586657]
34088b586657j42089q8854j51097n7555J40232J43626p2124j61704Q2622L97648
34078b495952L91772N6288k53732k67359m8164J70800K25384P7433j90803l63611
34068b697944k26277J59367M27265L12948M276j04081M7157J30927n3632k90209
34058b290203k91313r8213N7309J02108R9723L3261j07185j27313J42990M54945
34048b023891L55918j23141l84019p0616L81141L29843j76546n03616l28320L290
34038b539957P1985n5304n7656J23544K59789J95251Q816j31298j19116L9453
34028b204493K07429K02312J1850j47402j07072R882j5135j42921j34779O7768
34018b252561K53259K52435J23598k0131j54127k39073j86132l2698L4755n3612
$$ y = [-2586657, -2728746, -2817600, -2968697, -3026252, -2886020, -2742394, -2814518, -2976222, -2893600, -2495952, -2104180, -2047892, -2301624, -2568983, -2617147, -2446347, -2220963, -2143530, -2334333, -2697944, -2924221, -2764854, -2337589, -2024641, -2020365, -2124446, -2077289, -1946362, -1999994, -2290203, -2581516, -2679729, -2622420, -2520312, -2420589, -2387328, -2494513, -2621826, -2478836, -2023891, -1667973, -1791114, -2175133, -2245749, -1864608, -1534765, -1711311, -2214927, -2543247, -2539957, -2467972, -2523276, -2580932, -2457388, -2197599, -2002348, -1993532, -2124830, -2243946, -2204493, -1997064, -1794752, -1782902, -1930304, -2037376, -2027494, -2042629, -2185550, -2320329, -2252561, -1999302, -1746867, -1623269, -1643400, -1797527, -2036600, -2222732, -2255430, -2220675, -2274287]
34008b274287j42648j14342m8910J095J45265L71690L91987M9849l35341l62461
33998b318103j07290P0199J05713J83835K36788J7493l31362l37637N0706L09903
33988b119755J45939n7628R0146L43650K75774J437o0944R2047R5558j32673k83000
33977a609449j81896k164R1598J40238J70361R6888p2579j96156k24252k37952
33967b025363k31290j04086Q8961J41572J6565p9026k0689O1602L4195l2977k7499
33956b178035J8169K1368r806k9679l4055k3605J681p703p3947q4482M9773J58100
33944b192221J121k85432k73894J12517L85505J48997l18077m43603j27045K21234
33934b770898L00158K23184J97478K12275J56641L7980n7624j11689j58577j78281
$$ y = [-2274287, -2416935, -2531277, -2580187, -2579092, -2433827, -2062137, -1670150, -1620301, -1955642, -2318103, -2425393, -2355194, -2249481, -2065646, -1828858, -1811365, -2142727, -2480364, -2429658, -2119755, -1973816, -2031444, -1941298, -1597648, -1321874, -1320437, -1381381, -1289334, -1193776, -1326449, -1609449, -1791345, -1793509, -1701911, -1561673, -1391312, -1294424, -1367003, -1563159, -1787411, -2025363, -2256653, -2360739, -2271778, -2130206, -2113641, -2192667, -2213356, -2151754, -2117559, -2150536, -2178035, -2159866, -2138498, -2148304, -2177983, -2212038, -2235643, -2233962, -2241665, -2315612, -2400094, -2350321, -2192221, -2191100, -2476532, -2750426, -2637909, -2252404, -2103407, -2421484, -2865087, -2992132, -2770898, -2470740, -2247556, -2050078, -1837803, -1681162, -1643182, -1700806, -1812495, -1971072, -2149353]
33924b149353j13626J858K6400j08097k45467j65154R1903K27611J12314Q130
33914b313481J66562L93413L34053N9844n0580K6549p5669l94060m33724L4457
33904b252636M81369L54244r6001k39080k1508Q7929o4517j64236q5119q3160
33894b082715k27413j99992J22889L71281K45229j2762k7134J40037J69201M535
33884a496844j50273k05847k29843k07151o1452J19249J46937K7896l3284N1851
33874b038761J37057Q9589j0478p003J01785J64703P2925j11762k33384k20807
33864b056136j49852j04161l7296J27580K96237K62829R432k14852k05791n4507
33854b126517L5948N4036J24942K31517J99466k2662k35926k19531k111J67874
$$ y = [-2149353, -2262979, -2261121, -2234721, -2342818, -2588285, -2753439, -2661536, -2433925, -2321611, -2313481, -2146919, -1753506, -1419453, -1359609, -1410189, -1383640, -1459309, -1853369, -2287093, -2252636, -1771267, -1417023, -1513024, -1752104, -1773612, -1685683, -1750200, -1914436, -1999555, -2082715, -2310128, -2510120, -2387231, -2015950, -1770721, -1783483, -1810617, -1670580, -1501379, -1496844, -1647117, -1852964, -2082807, -2289958, -2351410, -2232161, -2085224, -2057328, -2090612, -2038761, -1901704, -1812115, -1822593, -1829596, -1727811, -1563108, -1490183, -1601945, -1835329, -2056136, -2205988, -2310149, -2347445, -2219865, -1923628, -1660799, -1651367, -1866219, -2072010, -2126517, -2090569, -2036533, -1911591, -1680074, -1480608, -1503270, -1739196, -1958727, -1960838, -1792964]
33844a792964J01541j20079k34152j01706J17621J68752M4815j8409Q1505J33217
33834a619859o0872l33456l43822n6480J98674J66106l0101j03576Q067R6222
33824b079097k0314k41746k69898M6469M71125N70139J97785k86245l90541m0217
33814b042540L62134M03468P2451k96815l83004j52410J47199K40359J01317n0730
33804a598571n8948k2266q1649j50906o7111P9342M1652j61300k17660L874K35474
33793a998069K07964J6638r7891j15873j56701k03320j62051q3577q2157j15049
33783b790086o0064O6214J70414K58045L31949K58411J1059j08439J35167M15264
33773a312066K09132l69998o34318l02166J27020J74552J2072k5093k4537j44101
$$ y = [-1792964, -1691423, -1811502, -2045654, -2147360, -2029739, -1860987, -1816172, -1834581, -1753076, -1619859, -1680731, -2014187, -2358009, -2414489, -2215815, -2049709, -2079810, -2183386, -2175319, -2079097, -2099411, -2341157, -2611055, -2564586, -2093461, -1523322, -1325537, -1611782, -2002323, -2042540, -1680406, -1276938, -1204487, -1501302, -1884306, -2036716, -1889517, -1649158, -1547841, -1598571, -1657519, -1679785, -1761434, -1912340, -1979451, -1900109, -1858457, -2019757, -2237417, -2233543, -1998069, -1790105, -1773467, -1871358, -1987231, -2143932, -2347252, -2509303, -2592880, -2675037, -2790086, -2850150, -2783936, -2613522, -2355477, -2023528, -1765117, -1754058, -1862497, -1727330, -1312066, -1102934, -1472932, -2107250, -2409416, -2282396, -2107844, -2095772, -2120865, -2145402, -2289503]
33763b289503j30470K35834N53606L07495k45031l71458L3558L26973J33927j82948
33753a628017k26720j21490j03859q4075O6834K06490J97609J41713R2702q2924
33743a541737l18126k53983J49758L59930L0242l98724l42727M7467K06457N9272
33733b002171j6812N6205P191j45739n9844K69799M04524J62642q5498j0656K21163
33722a199196K91451J62516k5628j80099k10445m6873J53757J01341j98681l91472
33712a543329k70017l7435N4044K8916N967k3063o7077m2273M4573N8061l252
33701a794885L3861J86270K27272N0382j68201k78846l15900k52393K0374L35340
33691a956726L06660n1081k10954Q7015L99484K69991q3322j94210o8081N850
$$ y = [-2289503, -2419973, -2184139, -1630533, -1323038, -1568069, -1939527, -1905969, -1578996, -1445069, -1628017, -1854737, -1976227, -2080086, -2164161, -2097327, -1890837, -1693228, -1551515, -1458813, -1541737, -1859863, -2113846, -1964088, -1604158, -1573916, -1972640, -2315367, -2267900, -2061443, -2002171, -2018983, -1962778, -1955587, -2101326, -2161170, -1891371, -1486847, -1324205, -1409703, -1420359, -1199196, -907745, -745229, -770857, -950956, -1161401, -1208274, -1054517, -953176, -1151857, -1543329, -1813346, -1850781, -1796737, -1767821, -1761854, -1784917, -1851994, -1894267, -1849694, -1791633, -1794885, -1761024, -1574754, -1347482, -1297100, -1465301, -1744147, -2060047, -2312440, -2292066, -1956726, -1650066, -1701147, -1912101, -1825086, -1425602, -1155611, -1238933, -1433143, -1501224, -1495374]
33681a495374K0985J09719J18924j18886l20091j29337K12529J75328k00659l61152
33671a988014j12365J63972J97521J47804J40469L3392j89715k67244r3770Q7378
33661a880572R2072L7454L5957L229q4530q1543L4638P9443k013l1772M9998O0379
33649a687260p0584j46212m6057Q7483J35086J61651J73816M9873j56844j87455
33639a686503K681J33936N6847l9101j9187j8632q7865l1830J80338K59843R6719
33628a152754j6773O1455J7212l11706m97346j70040L05721L57769Q2164m288
33618a328586J57490J72844n7685k16594j64058q9396n5241Q4857K68270K21166
33608a006933l9742j59411o479J33787M6111j23092j86577j69107j14546J7225
$$ y = [-1495374, -1474389, -1364670, -1245746, -1364632, -1684723, -1814060, -1601531, -1426203, -1626862, -1988014, -2100379, -1936407, -1738886, -1591082, -1450613, -1417221, -1606936, -1874180, -1967950, -1880572, -1788500, -1751046, -1715089, -1711860, -1796390, -1877933, -1843295, -1763852, -1765865, -1797637, -1747639, -1687260, -1757844, -1904056, -1950113, -1862630, -1727544, -1565893, -1392077, -1342204, -1499048, -1686503, -1683822, -1549886, -1493039, -1532140, -1551327, -1569959, -1657824, -1689654, -1509316, -1249473, -1152754, -1169527, -1108072, -1090860, -1402566, -1899912, -2069952, -1764231, -1406462, -1324298, -1328586, -1171096, -998252, -1055937, -1272531, -1436589, -1525985, -1581226, -1496369, -1228099, -1006933, -1046675, -1206086, -1212565, -1078778, -1032667, -1155759, -1342336, -1511443, -1625989, -1608764]
33598a608764J37425M9448j87093k45477k6063J69468J19455P494O2683J76044
33588a345380J22224o7297j91663j71181o0171P4175J32452Q217k26155l22438
33578b047217j69881N7636J63312J49131R5847M3034O9972K40160L78714K10985
33568h08307j60145k75109J633K14080M802l13310k57052P9152K28966P6891r4518
33557a302917j25262r0697p448J34015J45669j00775k96763p6011L07517K57016
33547a155656k05263l87647J7630M60629L93064L0722j33736r7288j47062k54314
33537a478921j85280P392Q8762Q7633J85925K73402P5681l06653m35092j66378
33527a853529J34481J23419r3215j98235r6226M7413O4397k9853n6887J19730
$$ y = [-1608764, -1471339, -1421891, -1608984, -1854461, -1880524, -1711056, -1591601, -1584107, -1521424, -1345380, -1223156, -1290453, -1482116, -1653297, -1713468, -1639293, -1506841, -1498624, -1724779, -2047217, -2217098, -2159462, -1996150, -1847019, -1751172, -1708138, -1638166, -1398006, -1019292, -808307, -968452, -1243561, -1241928, -1027848, -1023046, -1336356, -1593408, -1514256, -1285290, -1208399, -1302917, -1428179, -1518876, -1526324, -1392309, -1246640, -1347415, -1644178, -1720189, -1412672, -1155656, -1360919, -1748566, -1730936, -1270307, -877243, -846521, -980257, -1077545, -1224607, -1478921, -1664201, -1656809, -1568047, -1480414, -1294489, -1021087, -945406, -1252059, -1687151, -1853529, -1719048, -1595629, -1688844, -1887079, -1983305, -1935892, -1871495, -1901348, -1958235, -1838505]
33517a838505L68569L81563J02719j09417L5757K93457K20679j41433l22420j36927
33507a145958P5779Q472j98055k48033r5634J04082K08298J28848j11915k87467
33497a561583j77850P5882J28371j7527k200K50743L44978O8916k22420j93460
33487a306150o0746j42269k61943q6250K39671L08123R9640p4853j19254j57498
33477a561529j44615K4210J42395l9443k69470q8924L74575N14867J78964j30421
33467i99391r4015N984r0855j79044o2237N2028k2715q0271P1414K26698J50998
33456a021406l1835j42601k48535l28371q4088M74378P02528J55634o00400o71800
33446a796496r7900K75900P2915k12284j39865O6102O4558m4849m0803k534o1128
$$ y = [-1838505, -1469936, -1088373, -985654, -1095071, -1059314, -765857, -545178, -686611, -1009031, -1145958, -1070179, -1061707, -1259762, -1507795, -1603429, -1499347, -1291049, -1162201, -1274116, -1561583, -1739433, -1663551, -1535180, -1552707, -1554907, -1304164, -959186, -890270, -1112690, -1306150, -1366896, -1509165, -1771108, -1857358, -1617687, -1309564, -1209924, -1284777, -1404031, -1561529, -1706144, -1681934, -1539539, -1578982, -1848452, -1937376, -1562801, -1047934, -868970, -999391, -1093406, -1087422, -1178277, -1357321, -1419558, -1367530, -1390245, -1470516, -1399102, -1172404, -1021406, -1053241, -1195842, -1444377, -1772748, -1856836, -1382458, -679930, -524296, -1124696, -1796496, -1894396, -1618496, -1545581, -1757865, -1897730, -1831628, -1767070, -1811919, -1852722, -1855256, -1916384]
33435a916384p4392J01002K76111K05827o16o6387J0290K1406m9669k6083R4994
33424a423901R8426p0645j71996m6099J04495J3054k15929k26523N8563K90592
33414a589963J76135j09633j86386r109J13430M129j55399j43939M795J51949
33404a743991K78624L85920L49920R5464j98976k86613j75241p5213q6831j29353
33394a586290j31683j00422k6266R7130J84071J54354Q3249P8962O5127r6508
33384a278276l02849k88042k4614K11531K35580J63012J35968R4618l2844j35318
33374a221234j02322l0500m8991p8084K5740J86209J90473J658k11540l16957
33364a605548k97575j31325J79679M59233M71306K30562j3887j44063k66883l72555
$$ y = [-1916384, -1990776, -1889774, -1613663, -1407836, -1408452, -1474839, -1464549, -1443143, -1492812, -1518895, -1423901, -1325475, -1396120, -1568116, -1614215, -1509720, -1496666, -1712595, -1939118, -1880555, -1589963, -1413828, -1523461, -1709847, -1718956, -1605526, -1601397, -1756796, -1900735, -1895940, -1743991, -1465367, -1079447, -729527, -634063, -833039, -1119652, -1294893, -1370106, -1456937, -1586290, -1717973, -1818395, -1844661, -1747531, -1563460, -1409106, -1325857, -1246895, -1181768, -1278276, -1581125, -1869167, -1893781, -1682250, -1446670, -1283658, -1147690, -1053072, -1085916, -1221234, -1323556, -1354056, -1403047, -1481131, -1455391, -1269182, -1078709, -1077051, -1288591, -1605548, -1903123, -2034448, -1854769, -1395536, -924230, -693668, -707555, -851618, -1118501, -1491056]
33354a491056k34788J43783L21899R737l88879k91865J56176K61276j39559m05079
33344b058355r5107L55719L54818L4768r9636k3568p7164k33432j39746J81455
33334a800248K99877Q7458r7618k6813J16010J79954K63519L34151J42462k68828
33324g70076m48457j86765J48549J87899N3044L627J0560j8469L109M8020j33268
33313a102227m90500n06667K3411M99205L14717k36238m21704j15457K15702L06302
33303a513456K61532J29007r6273j86488L0528K44329Q1525k24851j91433P1325
33293a394255N8749k12192k38577N2097J87047k759j65641j51433k03311l01397
33283b371672q5892L75972N29505K84950K22500N24450N57846m326m83857k64894
$$ y = [-1491056, -1725844, -1582061, -1260162, -1250425, -1639304, -1931169, -1774993, -1513717, -1653276, -2058355, -2153462, -1797743, -1442925, -1408157, -1507793, -1531361, -1608525, -1841957, -1981703, -1800248, -1500371, -1412913, -1510531, -1537344, -1421334, -1241380, -977861, -643710, -501248, -770076, -1218533, -1405298, -1256749, -1068850, -1015806, -1012179, -1001619, -1020088, -1016979, -968959, -1102227, -1592727, -2099394, -2075983, -1576778, -1262061, -1498299, -1920003, -2035460, -1819758, -1513456, -1251924, -1122917, -1219190, -1405678, -1375150, -1130821, -1049296, -1274147, -1465580, -1394255, -1335506, -1547698, -1786275, -1734178, -1547131, -1549890, -1715531, -1866964, -2070275, -2371672, -2457564, -2081592, -1552087, -1267137, -1044637, -520187, 37659, 33333, -450524, -715418]
33273g15418J75054P7806l46238l50430Q1248K97159Q4720j28409r6318k3173
33263i43999p634J08300K70701J80514j67726m02304l19648r2598J06793K67468
33253a000133K93173M9135k71881k72317M9831K43075Q2708j06805q152J95454
33243g45912J62600o1793j61597m2216P9392J3358j81827l00690j96699Q5885
33233a349499L22247L03262O5918j40403j43534j1353R7917J20561O4149o4746
33223g35481j98397j79713M7417K66347J86502j56064l74751k20280O7398J04546
33213a192476m9920J3144L50445M69239O5134m16234l67144Q4271K81463L0192
33203g31886j93492o0333J64759J64176K9757p3525k29771m39759m00647K915
$$ y = [-715418, -540364, -462558, -808796, -1159226, -1077978, -780819, -696099, -824508, -920826, -943999, -951633, -843333, -572632, -392118, -559844, -962148, -1281796, -1374394, -1267601, -1000133, -706960, -657825, -929706, -1202023, -1152192, -909117, -826409, -933214, -941366, -745912, -583312, -645105, -806702, -848918, -769526, -756168, -937995, -1238685, -1435384, -1349499, -1027252, -723990, -658072, -798475, -942009, -953362, -855445, -734884, -670735, -735481, -933878, -1113591, -1066174, -799827, -613325, -769389, -1144140, -1364420, -1297022, -1192476, -1242396, -1229252, -878807, -409568, -344434, -760668, -1127812, -1043541, -762078, -731886, -925378, -985711, -820952, -656776, -627019, -700544, -930315, -1370074, -1770721, -1767806]
33193a767806L63562L17776J08601J36365K66428J13640k20315k78726m897J98251
33183g67121J32561L529n5904j45670k20277o0362K40339K40942j77428n29290
33173a338681l88213J3063J64974j138j37944p3773m839q8084j39618J14651O04459
33162a275143Q86818O09251m0814m64402k97982J65169L37064N0752k88443k80224
33152e97954l1046O0730j23893k84905j38524J97380L79278K96863J57256J10814
33142B5999L6764j67622l16767k08291P83J0668j30938j21964O3496J52159Q1035
33131e74678O9026J17096m5845l60960l39017J50765N21488K94126j87133l27491
33121f82623j48492n0837o7154M8386K30100K05962M4264L7969J54274J19997
$$ y = [-1767806, -1404244, -1086468, -977867, -841502, -575074, -461434, -681749, -960475, -965372, -767121, -634560, -631031, -686935, -832605, -1052882, -1113244, -872905, -631963, -809391, -1338681, -1726894, -1713831, -1548857, -1549995, -1687939, -1761712, -1766551, -1854635, -1994253, -1879602, -1275143, -388325, 220926, 180112, -284290, -582272, -417103, -80039, -29287, -317730, -597954, -629000, -568270, -692163, -977068, -1115592, -918212, -538934, -242071, -84815, 25999, 62763, -104859, -421626, -629917, -629134, -618466, -749404, -871368, -807872, -655713, -574678, -505652, -388556, -434401, -795361, -1134378, -983613, -462125, -167999, -355132, -682623, -831115, -881952, -949106, -900720, -670620, -464658, -420394, -382425, -228151, -108154]
33111a08154n0890j26918j44306k88855l91027j17048L64895M88272J10722k78787
33101e42096k50393J10501M80003O14607L87294q2508l53549j25426K81721L30207
33091H50361L4378j45958m0833J35935K83257M29530M26548K38748K59169N66858
33081C037993K51042j383128l148346k983552q36134R72352Q24057k07232l29429
33072c802377L69959N95847J11728j94204J634J53999O9304J66534M84299M97131
$$ y = [-108154, -159044, -285962, -430268, -719123, -1110150, -1227198, -862303, -374031, -263309, -542096, -792489, -681988, -201985, 412622, 799916, 717408, 363859, 238433, 520154, 850361, 884739, 738781, 697948, 833883, 1117140, 1546670, 1973218, 2211966, 2471135, 3037993, 3289035, 1905907, -1242439, -4225991, -5062125, -4089773, -3265716, -3472948, -3802377, -3432418, -2836571, -2724843, -2919047, -2917413, -2763414, -2694110, -2527576, -2043277, -1546146]
$$ [...]
##END NTUPLES=NMR SPECTRUM
##END=
