##TITLE=31Pdec_SR50_rmk
 CDCl3, 24 sc
 30.03.2021
##JCAMPDX= 6.0         $$ Bruker NMR JCAMP-DX V2.0
##DATA TYPE= NMR SPECTRUM
##DATA CLASS= NTUPLES
##ORIGIN= UXNMR, Bruker Analytische Messtechnik GmbH
##OWNER= root
$$ XWIN-NMR		Version 3.5
$$ Tue Mar 30 13:18:31 2021 Russian Standard Time (UT+4h)  she@DPX200
##.OBSERVE FREQUENCY= 81.013821
##.OBSERVE NUCLEUS= ^31P
##.ACQUISITION MODE= SIMULTANEOUS
##.ACQUISITION SCHEME= undefined
##.AVERAGES= 24
##.DIGITISER RES= 16
##SPECTROMETER/DATA SYSTEM= spect
##.PULSE SEQUENCE= zgpg30
##.SOLVENT NAME= CDCl3
##.SHIFT REFERENCE= (INTERNAL, CDCl3, 0, 248.564)
##AUDIT TRAIL= $$ (NUMBER, WHEN, WHO, WHERE, WHAT)
$$ ##TITLE= Audit trail, XWIN-NMR		Version 3.5
$$ ##JCAMPDX= 5.01
$$ ##ORIGIN= Bruker BioSpin GmbH
$$ ##OWNER= she
$$ F:/spectra/data/she/nmr/P31/1/pdata/1/auditp.txt
$$ ##AUDIT TRAIL=  $$ (NUMBER, WHEN, WHO, WHERE, WHAT)
(   1,<2021-03-30 13:17:28.67 +0400>,<she>,<DPX200>,
      <created by zg, POWCHK disabled, PULCHK disabled
       configuration hash MD5:
       00 E9 B6 7A A2 85 ED C7 34 08 36 98 17 FE 4E 26
       data hash MD5: 32K
       A4 3A EE E1 3B 9C 64 6E D8 1B 8B C7 4D 88 8B D3>)
(   2,<2021-03-30 13:17:34.06 +0400>,<she>,<DPX200>,
      <Start of raw data processing
       efp BC_mod = 2 LB = 1 FT_mod = 6 PKNL = 1 PHC0 = -4475.384 PHC1 = 237.601 SI = 64K 
       data hash MD5: 64K
       B6 FF AA 4E 60 37 2A 21 DC 3F 2D 21 F6 6C 39 FE>)
(   3,<2021-03-30 13:17:51.62 +0400>,<she>,<DPX200>,
      <pk PHC0 = -50.11686 PHC1 = 104.2 
       data hash MD5: 64K
       F2 2D 15 50 08 15 2C E1 78 FC 3E A6 07 CB 2A 73>)
$$ ##END=
$$ 
$$ hash MD5
$$ F6 27 19 CA 48 59 E5 98 FB F6 C7 98 3E 36 05 B7
##$RELAX= 
##$RELAX= 
##$RELAX= 
##$RELAX= 
##$RELAX= 
##$RELAX= 
##$RELAX= 
##$RELAX= 
$$ Bruker specific parameters
$$ --------------------------
##$DU= <F:/spectra>
##$EXPNO= 1
##$NAME= <P31>
##$PROCNO= 1
##$TYPE= <nmr>
##$USER= <she>
##$AMP= (0..31)
100 100 100 100 100 100 100 100 100 100 100 100 100 100 100 100 100 100 
100 100 100 100 100 100 100 100 100 100 100 100 100 100 
##$AQSEQ= 0
##$AQ_mod= 1
##$AUNM= <au_zg>
##$AUTOPOS= <>
##$BF1= 81.014009
##$BF2= 200.13
##$BF3= 200.13
##$BF4= 200.13
##$BF5= 200.13
##$BF6= 200.13
##$BF7= 200.13
##$BF8= 200.13
##$BYTORDA= 1
##$CFDGTYP= 0
##$CFRGTYP= 5
##$CHEMSTR= <none>
##$CNST= (0..31)
1 1 145 1 1 1 1 1 1 1 1 1 1 1 1 1 1 1 1 1 1 1 1 1 1 1 1 1 1 1 1 1 
##$CPDPRG= <waltz16>
##$CPDPRG1= <>
##$CPDPRG2= <waltz16>
##$CPDPRG3= <>
##$CPDPRG4= <mlev>
##$CPDPRG5= <mlev>
##$CPDPRG6= <mlev>
##$CPDPRG7= <mlev>
##$CPDPRG8= <mlev>
##$CPDPRGB= <>
##$CPDPRGT= <>
##$D= (0..31)
0 1 0 0 0 0 0 0 0 0 0 0.03 2e-05 3e-06 0 0 0 0 0 0 0 0 0 0 0 0 0 0 0 0 
0 0 
##$DATE= 1617095848
##$DBL= (0..7)
120 120 120 11 120 120 24 19 
##$DBP= (0..7)
150 150 150 150 150 150 150 150 
##$DBP07= 0
##$DBPNAM0= <>
##$DBPNAM1= <>
##$DBPNAM2= <>
##$DBPNAM3= <>
##$DBPNAM4= <>
##$DBPNAM5= <>
##$DBPNAM6= <>
##$DBPNAM7= <>
##$DBPOAL= (0..7)
0.5 0.5 0.5 0.5 0.5 0.5 0.5 0.5 
##$DBPOFFS= (0..7)
$$ [...]
##$SUBNAM2= <"">
##$SUBNAM3= <"">
##$SUBNAM4= <"">
##$SUBNAM5= <"">
##$SUBNAM6= <"">
##$SUBNAM7= <"">
##$SUBNAM8= <"">
##$SUBNAM9= <"">
##$SW= 501.771253377433
##$SWIBOX= (0..15)
0 1 3 0 0 0 0 0 0 0 0 0 0 0 0 0 
##$SW_h= 40650.406504065
##$TD= 32768
##$TD0= 1
##$TE= 0
##$TE2= 300
##$TE3= 300
##$TEG= 300
##$TL= (0..7)
0 120 53 12 22 120 120 120 
##$TP= (0..7)
150 150 150 150 150 150 150 150 
##$TP07= 0
##$TPNAME0= <>
##$TPNAME1= <>
##$TPNAME2= <>
##$TPNAME3= <>
##$TPNAME4= <>
##$TPNAME5= <>
##$TPNAME6= <>
##$TPNAME7= <>
##$TPOAL= (0..7)
0.5 0.5 0.5 0.5 0.5 0.5 0.5 0.5 
##$TPOFFS= (0..7)
0 0 0 0 0 0 0 0 
##$TUNHIN= 0
##$TUNHOUT= 0
##$TUNXOUT= 0
##$USERA1= <user>
##$USERA2= <user>
##$USERA3= <user>
##$USERA4= <user>
##$USERA5= <user>
##$V9= 5
##$VALIST= <valist>
##$VCLIST= <CCCCCCCCCCCCCCC>
##$VD= 0
##$VDLIST= <DDDDDDDDDDDDDDD>
##$VPLIST= <PPPPPPPPPPPPPPP>
##$VTLIST= <TTTTTTTTTTTTTTT>
##$WBST= 1024
##$WBSW= 4
##$XGAIN= (0..3)
0 0 0 0 
##$XL= 0
##$YL= 0
##$YMAX_a= 4913
##$YMIN_a= -6205
##$ZGOPTNS= <>
##$ZL1= 120
##$ZL2= 120
##$ZL3= 120
##$ZL4= 120
##$ABSF1= 0
##$ABSF2= 0
##$ABSG= 0
##$ABSL= 0
##$ALPHA= 0
##$AQORDER= 0
##$ASSFAC= 0
##$ASSFACI= 0
##$ASSFACX= 0
##$ASSWID= 0
##$AUNMP= <proc_1d>
##$AZFE= 0.1
##$AZFW= 0.5
##$BCFW= 0
##$BC_mod= 2
##$BYTORDP= 0
##$COROFFS= 0
##$CY= -3
##$DATMOD= 1
##$DC= 0
##$DFILT= <>
##$DTYPP= 0
##$F1P= 0
##$F2P= 0
##$FCOR= 1
##$FTSIZE= 65536
##$FT_mod= 6
##$GAMMA= 0
##$GB= 0
##$INTBC= 1
##$INTSCL= 5.30512e-09
##$ISEN= 30
##$LB= 1
##$LEV0= 0
##$LPBIN= 0
##$MAXI= 10000
##$MC2= 0
##$MEAN= 0
##$ME_mod= 0
##$MI= 50
##$NCOEF= 0
##$NC_proc= -6
##$NLEV= 6
##$NOISF1= 182.463
##$NOISF2= 159.3651
##$NSP= 0
##$NTH_PI= 0
##$NZP= 0
##$OFFSET= 248.5645
##$PC= 4
##$PHC0= -4525.5
##$PHC1= 341.801
##$PH_mod= 1
##$PKNL= yes
##$PPARMOD= 0
##$PSCAL= 0
##$PSIGN= 0
##$REVERSE= no
##$SF= 81.014009
##$SI= 65536
##$SIGF1= 159.3651
##$SIGF2= -187.1042
##$SINO= 113.3802
##$SIOLD= 16384
##$SREGLST= <1H.CDCl3>
##$SSB= 0
##$STSI= 65536
##$STSR= 0
##$SW_p= 40650.406504065
##$SYMM= 0
##$S_DEV= 0
##$TDeff= 32768
##$TDoff= 0
##$TI= <>
##$TILT= no
##$TM1= 0
##$TM2= 0
##$TOPLEV= 0
##$USERP1= <user>
##$USERP2= <user>
##$USERP3= <user>
##$USERP4= <user>
##$USERP5= <user>
##$WDW= 1
##$XDIM= 65536
##$YMAX_p= 368096698
##$YMIN_p= -288797938
$$ End of Bruker specific parameters
$$ ---------------------------------
##NTUPLES= NMR SPECTRUM
##VAR_NAME=  FREQUENCY,     SPECTRUM/REAL,   SPECTRUM/IMAG
##SYMBOL=    X,             R,               I
##VAR_TYPE=  INDEPENDENT,   DEPENDENT,       DEPENDENT
##VAR_FORM=  AFFN,          ASDF,            ASDF
##VAR_DIM=   65536,         65536,           65536
##UNITS=     HZ,            ARBITRARY UNITS, ARBITRARY UNITS
##FACTOR=    0.620285442955139, 1,           1
##FIRST=     20137.2065510759, 0,            0
##LAST=      -20513.1999529892, 0,           0
##MIN=       -20513.1999529892, -288797938,  0
##MAX=       20137.2065510759, 368096698,    0
$$ Real data points
##PAGE= N=1
##DATA TABLE= (X++(R..R)), XYDATA
$$ [...]
15303 1095236 2092958 2106636 2022136 1506138 -846680 -3968772 -4579139 -2123186 -44474
15294 -44474 -561185 -1467357 -283715 1484150 1127861 -666974 -1364107 -1025714 -1646267
15285 -1646267 -3030087 -3050395 -1850457 -2185036 -4950708 -7518383 -7576203 -5929399 -4254435
15276 -4254435 -2644958 -1005515 -542772 -1751214 -2672450 -1425474 784654 1393798 190446
15267 190446 -1018413 -1668395 -2712004 -3801515 -2997691 -74411 2176863 1342017 -1364992
15258 -1364992 -2655234 -1121405 1559160 2847369 1702975 -1037171 -3704386 -5035033
15250 -5035033 -4797173 -3477329 -1589563 429009 1926066 2397899 2236079 2347190 2765345
15241 2765345 2423897 749952 -1300323 -2494410 -2934782 -3461364 -3912400 -3259227 -1515867
15232 -1515867 -178715 -159063 -428859 191332 796400 -368962 -2717221 -3465761 -1655343
15223 -1655343 53046 -789392 -2513629 -1755518 1215334 2735693 1327966 -368366
15215 -368366 -310197 -280871 -2140192 -3790438 -2297846 812809 1338767 -1173458 -2727384
15206 -2727384 -962541 1726209 2348710 1430585 1152817 1875954 2637109 3299173 4070792
15197 4070792 4150939 2800493 841056 -535208 -1466259 -2381066 -2465718 -1111290 146365
15188 146365 -549747 -2235703 -2286966 -510876 549146 -265220 -972627 123317 1629719
15179 1629719 1415810 42285 -246062 1003219 2067324 1850416 1201240 1168816 1384173
15170 1384173 803408 -732792 -2174968 -2142535 -101437 2874115 4697520 4297382 2842366
15161 2842366 2132469 2148895 1568622 591955 1255684 4086647 6323574 5179386 1678266
15152 1678266 -725656 -672325 64377 -173146 -884117 -1055076 -847121 -704017 -254178
15143 -254178 891361 2299657 3426502 4193039 4399081 3836112 3428640 4556767 6439089
15134 6439089 6179992 2843993 -438292 -403773 1961188 3358539 3090788 3067737 3695322
15125 3695322 3168074 1132763 -89650 1013317 2953700 3798630 3791462 3969218 3984081
15116 3984081 3055665 1834015 1515511 1785016 1242730 -317705 -1300254 -187022 2518429
15107 2518429 4396306 3281949 -292950 -3106355 -2544127 261999 1719421 163552
15099 163552 -2468697 -3632367 -3220904 -2796420 -3137591 -3715020 -3774279 -2922385 -1190871
15090 -1190871 721466 1750474 1586524 1102068 1419029 3015379 5548824 7598737 6953844
15081 6953844 2881774 -1802296 -3007508 -342571 2288234 2042176 757112 1505405
15073 1505405 3734463 4475589 3083075 1867289 2371814 3616732 4236380 4139115 3497938
15064 3497938 1982156 -91531 -1201415 -319387 1485809 2026996 433555 -1847494
15056 -1847494 -2527506 -823292 1812586 3383718 3372625 2564235 1437085 17946 -856354
15047 -856354 68391 2291478 3471125 2349206 198028 -1492728 -2895110 -4203228
15039 -4203228 -4258587 -2747938 -1839288 -3129337 -4521841 -3070493 166375 1357295 -525139
15030 -525139 -2692650 -3121646 -2760577 -2555354 -1592928 450600 1846014 1524629 978598
15021 978598 1660760 2465174 1744052 191574 -371901 125757 418680 315036 676414
15012 676414 1510683 1987450 2137606 2797750 3790079 3649305 1497370 -1810942 -4576179
15003 -4576179 -5496891 -4156952 -1283859 1447700 2807928 3262552 3973832 4732997 4239430
14994 4239430 2636265 2071747 3652389 5183375 3740297 -48583 -2338798 -1030303
14986 -1030303 1525058 1911887 207019 -721414 334586 1493882 1039519 -69268 -17162
14977 -17162 1149894 2109333 2488521 2845927 3006612 2128397 386695 -874200 -927363
14968 -927363 -470145 -411072 -895717 -1792157 -3040090 -4052597 -3836810 -2461134 -1524822
14959 -1524822 -2151882 -3094370 -2107796 830207 2990691 2163163 -595453 -2547261 -2873366
14950 -2873366 -3040691 -3669154 -3195697 -769211 1436682 943939 -1082713 -1155675 1579761
14941 1579761 4310992 4716794 3573200 2540138 1948024 1905571 3034760 4462996 3443162
14932 3443162 -946818 -5645358 -7243974 -6011209 -4225883 -2563284 -817600 -346286
14924 -346286 -2463181 -5470980 -6474221 -5406639 -4339746 -3737289 -2642299 -1711153 -2339425
14915 -2339425 -3180680 -1447922 2243699 4213738 3253556 1925173 1743673 1192699 -339200
14906 -339200 -787364 717210 2026487 1967297 2463268 4475406 5503246 3802144 1649781
14897 1649781 1381804 1394964 -451804 -2354009 -1406828 1303850 2480085 1808982 1432816
14888 1432816 1530267 414184 -1737041 -3005646 -3144812 -3431627 -3567862 -2198178 -250578
14879 -250578 -195589 -1807567 -2041678 336835 2995311 3533362 2123972 176169 -1149656
14870 -1149656 -747846 1550345 3519658 2533194 -582976 -2295647 -1365902 -258636 -874617
14861 -874617 -1865963 -1431656 -98317 788354 1066196 813026 -446993 -2113168 -2124707
14852 -2124707 189943 2658605 3163200 2263644 1449117 609000 -907133 -2208220 -1847893
14843 -1847893 -7811 1827993 2578838 1897758 -7788 -1801884 -1688018 100015 959444
14834 959444 -593953 -2728313 -3098265 -2022061 -953882 306195 2341341 3678761
14826 3678761 2696305 943232 1268938 3128926 3225059 981059 -155469 2099914 5484841
14817 5484841 6606777 5266114 3500946 2264070 1110993 -79160 -956095 -1461200
14809 -1461200 -1315643 337367 3388740 5861189 6170829 5467457 5937734 7372657 7395884
14800 7395884 4934340 1542648 -865278 -1799450 -1436630 -39109 1097668 -37928
14792 -37928 -3544855 -6568634 -6363631 -3555013 -978274 -52870 66280 227531 126903
14783 126903 -353752 -371335 516342 1329238 864640 -722113 -2135240 -2212197 -615847
14774 -615847 2032590 4227638 4525993 3094651 1752673 1826771 2548291 2345400 1153764
14765 1153764 378251 781063 1510820 1385068 240593 -1313242 -2725529 -3560984 -3275451
14756 -3275451 -1715550 206935 1051905 464137 -169003 650473 2347926 2684304 784888
14747 784888 -1241848 -783563 1868499 4070557 4444572 4053867 3721269 2364761 -740606
14738 -740606 -3773654 -4304152 -2495002 -620675 -25721 -325680 -1163186 -2699075 -4258102
14729 -4258102 -4501711 -3589465 -3416713 -4669230 -5145615 -2593176 1654880 3789941 2365577
14720 2365577 342022 1411598 5411076 8789985 9153975 7578666 6118129 4976093
14712 4976093 3468389 2138271 1728588 1055470 -1405706 -4192907 -4214853 -1773048 -789408
14703 -789408 -2727600 -3783241 -543410 4565107 6681626 5057243 2618924 795705
14695 795705 -1150676 -2656201 -1997539 230123 1652335 2150932 3475482 4800091 3243153
14686 3243153 -343367 -1040163 2645796 5590989 3386482 -1216024 -3012990 -2106533
14678 -2106533 -2338621 -4286087 -4883133 -3123289 -1393831 -1058102 -868859 -324335 -760887
14669 -760887 -2029917 -1577480 1497970 4343922 4298889 2675931 2433577 3779975 4462643
14660 4462643 3442073 1948512 1123754 581045 -333816 -1166934 -803125 1278162 4346619
14651 4346619 6681086 6824937 5232785 4215672 5200616 6386830 4693927 204745
14643 204745 -3306527 -3345683 -2197410 -3256376 -5370575 -4290573 358457 3559351 2009226
14634 2009226 -860317 -86105 3261149 3896488 427547 -2952823 -3037636 -1496819 -917867
14625 -917867 -806728 301189 1731184 2150998 1944109 1776488 776515 -1445836 -2768458
14616 -2768458 -1228217 1639867 2813966 2041630 1409923 1670690 1967708 2546295 4401228
14607 4401228 6233279 5194030 1497871 -857422 470576 2646714 1733302 -1645946
14599 -1645946 -3405435 -1894974 150792 12167 -1049230 84024 3492078 5774811
14591 5774811 4817039 2863629 3237029 5384640 5669386 2783108 -363068 -890264 371363
14582 371363 881509 37413 -1016686 -1732959 -2403870 -3118085 -4088056 -5884646 -7778868
14573 -7778868 -7276509 -3327318 1237209 2725095 1100970 -673294 -765754 441074 2335484
14564 2335484 4347286 4923393 3096313 602496 -362780 -823795 -3172820 -6243300 -6326692
14555 -6326692 -3332244 -1520028 -2884565 -4111167 -2236839 589699 973705 -275121
14547 -275121 -82885 1676660 2546159 1823664 1140920 1207240 969767 81559 -286580 411436
14537 411436 988466 260894 -1201729 -1671747 -211488 2174364 3383418 2504341 934907
14528 934907 391742 374060 -722915 -2328471 -2032507 394700 2111027 1511611 725628
14519 725628 2055484 4405280 5403373 4826652 3521766 1153717 -2090993 -3614033 -1717492
14510 -1717492 695662 -394339 -3812654 -4496606 -1003323 2511873 2642472 1123294
14502 1123294 1185843 2787627 3802059 3685266 3478045 3421614 2702880 1068342 -721687
14493 -721687 -1787087 -1747315 -856758 145748 879561 1927004 3642674 4710671 3538604
14484 3538604 1034646 -73670 883593 1545777 346580 -936957 -44253 2199859 3175060
14475 3175060 2112662 448523 -707320 -1493334 -1957130 -1501579 102296 2124447 3383966
14466 3383966 2940960 843043 -1285008 -1331322 729732 2301862 1282011 -1292667 -3007497
14457 -3007497 -3347278 -3398943 -3220222 -1908237 -74747 236432 -1376379 -2766046 -2220330
14448 -2220330 -638244 148353 -304327 -1341739 -2399819 -2878724 -2126671 -626408 19754
14439 19754 -636886 -940448 343390 2025534 2586448 2697191 3451401 3469403 772961
14430 772961 -3061578 -4041616 -1443051 932846 333637 -1201457 -595982 1414262 1866357
14421 1866357 284857 -1043043 -665015 678236 1828890 2128288 925494 -1674740
14413 -1674740 -3785834 -3518797 -1614129 -275063 270461 1530091 3133992 2513283 -880732
14404 -880732 -3776784 -3105714 186750 2910625 3487110 2472516 827810 -588474 -1011997
14395 -1011997 -824607 -1464682 -2874022 -2514226 1149396 5459679 6247106 3091845 -360045
14386 -360045 -1118706 243453 1509697 1627871 970514 223142 -149448 62167 880824
14377 880824 2312118 4072179 5062431 4263614 2754614 3267357 6392900 8788755 7143594
14368 7143594 2678127 -631761 -1274448 -897026 -531064 541183 2044270 2216359 1003054
14359 1003054 804457 2703702 4516260 4150790 2638647 2089980 2649729 3357628 4245258
14350 4245258 5520929 6129625 5233593 3948100 3537320 2988307 675457 -2376007 -3419208
14341 -3419208 -1928623 -187981 249409 365411 1229665 1831912 790082 -1044823 -1410314
14332 -1410314 181805 1526376 610605 -1394504 -1288681 1812604 4691330 3914969 578060
14323 578060 -1009888 752586 2803603 2254340 421843 62742 946907 1082430 740724
14314 740724 1724107 3212784 2135136 -1725532 -4452918 -3313373 -498376 493402 -87516
14305 -87516 520069 2670727 3673447 2049498 -88655 136372 2622772 4503493 3549813
14296 3549813 511041 -1949750 -2218372 -1261175 -1021016 -1658538 -1308290 1082945 3685851
14287 3685851 3691129 916342 -1789760 -1974952 -253972 1090881 1167492 934874 1091038
14278 1091038 1021401 153056 -961277 -1672718 -2283380 -3037266 -3033999 -1607019 -74255
14269 -74255 -245325 -1507750 -1614982 -498954 -669785 -2925630 -4461750 -3118858 -976713
14260 -976713 -983790 -2030385 -898509 2032972 3033090 945440 -1014930 -268781 1813284
14251 1813284 3049834 3748844 4831123 5210588 3450954 353980 -2137096 -3236958
14243 -3236958 -2986165 -1355017 705517 1284853 430821 884417 3735305 5830667 4445641
14234 4445641 2043890 2478641 4488141 3803156 588439 -682513 1194145 2370311
14226 2370311 957837 241546 2416605 4196756 2280843 -900205 -1112605 1113256
14218 1113256 2261235 1823796 1902793 2353362 990054 -1965519 -3853229 -3809076 -3274806
14209 -3274806 -2542971 -750722 681047 -1055314 -4974311 -6183792 -2579595 1911886
14201 1911886 2714974 136659 -2508604 -3407749 -2542814 -45230 3048820 4328258 2909500
14192 2909500 1286794 1878266 3203234 2067411 -1628477 -4899937 -5701575 -4471067
14184 -4471067 -2275024 138322 1715456 1709893 835592 157592 -613554 -1952783 -2568558
14175 -2568558 -1002245 1439356 2018601 608321 -346541 16599 -239622 -2290446 -4479624
14166 -4479624 -4864318 -3562931 -1543742 725968 2286027 1567311 -1195767 -3288277
14158 -3288277 -2861316 -1403086 -1337128 -2640452 -3484633 -2936742 -1361707 721759 2538986
14149 2538986 2818770 1244006 -731978 -1858276 -2723775 -3986927 -4449693 -2903625 -611970
14140 -611970 422160 677464 1998314 3974575 4360198 2913646 1814603 1931728 1636893
14131 1636893 142847 -824445 -42951 966311 411813 -994858 -1452201 -636458 777902
14122 777902 2591896 4281066 4173118 1535803 -1494116 -2124019 -389051 1403898 2012701
14113 2012701 2107548 2378490 2867261 3817062 5086997 4976439 1947496 -2389450 -4391524
14104 -4391524 -2974759 -825428 -304407 -484423 476725 2142919 2795827 2166899 1351695
14095 1351695 963016 957863 1493527 2468433 2877506 1945230 234435 -1503620 -3580531
14086 -3580531 -6085270 -7506342 -6510740 -4192874 -2488661 -1199129 910815 2666825
14078 2666825 1307209 -2913654 -6057355 -5556385 -3239738 -1855120 -1160322 400112
14070 400112 2203303 2284272 551469 -1207888 -1871942 -1525598 -179142 1920830 3238805
14061 3238805 2482897 958393 1063915 2397331 1877066 -1634740 -5280971 -6053063 -4639513
14052 -4639513 -3683076 -3732370 -3147638 -1379044 -54864 -442832 -1535453 -1612967 -762635
14043 -762635 -688355 -2199810 -3923154 -3985138 -2366324 -732063 -98698 209265 890099
14034 890099 1195644 284023 -840252 -470443 916843 850691 -1495614 -3597445 -2719359
14025 -2719359 457484 2832887 2774626 1395727 247974 -491119 -1118163 -1219632 -446242
14016 -446242 364781 20251 -1327577 -2296692 -2088578 -1278599 -604166 86867 1108221
14007 1108221 1962877 2014925 1631540 1581046 1592157 833861 -155853 364066 2575322 4022232
13997 4022232 2627947 -189293 -1006757 1376190 4671529 6037179 4990303 3163587
13989 3163587 2195176 2281614 2280208 1100539 -716107 -1228348 493366 2873468 3786582
13980 3786582 3241559 2556415 1577866 -848133 -3563409 -3184654 1053520 4904518 3885977
13971 3885977 -893480 -4177210 -3262828 -717976 -95115 -1243147 -1231221 1290429 4238828
13962 4238828 4572915 1752736 -1637157 -2609568 -955586 575096 -511840 -3427804
13954 -3427804 -4962619 -3344640 -359143 926653 -126838 -1351508 -992352 18361
13946 18361 -196131 -1427626 -1627660 -30810 1637272 1689139 778579 562723 1177570
13937 1177570 1522996 1356138 1418177 1718747 1359876 215618 -667953 -639979 -137466 417881
13927 417881 1057914 1301994 281139 -1548256 -2282919 -1065166 578491 902383 245322
13918 245322 -53789 24758 -482560 -1459188 -1631243 -559005 600895 625802 -370815 -1391419
13908 -1391419 -1750932 -1432450 -683311 202734 712591 276508 -840524 -1065293 1017266
13899 1017266 4404989 6154855 5051194 3468661 3981739 5392033 4594657 1646046
13891 1646046 -192039 398265 1031564 82733 -477705 1251118 3514548 3699080 2472303
13882 2472303 2091927 2265623 1037574 -1157818 -1717592 23711 1859035 2060613 1149509
13873 1149509 132379 -607235 -349467 1641340 4240103 5034929 3509224 1831077 1841432
13864 1841432 3009004 3963750 4240265 3770352 2430349 980647 797087 1740474 1959173
13855 1959173 873661 576643 2675558 5213448 4835494 1378134 -1731618 -1726051 495346
13846 495346 2159919 2231439 2144316 3217354 4469418 3795729 908333 -2105609 -3480139
13837 -3480139 -3733575 -3993859 -3649155 -1461932 1629520 3004818 1821429 16866 -726522
13828 -726522 -1207981 -2829361 -4869580 -5100419 -2648220 830717 2846850 2511991 1230588
13819 1230588 921699 1596933 1432629 -319500 -1712990 -722540 1579443 2479791 1671249
13810 1671249 1426687 2735070 3820225 3136243 1488877 175123 -910025 -2113224
13802 -2113224 -2788266 -2506735 -2001316 -1813531 -1450614 -709972 -80443 965032 3772591
13793 3772591 7342788 7972484 4129464 -644645 -2249416 -1402703 -1553530 -3204342 -3909519
13784 -3909519 -2915853 -1944594 -1515434 -276407 1420683 859398 -2684327 -5766935 -4844536
13775 -4844536 -656953 3027146 3596046 1287978 -1829704 -3255986 -1704918 1294419
13767 1294419 2449526 527030 -1897093 -1734918 616763 2180185 1641311 816235 1709614
13758 1709614 3652655 4215876 2245401 -907544 -3057279 -3283630 -2048917 -46577
13750 -46577 1952463 2483652 470291 -2439489 -2537889 1399100 5851636 6930455 5514618
13741 5514618 5143249 5973010 4863592 1473015 -351420 1203911 2752281 1603584
13733 1603584 826419 4163138 8774933 8401981 2689856 -1993039 -1487692 1241691 1660823
13724 1660823 -5120 -522881 1146953 3179502 3843399 2983173 1546898 968111 1891897
13715 1891897 2718053 1105555 -2290310 -3884925 -2173809 21266 145718 -254814 857344
13706 857344 1468418 -1283566 -5282172 -5683110 -2361145 -189968 -1515368 -3167832 -2262439
13697 -2262439 -342680 535704 1705359 4632746 6946759 5491938 1380593 -1554997
13689 -1554997 -2066555 -1976957 -2347817 -2473812 -2280955 -2572004 -2784674 -1346735 1268496
13680 1268496 2338011 521774 -2287590 -3568489 -3018034 -2003321 -1458700 -1150245 -328786
13671 -328786 1232365 2446414 1634140 -1125640 -3234844 -2614585 -617243 77039 -346824
13662 -346824 531050 2795447 3519242 1443184 -788979 -709872 290254 -432994 -2485422
13653 -2485422 -3273966 -1906718 199352 1884433 3080323 3402760 2173637 38330
13645 38330 -1361570 -1763779 -2652514 -4618638 -5916517 -4746253 -1901576 139955 222265
13636 222265 -620329 -1084941 -1126783 -1310478 -1734019 -2214665 -2708497 -2783838 -1488087 1141269
13626 1141269 3095204 2489929 400522 -215123 1405344 2847274 2281675 1043570 1086763
13617 1086763 1809837 1349222 -408676 -2142719 -3202488 -3316951 -1529759 1951361 3899458
13608 3899458 1287180 -3874051 -6120308 -3348661 900683 2641856 1974578 1180686
13600 1180686 965779 541943 -209036 -476763 364865 2346898 4803387 6268507 5586281
13591 5586281 3395977 1361209 56315 -866304 -889758 681966 2471471 2274360 799755
13582 799755 1133612 3834477 5739801 4670128 2074463 -290496 -2793859 -5186391
13574 -5186391 -5044099 -1668810 1537890 1650248 532580 1403850 3522315 3853440 2142867
13565 2142867 661188 213642 -156550 -517605 -293334 -230164 -1154462 -1774434 -648431
13556 -648431 767785 73997 -2212227 -3857461 -4681597 -5665505 -5607810 -2740544 1109274
13547 1109274 2206958 412798 -1128888 -1420599 -2136955 -2750372 -368468 4484496 7056694
13538 7056694 5376978 3457466 4861751 7263678 6766948 4212666 3258221 4422584
13530 4422584 4918493 3274160 855878 -711214 -1130265 -745081 -101815 180511 342586
13521 342586 1420218 3105390 3050213 -44105 -3846080 -4791947 -2282369 1158808 3099515
13512 3099515 2912493 1150042 -791693 -858022 1723228 4621674 4373040 597645 -3262740
13503 -3262740 -4030793 -2250811 -575893 143385 1364622 3549963 4442510 2086395 -1688101
13494 -1688101 -3108213 -1602229 -456814 -1556717 -2344161 -78379 3364599 4109433
13486 4109433 2160678 1034071 2122237 3189046 2728809 2178892 2723459 3037718 1771943
13477 1771943 -153406 -1247335 -1462356 -1277996 -672075 -90359 -506035 -1480300 -1198471
13468 -1198471 487110 1236172 -254004 -2086171 -2115442 -1053993 -787698 -1219949 -679622
13459 -679622 1601896 4810435 7368436 7644516 5231690 2105480 727789 564513 -1100118
13450 -1100118 -4312546 -5617869 -3429623 -778944 -528312 -1204487 -472834 422176 -625910
13441 -625910 -2018554 -855436 1793231 2340443 453115 -767997 57732 1135497 1121351
13432 1121351 643732 125780 -594312 -459772 1577291 3449524 1800434 -2580372 -4979843
13423 -4979843 -3466900 -1524217 -2232645 -3550352 -2179168 753435 1402821 -882766
13415 -882766 -2748119 -1670775 1042656 2530161 1857708 565653 702218 2809959 5437776
13406 5437776 6474016 5160748 2701148 782961 -94531 -511690 -798266 -528014 524384
13397 524384 1473557 1062713 -570843 -1596541 -613992 1507365 2936314 3459923 4112963
13388 4112963 4524448 3043593 103360 -1207383 491272 2365667 1549435 -268404
13380 -268404 442353 3110571 3546941 210500 -3566582 -4439414 -3135670 -2250061 -2314083
13371 -2314083 -1997964 -858613 36493 -147331 -936199 -1292899 -820278 -61466 255989
13362 255989 72586 -219404 -641189 -1393849 -1718521 -392475 2059961 3240742 2034584
13353 2034584 342029 311632 1468491 2280201 2841008 3790296 4180974 3090613 1956843
13344 1956843 2289043 2329716 -368920 -3842583 -3393051 1500063 6118324 7178018 6504889
13335 6504889 6574385 6331478 3919455 517435 -1354814 -1295023 -391807 992097 2487391
13326 2487391 2530755 517040 -1111938 404330 3967476 5628525 3658753 526996
13318 526996 -459126 1180493 3382030 4297112 3801708 2602997 871749 -1486264 -3540425
13309 -3540425 -3672295 -1788067 92410 462120 148397 125827 -717973 -3303498 -5448664
13300 -5448664 -4442830 -1555950 -396580 -1340370 -1603555 -693404 -1117897 -2967928 -2823539
13291 -2823539 109192 1658254 -677305 -3136986 -1366777 2966087 5237994 4575341
13283 4575341 3304249 2167920 557218 -247038 1465463 4182044 5022907 4366810 4719794
13274 4719794 5797214 4888018 1811245 -558607 -871257 -655736 -770698 -133549 1361205
13265 1361205 2019454 1314201 717320 823721 552754 -47549 735181 2905213 3779821
13256 3779821 1889749 -618773 -1083496 251311 1454799 1735104 1510509 1132477 935743
13247 935743 1427744 2408304 2990482 3172718 4051026 5778686 6780715 5882945 3960703
13238 3960703 2649385 2538067 3282100 4322860 4839788 4088195 2415984 1076874 715973
13229 715973 871724 893857 315535 -1257876 -3188478 -3373998 -801032 2013226 1679178
13220 1679178 -1230185 -2954603 -2176400 -1349140 -1689051 -789243 2835560 6364634 6653395
13211 6653395 4901265 4214967 4540448 3389956 410524 -2053035 -2534388 -1822292 -879645
13202 -879645 174777 812438 -53629 -2332613 -4287244 -4462331 -3318538 -2510867 -2876804
13193 -2876804 -3457285 -2838161 -1557009 -2055397 -5020279 -7096150 -4831864 -190783 1442243
13184 1442243 -1028451 -2880916 -1097849 1117357 142333 -1960714 -1309474 1026084
13176 1026084 1031596 -1476975 -3139278 -3016577 -3244059 -4026520 -2917882 305403 2428711
13167 2428711 1570169 -438814 -1397406 -1077805 558703 3846235 6929858 6378533 1944583
13158 1944583 -2405984 -3810818 -3722885 -4087866 -3761192 -1399721 953582 508095 -1775422
13149 -1775422 -2457444 -487962 1846381 2449440 1771388 1586560 2696221 3993393 3615943
13140 3615943 1546503 579231 3039849 6924684 7890008 5203641 2525717 2083982 1868952
13131 1868952 270321 -537359 1302028 3432717 3176615 2345945 3936502 6370431 5827317
13122 5827317 2877467 1798405 3738937 5340310 4443282 2761349 2063195 1653200 794761
13113 794761 175382 -212350 -1444853 -2826511 -1957553 1022956 2569783 888074 -1118451
13104 -1118451 -210477 2599853 4248670 4067964 3379178 2503411 1000630 -259003 185819
13095 185819 2218707 4535238 6319623 6911130 5183196 1448199 -1220649 -241503 2486163
13086 2486163 2533019 -1188241 -5062777 -5628986 -3356247 -744336 1093677 2379945 2728432
13077 2728432 1313519 -1253861 -2780152 -1769653 823878 2720924 3002315 3004349 4184344
13068 4184344 5728885 5395897 2766350 284425 215284 1647779 1915211 428711 -644076
13059 -644076 279901 1852417 1784550 84044 -1128697 -664420 383755 589691 54581
13050 54581 -541085 -1475578 -3047814 -3937362 -2606826 -192265 425579 -1006390 -1304227
13041 -1304227 1194843 3545596 2507724 -343838 -1214229 -232401 -801542 -3240427 -3714026
13032 -3714026 -592591 2388092 1632138 -1003125 -1395725 652438 1718799 95364
13024 95364 -2285288 -3170727 -2841580 -2997881 -4054767 -4349411 -2141173 1609557 3355466
13015 3355466 1100422 -2416988 -2894479 -298751 1551622 1254165 1678165 4361603 6379855
13006 6379855 5349223 3587331 3805193 4164812 1919505 -964305 -872530 914462 376426
12997 376426 -1709340 -438264 4856116 8809184 7972015 5301898 4591103 5019760 4030679
12988 4030679 1883915 266154 -845901 -2072399 -2596480 -1735807 -566483 178255 1701064
12979 1701064 4425265 5969874 4477739 1937035 1260482 1819950 1178920 -106196 733973
12970 733973 3465087 4277740 1281496 -2525742 -3289087 -1154029 566317 -254518 -2595995
12961 -2595995 -4030227 -3194864 -768389 1175429 870092 -1448742 -3481941 -2976083 -136003
12952 -136003 2353785 2072537 -531407 -2791190 -2997706 -2032641 -1511100 -1464920 -917164
12943 -917164 146507 853106 991126 960395 544872 -571364 -1330486 -369653 1367199
12934 1367199 1347311 -662513 -1741081 24457 2631539 3061080 1432581 290964 732730
12925 732730 1240281 204880 -1792076 -2472415 -259386 3585138 5400688 2824039 -1939380
12916 -1939380 -4220778 -2648369 -661236 -1264898 -2754718 -1817939 1078151 2435289
12908 2435289 1027024 -675916 -599732 189579 -59629 -648776 465243 3248189 4965973
12899 4965973 3304912 -765396 -3949787 -4215274 -2580668 -1091180 -142964 1049670
12891 1049670 2187416 1960559 311076 -1253131 -1912950 -2267301 -2335766 -923144 1982394
12882 1982394 4117812 3760745 2168854 1663749 2461725 2928450 2040098 169887 -1835200
12873 -1835200 -3162510 -3257404 -2420957 -1534547 -814525 41757 379150 -828027 -2549499
12864 -2549499 -2372539 -467390 28579 -1953472 -3229031 -1510651 511721 -486572 -2832104
12855 -2832104 -2579492 118829 1633399 553869 -1447582 -3521201 -6093282 -7885137
12847 -7885137 -6807001 -3886728 -2306537 -2413459 -1673714 295961 993357 -133499 -539653
12838 -539653 735622 1567941 1148221 1428033 2553425 1499895 -2387925 -4980887 -3534177
12829 -3534177 -1223055 -1997872 -4515714 -5146877 -3952824 -3392012 -3521056 -2886496 -2309324
12820 -2309324 -3363107 -4484737 -2992705 -20104 869647 -622215 -1442210 -442508 530853
12811 530853 799186 1757532 3105595 2436289 -317274 -1927288 -742371 1083917 1671681
12802 1671681 2047735 2907927 2504972 240668 -1129725 70076 992696 -1045445 -3208640
12793 -3208640 -1101491 3643414 4986699 1496352 -1413587 448335 4222719 4767986
12785 4767986 1956896 -64429 887967 2819277 3175136 2068981 1351993 1949125 2824283
12776 2824283 2151568 -623875 -3837178 -5199569 -4473887 -3658726 -4182649 -5218126 -5565396
12767 -5565396 -5647149 -6073244 -5567247 -2636588 1256858 2701985 729978 -2005991 -2958420
12758 -2958420 -2481387 -2073750 -1938242 -1699570 -1842361 -2677296 -3066625 -1984664 -524433
12749 -524433 -533719 -1741996 -2036897 -473349 1611165 2581815 2162156 858846 -901287
12740 -901287 -2469074 -2818068 -1510154 536913 1742784 1306549 -53055 -697596 396853
12731 396853 2553846 4142049 4448801 4194535 4096953 3966616 3684491 3842988 4508470
12722 4508470 4519631 3249470 2019160 2274148 3254007 3204130 2220805 1954527 2828266
12713 2828266 3514738 3154567 2298084 1578900 1143963 1425248 2705870 3847836 3343803
12704 3343803 1826607 1512998 2770667 3410144 2142564 591042 681011 1903080 2617282
12695 2617282 2576266 2615620 2953502 3235782 3455510 3667594 3567475 3299072 3750116 5075941
12685 5075941 5945738 5353141 4200685 3888012 4229738 4092562 3358215 2875894 2981716
12676 2981716 3354803 3931576 4719881 5024572 4109280 2519519 1637256 1898060 2389178
12667 2389178 2285308 1822459 1603406 1575043 1120622 19841 -950682 -659695 934064
12658 934064 2339749 2148621 847879 135765 500023 613945 -555163 -2118368 -2366907
12649 -2366907 -824819 1275632 2149735 1056765 -690435 -637405 1909749 4368464 3794989
12640 3794989 973260 -466256 944316 2846320 3045284 2513571 2946073 3680073 3173631
12631 3173631 1882273 1387615 1716045 1639506 970314 643951 875430 822027 -53367 -1337282
12621 -1337282 -2122773 -1581447 116967 1085550 -565983 -3568837 -4028210 -521024 3319370
12612 3319370 3299984 71737 -2272977 -1680738 270609 1347104 771976 -1132824 -3329780
12603 -3329780 -4499242 -4633004 -5232443 -6440754 -5792631 -2124869 1300189 886365 -1699877
12594 -1699877 -2012971 170371 992376 -515050 -730322 2029102 4049034 1839184 -2418374
12585 -2418374 -4085145 -2291921 -42076 337921 -700792 -1523730 -1140451 79316 608750
12576 608750 -487653 -1728608 -763538 1911886 3021189 1061504 -1668150 -2724132
12568 -2724132 -2533380 -2146500 -834011 1600456 2561444 -107031 -4168701 -5436931 -3268651
12559 -3268651 -710751 186620 277231 759023 1487825 2098404 2513092 2088393 347402
12550 347402 -1292486 -759363 1353338 2043328 252517 -1296853 51474 3055253 4320821
12541 4320821 2667739 -55868 -1828713 -2317250 -2026938 -1296674 -622614 -737486 -1569595
12532 -1569595 -1894537 -856348 722828 1510984 1718650 2667570 4340508 5016873 4036296
12523 4036296 3263501 4320170 5618471 4255819 375335 -2576982 -2176733 249079
12515 249079 1690093 713205 -1797283 -3743742 -3277978 -548036 1815566 1561971 222974
12506 222974 1459647 5581028 8372222 6629122 2314363 -658553 -1512603 -2068884 -2876483
12497 -2876483 -2735700 -1336988 81099 511629 -81185 -1388329 -2727849 -3077017 -2401445
12488 -2401445 -1945151 -1956919 -711929 2420126 4722238 3479391 203578 -1263351 242286
12479 242286 2965446 5814585 8709291 10085933 7975128 3683959 790012 142588
12471 142588 -587089 -2083233 -2210362 -619111 -256959 -2429358 -4269945 -3524504 -2264163
12462 -2264163 -2951136 -4027802 -2840554 -394243 438617 -470799 -1236393 -1697928 -2803765
12453 -2803765 -3495352 -1999803 433572 776748 -1024249 -2045217 -1176040 -423901 -958371
12444 -958371 -1286665 -452879 15652 -1017909 -1886955 -476135 2550305 4549394 4083421
12435 4083421 2190737 990761 1523303 2600463 2091607 -197 -845677 1250392 3554965
12426 3554965 2314975 -1441041 -3104506 -1362362 287536 -266387 -520294 1588767
12418 1588767 3647574 3025378 1612223 2311420 3623140 2356786 -207077 -16418 2711500
12409 2711500 3436083 647265 -1758646 -860264 1049349 853876 -565549 -760339 25715
12400 25715 231504 429872 2027505 3864597 3420287 838512 -1178957 -1307318 -733560
12391 -733560 -289516 822888 2720614 3640135 2374331 293340 -411125 631435 2297883
12382 2297883 3921216 5397990 5875962 4068523 313080 -2813341 -2817012 22097 2793643
12373 2793643 2737955 -379848 -4440324 -6906790 -6496876 -3698664 -380398 1380661 921564
12364 921564 -408796 -793641 -17619 701722 764505 834229 1153523 673849 -1163439 -2932450
12354 -2932450 -2834618 -1053091 837252 2124564 3034315 3062121 1258844 -1630252 -3192100
12345 -3192100 -2193921 15247 1559336 2069638 1954423 1177593 -73735 -749525 -306620
12336 -306620 230101 -106272 -450935 503202 2052592 2185808 467082 -1444408 -2106994
12327 -2106994 -1566161 -299431 1391734 2555434 1812027 -775964 -3263060 -4052554 -3598432
12318 -3598432 -3207622 -3178483 -2991965 -2511820 -2057458 -1805540 -1772531 -1818772 -1195275 1041941
12308 1041941 4460041 6972386 7051704 5523342 4251861 3726251 2957661 1246409 -924090
12299 -924090 -2387697 -2035916 289532 3016081 3923569 2801455 1782545 2023967 1804245
12290 1804245 -258130 -1886823 78790 4599353 7371039 6575412 4424823 2814428
12282 2814428 983319 -1518252 -2946975 -2218527 -901170 -516249 -320021 359840 161258
12273 161258 -1603244 -2655387 -955938 1734014 2458704 1588104 1506540 2085555 1108618
12264 1108618 -1281642 -2171252 -282388 2161913 2667269 1317318 -109222 -48082 1924128
12255 1924128 4329029 4278801 748383 -3161558 -3622093 -1195997 241933 -732683 -1739622
12246 -1739622 -1010056 486459 1891372 3668970 4877762 3088419 -1160914 -3452725
12238 -3452725 -1432900 1555509 1541568 -331331 -452824 1298981 2143285 1525401 1710272
12229 1710272 3516035 4774985 3547546 651470 -1445025 -917926 1968985 4538279
12221 4538279 3656155 -516419 -3759438 -2540162 1528306 4002292 3354236 1933294
12213 1933294 1789131 2260314 1901887 522812 -1235411 -2650686 -2805970 -1116453 1621876
12204 1621876 3696710 4124072 3147856 1526856 224208 184267 1310566 2246453 2171785
12195 2171785 1969486 2511458 2938992 2122131 707229 51210 232008 874254 2605040
12186 2605040 5427073 6864714 4527726 -57820 -2849428 -2232537 -165716 1191699
12178 1191699 1418641 696319 -539333 -791876 1050482 3330819 3194197 746101 -817128
12169 -817128 433643 2926991 4002789 2515408 -979421 -4573608 -5805945 -4305425
12161 -4305425 -3051260 -4512715 -6553153 -5479574 -2177961 -949180 -2580607 -3379616
12153 -3379616 -1537111 543076 1304341 2205968 3089523 826231 -4541931 -7407363 -4163951
12144 -4163951 1111292 2677556 1001890 72403 263043 -852120 -2877466 -3128984 -1569270
12135 -1569270 -497118 -159286 1035057 2658946 2775379 1773718 1787328 2768071 2948143
12126 2948143 2641841 3540780 4614116 3066947 -472833 -2082043 -524670 1036858
12118 1036858 381858 -637519 187692 2084263 3480958 4567654 5836389 6564435 6420252
12109 6420252 6358207 6511117 5460179 2964459 1047302 821733 564413 -1271985 -3299434
12100 -3299434 -3447048 -2093212 -851350 139988 1481700 2392160 1730129 396028 437015
12091 437015 1963319 2864829 1748022 -306036 -1275194 -539642 719376 1073902 547152
12082 547152 610546 2272650 4548765 5573538 4962780 4033263 3811438 4034228 4106773
12073 4106773 3726128 2503963 436053 -1093366 -349017 2402683 5089107 6567370
12065 6567370 7428051 7891282 7076562 4985566 3032307 1777638 338909 -1112923 -914633
12056 -914633 714641 753957 -2123309 -4920866 -4829869 -3686728 -4485675 -5770481 -3954163
12047 -3954163 68696 1644876 -286509 -1564664 260359 2096803 834910 -1397259
12039 -1397259 -1067118 671730 110673 -2330847 -2298665 1425196 4398308 2836560 -821880
12030 -821880 -1474461 1434609 3582931 2299365 226299 1287146 5295279 8629735
12022 8629735 9069220 7571983 5504476 2682638 -848712 -3190352 -2705838 -750454
12014 -750454 -201890 -1511690 -2215597 -697538 1489577 2080023 1323259 1143064 1945619
12005 1945619 2238497 1483945 1450965 3701139 6862801 7841140 5492655 1881031 -297334
11996 -297334 -479717 94158 545225 1078535 1796280 1997129 1213626 307956 720091 2604721
11986 2604721 4275468 3842818 1198718 -1989779 -4182697 -5307321 -5952039 -5913575 -4473853
11977 -4473853 -1963693 41316 461475 -174862 -792235 -1102006 -1295929 -1298454 -1181891
11968 -1181891 -1540791 -2416218 -2566301 -1075369 886739 1381193 378977 -523526 -853657
11959 -853657 -1791905 -3703356 -5099195 -4779628 -3308700 -1519086 727425 3154491 4158118
11950 4158118 2928904 1215464 1142827 2182522 2229463 1099488 813321 2346826 4009789
11941 4009789 3640043 1118501 -1837473 -3422724 -2882744 -752775 1590258 3081539
11933 3081539 3764497 4064066 3733942 2456537 1090956 980414 2022764 2764466 2565389
11924 2565389 2269631 2398037 2212675 1300665 661589 1156081 1998812 1953945 1085249 93674
11914 93674 -1176679 -3039345 -4410604 -3780927 -1689040 -486312 -1220063 -2258313 -1765971
11905 -1765971 -286139 287008 -437240 -824271 502555 2837761 4206968 3523198 1556827
11896 1556827 -76663 -519915 -93953 615513 1476669 2323428 2352530 895976 -1239658
11887 -1239658 -2099579 -642435 2095525 4273887 5121193 5034816 4407172 3300047 2212489
11878 2212489 2187826 3574703 5085018 4783739 2213418 -808435 -1874966 -412597 1927096
11869 1927096 3271695 3315756 2813743 2103391 1138439 598515 1540240 3552459 4446482
11860 4446482 2663951 -641563 -2751863 -2263188 -159627 1687106 2386378 2419177 2639539
11851 2639539 3091183 2948891 1820668 704779 879911 2076109 2853654 2722826 2434816
11842 2434816 2035825 585274 -1443729 -1647312 888936 3540353 3541512 1875551 1417706
11833 1417706 2504105 3118594 2646488 2407665 2698639 2257238 830365 -428934 -1296315
11824 -1296315 -2479625 -3182579 -1811555 406787 -60193 -3856657 -7403456 -8118752 -7487131
11815 -7487131 -7106630 -5462612 -1525231 1807842 1610717 -229204 -84305 1411550 841797
11806 841797 -1634090 -2155952 447392 2521911 1087110 -1977485 -3005007 -1344948
11798 -1344948 747888 1446693 893264 153179 -192812 -510774 -1422397 -2565475 -2567157
11789 -2567157 -798182 1599783 3233882 4054434 4416872 3790050 1955662 411699 693888
11780 693888 2035903 2520437 1878429 1320646 1265175 1145875 936551 1046995 1210961 1060841
11770 1060841 1047411 1330867 1021400 190960 858206 3697392 5732902 4255894 1189844
11761 1189844 139794 894162 871887 397556 1769033 4132143 4465969 3182682 3328938
11752 3328938 4339980 2538026 -1540691 -2649768 679070 3301376 1564055 -1561661
11744 -1561661 -2382873 -1862153 -1603710 -6567 3311389 4374456 1066083 -2028714 -370603
11735 -370603 2870386 1698942 -3309830 -6482733 -5598271 -3189509 -1131205 463201
11727 463201 370621 -2292913 -4844589 -4237079 -2171599 -2065332 -2735903 -901732 1659825
11718 1659825 258918 -4054718 -5207673 -1949962 208124 -1612461 -3351460 -1661462
11710 -1661462 607138 127838 -1173355 -159972 2114516 2997186 2583443 1837892 -199370
11701 -199370 -3634974 -5288108 -2880948 933743 2316182 1454907 449813 -1222361
11693 -1222361 -4679615 -7223072 -5072371 259080 3105662 1326036 -1366784 -1455439
11685 -1455439 -159493 -402013 -2219986 -3322153 -2593700 -1176303 -647890 -1263461 -1877129
11676 -1877129 -1217253 661016 2314298 2561895 1795982 1167096 954855 470307 -654688
11667 -654688 -1664012 -1150609 1674385 5785785 8646122 8605947 6864563 5850642 5823682
11658 5823682 4808487 2052804 -584736 -1436064 -1106366 -646511 282950 1912108 2927109
11649 2927109 2377179 1454069 1482754 1590852 436825 -1037580 -885404 690553 1662669
11640 1662669 1052753 -441866 -1988797 -2876047 -2044841 535111 2740192 2662194 1320263
11631 1320263 769876 564827 -970250 -2763827 -1969337 1062598 2629086 1269445 -323101
11622 -323101 -407464 -1233278 -4428106 -6924549 -5209955 -1184209 444505 -770523 -985903
11613 -985903 1251073 2860789 1703720 44193 523336 2041555 2346322 2081212 2997790
11604 2997790 3963713 2479719 -621757 -1808168 -309794 735802 -499035 -1780622
11596 -1780622 -1108676 -469340 -2426825 -5390009 -5764735 -3452474 -1593180 -1348027 -557598
11587 -557598 1996717 4256995 4003843 1887407 71030 -318357 659080 2471563 3987682
11578 3987682 4107004 3286601 2962571 3010448 1796449 -531067 -1217985 1189100 4260347
11569 4260347 4841109 3046233 1186728 273716 -266783 -549236 -35419 1308071 3297387
11560 3297387 6093630 8972218 9764317 7425475 4103752 2644393 2969511 2972137 2036948
11551 2036948 1351297 1416016 1634484 1942564 2573081 2591600 977512 -1125014 -1556103
11542 -1556103 -338368 577489 548562 748869 1507787 1759236 1396929 1621345 2448006
11533 2448006 2252542 400579 -1797824 -3168301 -3577632 -2632271 -27364 2510659 2460051
11524 2460051 273155 -959695 -239163 193765 -657921 -685515 953974 1452293 -917181
11515 -917181 -3040152 -1383171 2429186 4197471 3389422 2951173 4133920 5290749 5242702
11506 5242702 4474944 3292238 1748273 1037812 2106702 3326074 2464541 466192 75075
11497 75075 1102412 713733 -1424242 -2135356 207852 3140767 3993296 3192957 2126608
11488 2126608 659963 -1259449 -2044578 -667839 1489602 2772520 3328502 3427968 1988875
11479 1988875 -1062574 -3084671 -2034580 129813 195873 -1338918 -1034941 2347484 6339820
11470 6339820 8303901 7919631 5992277 3187271 515689 -852164 -914841 -580219 124703
11461 124703 1963390 4349306 5144270 3404183 927162 173994 1620480 3818277 5156126
11452 5156126 4959476 3675269 2523574 2274155 2037388 160642 -3229477 -5591300 -4758891
11443 -4758891 -1788794 11023 -1013655 -2625229 -1062822 4152730 8553748 7182679
11435 7182679 740063 -4540214 -4117688 -329789 1531390 504987 177573 2423598
11427 2423598 4776174 4745822 3257665 2104702 872528 -1304571 -3088528 -2600742 -346425
11418 -346425 1833632 3543688 5236100 5887753 3950395 249382 -2505768 -3070695 -2398313
11409 -2398313 -1132296 1238564 4304921 6056666 5238281 2828956 436394 -1325390
11401 -1325390 -2185656 -1573404 247185 1627544 1388100 459093 579956 1921799 3017771
11392 3017771 2746787 1527092 590380 590321 974032 670651 -416280 -891672 421498 2440287
11382 2440287 2726067 771694 -932315 -20201 2584877 3878920 2587902 427191
11374 427191 -374445 395352 1212481 761616 -921192 -2749707 -3505459 -2700182 -1022407
11365 -1022407 86752 -286486 -1519035 -2026252 -1070764 333741 733949 93862 -431838
11356 -431838 -406684 -610850 -1278147 -1160395 590138 2590189 2765511 1252514 156002
11347 156002 431685 649801 -597140 -2419735 -2769299 -1147787 784417 1179690 20255
11338 20255 -953494 -256518 1484637 2069246 357460 -2192289 -3215490 -2156772 -500310
11329 -500310 249128 -146354 -1045989 -1635150 -1564273 -1723916 -3647559 -6954250 -8463794
11320 -8463794 -5901554 -1727664 -594700 -3129671 -5281439 -4410213 -2741167 -3194958
11312 -3194958 -4789422 -4715502 -2872724 -1464131 -1250067 -913897 307202 1591788 2023484
11303 2023484 1500981 374731 -623935 -639601 52891 -11617 -1153432 -1558505 -223066
11294 -223066 782704 -641306 -2770680 -2302559 387974 1677056 283200 -1096014
11286 -1096014 -416972 769914 406243 -863469 -1389968 -1250794 -1380303 -1644385 -1598144
11277 -1598144 -1812026 -2742822 -3437511 -2955360 -1989815 -1453266 -489913 2240754 5974664
11268 5974664 8411020 8612750 7747881 7087556 6744575 6385291 5795499 4551074 2320355
11259 2320355 -222133 -1776488 -2019721 -2009175 -2705922 -3810662 -4344094 -3774138 -2336332
11250 -2336332 -800521 -108045 -636052 -1566697 -1580400 -503675 338876 -105114 -1090339
11241 -1090339 -1109290 -118339 297974 -864943 -2595065 -3111891 -1799934 679819 3340807
11232 3340807 4947701 4033929 586789 -2562397 -2130374 1380783 3893935 3086801 1278377
11223 1278377 1402640 2402886 1361627 -1392601 -2805833 -2186510 -2082156 -3598605 -4398569
11214 -4398569 -2775025 -641855 -387518 -1165235 -752156 641153 981547 -234518 -1573737
11205 -1573737 -1908013 -1002199 1442607 5118173 7857560 7329450 4144700 1394138 843507
11196 843507 1309003 1146516 592857 820762 1952580 2966258 2873207 1360168 -1149638
11187 -1149638 -3504960 -4279304 -2784789 188740 2607282 2457101 -434724 -3634211
11179 -3634211 -4144231 -1795230 444192 314404 -876349 -509986 1540368 3218642 3397273
11170 3397273 2503668 749235 -1757786 -3433118 -2524973 -292807 -139984 -2799244 -4981066
11161 -4981066 -3977350 -1159800 659859 1122653 1576804 2170631 1915214 652387 -873271
11152 -873271 -2149577 -2745995 -2084352 -702918 -430253 -1734088 -2379887 -680883 1412790
11143 1412790 935407 -1588972 -3067892 -2405300 -1074113 299348 2361521 3924420
11135 3924420 2296236 -2093541 -4896035 -3574747 -961828 -768643 -2198543 -2041719
11127 -2041719 -203872 448114 -913970 -1664172 187207 3033730 3809823 1538910 -2078625
11118 -2078625 -4611172 -4833403 -3349560 -1628371 -287321 1165900 2555577 2321940
11110 2321940 -32797 -1943283 -472588 3383197 5534990 4197003 1953456 1553374
11102 1553374 2101483 1238830 -731015 -1417433 -397539 -238614 -2930887 -6896075 -8597022
11093 -8597022 -6580330 -3085252 -1503734 -2655096 -4153371 -3609842 -1614019 -570415
11085 -570415 -1181588 -1744443 -983912 374791 1621529 3614541 6648063 8339488 6092234
11076 6092234 1191539 -1921323 -827961 2228272 3505219 2054784 -108836 -1097071
11068 -1097071 -1150120 -1680612 -3133777 -4265973 -3603916 -1277969 1174327 2684918 3302268
11059 3302268 2879329 847113 -1727361 -1759512 2122687 6789704 8079487 6187073 4679833
11050 4679833 4674472 3710999 1007997 -165915 2458263 5803006 5117962 232213 -4610156
11041 -4610156 -6052239 -4334700 -1514828 722100 1770225 2291384 3377202 4576272
11033 4576272 3956813 1315717 -522270 455210 2223558 1939996 613040 1255066 3679521
11024 3679521 4941291 4297568 3747634 3827543 3079707 2039276 3279526 6399095 7409260
11015 7409260 4901461 2539414 3036746 3881287 2261319 315509 1259014 3343155 2563491
11006 2563491 -472542 -1359161 1183240 3801504 3926875 2586626 1356056 221892
10998 221892 -639684 -143604 1560426 2801901 3088871 3659557 4629002 4185471 1717003
10989 1717003 -608734 -734215 660394 1629927 1520598 1044366 1141439 2475063 4743250
10980 4743250 6145180 5119403 2778322 1602877 1556282 168418 -2825547 -4103558
10972 -4103558 -1798121 941426 145160 -3203602 -4693965 -2760746 -329733 -248652 -1749354
10963 -1749354 -2214792 -659387 1553850 2487946 1308560 -1290388 -3628305 -4070711 -2098799
10954 -2098799 1124252 3308166 2884511 669621 -1048944 -1484910 -2151270 -3787314 -4298160
10945 -4298160 -1855119 1454469 2082306 307223 -389433 988843 1756652 536049 -649502
10936 -649502 -554021 -867360 -2173995 -1825966 1259425 3429750 1643865 -1144970 -317124
10927 -317124 3000456 3625947 198107 -3327087 -3778698 -2192250 -837371 -385177 -613670
10918 -613670 -1098513 -826207 539050 1248171 -172085 -1827692 -824299 1847894 2403905
10909 2403905 58058 -2175443 -2706611 -3157645 -4030119 -3011140 495919 3188152 2848663
10900 2848663 2076971 3909684 6581371 6349324 3580953 1992728 2607426 2402992 -519765
10891 -519765 -3653885 -3519226 -491125 1606477 159967 -3363116 -5422998 -4394707
10883 -4394707 -1742807 415054 1529654 1887169 1215730 -401291 -1256761 215967 2802064
10874 2802064 3846117 3199546 3394191 5396399 6799488 5624781 3732813 4296707 7047381
10865 7047381 8321482 5803908 1487621 -790325 147220 1841803 1706256 244049
10857 244049 -426783 -383705 -1827160 -4910724 -6536212 -4888850 -2466805 -2135436 -2639056
10848 -2639056 -1318285 815413 828222 -726969 -780007 514195 -61602 -2732299 -3915698
10839 -3915698 -2405753 -1319182 -2165332 -1936515 1257158 4123715 3155076 78430 -1263232
10830 -1263232 -645617 -477055 -1274516 -1577589 -852517 346724 1698859 2372770 860651
10821 860651 -2208967 -3347210 -870441 2041242 1886208 126157 461703 2775459 3725154
10812 3725154 2212526 390763 -278998 -475975 -637435 -192818 678179 1030832 995932
10803 995932 1564708 2643292 3142689 2741337 2011852 1333419 997450 1418988 1962117
10794 1962117 1038338 -1121679 -1703366 704497 3360583 3017181 453468 -1198733 -819876
10785 -819876 657285 2558127 3882772 2563714 -1320613 -3702662 -1655142 1724348
10777 1724348 1782301 -423166 -352448 2163773 3118817 1666075 1091545 2109216 1337914
10768 1337914 -2101514 -4139758 -2104930 1394695 3319641 4373945 5645760 5371694
10760 5371694 2361811 -818119 -1461609 -704169 -755833 -832369 745967 2629946 2343026
10751 2343026 751398 1046445 3752992 5826015 4876389 1976946 -165798 -227615 1017989
10742 1017989 1982029 1742403 542812 -872853 -2010391 -2495148 -2010618 -1124266 -1111699
10733 -1111699 -1716055 -483376 3613768 7306633 6759638 3207899 1255686 1972745 1948634
10724 1948634 -284878 -1534577 527139 3260183 3258578 1469788 1042966 2387690 3400602
10715 3400602 3033438 1995502 1064772 821893 1930399 3894117 4767076 3661563 2109355
10706 2109355 1488825 951662 -326271 -880773 666653 2623775 2287524 -92436 -1937510
10697 -1937510 -2140331 -1830388 -1862973 -1811359 -1262962 -250310 1406825 3597947 5119638
10688 5119638 4915691 3727711 3056679 2977834 2478595 1405039 437526 -383404 -1374455
10679 -1374455 -1842152 -870428 676539 897013 -200718 -406423 1423725 3518680 3664836
10670 3664836 2272909 1637321 2725490 3987514 3402653 853230 -1818355 -2658015 -1284960
10661 -1284960 900717 1913235 857306 -1258757 -2546800 -2267457 -1412934 -919185 -112483
10652 -112483 1989025 4440905 5100843 3542182 1497476 200709 -750267 -1422940 -782015
10643 -782015 1011944 1830010 656758 -698985 -747200 -888766 -2538488 -3910303 -2725249
10634 -2725249 -500770 -762530 -3838810 -6540077 -6486642 -4014745 -455232 2663633 3311673
10625 3311673 776684 -2504405 -3455224 -2212792 -1194869 -1378051 -2146548 -3552975 -5597295
10616 -5597295 -6453617 -4799485 -2756346 -2967686 -4082680 -3117618 -867427 -295820 -735199
10607 -735199 966839 4120733 4687482 2083510 -241245 -1283401 -3396916 -5922358
10599 -5922358 -4589370 644605 3517297 302956 -4763191 -6268514 -4874148 -4129138
10591 -4129138 -4442942 -4227436 -3608348 -3313688 -2616584 -1343479 -1179395 -2433855 -2478951
10582 -2478951 87144 2716265 2826727 1519190 1006264 1266252 1641841 2905475 5241239
10573 5241239 6619584 5394955 2507492 -275260 -2081119 -2242103 -758263 147419
10565 147419 -1634593 -3989734 -2892515 904798 2276873 -470834 -3249240 -2736850
10557 -2736850 -322821 1564692 2086068 223433 -4179264 -7097800 -4151020 1726982
10549 1726982 3208204 -260625 -1883838 952857 3218390 2101006 1175753 2033909
10541 2033909 1112269 -1766737 -1228894 3366817 5205705 1960595 383372 3977310
10533 3977310 6539650 3829604 1083266 2311390 2753805 -771913 -2756429 -70818
10525 -70818 730631 -4379152 -8417040 -6089088 -3573101 -5948508 -6811510 -1259408 2967212
10516 2967212 -629599 -4434644 -749712 3541024 380012 -3734716 -598022 3465670
10508 3465670 310306 -3665707 -818742 1437896 -4138680 -7658232 -612355 4494425
10500 4494425 -3959550 -12264606 -5299753 3581886 -2343807 -8407561 3099373 11236217
10492 11236217 -8484777 -27883618 -9627890 4235656 -69365956 -212444464 -288797938
10485 -288797938 -213831524 -70366454 4808596 -8063045 -26615520 -8701178 8242976
10478 8242976 -3124335 -15546032 -6024783 5679417 199895 -7902279 -2802758 4179877
10470 4179877 560932 -3776547 1026701 5040128 -423289 -4813189 1355781 8331458
10462 8331458 5559452 320965 2356850 6018119 3005944 -1236537 1365402 6050285
10454 6050285 4572354 -235764 -1479100 -548450 -1603658 -2442585 -628441 -204384 -3438989
10445 -3438989 -4584691 -279479 2888804 -247049 -3689284 -994386 3038037 1063742
10437 1063742 -4236352 -6051642 -5066619 -5661123 -6540733 -4390956 -1631139 -1896501 -2620246
10428 -2620246 -175658 2372727 585509 -2799744 -2459075 409928 1057851 -450238
10420 -450238 -977855 -928505 -2262409 -3216268 -1578002 -20843 -1768926 -4078872 -2431660
10411 -2431660 1668101 3397866 2529023 2457792 3574266 3596628 2746428 3041915 3908985
10402 3908985 3457322 2646746 3637705 5485383 5580310 3771085 1466297 -1225696 -3888899
10393 -3888899 -3917410 -242712 3399858 2944824 -329455 -2287217 -1957490 -1488718 -2105480
10384 -2105480 -3352128 -4395355 -3594334 497053 5470011 6203488 2364129 161302
10376 161302 3051655 5854663 3084858 -1854565 -2223126 1266553 2499943 276073
10368 276073 -962749 303729 563924 -1861099 -3963958 -3314764 -1429543 -505509 -385737
10359 -385737 43512 976265 1836665 1655804 -263450 -2651732 -2739410 -168110 1687751
10350 1687751 478066 -1623103 -1851365 -1358213 -2342069 -3523386 -2624208 -984513 -1262674
10341 -1262674 -2482324 -1914277 -217172 -627 -636151 588401 2994453 3121050 574079
10332 574079 -1318219 -878817 9068 -255588 -912147 -1117759 -1242567 -1510828 -1757149
10323 -1757149 -2306381 -2986652 -2356554 -280730 562493 -1177373 -2126645 959601 5087437
10314 5087437 4985157 1770681 1600202 5808971 8723345 6609856 2928817 2156616 3324236
10305 3324236 3032028 1164267 -43249 -207423 -676687 -1555582 -1636994 -723002 -39323
10296 -39323 -537106 -1903874 -3040714 -3050544 -2208944 -2018303 -3527821 -5676330 -6288538
10287 -6288538 -4667480 -2236955 -743399 -721972 -1464016 -1665264 -572816 827630 713526
10278 713526 -682026 -581859 2533048 6209393 6990984 4675850 1506268 -1394200 -4112338
10269 -4112338 -5620125 -4464140 -1523654 527676 472890 -777780 -2249866 -3393961
10261 -3393961 -3114986 -863813 1579600 1851861 356037 -430454 276415 893655 399418
10252 399418 -482544 -1043911 -1324887 -1115813 -298327 32132 -1097359 -2454071 -2133992
10243 -2133992 -697716 -192522 -492314 364828 2244160 2605483 712981 -967858 -675179
10234 -675179 128047 -377092 -1277303 -527641 1825271 3655127 3275896 985799 -1405438
10225 -1405438 -2179129 -1275839 -139144 451208 1460828 3419893 4471423 2665014 -702597
10216 -702597 -2550214 -2345569 -2237544 -2958193 -2676701 -659830 851148 -31562 -1817239
10207 -1817239 -1802462 103459 1535089 1023759 -335437 -595960 650054 2081258 2544869
10198 2544869 2375798 2263185 1564245 -690988 -3302118 -3603717 -1298558 720005 547637
10189 547637 -131598 682459 1895316 1526515 174109 -394140 -220421 -13499 924959
10180 924959 2544285 2053916 -2012072 -5692824 -4251115 332180 1685393 -1583440
10172 -1583440 -4316098 -3122540 -768957 -595906 -1531420 -1234910 -193462 179467 368097
10163 368097 911780 397402 -1981305 -4049097 -3486949 -1309884 -43429 111823 807664
10154 807664 2214550 2614997 1230121 -322840 92291 2420873 4029147 2484998 -1122981
10145 -1122981 -2850644 -885070 1753294 1535212 -206719 515473 3748389 5292842
10137 5292842 3172025 279814 -507232 -25974 33898 172194 1020827 1151033 -559740
10128 -559740 -2544661 -2799720 -1708887 -669588 289350 1552718 2247017 1518540 189501
10119 189501 -505580 -588412 -447434 190258 1087963 973129 -411373 -1434186 -1210118
10110 -1210118 -1304083 -3125602 -5348620 -5837521 -4723534 -3668294 -3210179 -2577211 -1237913
10101 -1237913 679780 2558947 3077414 1368467 -836020 -440865 2419382 3651594
10093 3651594 978445 -2292408 -2028074 620079 1400385 -440947 -1775626 -1133452 -594260
10084 -594260 -1792984 -3542825 -4397559 -4691714 -4834047 -4077192 -2477429 -1970087 -3640070
10075 -3640070 -5428267 -4622449 -1832074 -392414 -1859514 -3983721 -3818940 -1379629
10067 -1379629 1001899 2011335 2374446 2783842 2713631 1940168 1582366 2431719 3530673
10058 3530673 3797867 3871807 4610625 4807854 2594254 -1421119 -4636473 -5860231 -6074378
10049 -6074378 -5947176 -4939733 -3143285 -1790138 -1426081 -1399457 -1404274 -1657087 -1504975
10040 -1504975 -22718 1883637 2266348 1190764 586055 902490 594251 -790228 -1862951
10031 -1862951 -2126772 -2452565 -2479660 -934979 992330 540994 -1526534 -1229219 1739856
10022 1739856 2458949 -1268235 -4504306 -2675904 996136 544217 -3681835 -6439582
10014 -6439582 -5721874 -3940376 -2449744 -326656 1951869 2591350 2217704 3146233 4886042
10005 4886042 4568319 2004658 152801 126633 -149049 -1562284 -2133425 -942536 -17536
9996 -17536 -631731 -909776 970446 3765397 5200068 4938942 3926201 2602677 1282026
9987 1282026 761195 1214907 1644844 1255555 195872 -1389446 -3360122 -4290188 -2320362
9978 -2320362 1842629 4801720 4479365 2462898 1165956 501159 -929327 -2736413 -2951499
9969 -2951499 -1005875 1079771 828805 -1956383 -4807345 -4982081 -2341761 595108 1826375
9960 1826375 2125843 3070597 3974035 2907180 346679 -709692 1224588 4074100 5001506
9951 5001506 3550722 1195549 -626181 -1099478 -112905 1225523 1329241 200683 -480108
9942 -480108 -47066 -32575 -1486173 -2695309 -1423482 1545708 3201106 2456770 1589959
9933 1589959 3042803 6244184 8519886 8260784 6116866 3540802 1481681 621884 1390679
9924 1390679 2768952 2328586 -833370 -3908415 -3301039 363233 2647499 1273906 -998656
9915 -998656 -769896 1392574 2848811 3083637 3259149 3260331 2214237 899641 707972
9906 707972 948227 2248 -1502509 -1559227 -304846 203301 -685462 -1887439 -2936441
9897 -2936441 -3699986 -2710857 628297 3161690 1700236 -1024128 666470 6400935 9549153
9888 9549153 7016980 3186269 2221043 2753301 2997067 4589316 7509057 7987650 6606023
9879 6606023 11189289 24015815 32649508 23973581 3672872 -9656183 -8627745 -3644755
9871 -3644755 -4463399 -7490481 -6005016 -2186344 -1459118 -2603973 -1654428 -187508 -1661287
9862 -1661287 -3481552 -847093 4088425 4929793 1589093 285490 3089450 5022895
9854 5022895 2883671 117855 406965 2091768 2115625 991888 502207 2675 -1625034
9845 -1625034 -3013238 -2400412 -703123 100282 -69738 -260019 -545046 -1059061 -682827
9836 -682827 1058799 2267844 1045538 -1647334 -3519404 -4130843 -4567388 -5058873 -4922585
9827 -4922585 -4052351 -2811629 -1294598 31053 184844 -614654 -762477 -125776 -953306
9818 -953306 -4144956 -6999049 -7013981 -5517732 -4756968 -3986001 -1949060 -645277 -2120775
9809 -2120775 -3605362 -1180824 2985585 3003208 -1439481 -4399997 -3121054 -1774841 -3718309
9800 -3718309 -6104840 -5547228 -3871075 -4040673 -4615425 -2858760 -66770 879434 715620
9791 715620 1896095 3499530 2761141 361681 -461524 651503 1127888 560604 1363244
9782 1363244 3861433 4975791 3091129 665520 227687 690342 -163185 -1583532 -755315
9773 -755315 2896899 6231895 5602482 943077 -3723848 -4231664 -794741 2286372 1949760
9764 1949760 -4249 -40053 1744386 1962563 -618945 -2862154 -1610334 1832307 3489997
9755 3489997 2069506 427766 1322580 3421785 3202947 233846 -1855413 -638132 1258502
9746 1258502 58938 -3070412 -3480943 -114461 3069132 3468767 3314958 4840711 6092111
9737 6092111 4638586 2117487 1394419 1762842 875295 -585494 -287137 1210780 1510915
9728 1510915 915789 1586099 2769338 1393390 -2413557 -4724990 -3558404 -1390707 -826650
9719 -826650 -1211445 -946211 -148768 577752 1559506 2741782 2985573 1913869 744021
9710 744021 413253 532674 726089 1167120 1380428 536731 -608989 -171726 1959516
9701 1959516 3735605 3940073 3464504 3137436 2516525 1519036 1172389 1966478 3139846
9692 3139846 3970303 4157403 3142370 1111456 150797 1698443 3377620 1775963 -1848615
9683 -1848615 -2715931 181754 2384795 869681 -1803742 -2375195 -1745083 -2091521 -2697462
9674 -2697462 -1962979 -790609 -693764 -811486 110177 840961 -152928 -1452199 -630186
9665 -630186 1995578 4244413 5259655 5361675 4408930 2904899 2980414 5418182 7301569
9656 7301569 5587698 1549227 -1329937 -2334266 -3072243 -3474625 -2051244 580852 2130733
9647 2130733 2302661 2643056 3045593 1963039 52729 -103117 1604767 2245442 550545
9638 550545 -1146627 -880018 169438 489689 1052995 3199826 5728264 6293260 4525801
9629 4525801 2036235 204162 -637343 -564171 116766 748184 775693 110001 -989666
9620 -989666 -1723790 -791803 1931468 3869879 1977874 -2846855 -5723679 -3589137 721994
9611 721994 2135209 -206027 -2584297 -2319889 -955047 -1035882 -2075675 -1712413 257664
9602 257664 1379081 196849 -1634664 -1862991 -698163 112202 167177 453449 997951
9593 997951 626895 -727634 -1485283 -848157 -49534 -313959 -1106358 -1376128 -1132871 -790929
9583 -790929 -337624 -162579 -1194028 -3025619 -3525696 -1770713 249250 566093 223316
9574 223316 1192529 2772445 2648097 583701 -1524250 -2552573 -2531328 -891375 2610404
9565 2610404 5532377 4670009 755975 -1897201 -1214014 293401 169853 -192435 1485588
9556 1485588 4217833 5288077 4324678 3144788 2464071 1367261 -214944 -851128 193884
9547 193884 1815459 2678588 2750011 2635019 2300766 1245131 -384430 -1510093 -1250327
9538 -1250327 -198241 -70835 -1647859 -3493589 -3621321 -2188308 -1189422 -1290829 -708233
9529 -708233 1754693 4178630 3911511 1588065 554387 2338156 4803636 5399169 4406621
9520 4406621 3864644 4619067 5790650 6344506 5933844 4750225 3626845 3695027 4808761
9511 4808761 5017362 3025083 493018 62527 1562707 2444712 1872730 1650301 2544919
9502 2544919 2746775 1436301 894826 2699595 4399505 3061842 133687 -787645 418882
9493 418882 1013781 823532 2536893 6305801 8513031 7183512 4640988 3057744 1189521
9484 1189521 -2047338 -4240801 -2977005 -130882 797462 -84410 86291 1896968 2809324
9475 2809324 1082751 -2168156 -4849183 -5637814 -3967572 -438591 2525984 2322191 -910337
9466 -910337 -4116032 -4474064 -2126017 198220 -134405 -2971252 -5125564 -3618377 626639
9457 626639 3597772 3017103 583723 -1227884 -2322611 -3505353 -4074940 -3095599 -1544109
9448 -1544109 -995401 -1272379 -1265904 -893665 -456979 552115 2065845 2380652 678956
9439 678956 -840157 281539 3219084 5462335 6476042 7122086 6961899 5238905 3349535
9430 3349535 3098835 3457611 2283373 268325 -320652 71350 -904664 -3030858 -3897756
9421 -3897756 -3393625 -3576992 -4161215 -2702771 300139 1278842 -418534 -1188358 602160
9412 602160 1810071 201529 -1616598 -957678 303416 -553988 -2074969 -1260517 1276863
9403 1276863 2677645 2485541 2234981 1903722 493770 -839020 120370 2749112 3955376
9394 3955376 2477934 191915 -939360 -869927 -277795 547541 1282530 1573590 1612345
9385 1612345 1596393 1009715 -354687 -1395230 -1251696 -1046625 -2236403 -3963808 -4252809
9376 -4252809 -3365306 -3437390 -4733971 -4929152 -2826949 -330924 574879 685754 1640361
9367 1640361 2805000 2430019 1048941 1091235 2932415 3785542 1630023 -1696241 -3057852
9358 -3057852 -2286829 -1631587 -1688729 -666654 1994979 4048860 3720989 2235766 1372687
9349 1372687 590821 -1209282 -2789859 -2116185 297223 2189007 2831882 2924718 2186837
9340 2186837 130096 -1490541 -521520 1543014 1154659 -1452262 -2172509 335369 2342511
9331 2342511 1248146 -238853 883266 2411200 457516 -3961080 -6113263 -4200203
9323 -4200203 -1039204 480460 371760 -27137 160350 1429361 3541501 4806142 3589765
9314 3589765 782339 -909621 -358344 801396 613480 -975503 -2683904 -3484559 -3125175
9305 -3125175 -1886003 -327702 1035370 1934386 2099450 1187876 -597093 -2121959 -2122054
9296 -2122054 -447608 1599478 2198311 665831 -1449763 -1541605 1050174 3967889 4853019
9287 4853019 4378473 4492560 4747271 3154886 244008 -1088600 -192544 259675 -1161972
9278 -1161972 -2396745 -1854768 -1337992 -2675051 -4306233 -3998488 -2605853 -2133976 -2001016
9269 -2001016 -446064 1711088 1955318 -31942 -2237995 -3574305 -4641960 -5540281 -5348620
9260 -5348620 -3893119 -2237327 -1400170 -1760198 -3142367 -4352268 -3663251 -1130942 779418
9251 779418 338843 -1078640 -1374612 -786615 -592838 -516622 176965 606594 -40201 -232563
9241 -232563 1574516 3666304 3337098 1385357 893554 2194107 2674567 1428176 453426
9232 453426 761035 600853 -1439224 -4126838 -5342176 -4299119 -1654708 839621 936872
9223 936872 -1786546 -4423318 -3746478 -421204 2133567 2595803 2646423 3320103 3615781
9214 3615781 2994424 2267426 1566380 258762 -769428 228032 2393736 2610152 142903
9205 142903 -2153518 -2305013 -1750955 -2018704 -1959447 -256544 1891322 2769514 2842278 3396922
9195 3396922 4072417 3620134 1983864 217025 -635796 277765 3121754 6241568 7152080
9186 7152080 5535298 3639658 3025849 2934408 2724252 3465278 5493701 6553205 4552647
9177 4552647 846189 -1237563 -397489 1576581 2157774 501114 -1915858 -2582574 -693144
9168 -693144 1388735 776663 -1961488 -3517038 -2589854 -1262810 -1034628 -548888 1252270
9159 1252270 2627541 1876612 317470 -23282 217224 -739581 -2434891 -3026724 -2520085
9150 -2520085 -2489209 -3068330 -2672782 -750162 1175769 1587632 800900 323516 1014524
9141 1014524 1989360 1332761 -1574619 -4626529 -5093585 -3136758 -1570405 -1938540 -2903924
9132 -2903924 -3059201 -2861671 -2638916 -1251874 1381484 2619978 275814 -4007698 -6600337
9123 -6600337 -5868651 -2657879 1569987 5065129 5815105 3589761 910454 -10812 -69670
9114 -69670 -1000195 -1855505 -437534 2766773 4883449 4479390 2716986 1066006 87884
9105 87884 129806 1036865 1421284 245226 -1151871 -570559 1814205 3672896 3682429 2616866
9095 2616866 1653708 1424663 2272512 3574161 3444580 1177378 -785889 245433 3033216
9086 3033216 3959227 2329046 911984 1098531 1029900 -487357 -1496441 -94798 2399897
9077 2399897 3500252 2921372 1936821 770261 -1295199 -3832072 -5017127 -3584864 -376629
9068 -376629 2005892 1246426 -2138532 -4460629 -2488398 2398642 5303903 3558450 -328711
9059 -328711 -2245907 -1181450 972687 2660338 3689572 3871554 2778211 959754 -145234
9050 -145234 57163 652016 636402 216231 233450 849136 1372532 1223521 545670 -254478
9040 -254478 -1136286 -2128791 -2591324 -1534250 923851 2946514 2548539 -207574 -3014227
9031 -3014227 -3480685 -1413560 1081271 1847512 1052514 872271 2435088 3889464 2776809
9022 2776809 -152163 -1464297 257090 2342997 1843052 -430005 -1463860 -362639
9014 -362639 1085961 1612269 2046672 3421328 5074078 5312556 3290435 -40573 -2547889
9005 -2547889 -2714351 -1118883 342332 850089 1281208 2138168 2429262 1598128 1001903
8996 1001903 1890810 3086652 2444318 -138959 -2808118 -4225179 -4489177 -4206739 -4023902
8987 -4023902 -4462257 -5056980 -4525902 -2841704 -1787967 -2198847 -2437627 -1336517 -526221
8978 -526221 -1410947 -2005560 -65339 2453987 2015532 -658118 -1745950 -701475 -681397
8969 -681397 -2385912 -2413130 945715 4747796 6142092 6122196 6333938 5798081 3537518
8960 3537518 1417643 1381100 2146583 1423286 -499852 -1863002 -2285983 -2109139 -761359
8951 -761359 1627824 2726910 959471 -1423424 -1180720 1071600 1983085 865023 635133
8942 635133 2996720 5612130 5347733 2429116 -90554 -47229 1857173 3458298 3556698
8933 3556698 2666414 1852212 1588852 1899657 2658569 3051564 1781943 -937189 -2624349
8924 -2624349 -1544939 456329 467713 -944580 -738812 1382561 2425326 1321908 846352
8915 846352 2843998 5088964 4950484 3119153 1493450 274415 -487722 601988 3469712
8906 3469712 4992225 3282534 1084259 1676651 3784758 4121644 2776654 2080278 1955123
8897 1955123 753139 -630624 -98145 961453 -929252 -5270875 -7479459 -5423572
8889 -5423572 -1926235 72530 838931 1155490 206575 -2006130 -3370231 -2831263 -2235603
8880 -2235603 -3063435 -3707569 -2187918 309240 980108 -539191 -1755279 -734019 1458645
8871 1458645 2059814 5216 -2364872 -1799751 1482515 3558224 2054142 -434054 -395135
8862 -395135 1223193 1141672 -263509 407593 3258963 4220974 1485434 -1581499 -1759811
8853 -1759811 -386854 -198485 -1053492 -1425451 -1550753 -2382868 -3263290 -2963022 -1621557
8844 -1621557 51736 1945744 3549073 3660322 2457199 1835923 2406741 2472121 1324907
8835 1324907 780985 1668062 1809831 -147256 -1870744 -1134796 358368 214606 -316642
8826 -316642 891086 2168695 768115 -1415013 4216 4517046 6590695 3549574
8818 3549574 -898381 -2287759 -689651 1340628 2881731 4484759 5928346 6102509
8810 6102509 4253548 690929 -2722124 -3124397 244464 3729185 2799846 -1758858 -4241046
8801 -4241046 -1598505 2429830 2555930 -1282331 -4724969 -4704511 -1813446 1936739 5175137
8792 5175137 7118410 7347187 6107328 4116633 2059259 514435 -199635 -486804 -1077936
8783 -1077936 -1858200 -1958896 -1275359 -710833 -500263 251872 1610988 1988900 559244
8774 559244 -912042 -380957 1338684 1811095 891536 1092053 3574085 5808218 4589194
8765 4589194 252018 -3711968 -4874085 -4083698 -3175041 -2152098 -49811 2413010 3159363
8756 3159363 1853052 677302 1204338 2218544 1874777 465967 -554461 -978824 -1414908
8747 -1414908 -1598687 -1230286 -1469464 -3185729 -4579122 -3357228 -716865 65874 -1105572
8738 -1105572 -899840 1891801 4336522 4224539 3283862 3477846 3483752 1615905 -604320
8729 -604320 -1017798 -701444 -1817284 -3367906 -2864790 -1105612 -1307022 -3729122 -4998350
8720 -4998350 -3362322 -1249294 -1361813 -2873324 -3132478 -1429502 473442 707522 -798567
8711 -798567 -2411983 -2523417 -1396725 -761957 -1118365 -780395 1140190 2495377 1196008
8702 1196008 -787562 254666 3921574 5706111 3270607 -681707 -2819439 -3186884
8694 -3186884 -3148684 -2366057 -289305 1482320 1025246 -919057 -2020796 -1573372 -725995
8685 -725995 -250611 141321 725072 1423049 2091364 2164655 897987 -1002203 -1247746 1056160
8675 1056160 3526020 3436979 1555683 913609 2363077 3617339 2620687 -189203 -3152199
8666 -3152199 -5041605 -5087002 -3077788 -171001 1566382 1017166 -1257638 -4042881 -6140410
8657 -6140410 -6254670 -3858609 -527004 1086460 260529 -940675 -381220 1682181 3427359
8648 3427359 3633621 2267600 -64565 -2255641 -2991042 -1946370 -393559 164131 -235660
8639 -235660 -239121 934020 2376597 2416033 475859 -2115431 -3347000 -2616636 -1240834
8630 -1240834 -683930 -947892 -1311301 -1841710 -2977919 -4134870 -4219763 -3356126 -2547423
8621 -2547423 -1723948 18672 2052618 2305812 541054 -647844 452813 1915734 1036614
8612 1036614 -1602088 -3202086 -2815017 -1900574 -1415481 -845398 -56429 235821 102524
8603 102524 402095 832476 101175 -1536131 -2226644 -1795205 -2577033 -5529470 -7861438
8594 -7861438 -6749954 -3668685 -2340016 -3341003 -3553483 -857296 3150781 5580508
8586 5580508 5391153 3519105 1566434 1038226 2392625 4121003 4092620 2426138 1510239
8577 1510239 2382643 2920963 1148652 -1307731 -1384658 656890 1340677 -984175 -3767256
8568 -3767256 -4004471 -2313366 -1455940 -2006563 -1714627 845907 3837967 4177470 1079649
8559 1079649 -3127834 -5277141 -3994891 -550929 2340575 2770726 1121508 -723198
8551 -723198 -1577967 -1730089 -1439887 -53133 2246822 3097395 652207 -2795303 -2799233
8542 -2799233 894513 3114538 396418 -3574125 -3104365 1003149 2805618 484750
8534 484750 -1175050 1094535 3760177 2542847 -627285 -1331626 -252402 -1460123 -4604577
8525 -4604577 -4845461 -922342 2329761 1249655 -1693918 -2736124 -2387884 -2835107 -3197278
8516 -3197278 -1475511 991728 1277759 -85680 137810 2497966 4072253 3365905 2429411
8507 2429411 3056351 3880249 2854562 449103 -1327131 -1681348 -1385609 -1326789 -1790425
8498 -1790425 -2497920 -2684687 -1814707 -528377 -7703 -290771 -401140 -224736 -662132
8489 -662132 -1573167 -1447765 38393 967984 -72158 -1784355 -2171781 -1357741 -728496
8480 -728496 -475863 111063 851310 1230297 2056760 4259527 6287354 5200034 846088
8471 846088 -3194828 -3774558 -1621357 376037 831781 469825 117085 -308335 -985779
8462 -985779 -1481991 -1105771 311580 1892234 2046810 26851 -2693344 -3512618 -1674876
8453 -1674876 732243 1376993 333076 -759522 -1194016 -1442282 -1472332 -536267 1209411
8444 1209411 2302056 1757032 350846 -373306 234975 1550302 2374957 1899996 573852
8435 573852 -34230 967726 2305918 2028710 395828 -387146 351286 630126 -658070
8426 -658070 -1195950 1568175 5976842 7606009 4900323 975624 -458386 1074576 3477607
8417 3477607 4610738 3487537 734112 -1252789 -163209 3241414 5404659 4216082
8409 4216082 1580746 663063 2004294 3778083 4599411 4331893 3017605 906832 -816668
8400 -816668 -986249 -49553 483941 -47120 -1145988 -2260807 -2970751 -2570437 -855616
8391 -855616 1025350 1841781 2003574 2605558 3262167 2678462 1127592 350196 800852
8382 800852 954541 -91862 -1115811 -761973 352461 568266 -622284 -2100129 -2351378
8373 -2351378 -886474 1089318 1632703 481569 -41200 2080419 5306951 6168748 3972854
8364 3972854 1553770 1037197 1437269 1382373 1599670 2942144 4024137 3009545 505619
8355 505619 -1257441 -1252551 -94462 1395813 2503970 2403207 1229813 657228 1938147
8346 1938147 4100780 5434087 5821132 6064852 5949246 4925321 3946188 4418932 5666626
8337 5666626 5611238 4017064 2997262 3879536 5309164 5153085 3083531 666643 -386645
8328 -386645 151218 621079 -955883 -4202129 -6039081 -4212957 -363770 2010397 1891517
8319 1891517 1029111 507421 -317915 -1328473 -933185 1100907 2502880 1734995 512522
8310 512522 1266830 3431634 4274488 2757597 621720 -364955 -588724 -1399450 -2749022
8301 -2749022 -3090899 -1686606 -162951 -776984 -3155684 -4120153 -1652739 2154999 3676156
8292 3676156 2416699 1035616 1082203 1265232 447870 -187264 655038 1935304 1750798
8283 1750798 3201 -1938243 -3221122 -3743367 -3397549 -2582951 -2569745 -3720537 -4144125
8274 -4144125 -2005642 1324635 2529022 735018 -1432702 -1630838 -606135 -234467 -548868
8265 -548868 -404640 -787 -658289 -2238974 -2771074 -1357188 72425 -771084 -3199133
8256 -3199133 -4339139 -3102713 -1611864 -2055904 -3624090 -3804230 -1794980 836981 2467934
8247 2467934 2940755 2853939 2670337 2754598 3198638 3319439 2267846 412132 -751022
8238 -751022 -350967 931943 1844834 1704386 541135 -959532 -1576171 -620937 934863
8229 934863 1351392 222007 -1300150 -2273737 -2672249 -2382925 -1140852 297751 591849
8220 591849 -209543 -829356 -1141698 -2207426 -3423748 -2354993 1302304 4312971 4375710
8211 4375710 3367326 3609295 3492295 361865 -4094084 -5583284 -3623140 -1973650 -2524777
8202 -2524777 -2933196 -1382694 199410 -352010 -1798367 -1746939 -335580 673455 873198
8193 873198 1142291 1855385 3048016 5115763 7402385 7316393 3196519 -2609403 -5813052
8184 -5813052 -5097123 -2952316 -1822952 -1622711 -1330474 -855883 -408128 337229 1350202
8175 1350202 1724832 1075639 434806 658624 826353 -436980 -2588517 -3601665 -2684594
8166 -2684594 -1134893 -208639 436411 1397633 1901179 917374 -780103 -1338975 -546772
8157 -546772 -127602 -895251 -1368829 -329603 826147 150060 -1396161 -851173 2438995
8148 2438995 5631589 6072514 4280595 2394030 1414086 1267667 2075256 3632595 4595477
8139 4595477 3898181 2371224 1427159 885159 -76251 -527032 1166347 3944566 4480271
8130 4480271 1876839 -611523 -159927 1502755 842347 -2094433 -3792355 -2233290 931451
8121 931451 3361490 4710487 5525340 5591924 4758980 3954352 3896966 3767278 2554046 932493
8111 932493 282729 357361 -394501 -2263379 -3733907 -3886326 -3745195 -4302311 -4502241 -2749542
8101 -2749542 121484 1175112 -875400 -3625241 -3778738 -1224412 1107749 1280790 539053
8092 539053 789896 1529700 934580 -931421 -2195325 -2368339 -3119058 -5111741 -6267495
8083 -6267495 -4717245 -1816796 -263347 -367932 -392890 136383 -30756 -1016991 -927217
8074 -927217 1438642 4771896 6965096 7199974 5686269 2886282 -59763 -1531204 -1219224
8065 -1219224 -707212 -1253226 -2001265 -1452459 295182 2025368 3275831 4337126 4956292
8056 4956292 4507648 3286794 2397961 2309041 2432265 2156208 1557825 1083645 1023913 1166998
8046 1166998 710410 -941060 -2926509 -3362081 -1716655 235757 845799 918086 2154456
8037 2154456 4150361 4855430 3666577 2098403 1365874 1211932 1331419 1894796 2078064
8028 2078064 267171 -3014064 -4316062 -1318503 3544251 5574265 3274288 -692664
8020 -692664 -3566784 -5014207 -5140021 -2690326 2669369 7693463 7912708 3013083 -2040033
8011 -2040033 -2254596 2111062 6520414 7521970 5782376 4094867 3883301 4238946 3585419
8002 3585419 1567251 -604300 -1467559 -942317 -329102 -469937 -651766 -138980 30709
7993 30709 -1643761 -4317703 -5216675 -3233555 -333253 1299880 1736938 1926342 1645024
7984 1645024 408103 -938425 -1322276 -1222110 -1684478 -2418810 -2599090 -2751040 -3839658
7975 -3839658 -4995985 -4313149 -1815573 419058 1246751 1565959 2064624 1907879 603059
7966 603059 -513852 -27672 1266762 1153815 -1177317 -3998629 -4880204 -3284902 -1004694
7957 -1004694 125932 455654 1512264 3028900 2814559 289265 -1919107 -1549946 -69881
7948 -69881 -192286 -1537906 -1618602 -168929 743507 593149 1037929 2446679 3024110 2061331
7938 2061331 1015382 529495 -543330 -2085745 -1910190 415026 1988357 797653 -1244132
7929 -1244132 -1612942 -827375 -382388 294213 1866650 2420678 248152 -2365412 -1780079
7920 -1780079 1549798 3756487 3158041 1817145 1593348 1816366 1371323 527474 34581
7911 34581 234745 1305644 2827674 3406303 2420068 1477953 2121309 3015723 2042060 280732
7901 280732 571285 2484079 2570136 65379 -1615405 -418026 1011924 -308324 -2987982
7892 -2987982 -3508187 -1061481 2299629 4716813 5483821 4351000 2078926 664697 1119558
7883 1119558 1964487 1568489 802477 1550725 3715580 5679765 6768355 7200243 6492374
7874 6492374 4198277 1659340 702678 895016 366629 -817776 -631726 1263282 2387897
7865 2387897 1021792 -1069434 -902702 1914924 4830815 5087568 2169179 -1672957 -2944960
7856 -2944960 -140321 3961907 4569544 389588 -4444456 -5255951 -2369686 156300 484220
7847 484220 904664 3258608 5197969 3281742 -1462836 -3901550 -1128888 3848466 6170775
7838 6170775 5254360 4692970 6701533 9281954 9550487 7570198 5297612 3401842 1311264
7829 1311264 -492349 -738232 79646 -216615 -2149714 -3342539 -1797225 1155665 2643698
7820 2643698 1837543 186740 -1041413 -1653266 -1408580 24994 1788754 2195266 951264
7811 951264 -321096 -424728 -169776 -746236 -1706719 -1802537 -939136 154805 1563273
7802 1563273 3666825 5113958 3432140 -1457088 -5978784 -6577388 -3668350 -507299
7794 -507299 1055912 1870832 2892622 3517396 3162939 2671963 2867302 2927472 1646753
7785 1646753 -408033 -1412010 -597916 1143204 2679933 3502886 3445883 2764605 2326472
7776 2326472 2566232 2536615 1300075 -177313 -287913 367195 -335565 -2359796 -3114486
7767 -3114486 -1475952 486399 1028851 1181857 1935093 1966190 762398 1036951 4354689
7758 4354689 6825452 3906115 -1932834 -3697711 178455 3886268 3172956 763868
7750 763868 692834 2180587 2399686 1368862 463965 -812110 -2946620 -3991725 -2632693
7741 -2632693 -1212651 -1986901 -2808775 -728550 2328508 2301552 -175135 -914024 654212
7732 654212 917117 -1186439 -2286655 -574387 1178025 349407 -1855546 -3280133 -3722968
7723 -3722968 -3247884 -1142363 1589374 2127525 179957 -951806 328934 1127749 -959336
7714 -959336 -3710373 -4297500 -4116264 -5702876 -7456485 -5872700 -1534065 1450709 1407006
7705 1407006 652051 1120433 1851027 1438350 338766 -213203 22282 288180 -171394
7696 -171394 -1157274 -1298763 364188 2352115 2016773 -484408 -1733585 147221 2682845
7687 2682845 2837778 1115874 -424769 -1735729 -3465702 -4324851 -3097048 -1547679 -1988993
7678 -1988993 -3509158 -3954784 -3936681 -5049943 -5699374 -3154609 1120058 2757758 867533
7669 867533 -1168594 -1232648 -564429 -140612 799296 2081181 2400905 2272991 3281708
7660 3281708 4174502 2140092 -1527063 -2018342 1481667 3928616 2051734 -1041197 -1588561
7651 -1588561 -929253 -2065520 -4254101 -4850672 -3725860 -2272671 -342392 2500091 4650176
7642 4650176 4476687 3011417 2085257 1611633 1036951 1286695 2710793 3329615 1854891
7633 1854891 257484 522790 1193948 295509 -667681 644946 2750901 2476026 427085
7624 427085 105870 2214207 3910318 3644739 2974408 3195102 3480403 3072899 2640992
7615 2640992 2727113 2927736 3056787 3369663 3507001 2835948 1773461 1358040 1865698 3045003
7605 3045003 4790387 6221940 5510241 2418892 -508875 -1325119 -1440635 -2611711 -3283148
7596 -3283148 -1208699 2054095 3078620 1769487 725996 433419 -689232 -2082221
7588 -2082221 -1387426 1030652 2261791 1790206 1926752 2881625 1993499 -1087026 -2908830
7579 -2908830 -1510292 774840 1468671 1159271 868570 -85894 -1726904 -2421633 -2058392
7570 -2058392 -2673963 -4196311 -3584824 -367727 1361975 -511043 -1946441 877329 4822857
7561 4822857 4326787 -56674 -2862171 -1880031 -95262 -136618 -1358408 -2467032 -3145049
7552 -3145049 -2751147 -702857 1528367 1686501 195761 -322106 881699 1747938 843229
7543 843229 -698925 -1118189 67921 2326629 4532960 5200883 3983064 2592283 2524262
7534 2524262 2648903 1196141 -843943 -1111979 6831 -54943 -1475090 -1531875 728792
7525 728792 2687575 2282228 1030136 1239799 2519752 2923458 1951339 753978 404264
7516 404264 1103400 2242164 2680860 1954846 1281663 1958294 2934999 2027229 -483361
7507 -483361 -2002514 -1683227 -1392670 -1847978 -1129598 1292288 2354079 -127957 -3404831
7498 -3404831 -3378149 -424010 1616988 1110296 78646 495918 2017078 3369637 3719257
7489 3719257 2724340 1123041 838427 2578948 4076153 2993632 733890 423499 1621980
7480 1621980 606020 -3639864 -7296229 -6929280 -3800562 -1179487 25451 793902 1305915
7471 1305915 1208351 1131399 1596443 1447646 -463637 -2930604 -3936384 -3849878 -4711719 -6590243
7461 -6590243 -7019615 -4402638 -69741 3494161 4873279 3842179 1002646 -1985242
7453 -1985242 -3252625 -2692272 -2075121 -2598178 -3423161 -3295076 -2363389 -1405128 -329040
7444 -329040 1239851 2581042 2494993 1090175 -213246 -437764 175887 1119932 2242203
7435 2242203 3117948 2851891 1298505 -87540 424430 2653673 4379209 3735922 1292576
7426 1292576 -721653 -982702 -218500 199083 29050 63081 760356 1641587 1932680 1372918
7416 1372918 436966 -42062 265730 537804 -437165 -2508982 -3943947 -3599613 -2492884
7407 -2492884 -2238715 -2756024 -2842833 -2305318 -1837500 -1286227 -8584 1252019 1025509
7398 1025509 -285137 -841368 -715629 -2025683 -4829622 -5922999 -3547415 -543833 -310308
7389 -310308 -1897591 -2077183 -469398 746093 990777 1536486 2173031 1320884 -402454
7380 -402454 -253100 2285662 4365747 4031985 2814499 2839903 3899066 4791118 5310627
7371 5310627 5398803 4324250 2181774 396005 -544844 -1901211 -3971295 -4894545 -3887970
7362 -3887970 -3257974 -4802684 -6346819 -4834228 -1342595 249915 -1237339 -3355772
7354 -3355772 -4239412 -4477223 -4493503 -3209723 -418895 1952234 2318428 1392388 466201
7345 466201 -619628 -2338687 -3572211 -2620968 208731 2417194 2016368 -203786 -1530748
7336 -1530748 -460867 1362442 1007780 -1874292 -4218638 -3438033 -943539 -122196 -1558450
7327 -1558450 -2457960 -835219 1945182 3479318 3280671 2401234 1621876 1205066 1268341
7318 1268341 1224682 -150745 -2886371 -4877438 -4052199 -942320 1965860 2908624 1915134
7309 1915134 -57032 -1766819 -1985038 -559331 1008028 1255628 738654 968864 1758864
7300 1758864 1476383 -1390 -784617 -203067 -331525 -2634731 -4895402 -3956691 -615909
7291 -615909 1055117 -599522 -2544304 -1493087 1727992 4021790 4444636 4447943 4685139
7282 4685139 4205994 2756338 1405158 346229 -1623886 -4383389 -5421333 -3248029
7274 -3248029 -132851 875491 486686 1890686 5313626 7106057 5162483 2239110
7266 2239110 1846468 3204759 3220877 2018774 2756687 5938489 7807295 6012106 3574628
7257 3574628 4334744 6722091 5859633 1022834 -3071092 -3029548 -1128711 -1160736 -2977442
7248 -2977442 -3730472 -2451011 -542863 994683 2020840 1745704 -396103 -2694690 -2709304
7239 -2709304 -855455 138148 -580892 -1154348 -743352 -957074 -2395380 -2745484 -260502
7230 -260502 3184110 4657780 4004579 3024726 2461417 2093382 2529301 4413916 6539736
7221 6539736 6988760 5783331 4542451 3931828 3255215 2232594 1486169 1462632 2168198
7212 2168198 3413938 4098769 2361870 -1790022 -5170350 -4942880 -2426591 -819662 -179701
7203 -179701 1990511 5635575 7580493 6661908 5544383 5972056 5878070 3531137 1345034
7194 1345034 2357802 5145772 5826133 3929211 2664033 3546349 4164895 2153483 -1205285
7185 -1205285 -2759419 -1300613 1652192 3804100 3718051 1372300 -1658875 -2983520 -1540826
7176 -1540826 1022168 2086472 1271528 805783 2224286 3989624 3715724 1841890 1026795
7167 1026795 1973008 2271244 318193 -1897995 -1713687 280418 1506959 1348915 1247090
7158 1247090 1624244 1523128 1086273 1556758 2614984 2540110 1516962 1826292 3782968
7149 3782968 4513022 2388122 -137692 -315258 694054 80704 -1987401 -3007718 -2304162
7140 -2304162 -1534930 -1480282 -1110144 67150 1165228 1819803 2825918 4256198 4724737
7131 4724737 3399126 1481031 828591 1864133 3349552 3615226 1826502 -1182662 -3130719
7122 -3130719 -2204351 824510 3028549 2312846 -424596 -2452261 -2208809 -738307 -118443
7113 -118443 -824654 -1271562 -280820 785229 -371960 -3356468 -4685203 -1837801 3464737
7104 3464737 7098908 6907119 4234381 1713229 582988 5422 -1625409 -4534816 -6637665
7095 -6637665 -5587944 -2006770 624380 52866 -2020243 -2363598 -212699 2449643 3671227
7086 3671227 3214943 2173035 2126706 3971703 6444166 6713408 3710270 -114286 -1769418
7077 -1769418 -1384587 -1194977 -1964996 -2604781 -2671575 -2876293 -3229264 -2834987 -1683866 -834648
7067 -834648 -690715 -726714 -912737 -1725005 -2716624 -2745822 -1727097 -659726 35348 716000
7057 716000 1271101 1297960 1314074 2154020 3442072 4252474 4659821 4809472 3514176 379785
7047 379785 -1679003 464439 4843630 6040521 2549900 -1381734 -2198268 -1266486 -994868
7038 -994868 -691596 1061539 3090650 3688947 3645708 4440139 5378562 5064114 3866029
7029 3866029 2573712 558992 -2324507 -4123679 -3709216 -3168144 -4324426 -5040421 -2500148
7020 -2500148 1658262 3429202 2321041 1047384 360806 -1287351 -3306269 -3007935 -685642
7011 -685642 -32474 -2091457 -3038028 -130313 3785366 4409060 1777499 -952031 -2276313
7002 -2276313 -2806407 -2451304 -443154 2147845 2685289 257124 -3070397 -4810760 -4626742
6993 -4626742 -3830345 -3272467 -2528209 -927312 1259954 2985392 3543572 3042627 1806358
6984 1806358 103824 -1232626 -920864 1249265 3776303 5113411 5115635 4088904 1819337
6975 1819337 -1061838 -2282452 -667063 1442254 1003360 -1306136 -2304295 -1395164 -1140039
6966 -1140039 -2613135 -3652321 -2665270 -1018541 -271984 129804 821563 838953 -144331
6957 -144331 -290132 1580891 3665873 3820724 2703725 2098206 1826782 766376 -489658
6948 -489658 -591096 -99444 -697222 -2290728 -3109826 -2319584 -657567 1075437 2409116
6939 2409116 2610605 1409196 -159238 -1081208 -1737343 -2472502 -2081184 189275 2352189
6930 2352189 2067038 514304 927743 3558019 5185922 3913284 1453482 -61495 -745136
6921 -745136 -1298112 -1209774 -150836 804569 898456 1032892 1953389 2575631 1678352 13496
6911 13496 -901556 -1099311 -1568395 -2042866 -1202610 1020978 2859429 2756609 1084538
6902 1084538 -436535 -420698 1139903 2878969 2946002 457276 -3536005 -6669077 -7120076
6893 -7120076 -4977791 -1883284 505878 1603069 1695972 1261894 834323 1030724 1884917
6884 1884917 2323992 1293169 -526558 -1201552 -14988 1679603 2461836 2435136 2280427
6875 2280427 2193175 2586458 4232737 6485647 6972037 4642302 1643133 360910 133927
6866 133927 -895200 -2147404 -1645606 299472 1517009 1643868 2309540 3766183 4393454
6857 4393454 3789602 3377355 3477792 2719990 1049568 434731 1598616 2684237 2198461
6848 2198461 848059 -407479 -1593669 -2254447 -1558232 -704718 -2089455 -4994345 -5607632
6839 -5607632 -2870360 -528387 -1167696 -2091247 -203467 2605756 2851672 1300997 1044282
6830 1044282 1830910 884179 -1886512 -3794451 -3746069 -2784167 -975521 2243167 5035040
6821 5035040 4575987 1632051 -11019 1034663 2461505 2657828 2685112 3190585 2952119
6812 2952119 1619314 733909 863873 627770 -403353 -816133 -465112 -1318440 -3685339
6803 -3685339 -4664170 -2358593 974749 2162611 1282571 402465 120948 -250953 -511445
6794 -511445 69212 1033168 1249204 569102 -316705 -932769 -932446 34168 1397673 1730184
6784 1730184 668964 -410065 -508054 -404451 -988968 -1743424 -2092963 -2743331 -4173412
6775 -4173412 -5015058 -3500464 192453 4053588 5917063 4602684 928047 -1787169
6767 -1787169 -283719 4362405 7101959 5134900 1668377 1359238 3944979 5201711
6759 5201711 3104568 129435 -364727 2221188 5755158 7434054 5953675 2887536
6751 2887536 1501672 3159936 5737345 6688620 6372242 6697774 7751722 7855311 6160781
6742 6160781 3236729 -201872 -3290358 -4567629 -3514933 -1823289 -1241102 -1055795 247731
6733 247731 1911726 2014120 845614 453630 1275305 1883512 1729920 1487631 1035071
6724 1035071 -105947 -712980 645349 2322726 1298570 -1772013 -3082382 -1786933
6716 -1786933 -1315929 -3204367 -4053805 -1249408 2214635 2208332 -163459 -743499 976512
6707 976512 1614109 -266168 -2046920 -1330324 746058 1609968 670248 -589771 -857134
6698 -857134 -317165 48565 96989 1047311 3662677 6153470 5552296 1791253 -1422167
6689 -1422167 -1125486 1151969 1962629 815019 78502 828466 1490606 770739 -399040
6680 -399040 -596321 92615 738048 1109452 1599538 2142951 1977300 554895 -1456389
6671 -1456389 -2343818 -1063345 1198085 2047270 770379 -842979 -1007670 72552 1521570
6662 1521570 3451923 5808851 6994784 5750593 3602259 3283953 5075643 6651796
6654 6651796 6338366 4650725 2769619 1377863 957645 1414800 1442652 41665 -1524818
6645 -1524818 -1302367 81248 153472 -1394627 -2235865 -1394114 -721677 -1428848 -2166458
6636 -2166458 -2051130 -2597393 -4570361 -5730980 -4326086 -2310781 -2033242 -1965825 580900
6627 580900 4238363 5342579 3957971 3531496 4650488 4061343 915800 -933331 779933
6618 779933 2480487 239244 -3778465 -4444113 -1089006 2482453 4157691 5266513 6419954
6609 6419954 5995122 3687760 1834729 1685491 1506461 156881 -437479 1239024 2914340
6600 2914340 1689598 -1160093 -1906822 20991 1604661 1278528 935632 2072945 3043661
6591 3043661 1888881 -274786 -675490 1617843 5219020 8303124 9465428 7862074
6583 7862074 4300212 1457453 1253005 2454756 2505711 1223477 823521 2476351 4831211
6574 4831211 6201799 6413206 6019981 5349644 4922586 5261689 5569215 4108251 778116
6565 778116 -2122387 -2710546 -1754078 -1027255 -854978 -611818 -255330 285481 1961228
6556 1961228 4878062 6831558 5861519 3436508 2485587 2822961 1636518 -1432704 -3236059
6547 -3236059 -2196226 -989877 -2079784 -3520497 -2139553 1207922 2915884 1945384
6539 1945384 475970 -183355 -840415 -1418628 -203116 2800353 4699484 3597982 1428775
6530 1428775 1156325 2960819 4967457 6114519 6307838 5118281 2578985 376812 75611
6521 75611 788463 625724 -306474 -637203 -676274 -1727632 -2770181 -1257915 2198493
6512 2198493 3512438 981951 -1867411 -1558016 280355 200052 -1297484 -1230964 297688
6503 297688 512485 -634165 -151714 2367029 3380299 1198213 -1042309 -559819 688923
6494 688923 -59580 -1319632 -186769 2185944 2474614 1134573 1594989 3834866 3774943
6485 3774943 68388 -3099858 -2099249 996735 2037466 660344 -521679 -512219 -499910
6476 -499910 -1034916 -1604049 -2403221 -3901415 -4977009 -3975513 -1638363 -721075 -2367726
6467 -2367726 -4748932 -5666094 -4777640 -2796806 -177406 2609500 4778559 6054337 6925847
6458 6925847 7502635 6972581 4815729 1891997 -271793 -908620 -442692 135927 214363
6449 214363 209293 1118355 2940579 3952612 2487869 -756662 -3286681 -3751110 -3233935
6440 -3233935 -3338065 -4029193 -4020464 -2709894 -1119628 -967114 -2854911 -5304444 -5962204
6431 -5962204 -4103411 -1395171 313478 1132170 2195909 3522280 4165279 3859701 3039765
6422 3039765 1805019 462855 378794 2197765 3758403 2373760 -857827 -1884650 628949
6413 628949 3387232 3313319 1489474 624721 1178323 2085525 3084823 3900836 3033184 116074
6403 116074 -1995011 -490828 2998485 4373976 2936353 1997966 3399171 4730304 3348309
6394 3348309 544485 -371970 1310125 3116667 2927625 1269300 -249528 -1402674 -3084693
6385 -3084693 -4971104 -4952381 -1833236 2330128 4201062 3290191 2322444 3135797 4177854
6376 4177854 3176703 645881 -851356 73975 2547372 4823814 5680619 5176167 4777179
6367 4777179 5665391 6457317 4530548 481220 -1426359 850970 3624009 2792360 77266
6358 77266 -86372 2078048 2480705 592880 477862 3544213 5664731 3839569 1161669
6349 1161669 1825488 4655378 5461293 3572321 2077433 2683254 3933426 4288350 3952896
6340 3952896 3357277 2211744 642258 -476737 -868382 -1241663 -1946753 -2347788 -1931665
6331 -1931665 -1157318 -789535 -994861 -1396579 -1542684 -1039276 396435 2569409 4467599
6322 4467599 4671886 2634695 -363507 -2149273 -1928664 -978669 -563019 -159145 1120416
6313 1120416 2327256 1747160 -213685 -1240493 -352157 958240 1193387 642136 175046
6304 175046 33983 476053 1832446 3133073 2532842 167103 -1242546 27607 2210798
6295 2210798 2728898 1807112 1442451 1903936 1539877 -239435 -1757907 -1185507 1292637
6286 1292637 3719747 4261361 2914619 1546317 1822669 3109278 3326542 1882089 317373
6277 317373 -258980 -596066 -1419714 -2024140 -1918458 -2028434 -2703095 -2243805 646717 4297832
6267 4297832 5935496 5020800 2934426 670220 -1043501 -726477 2030204 4626842 4208236
6258 4208236 1829959 990049 2413065 3578924 3471690 4025432 5805652 6005382 2984855
6249 2984855 -194128 230712 3166777 4393371 2815993 1606564 3065812 5495521
6241 5495521 6249994 5415760 4695821 4304221 3160224 1447539 743768 1467645 2154691
6232 2154691 1929269 1915424 2981629 3621479 1934016 -1202837 -3057457 -2782349 -1998742
6223 -1998742 -1546206 -103944 2963885 5458926 4700664 946789 -2860891 -4093938 -2415639
6214 -2415639 301186 1343223 -443619 -2935797 -2736005 364389 2629276 1260482
6206 1260482 -1813439 -2841325 -1348360 14052 -277890 -1073447 -1032210 -394932 67026
6197 67026 247889 399656 607121 764318 567286 -140239 -668329 -52763 1189235 1308638
6187 1308638 140088 -198620 1236353 2200501 776785 -1187124 -967527 425386 -113537
6178 -113537 -2667230 -4395986 -4107394 -3071142 -1620800 1125386 3989949 4275803 2357546
6169 2357546 1706122 3095163 2936389 -568862 -3634619 -2312809 1507440 3198227 2246961
6160 2246961 2046987 3977658 5588390 4782462 2684469 1499404 1574615 1560937 412186
6151 412186 -1401494 -2276825 -1157536 866232 1296863 -829777 -3539334 -4252299 -2684979
6142 -2684979 -456360 1342111 2866206 4243648 4886002 4230314 2575464 1138455 1270567
6133 1270567 3037798 4609570 4082883 1993002 607998 520207 -70819 -1900004 -2872540
6124 -2872540 -1583782 -446932 -2483360 -6266842 -7383182 -4750655 -2215145 -3020455
6116 -3020455 -5544480 -6215851 -4555856 -3053198 -3127400 -3627705 -3305937 -2710687 -2828828
6107 -2828828 -3252379 -2937247 -2091438 -1930591 -2611118 -2728700 -1374086 402195 1079393
6098 1079393 845061 1112160 2257322 3146402 2945163 2182333 1656454 1302940 711850
6089 711850 44327 -177821 228401 1074085 2161697 3324277 4263003 4566577 3929701
6080 3929701 2513039 1164100 904268 1944853 3577710 5117950 6212098 6133818 4171510
6071 4171510 1392415 409286 2082120 3943304 3553900 1872342 1131593 955993 -444868
6062 -444868 -2374836 -2572179 -1625170 -2509642 -5247117 -5970974 -2664518 1650602 3241145
6053 3241145 2193108 752306 -90886 -317016 312795 1059355 97051 -2410546 -3472572
6044 -3472572 -1538510 891166 1141997 169780 -111519 -449885 -1883330 -2353005 334045
6035 334045 4137981 5546700 5054588 5438743 6000632 3734377 -285410 -1290499 1675827
6026 1675827 3941512 2526019 353279 641684 1470678 -545183 -4335593 -5983200 -4383659
6017 -4383659 -1818468 1230 1294177 2093521 1601835 -33416 -1227342 -732183 1143692
6008 1143692 3215700 4614489 5384518 6269201 7512820 7828522 5649146 1786690 -582488
5999 -582488 464624 3187472 4465333 3389451 1383442 -159068 -803688 -375016 998656
5990 998656 2326591 2521915 1647441 537252 -355984 -738465 174682 2525566 4376785
5981 4376785 3257414 -503627 -3520592 -3106871 -161780 2363676 2829086 1822261 537215
5972 537215 -536440 -1438408 -2162278 -2453077 -1846049 -81094 2128168 3151716 2100349
5963 2100349 273860 -113618 1096599 1475431 -762733 -3981051 -4905352 -2709329 258307
5954 258307 1843884 2406755 3034102 3147205 1574423 -839772 -1675804 -81305 2143638
5945 2143638 3105651 3063766 3193472 3255594 2050480 -138304 -1277422 -400519 615038
5936 615038 -567736 -3172381 -3836529 -1034206 2630347 3628475 1824573 34871 -11527
5927 -11527 684634 766427 499944 615885 769617 301113 -486280 -832905 -555530 192791
5917 192791 1335605 2328374 2258606 1336900 1020155 1510345 659074 -2767508 -6068539
5908 -6068539 -5533717 -1859089 380687 -938310 -2719376 -1567579 1221574 1980074 186065
5899 186065 -1292917 -843614 3974 -230075 -572164 255174 1319504 1088907 275203
5890 275203 756725 2197045 2248377 413015 -783689 385906 1996628 1278783 -1237822
5881 -1237822 -2628895 -1806426 -533855 -425106 -1079541 -1436186 -1162290 -318411 813679
5872 813679 1270160 239510 -1428229 -2011866 -1291310 -511405 -39647 916271 2154810
5863 2154810 2392038 1703036 1507852 1562258 -49121 -2830448 -3155918 303677 3585803
5854 3585803 2756489 -374280 -1276470 584336 1975377 1660804 1744709 3272641 4292216
5845 4292216 3205945 1150487 -117888 -520874 -720605 -579619 300734 1536695 2287105
5836 2287105 2123947 1363856 899259 1391907 2239923 2114655 1005514 405548 636313
5827 636313 -145418 -2667788 -4213485 -2040996 2246344 4533883 3541053 1575896 573624
5818 573624 289600 288949 952305 2140747 2962388 3041177 2409435 672191 -1882264 -3293461
5808 -3293461 -2347936 -941686 -1401949 -2660649 -2241610 -797081 -778913 -1550916 -407945
5799 -407945 1888421 1683057 -1045150 -2132027 -557150 -818266 -5458064 -10262642 -10381909
5790 -10381909 -7033817 -4241353 -2512521 -149024 1968356 1683276 30161 -52603 1355780
5781 1355780 1505558 -124297 -968456 332775 1903124 1588714 -374617 -2376894 -3408138
5772 -3408138 -3349494 -2430074 -952868 837511 2589072 3524550 3055735 1851374 1162842
5763 1162842 976465 433076 220533 2208058 5904769 7826816 5855934 1992942 -752841
5754 -752841 -1865904 -1979599 -658380 1996620 3744598 2989041 1389342 997958 630192
5745 630192 -1799798 -4851135 -4966688 -1567981 2394769 4469507 4437838 2654203 -300763
5736 -300763 -2546321 -2326410 -488503 865758 1789642 3885032 6713032 7865961 6707723
5727 6707723 5140409 4333797 3440813 1976889 770447 -34271 -1325956 -2712090 -2405836
5718 -2405836 -233347 1724887 2409445 3173587 4716613 5171239 3028578 -47482 -1328168
5709 -1328168 -548264 476741 653506 332549 87343 369724 1751771 4029179 5536540
5700 5536540 4766077 2441311 730293 550763 945300 1165136 1853193 3398473 4363652
5691 4363652 3083120 460833 -576169 1047888 2811589 1986916 -471254 -1330399 295559
5682 295559 2013414 1863668 686588 269416 1197982 3134498 5118958 5070297 1607623
5673 1607623 -2736332 -3209093 651984 3473226 1354488 -2662117 -3768137 -2777350 -3664085
5664 -3664085 -6007893 -5569230 -1794834 857027 -146776 -2083603 -2102834 -1392358 -2114984
5655 -2114984 -3701332 -4598664 -5013207 -5580514 -5395711 -3490093 -703978 1529250 2807070
5646 2807070 3025880 1836062 38927 -384183 1022134 2308878 2218125 2041842 2844246
5637 2844246 3140595 1546964 -270786 -29744 1214467 571294 -1927710 -3189424 -1823412
5628 -1823412 -141368 -377333 -1297051 -474759 1414355 1055659 -2546743 -5742297 -4535407
5619 -4535407 -202310 1785530 -1189566 -5342713 -5560665 -2051010 604870 -100719 -2144207
5610 -2144207 -2835348 -2142632 -1387329 -1054274 -1066255 -1461905 -1753329 -990800 817832 2612387
5600 2612387 3842076 4536680 3871207 999760 -2307488 -2608251 562041 3584458 3699947
5591 3699947 2480792 2566908 3511473 3403469 2620440 3026132 4572225 5404084 4700972
5582 4700972 3104944 902689 -2000606 -4666704 -5721531 -5177248 -4000945 -2304864
$$ [...]
##END NTUPLES=NMR SPECTRUM
##END=
