##TITLE=31Pdec_SR50_h20
 D2O, 24 sc
 8.04.2021
##JCAMPDX= 6.0         $$ Bruker NMR JCAMP-DX V2.0
##DATA TYPE= NMR SPECTRUM
##DATA CLASS= NTUPLES
##ORIGIN= UXNMR, Bruker Analytische Messtechnik GmbH
##OWNER= root
$$ XWIN-NMR		Version 3.5
$$ Thu Apr  8 14:33:59 2021 Russian Standard Time (UT+4h)  she@DPX200
##.OBSERVE FREQUENCY= 81.013821
##.OBSERVE NUCLEUS= ^31P
##.ACQUISITION MODE= SIMULTANEOUS
##.ACQUISITION SCHEME= undefined
##.AVERAGES= 24
##.DIGITISER RES= 16
##SPECTROMETER/DATA SYSTEM= spect
##.PULSE SEQUENCE= zgpg30
##.SOLVENT NAME= D2O
##.SHIFT REFERENCE= (INTERNAL, D2O, 0, 248.564)
##AUDIT TRAIL= $$ (NUMBER, WHEN, WHO, WHERE, WHAT)
$$ ##TITLE= Audit trail, XWIN-NMR		Version 3.5
$$ ##JCAMPDX= 5.01
$$ ##ORIGIN= Bruker BioSpin GmbH
$$ ##OWNER= she
$$ F:/spectra/data/she/nmr/P31/1/pdata/1/auditp.txt
$$ ##AUDIT TRAIL=  $$ (NUMBER, WHEN, WHO, WHERE, WHAT)
(   1,<2021-04-08 14:32:51.15 +0400>,<she>,<DPX200>,
      <created by zg, POWCHK disabled, PULCHK disabled
       configuration hash MD5:
       00 E9 B6 7A A2 85 ED C7 34 08 36 98 17 FE 4E 26
       data hash MD5: 32K
       9F EB 71 E5 2E EA 75 18 EE 9D 9F 3C 57 2F 24 30>)
(   2,<2021-04-08 14:32:55.34 +0400>,<she>,<DPX200>,
      <Start of raw data processing
       efp BC_mod = 2 LB = 1 FT_mod = 6 PKNL = 1 PHC0 = -5281.532 PHC1 = 382.2021 SI = 64K 
       data hash MD5: 64K
       0B D2 E5 93 99 2B 92 95 C3 DE 2B AF 56 1C C5 88>)
(   3,<2021-04-08 14:33:29.23 +0400>,<she>,<DPX200>,
      <pk PHC0 = -200.798 PHC1 = 428.2 
       data hash MD5: 64K
       DA A9 95 9F C2 95 DF 3A 83 1D CA D9 F4 BA 1E 49>)
(   4,<2021-04-08 14:33:33.14 +0400>,<she>,<DPX200>,
      <abs ABSG = 5 
       data hash MD5: 64K
       73 C7 5F ED 46 E7 2A 26 17 30 46 3C 0B 77 9B 01>)
$$ ##END=
$$ 
$$ hash MD5
$$ AB 15 E0 69 F8 2F 5A CA 5C 26 3D 0F AC 2D 2B D2
##$RELAX= 
##$RELAX= 
##$RELAX= 
##$RELAX= 
##$RELAX= 
##$RELAX= 
##$RELAX= 
##$RELAX= 
$$ Bruker specific parameters
$$ --------------------------
##$DU= <F:/spectra>
##$EXPNO= 1
##$NAME= <P31>
##$PROCNO= 1
##$TYPE= <nmr>
##$USER= <she>
##$AMP= (0..31)
100 100 100 100 100 100 100 100 100 100 100 100 100 100 100 100 100 100 
100 100 100 100 100 100 100 100 100 100 100 100 100 100 
##$AQSEQ= 0
##$AQ_mod= 1
##$AUNM= <au_zg>
##$AUTOPOS= <>
##$BF1= 81.014009
##$BF2= 200.13
##$BF3= 200.13
##$BF4= 200.13
##$BF5= 200.13
##$BF6= 200.13
##$BF7= 200.13
##$BF8= 200.13
##$BYTORDA= 1
##$CFDGTYP= 0
##$CFRGTYP= 5
##$CHEMSTR= <none>
##$CNST= (0..31)
1 1 145 1 1 1 1 1 1 1 1 1 1 1 1 1 1 1 1 1 1 1 1 1 1 1 1 1 1 1 1 1 
##$CPDPRG= <waltz16>
##$CPDPRG1= <>
##$CPDPRG2= <waltz16>
##$CPDPRG3= <>
##$CPDPRG4= <mlev>
##$CPDPRG5= <mlev>
##$CPDPRG6= <mlev>
##$CPDPRG7= <mlev>
##$CPDPRG8= <mlev>
##$CPDPRGB= <>
##$CPDPRGT= <>
##$D= (0..31)
0 1 0 0 0 0 0 0 0 0 0 0.03 2e-05 3e-06 0 0 0 0 0 0 0 0 0 0 0 0 0 0 0 0 
0 0 
##$DATE= 1617877970
##$DBL= (0..7)
120 120 120 11 120 120 24 19 
##$DBP= (0..7)
150 150 150 150 150 150 150 150 
##$DBP07= 0
##$DBPNAM0= <>
##$DBPNAM1= <>
##$DBPNAM2= <>
$$ [...]
##$SUBNAM3= <"">
##$SUBNAM4= <"">
##$SUBNAM5= <"">
##$SUBNAM6= <"">
##$SUBNAM7= <"">
##$SUBNAM8= <"">
##$SUBNAM9= <"">
##$SW= 501.771253377433
##$SWIBOX= (0..15)
0 1 3 0 0 0 0 0 0 0 0 0 0 0 0 0 
##$SW_h= 40650.406504065
##$TD= 32768
##$TD0= 1
##$TE= 0
##$TE2= 300
##$TE3= 300
##$TEG= 300
##$TL= (0..7)
0 120 53 12 22 120 120 120 
##$TP= (0..7)
150 150 150 150 150 150 150 150 
##$TP07= 0
##$TPNAME0= <>
##$TPNAME1= <>
##$TPNAME2= <>
##$TPNAME3= <>
##$TPNAME4= <>
##$TPNAME5= <>
##$TPNAME6= <>
##$TPNAME7= <>
##$TPOAL= (0..7)
0.5 0.5 0.5 0.5 0.5 0.5 0.5 0.5 
##$TPOFFS= (0..7)
0 0 0 0 0 0 0 0 
##$TUNHIN= 0
##$TUNHOUT= 0
##$TUNXOUT= 0
##$USERA1= <user>
##$USERA2= <user>
##$USERA3= <user>
##$USERA4= <user>
##$USERA5= <user>
##$V9= 5
##$VALIST= <valist>
##$VCLIST= <CCCCCCCCCCCCCCC>
##$VD= 0
##$VDLIST= <DDDDDDDDDDDDDDD>
##$VPLIST= <PPPPPPPPPPPPPPP>
##$VTLIST= <TTTTTTTTTTTTTTT>
##$WBST= 1024
##$WBSW= 4
##$XGAIN= (0..3)
0 0 0 0 
##$XL= 0
##$YL= 0
##$YMAX_a= 4703
##$YMIN_a= -5015
##$ZGOPTNS= <>
##$ZL1= 120
##$ZL2= 120
##$ZL3= 120
##$ZL4= 120
##$ABSF1= 248.5645
##$ABSF2= -253.2056
##$ABSG= 5
##$ABSL= 3
##$ALPHA= 0
##$AQORDER= 0
##$ASSFAC= 0
##$ASSFACI= 0
##$ASSFACX= 0
##$ASSWID= 0
##$AUNMP= <proc_1d>
##$AZFE= 0.1
##$AZFW= 0.5
##$BCFW= 0
##$BC_mod= 2
##$BYTORDP= 0
##$COROFFS= 0
##$CY= -3
##$DATMOD= 1
##$DC= 0
##$DFILT= <>
##$DTYPP= 0
##$F1P= 0
##$F2P= 0
##$FCOR= 1
##$FTSIZE= 65536
##$FT_mod= 6
##$GAMMA= 0
##$GB= 0
##$INTBC= 1
##$INTSCL= 5.30512e-09
##$ISEN= 30
##$LB= 1
##$LEV0= 0
##$LPBIN= 0
##$MAXI= 10000
##$MC2= 0
##$MEAN= 0
##$ME_mod= 0
##$MI= 50
##$NCOEF= 0
##$NC_proc= -5
##$NLEV= 6
##$NOISF1= 182.463
##$NOISF2= 159.3651
##$NSP= 0
##$NTH_PI= 0
##$NZP= 0
##$OFFSET= 248.5645
##$PC= 4
##$PHC0= -5482.33
##$PHC1= 810.4021
##$PH_mod= 1
##$PKNL= yes
##$PPARMOD= 0
##$PSCAL= 0
##$PSIGN= 0
##$REVERSE= no
##$SF= 81.014009
##$SI= 65536
##$SIGF1= 159.3651
##$SIGF2= -187.1042
##$SINO= 113.3802
##$SIOLD= 16384
##$SREGLST= <1H.CDCl3>
##$SSB= 0
##$STSI= 65536
##$STSR= 0
##$SW_p= 40650.406504065
##$SYMM= 0
##$S_DEV= 0
##$TDeff= 32768
##$TDoff= 0
##$TI= <>
##$TILT= no
##$TM1= 0
##$TM2= 0
##$TOPLEV= 0
##$USERP1= <user>
##$USERP2= <user>
##$USERP3= <user>
##$USERP4= <user>
##$USERP5= <user>
##$WDW= 1
##$XDIM= 65536
##$YMAX_p= 304594391
##$YMIN_p= -17349623
$$ End of Bruker specific parameters
$$ ---------------------------------
##NTUPLES= NMR SPECTRUM
##VAR_NAME=  FREQUENCY,     SPECTRUM/REAL,   SPECTRUM/IMAG
##SYMBOL=    X,             R,               I
##VAR_TYPE=  INDEPENDENT,   DEPENDENT,       DEPENDENT
##VAR_FORM=  AFFN,          ASDF,            ASDF
##VAR_DIM=   65536,         65536,           65536
##UNITS=     HZ,            ARBITRARY UNITS, ARBITRARY UNITS
##FACTOR=    0.620285442955139, 1,           1
##FIRST=     20137.2065510759, 0,            0
##LAST=      -20513.1999529892, 0,           0
##MIN=       -20513.1999529892, -17349623,   0
##MAX=       20137.2065510759, 304594391,    0
$$ Real data points
##PAGE= N=1
##DATA TABLE= (X++(R..R)), XYDATA
$$ [...]
39119C140036j303583l68339l02452j395359j485154L65246J817129O72644j479653
39110c39485j506062M65679J364654P0336j053579k18254J038385O86253n25602
39101a7675o87747N9787K29587j85434P3451J022558J317238M97247n09556j058176
39091G41280j261395r17401K45414J259883P47522p20103r86519M88746J662262
39082A259689R28565n99076r47841q3797M47787j40532j086178j285888n27988
39073b035259L85020N21529j3014r7808P12715J197096K46062j091841r94213
39064a169713K13916N81917k31033o11555l5226J45471m66238m07428O98144J021547
39054b60198k09074j012125l6309R94549M61575r8301J060987K201671P95934
$$ plain form
39119 3140036 1836453 1468114 1165662 -229697 -1714851 -1349605 467524 1140168 -339485
39110 -339485 -1845547 -1379868 -15214 55122 -998457 -1216711 -178326 507927 -17675
39101 -17675 -705422 -645635 -416048 -601482 -528031 494527 1811765 2309012 1799456 741280
39091 741280 -520115 -1437516 -1192102 67781 815303 95200 -891319 -402573 1259689
39082 1259689 2188254 1589178 641337 557540 1005327 864795 -221383 -1507271 -2035259
39073 -2035259 -1650239 -1128710 -1141724 -1239532 -526817 670279 916341 -175500 -1169713
39064 -1169713 -955797 -373880 -604913 -1216468 -1251694 -1106223 -1572461 -1979889 -1281745 -260198
39054 -260198 -469272 -1481397 -1517706 -523157 -61582 -159883 901104 3102775 3898709
39045C898709j781415k065047n2814R38998k88258j318350m67051Q33941R17500
39036F16213K12094l89942r74856j346391o23741Q16131J147208n9420q93981
39027a496685j80407O37761J44151n26782L05697J874186K044419M97672j040539
39018B259473j314694p58267l70633n13225q19014o76406O6660O93726M42909
39009i89471k18947j06256P47035R55491L4998o68214j30142O53664K77958q87672
38999c31556j412352q65370Q1433R35187J545930J506373N62194o70451j314016
38990C7372j258278q89126l10968L90999O82363K45815l46324m15373j37895K3785
38980a977630K42367P99094J208877Q42343q225n69973o62629n11398m2340P09084
$$ plain form
39045 3898709 2117294 52247 -567 938431 650173 -668177 -1135228 -301287 616213
39036 616213 828307 438365 -536491 -1882882 -2506623 -1690492 -543284 -602704 -1496685
39027 -1496685 -1677092 -1039331 -895180 -1421962 -1116265 757921 2802340 3300012 2259473
39018 2259473 944779 186512 -184121 -697346 -1516360 -2192766 -2126106 -1432380 -989471
39009 -989471 -1208418 -1314674 -567639 387852 422850 -245364 -375506 278158 556116 -331556
38999 -331556 -1743908 -2609278 -2527845 -1592658 -46728 1459645 2021839 1351388 37372
38990 37372 -1220906 -2110032 -2421000 -2030001 -1347638 -1101823 -1448147 -1863520 -2001415 -1977630
38980 -1977630 -1735263 -936169 272708 1115051 1106826 536853 -125776 -637174 -679514 29570
38970B9570J054874N55919o3723k31K02487l88281j206883q64614M38577Q93780
38960F51475k14077j341377r10346N25578J241591O65008j89569k45235M22517
38951F05565Q85805N14374k90595n93046j89951K5532o25578j397448j015054
38942b080396M37300J477559J167617J98848k66931p3570R5579j55585n09878
38933B90543m70949k4432K48081j84251r08701p14290Q45546K396164K123914
38924C601625J41609j505688j388574k68110K99735j2363m10947m15204k71834
38915b29751k53333l10679k82743P5580R65675J869483J502198n86159k688993
38906F1278k548531l90928J102035M32384o28830J67155J979268K077746K2756
$$ plain form
38970 29570 1084444 1640363 1576640 1576409 1778896 1390615 183732 -680882 -242305 651475
38960 651475 437398 -903979 -1814325 -1288747 -47156 617852 428283 183048 605565
38951 605565 1491370 2005744 1715149 1122103 932152 957684 332106 -1065342 -2080396
38942 -2080396 -1643096 -165537 1002080 1200928 933997 860427 956006 800421 290543
38933 290543 -180406 -204838 43243 -141008 -1049709 -1763999 -918453 1477711 3601625
38924 3601625 3743234 2237546 848972 580862 880597 868234 457287 42083 -229751
38915 -229751 -483084 -793763 -1076506 -1000926 -35251 1834232 3336430 2750271 61278
38906 61278 -2487253 -2878181 -1776146 -1343762 -1972592 -1805437 173831 2251577 2274333
38897B274333j670205j281562m2134L73563M06952J079307J590334N96212j133657
38888B193143j631382q15946l84568p69332n88931N47456J078216J78456p22868
38879i15756l07644N85075O62151L19900N17021Q45002M03642m44094q16156q77908
38869b8767j080751q22556L53019J156911K28590j292131j163484L90026R93441
38860a265702j9562p15174l6023M98598k63319q58265L11644K053027K050820
38851A756044L56048r11376p95246m15871o86317r41684l48786O65258J157386
38842a64544J015825Q04241P17454M09452k60198q98342j127189j047007q78737
38833a429045m74593L17081R65552O88920k56863n70869K74537J043028M72891
$$ plain form
38897 2274333 604128 -677434 -719568 -346005 60947 1140254 2730588 3326800 2193143
38888 2193143 561761 -254185 -638753 -1408085 -1997016 -1449560 -371344 -192888 -915756
38879 -915756 -1223400 -638325 23826 343726 860747 1705749 2109391 1665297 849141 -28767
38869 -28767 -1109518 -1932074 -1579055 -422144 -193554 -1485685 -2649169 -2259143 -1265702
38860 -1265702 -1285264 -2000438 -2036461 -1537863 -1801182 -2659447 -2347803 -294776 1756044
38851 1756044 2112092 1200716 405470 -10401 -696718 -1638402 -1987188 -1321930 -164544
38842 -164544 851281 1655522 2372976 2782428 2522230 1623888 496699 -550308 -1429045
38833 -1429045 -1903638 -1586557 -621005 67915 -188948 -759817 -485280 557748 1030639
38824A030639o99679p56964L41796Q95680J57043n38694M0131J118517J200880
38815B789349K32306o58070q89225p69745n17492l0942M73321M85089p8561p57174
38805B78856j119580j024056n07940J15467L15615J7487r7806M29574R14579L93276
38795b84528q06790j323307o19343L75404P37645P34205J000974J307251R55480
38786B076991M7550m78812j02150N92284O74408j0866o97370n61424L54659J075152
38776B970422O59333o56922j498835q46232O34417J232300K66840j010498r95685
38767G55140J81459Q53191Q4500j028004q21227O36847J512567N46796j278010
38758A443259j939045q89285L73212L42117o36807j081724m39112M33452P37125
$$ plain form
38824 1030639 330960 -426004 -84208 811472 968515 429821 469952 1588469 2789349
38815 2789349 3021655 2363585 1474360 704615 187123 156181 629502 1114591 1036030 278856
38805 278856 -840724 -1864780 -2372720 -2257253 -1941638 -1924151 -2021957 -1592383 -677804 -284528
38795 -284528 -1091318 -2414625 -3033968 -2658564 -1920919 -1186714 -185740 1121511 2076991
38786 2076991 2124541 1645729 1543579 2135863 2810271 2799405 2102035 1540611 1895270 2970422
38776 2970422 3629755 2972833 1473998 627766 1262183 2494483 2761323 1750825 755140
38767 755140 936599 1789790 1874290 846286 25059 661906 2174473 2721269 1443259
38758 1443259 -495786 -1385071 -1011859 -669742 -1306549 -2388273 -2827385 -2393933 -1656808
38749a656808P22372R11089J161500J066144O68394J92835l86103q93632p04392
38740A081399K50380Q40445J36573j045686j206855l82888R1036j79778k32748
38731f48122L53135P65885N02334P2571k29811p10162j028232l28272Q40665P29945
38721C19936o56820j041412M36465J381103j06083k082136j689302M14823J456054
38712a567372R53887N68906N66173j52085j024135l83640J042150P64465j041996
38703b73647j423635L08993J239489q1931j030612M61896K140756J199911r87989
38694A553231j282016J28483N98599k94526n45373L32406N58310m97909j079387
38685e28182J6037J481904J443214j37274j728854j903263m13292J511145J928534
$$ plain form
38749 -1656808 -934436 -23347 1138153 2204297 2872691 3065526 2679423 1785791 1081399
38740 1081399 1331779 2172224 2308797 1263111 56256 -326632 -235596 -415374 -648122
38731 -648122 -294987 470898 973232 1045803 815992 105830 -922402 -1250674 -410009 319936
38721 319936 -336884 -1378296 -941831 439272 333189 -1748947 -3438249 -3023426 -1567372
38712 -1567372 -613485 -44579 521594 369509 -654626 -1038266 3884 768349 -273647
38703 -273647 -1697282 -1388289 -148800 -230731 -1261343 -799447 1341309 2541220 1553231
38694 1553231 271215 399698 998297 703771 158398 490804 1049114 551205 -528182
38685 -528182 -512145 969759 2412973 2275699 546845 -1356418 -1769710 -258565 1669969
38676A669969J80457k013873k417262r26397P13348J392335J437249J229694O41865
38667A907385p0981k74300p6181k00657o13851n52683m4007K973m99030m60423
38657h81755N09939J218774O41606n42803j039112o89032k24510R1249N95748
38648c19896J268403J494727R00875m7457n23267l28325j74710p03032j350065
38639B17253q97189N92516J315405L2163j938029k255630o61937Q57150R04299
38630a833999J93987k1875L36588O49266O73129M12955k42617j018240j058149
38621a908955P204J271577J523398O79555l45284r05718j106630j127782p48790
38612b661425J70625J087085J115254J02601r34795q52398K08733R57443O17385
$$ plain form
38676 1669969 1850426 -163447 -2580709 -3507106 -2793758 -1401423 35826 1265520 1907385
38667 1907385 1836404 1562104 1485923 1285266 671415 118732 74725 77698 -421332 -881755
38657 -881755 -371816 846958 1488564 945761 -93351 -782383 -1006893 -915644 -319896
38648 -319896 948507 2443234 3344109 3296652 2773385 2445060 2270350 1567318 217253
38639 217253 -679936 -87420 1227985 1260148 -677881 -2933511 -3595448 -2738298 -1833999
38630 -1833999 -1640012 -1661887 -1325299 -676033 -2904 410051 167434 -850806 -1908955
38621 -1908955 -1901751 -630174 893224 1572779 1227495 321777 -784853 -1912635 -2661425
38612 -2661425 -2490800 -1403715 -288461 -185860 -1120655 -1973053 -1764320 -806877 -189492
38603a89492j38797k46270L48011Q52078P36445J26451n30616p07984j45275N93041
38593F97592M76182n52864j200934n57921N82410R70761O15821K15313k05636
38584A040724p60447p00432L76684J045708k10140k194039k181765N1849J720860
38575a810998J056336l90290m61032N42397R04411K12070m56074k66137O01691
38566f7626J428864J495972O67086j81439l3793P57925Q32387j12403q63217o51089
38556C272667j54050l895K05850O46553M89171n64092j329621q63317N8510L14885
38546B072661J32295J94339K01576l17933p50703l76689K25442J60702j52538
38537A389152K00547Q08985M61701q40722j773960j459309k94878Q03533J161935
$$ plain form
38603 -189492 -328289 -574559 -226548 625530 1361975 1488426 957810 249826 104551 697592
38593 697592 1173774 620910 -580024 -1137945 -555535 415226 1031047 1246360 1040724
38584 1040724 280277 -420155 -43471 1002237 792097 -1401942 -3583707 -3531858 -1810998
38575 -1810998 -754662 -1144952 -1605984 -1063587 -159176 52894 -403180 -669317 -67626
38566 -67626 1361238 2857210 3524296 3342857 3309064 4066989 4899376 4786973 3923756 3272667
38556 3272667 3118617 3114722 3320572 3967125 4456296 3892204 2562583 1699266 1757776 2072661
38546 2072661 2204956 2399295 2600871 2282938 1532235 1155546 1380988 1541690 1389152
38537 1389152 1589699 2398684 2860385 2019663 245703 -1213606 -1508484 -704951 456984
38528D56984O39696j71319m47362k48046l64649p37177l29082Q29249J159418
38519G87712J25828n56037K20156Q54659j55622j227112j96687J685131J425059
38510B963087r41471k497285j917246n73786O13458K035531K935801J647638r61443
38501C304284j688512K06547J623348M73753j267161j233048l62784n25491j057651
38492e26715m47009N71026M71195j10757K54262P94501j17653j596019j309382
38483b016551N43569J352277J94364j006309p91785l1145K41573N00542J168617
38474A55152J315065K29763j058326j108296l7201Q58896Q22650J56594n06915
38465H27382p80159n96818j21133M71989J081557J380612Q48578l78209j175174
$$ plain form
38528 456984 1096680 925361 477999 229953 -134696 -871873 -1200955 -371706 787712
38519 787712 913540 357503 577659 1432318 1276696 49584 -147103 1538028 2963087
38510 2963087 2021616 -475669 -2392915 -2966701 -2353243 -317712 2618089 4265727 3304284
38501 3304284 1615772 1822319 3445667 3919420 2652259 1419211 1056427 530936 -526715
38492 -526715 -973724 -402698 68497 -42260 212002 1006503 888850 -707169 -2016551
38483 -2016551 -1472982 -120705 73659 -932650 -1724435 -1755580 -1514007 -1013465 155152
38474 155152 1470217 1699980 641654 -466642 -503843 355053 1177703 1334297 827382
38465 827382 47223 -549595 -670728 -198739 882818 2263430 3112008 2733799 1558625
38456A558625p38152K10765M48025J3509j88739j16497m78593j098014r74319
38447a363390q3295M40376K03507J26388O97109J141043R00590N21046L89934
38438B973308j5322q18388j026257j08764Q50591O26942m42810j144246r33744
38429c8690p3943Q44702R22558l32043j711729j251746P46806J497997k28045
38420C75867j913259j021011J074815J448691K86994N7826J018511J027211l79925
38411A975720j172907n11692k9131n85836p53545K38477Q17453j06175j058339
38402a185975n01739O90480J059342R26368J059406Q00178m08105j245623m91701
38393G02631N98327K00428r56604q13723N29969J050771Q2978r44274q96320q6130
$$ plain form
38456 1558625 820473 1031238 1479263 1492772 1304033 1187536 708943 -389071 -1363390
38447 -1363390 -1446685 -1006309 -802802 -676414 20695 1161738 2062328 2583374 2973308
38438 2973308 2957986 2139598 1113341 1004577 1855168 2482110 2039300 895054 -38690
38429 -38690 -112633 732069 1654627 1322584 -389145 -1640891 -894085 603912 375867
38420 375867 -1537392 -2558403 -1483588 -34897 252097 309923 1328434 2355645 1975720
38411 1975720 802813 291121 261990 -323846 -1077391 -838914 -21461 -127636 -1185975
38402 -1185975 -1687714 -997234 62108 988476 2047882 2848060 2439955 1194332 702631
38393 702631 1300958 1501386 544782 -268941 261028 1311799 1394777 450503 -445817 -531947
38383e31947Q15136J310116Q30429m30398r80325K3986J117830P29124k4436P86186
38373C645701K182989J512438j047121k517291j730677o07432m33617k35538L81731
38364A151183J84319p60578m54290J289170J813040J03151j104355M5977J202342
38355C469959L0807j425251l01616J745692J023828k016448l467457k054396l67254
38346c362136j54207k68752L01048Q04777Q28170J072625J355476N22672j019274
38337H0399j326642j54417M56937l62639r12721m4865Q81399N64657k5025L54403
38327d88514R53907N39237l78502n40660l305L06206J42014j90412n99105q08551
38317a067685j98963J007099J486592O88140j92308o5453M77326N06883L39033
$$ plain form
38383 -531947 283189 1593305 2423734 1993336 1013011 1036997 2154827 2883951 2859515 3645701
38373 3645701 5828690 7341128 6294007 3776716 2046039 1438607 1004990 769452 1151183
38364 1151183 1335502 574924 120634 1409804 3222844 3325995 2221640 2267617 3469959
38355 3469959 3500766 2075515 1773899 3519591 4543419 2526971 -940486 -2994882 -3362136
38346 -3362136 -3516343 -3785095 -3484047 -2679270 -1851100 -778475 577001 1099673 80399
38337 80399 -1246243 -1400660 -943723 -1306362 -2219083 -2263948 -1382549 -817892 -842917 -488514
38327 -488514 465393 1004630 626128 85468 82163 388369 530383 339971 -259134 -1067685
38317 -1067685 -1266648 -259549 1227043 1915183 1722875 1657422 2134748 2641631 2980664
38308B980664M93341L53971o08617j359430p10197N79695P67391l37014j319890
38299H39914j268601n47783K22464P01426N80045r0026n47979k29496L37416L77088
38289C74468M7097j23737k65210n77061m89236L43303R69905M82717l05324j20208
38279C36714N28390K48241o05419m01339P88112J042229j87335j021470j96146
38270E31977R11173N72919o56687j101540m98634J66655M51079N80068M21271
38261A378281k32999p51346l43790N70818Q41192K49804l90593o37524p73896
38252i0053q33630m60781J63384L99867L24486O33238J134730P11980o71211j390489
38242g8479n36081N23072K82788m63892j26159P78210N06471o53090o63166O39010
$$ plain form
38308 2980664 3474005 3827976 3219359 1859929 1149732 1729427 2496818 2159804 839914
38299 839914 -428687 -976470 -754006 -52580 527465 437439 -110540 -340036 -2620 374468
38289 374468 421565 297828 32618 -544443 -1033679 -690376 279529 762246 456922 336714
38279 336714 865104 1113345 507926 106587 894699 1936928 1749593 728123 531977
38270 531977 1443150 2016069 1359382 257842 -240792 -74137 376942 957010 1378281
38261 1378281 1145282 393936 50146 620964 1462156 1711960 1321367 683843 -90053
38252 -90053 -923683 -1384464 -1221080 -821213 -496727 136511 1271241 1983221 1312010 -78479
38242 -78479 -614560 -91488 191300 -272592 -398751 379459 885930 232840 -430326 208684
38232B08684J057094q0985n33151Q39772J612197j93525k196068j104950J735711
38223A344779K220615j0679j284211k00215K89720j585414l039870j353849J515637
38214b103487K081061O51513J23436J017553J186162j82268j408231j200993j92485
38205b7739O14831R17457N12189n54405j190249l53677J042121J070921l29838
38196A701611j247770p11115J78545M05580M36852P56545P17815j40920r48486
38187A148657p21105J96676P89895P38332M11656J31924L0395J24905J48761k01370
38177B798726o72108p23585m48635m31935o36984l88188L68095Q03633N17294
38168A186313J35939K36275N68914P33829P64906O82270L11032j36025j76144
$$ plain form
38232 208684 1265778 1184793 651642 1491414 3103611 2910086 714018 -390932 1344779
38223 1344779 3565394 3554715 2270504 2070289 2360009 774595 -2265275 -3619124 -2103487
38214 -2103487 -22426 629087 752523 1770076 2956238 2773970 1365739 164746 -27739
38205 -27739 587092 1504549 2016738 1462333 272084 -81593 960528 2031449 1701611
38196 1701611 453841 -257274 -78729 326851 763703 1520248 2238063 2097143 1148657
38187 1148657 427552 624228 1414123 2152455 2564111 2696035 2726430 2851335 3000096 2798726
38177 2798726 2126618 1403033 954398 522463 -114521 -502709 -134614 669019 1186313
38168 1186313 1322252 1558527 2127441 2861270 3626176 4308446 4619478 4483453 4307309
38159D307309k6498m53022j327943j474382m57975O04685O94398K52850R0982
38150B210404j8304o18592j258361j060023j35667N80674O36949L79860K13240
38141I30180K49926M88303P21545M77759l98230j284601j387621o76343J45036
38132g34046M54945K41541l8663L8123L95498N41384K90918Q0395J50493m8460
38122A372128q25704j187573q2536J603037J856595L69180j088929j342506j072924
38113c99232r33714l69383P50867J196372L80934l29439K02151Q81881K50033
38104A630470r55668j000657N9789P24682M85455R1278q1530k14193r5966M01947
38094A045607M78670l64826r91081l25124M80795k10090j398122p83857J158546
$$ plain form
38159 4307309 4280811 3827789 2499846 1025464 567489 1172174 1866572 2119422 2210404
38150 2210404 2192100 1573508 315147 -744876 -880543 -299869 337080 716940 930180
38141 930180 1180106 1668409 2389954 2867713 2469483 1184882 -202739 -879082 -734046
38132 -734046 -279101 -37560 -76223 -38100 357398 898782 1189700 1270095 1420588 1372128
38122 1372128 546424 -641149 -723685 879352 2735947 3105127 2016198 673692 -399232
38113 -399232 -1332946 -1702329 -951462 244910 625844 296405 498556 1380437 1630470
38104 1630470 674802 -325855 -266066 458616 944071 1035349 953819 739626 643660 1045607
38094 1045607 1524277 1159451 168370 -156754 324041 113951 -1284171 -2068028 -909482
38085i09482J538544k64152j466656l79947J015580N90435n24821k12052J020886
38076D08335J154043L5451p54667o46829n16800p52389p64692l23970J29479M46139
38066a585900P94683Q79565K93036n16008p21373l89903k25949k81200l9688L87906
38056a404831L39131j64292l94321j85800j22139l14149j04773O81522J189040
38047d80612P17592k85006q79045p08437o0510O08244Q57724M69065j68371k72916
38037b02272L81520J052733Q85354o0443r26865j054771n94479j31003R0074L18707
38027b41445O07776L77545p12691j658355r47140J161787K374955J249075p08770
38018A502737j113804m8052L71090o34427j527997j069267k7139M12437L72713
$$ plain form
38085 -909482 629062 364910 -1101746 -1481693 -466113 124322 -400499 -612551 408335
38076 408335 1562378 1597829 843162 196333 -320467 -1072856 -1837548 -2161518 -2032039 -1585900
38066 -1585900 -791217 88348 381384 -134624 -855997 -1245900 -1471849 -1753049 -1792737 -1404831
38056 -1404831 -1065700 -1229992 -1624313 -1810113 -1932252 -2246401 -2351174 -1669652 -480612
38047 -480612 236980 -48026 -927071 -1635508 -1696018 -1087774 -230050 239015 70644 -202272
38037 -202272 179248 1231981 2117335 2056892 1130027 75256 -519223 -650226 -560152 -241445
38027 -241445 366331 743876 31185 -1627170 -2574310 -1412523 962432 2211507 1502737
38018 1502737 388933 340881 711971 77544 -1450453 -2519720 -2546859 -2134422 -1761709
38009a761709M66323N24744K28629L2325L87042P91337N85904L7577k43620k96782
37999G51770l64954j77450L99245P03216K53055l15858l10507k02223o10001q79762
37989g53469j56437P97789N88531m06358m80192O51196J437303J024930L39643
37980C042936J71200m2688p68994j277942r11914j91564K14404M86931Q24448
37971A546817P56585J36624k76463r0088m2238o04813r68687m56122J74381K6614
37961B02610l51668M358P53836R27750N72379L24880L4030p25319j315272p37874
37951c10290O54597J517396J276946L35767r44306k084359j957384j57745J525651
37942a43727R58156j139757j871364k37354J513366J194655n13279j491409r42083
$$ plain form
38009 -1761709 -1295386 -770642 -542013 -509688 -122646 668691 1254595 1292172 1048552 751770
37999 751770 386816 209366 608611 1311827 1564882 1249024 938517 736294 126293 -753469
37989 -753469 -909906 -112117 476414 70056 -410136 241060 1678363 2703293 3042936
37980 3042936 3214136 3171448 2402454 1124512 212598 21034 235438 722369 1546817
37971 1546817 2303402 2440026 2163563 2073475 2031237 1426424 457737 1615 175996 202610
37961 202610 -149058 -144700 609136 1536886 2109265 2434145 2468175 1742856 427584 -310290
37951 -310290 344307 1861703 3138649 3474416 2530110 445751 -1511633 -1669378 -143727
37942 -143727 814429 -325328 -2196692 -2434046 -920680 273975 -239304 -1730713 -2672796
37933b672796K86808J067590Q32574j27886o61496J01839J300692J152073m55418
37924H23980j547529q60336L64174L56856o07775q72917J25754J275778J373518
37915D31503M08359o29044p58257K0436O83807M81512L5037L25189R01225M72074
37905B371841p52473j055096K9633Q16075K29322l69793M61616J648528J236311
37896D615964m06384j098187j62345P20967J48547j114994j464159o23847K60001
37887H75563K71224k03167k06958L22604M56995j67477n73881l3621M67057k39708
37877I68631j253815q74636L29935K46164r59676p39997J340547K256371L43029
37868A656553j639979p80240J335966J416081j75331n15504P02666R78230m26708
$$ plain form
37933 -2672796 -2385988 -1318398 -485824 -613710 -1275206 -1173367 127325 1279398 823980
37924 823980 -723549 -1583885 -1219711 -862855 -1470630 -2343547 -2217793 -942015 431503
37915 431503 839862 210818 -547439 -527003 156804 638316 673353 998542 1899767 2371841
37905 2371841 1619368 564272 593905 1409980 1639302 1269509 1731125 3379653 4615964
37896 4615964 4209580 3111393 2949048 3670015 3818562 2703568 1239409 615562 875563
37887 875563 1146787 943620 736662 1059266 1516261 1348784 774903 741282 1208339 968631
37877 968631 -285184 -1159820 -829885 -583721 -1543397 -2283394 -942847 1313524 1656553
37868 1656553 16574 -763666 572300 1988381 1813050 1297546 2000212 2978442 2551734
37859B551734j429681r27664l45179o69502q44455j33741M00901k4722m08115
37850a830424K38554J182158J188764K36461q19896j276154p90326L94471J198423
37841b77969P77911j44661k77014J57717l6254o56993l45074P84685J047260P9057
37831A108665n32393j19920J516p38572q79736K79139R98330l820j092549l19867
37821a299207J231823J150442m37409j230714m01877N28400M22284J8570K72182
37812B54494Q23662Q19766K32463l28181n88119q40749j293269j500163p87533
37803c207629O05664J341147O23652m25929j47290J176340J653721O25942m95109
37794A750509o10026l97262o23490o77416O6246Q33051P01091J43775N1504J93237
$$ plain form
37859 2551734 1122053 194389 -150790 -820292 -1664747 -1798488 -1397587 -1422309 -1830424
37850 -1830424 -1591870 -409712 779052 1015513 195617 -1080537 -1870863 -1476392 -277969
37841 -277969 499942 355281 78267 235984 199730 -457263 -802337 -17652 1029608 1108665
37831 1108665 576272 456352 457868 -280704 -1160440 -881301 117029 113209 -979340 -1299207
37821 -1299207 -67384 1083058 645649 -585065 -986942 -458542 -36258 -17688 254494
37812 254494 1078156 1897922 2130385 1802204 1214085 373336 -919933 -2420096 -3207629
37803 -3207629 -2601965 -1260818 -637166 -1063095 -1210385 -34045 1619676 2245618 1750509
37794 1750509 1140483 743221 119731 -557685 -491439 341612 1042703 1186478 1237982 1431219
37784A431219q3588m73926k94473K31524L84240O3357l80364p36648o44502L26086
37774a77075J527905J373227l90823j835780j478051l74153j11340j52332Q06863
37765h11559J977222J427276n80608j624621o10300Q47971R47205r5919r06106
37756E70561p16516K30478J079433Q77711m49351j565119j073539N71834J462336
37747I87828O07210r86159j696569r52042N49527J561649J220222j15226j030346
37738A46094o15496M02078O88943Q1391m35983k13826M00342P13187L98105k25691
37728A339144k93747O73061J670826J058686r73335k124348j138291K19462j68018
37719B63440j454567j201319P84091K188606J522404k45935j405221j244883o9827
$$ plain form
37784 1431219 1347631 873705 579232 810756 1194996 1258353 877989 141341 -503161 -177075
37774 -177075 1350830 2724057 2333234 497454 -980597 -1354750 -1466090 -1618422 -811559
37765 -811559 1165663 2592939 2012331 387710 -222590 625381 1572586 1476667 570561
37756 570561 -145955 84523 1163956 2041667 1592316 27197 -1046342 -474508 987828
37747 987828 1595038 608879 -1087690 -2039732 -1490205 71444 1291666 1176440 146094
37738 146094 -469402 -67324 621619 703010 267027 53201 453543 1166730 1564835 1339144
37728 1339144 1045397 1718458 3389284 4447970 3474635 1350287 211996 431458 263440
37719 263440 -1191127 -2392446 -1608355 580251 2102655 1856720 451499 -793384 -863211
37710h63211J143922J193771m4980j076013o85379K86162M16153j5883K5705J38674
37700E18921n41371j079772r1689J312948R11247o72635p08717Q94985J246824
37691A790741m57808j338159K37282J779475R42818n97557l26060P64607K65158
37682C060497j203406j141280M06341J003914n8760r26914m98156J68849J44505
37673I55590m0685N0854j00642n63313m06482O14919J275251O73390l61826n92821
37663A504235j58173l8036l99031n32421j68582J09397j55007o15829o99331l68828
37653a521606L7848L73251O15988N16763l3457m13012P1749Q40368M60593j118198
37643a69713j987793q62337R27284J332743M64950p9275N6109p3328n15601l33296
$$ plain form
37710 -863211 280711 1474482 1429502 353489 -331890 -45728 370425 354542 380247 518921
37700 518921 -22450 -1102222 -1193911 119037 1030284 357649 -351068 543917 1790741
37691 1790741 1332933 -5226 232056 2011531 2954349 2356792 2030732 2795339 3060497
37682 3060497 1857091 715811 1122152 2126066 2067306 1140392 642236 811085 955590
37673 955590 914905 965759 865117 301804 -104678 510241 1785492 2458882 2097056 1504235
37663 1504235 1346062 1308026 908995 376574 207992 317389 162382 -453447 -1152778 -1521606
37653 -1521606 -1483758 -1110507 -494519 22244 -11213 -424225 -352476 487892 948485 -169713
37643 -169713 -2157506 -3019843 -2092559 -759816 -294866 -374141 -318032 -391360 -906961 -1240257
37633a240257L80749N29365J29691K54710P18019J88209j027487r29259O92671
37624c03589J446997K25181q17698J23740J457188R61127n57242q87232k2532
37615A625940M40368K32017K11846K46247k90933p45511k39253L27118l11292
37606A496547j194333n34164R67463J007329m33818j003646J20377J085785O15885
37597B127425k41446l98883l58320n76231l77730L59018L88681p41882j424439
37588a243807l17637J416699J696583L70079r10238j022569l58456J93118K74902
37579I8674J31598J64842M11361M56262J20114p9706K27310M06114j89199p93926
37569I53444k32145Q69651O27587j110580k154859j045448Q98700J575763P81205
$$ plain form
37633 -1240257 -859508 -330143 -200452 54258 772277 960486 -67001 -996260 -303589
37624 -303589 1143408 1368589 550891 674631 2131819 3092946 2535704 1648472 1625940
37615 1625940 2066308 2298325 2510171 2756418 2465485 1719974 1480721 1807839 1496547
37606 1496547 302214 -231950 735513 1742842 1309024 305378 425755 1511540 2127425
37597 2127425 1885979 1487096 1128776 552545 174815 533833 922514 180632 -1243807
37588 -1243807 -1561444 -144745 1551838 1921917 1011679 -10890 -369346 -176228 98674
37579 98674 230272 395114 806475 1262737 1382851 1303145 1530455 1936569 1747370 953444
37569 953444 721299 1590950 2218537 1107957 -1046902 -2092350 -1193650 382113 1163318
37560A163318k02404n70775l88258J32469O15735L98093o16650j464741j265632
37551b198845l67709L14389N55411P33081R88290J119382R33629K90385p07047
37542A660966j300732o45287Q22055J488979O06931o93430j080410p35374n37207
37533d13509m91312r5426M33132M92209K07982J33291K20137J29771J69464P72254
37523A557993J333372Q42149l71596q30153j02554M23873m29907j817252j977394
37514a371469o29469P25324Q20408N8834l91380k35152n8338l9769L14491R50274
37504A43754Q65697l05517j198419m01743J296270J789791O15504n41871m96357
37495A767109o6569l07506p81266o36852j94943k15430m56468k03600L94863O85442
$$ plain form
37560 1163318 960914 390139 1881 134350 750085 1148178 531528 -933213 -2198845
37551 -2198845 -2566554 -2252165 -1696754 -963673 24617 1143999 2077628 2368013 1660966
37542 1660966 360234 -285053 537002 2025981 2632912 1939482 859072 123698 -413509
37533 -413509 -904821 -1000247 -567115 -74906 133076 266367 486504 616275 785739 1557993
37523 1557993 2891365 3733514 3361918 2531765 2429211 2853084 2423177 605925 -1371469
37514 -1371469 -2000938 -1275614 -455206 -396372 -787752 -1022904 -1081242 -1121011 -806520 143754
37504 143754 1009451 703934 -494485 -896228 400042 2189833 2805337 2263466 1767109
37495 1767109 1700540 1393034 611768 -25084 -220027 -435457 -891925 -1095525 -700662 -15220
37485a5220O95276Q50919R47076N06177j53306k73884J36762M12897L05227L9284
37475C451208m05428j105389j560126j268109o92729o05514p30372k38645N96911
37466b558193O43328j20768l25700O88307J793015J723165P28394j31485m35004
37457B005059l83860r4570K77435K50758l63075r14934o62472J93420P47794M40666
37447A496221n24826j483326j630950m81312J426578K584513J927799R8597j208856
37438B204438j084470j29247N38333M38089j69524p90025j003289n82492L01777
37429b76410J013988Q87674o1372r34754p63697L31899J090859N72803n62734
37420A298256q37286K3639O47274n3697j264702j344098p2910J106995J036279
$$ plain form
37485 -15220 680056 1530975 2478051 2984228 2830922 2557038 2693800 3106697 3411924 3451208
37475 3451208 3045780 1940391 380265 -887844 -1580573 -2186087 -2916459 -3155104 -2558193
37466 -2558193 -1914865 -2035633 -2361333 -1673026 119989 1843154 2571548 2440063 2005059
37457 2005059 1621199 1526629 1804064 2054822 1691747 776813 114341 307761 1055555 1496221
37447 1496221 971395 -511931 -2142881 -2624193 -1197615 1386898 3314697 3413294 2204438
37438 2204438 1119968 990721 1529054 1967143 1797619 1007594 4305 -578187 -276410
37429 -276410 737578 1625252 1563880 629126 -134571 197328 1288187 1860990 1298256
37420 1298256 460970 484609 1131883 1078186 -186516 -1530614 -1603524 -496529 539750
37411E39750J12489n91569o68215l78598L2567L91417L89117M470j43741M03354
37401I1041R66855M23577j059061j917021j189389K21901Q82412O54751L61037
37392e63897K32222j64068o85294n49493K87623P74378K61050m92195m19381L58776
37382i60279Q17472M32891k93246n42689k0674P75413R46385J19849r33205j080633
37372g38716l23067J85686j35998m24462J87928J079946J007206n0312q79736
37363i1525o59003K16242Q11350N42044m39816j256812j014671O8100P66205N38483
37353e19403K61470N59613N37891n62187j542190q81935N93291Q21638j57475
37344h89287l67090O68625J251237O59452K61094O23994K87452j198501j730219
$$ plain form
37411 539750 652239 60670 -607545 -986143 -953576 -562159 -173042 -168572 -312313 91041
37401 91041 1057896 1481473 422412 -1494609 -2683998 -2462097 -1579685 -924934 -563897
37392 -563897 -331675 -495743 -1181037 -1730530 -1442907 -668529 -407479 -899674 -1319055 -960279
37382 -960279 -142807 290084 -3162 -545851 -566525 208888 1155273 1275122 341917 -738716
37372 -738716 -1061783 -876097 -1012095 -1436557 -1248629 -168683 838523 788211 -91525
37363 -91525 -750528 -534286 277064 819108 379292 -877520 -1892191 -1824091 -1057886 -519403
37353 -519403 -257933 301680 839571 277384 -1264806 -2146741 -1553450 -731812 -889287
37344 -889287 -1256377 -587752 663485 1322937 1584031 2208025 2495477 1296976 -433243
37335d33243j01315J502571Q95302m57952r0836J077441M74526j335600j472053
37326E8841K08273Q51113m40031j283098m03767M22572J01705K62248J692350
37317A470206K116670K2399k188790j762721O9429M13534o17888r11015m33797
37308a821973o60549r85080L79770K326938J717342j304999k758100p00452J874723
37299a932380J728788j38409r12605l39223l5000j88136K82928J197305J243442
37290I06710L16369l24141j73945p7072n83324j078501q33578p499O14471L91305
37280h49205n54533j153987l05039J593421K697251J898815K00053p91212q72724
37271A862840q53991j022190j133298j222606j246666n82684Q70588J782819J038378
$$ plain form
37335 -433243 -534558 968013 1863315 1405363 1314527 2391968 2866494 1530894 58841
37326 58841 267114 1118227 678196 -604902 -1008669 -586097 -484392 -222144 1470206
37317 1470206 3586876 3609275 1420485 -342236 -272807 140727 -477161 -1388176 -1821973
37308 -1821973 -2482522 -3467602 -3087832 -760894 956448 -348551 -3106651 -3807103 -1932380
37299 -1932380 -203592 -342001 -1254606 -1593829 -1628829 -1816965 -1534037 -336732 906710
37290 906710 1223079 898938 724993 647921 64597 -1013904 -1847482 -1854981 -1240510 -849205
37280 -849205 -1403738 -2557725 -2862764 -1269343 1427908 3326723 3526776 2735564 1862840
37271 1862840 1008849 -13341 -1146639 -2369245 -3615911 -4198595 -3328007 -1545188 -506810
37262e06810k92997l04160Q06977J018346l03783j422403r34199K93058P44532
37253i01439M28869L23530N70292M06345m25583j110058p44995M49679J153740
37244A50380M04722j006087j232850K05167J557646J150706l09800q88880j51671
37235a20667O83005Q15951N29837P5117n13776o84068n0004M22474l24042j283056
37225d49229o16706J096803J389822p4688q58485Q8820O33929p00190k006749
37216a496673j256234K43684K74684m76261K343J206948J058892k86434p87718
37207a516769k01934k60137j181644j074878O87103K199680J910537N04063p94830
37198B71191j640274j605901n7209K063214K460457O66396r59308o51875K94521
$$ plain form
37262 -506810 -799807 -1103967 -296990 721356 417573 -1004830 -1939029 -1645971 -901439
37253 -901439 -472570 -149040 421252 827597 402014 -708044 -1453039 -1003360 150380
37244 150380 555102 -450985 -1683835 -1478668 78978 1229684 919884 31004 -120667
37235 -120667 562338 1378289 1908126 1983243 1469467 785399 735395 1157869 833827 -449229
37225 -449229 -1065935 30868 1420690 1346002 487517 576337 1210266 510076 -1496673
37216 -1496673 -2752907 -2509223 -2234539 -2710800 -2708457 -1501509 -442617 -729051 -1516769
37207 -1516769 -1718703 -1978840 -3160484 -4235362 -3548259 -1348579 561958 1066021 271191
37198 271191 -1369083 -2974984 -3032193 -968979 1491478 2157874 1198566 546691 841212
37189H41212J0322q87886p15327K45793L87321l89725o77524n2103L99662L1245
37179h07010n36222o81929n11963j57443M45844R05381O11232j63622m17660R9181
37169a214211N27843K96323p0163O0361M54852N49754L25358J26681P1831R6626
37159A225255K30800M28454M09687L5257l63367l36014J16973N28294M48408j27692
37149B596055p39020q96966o44512m99317o52208n78217J11832Q29996P74511
37140C02154K53022K15514N38650Q6114j191547j674102m61071R73881Q45682
37131a11703k65221m79482L45051O60530R5141M2153R67444J317364J50232j050734
37121A670775o76775M40385N45541j51000j62720M52697K26710r56824j464281
$$ plain form
37189 841212 851534 -36352 -751679 -505886 -118565 -508290 -1185814 -1237917 -838255 -807010
37179 -807010 -1343232 -2025161 -2537124 -2694567 -2248723 -1343342 -732110 -895732 -1313392 -1214211
37169 -1214211 -686368 -390045 -460208 -399847 55005 604759 930117 1056798 1128629 1225255
37159 1225255 1456055 1884509 2294196 2329453 1966086 1630072 1747045 2275339 2723747 2596055
37149 2596055 1857035 960069 315557 -183760 -835968 -1414185 -1302353 -472357 302154
37140 302154 555176 770690 1309340 1395454 203907 -1470195 -1931266 -957385 -111703
37131 -111703 -376924 -856406 -511355 149175 244316 286469 1253913 2571277 2721509 1670775
37121 1670775 994000 1434385 1979926 1828926 1666206 2118903 2345613 1388789 -75492
37112g5492o12776K36454j2471n11260p8915Q74329J161503O03928n6729l90107
37102A138464n44063p10913r17363r73249m20407Q18609J700955J044672n56965
37093E79740j151074j93317O46118K00823l62697L16282J397755J275299J93117
37084B902046m41654m72605p85077j307785j169811m90225j86882k78341j15821
37075b346155M2672m35628p91685K30234J839825J856953J21333j071937m38719
37066i93107O61999P78066L23667M9909l10960p63375m52797M53196L64028r23214
37056h12588j241374M45005J879802J052205l58022J06185J273912L61599j895723
37047H11001k123975L6449J257503O6163q96921L76614J814644Q71455j204008
$$ plain form
37112 -75492 -688268 -451814 -464285 -975545 -1054460 -180131 981372 1585300 1528571 1138464
37102 1138464 594401 -116512 -1033875 -2007124 -2427531 -1608922 92033 1136705 579740
37093 579740 -571334 -764651 -118533 82290 -280407 35875 1433630 2708929 2902046
37084 2902046 2460392 1987787 1202710 -105075 -1274886 -1765111 -1951993 -2230334 -2346155
37075 -2346155 -2303483 -2739111 -3530796 -3300562 -1460737 396216 517549 -554388 -993107
37066 -993107 -331108 446958 770625 820534 509574 -253801 -706598 -253402 110626 -812588
37056 -812588 -2053962 -1608957 270845 1323050 965028 1071213 2345125 2706724 811001
37047 811001 -1312974 -1276525 -19022 47141 -849780 -473166 1341478 2212933 1008925
37038A008925j524821j11246O59971O5681l72134O4541K67105m17051j016551
37029a375580o55060J74979P11008R98691J203497R41679O5656p08984p36788
37020F19098m08351m50269p08884m21889M75107J065646O36508l42818p61052
37011b96904k24640M69910L56101m56532r40946n24159K33350N69243N55341O52129
37001C92893O99111J96838n72545o51255K05756J068227J069330M02940k80236
36992B531059p75584j111654j036668l68131N04900R99511R09388K39495r72658
36983I19658k139976k096542m50023J489827K069689J247393K56759k60042n60144
36974D76599n36492K74443J276965J059775l72475j169130l23685O92501K58940
$$ plain form
37038 1008925 -515896 -627142 32829 98510 -273624 -209083 58022 -359029 -1375580
37029 -1375580 -2030640 -1855661 -1144653 -145962 1057535 1999214 2064870 1355886 619098
37020 619098 210747 -239522 -948406 -1370295 -895188 170458 806966 464148 -296904
37011 -296904 -521544 -51634 304467 -152065 -1093011 -1617170 -1383820 -814577 -259236 392893
37001 392893 1092004 1288842 716297 65042 270798 1339025 2408355 2811295 2531059
36992 2531059 1755475 643821 -392847 -760978 -256078 743433 1652821 1892316 919658
36983 919658 -1220318 -3316860 -3766883 -2277056 -207367 1040026 1296785 1036743 476599
36974 476599 -59893 214550 1491515 2551290 2178815 1009685 686000 1378501 1637441
36965A637441p57841m45382R64988J425085L30306o57246l93904R1630l68484
36956A826593j019349n40357O08561Q27799q5598o69931j68485L35824j97534
36947I17523r51439m62843R92652J602426N82979p76280j099425p51192p43001
36938f88600p96553M0386J290978J292855k11098j326630o08243Q94176J246713
36929A133984K95958n59830o40794o22462j043794j424651j113971j82201P96079
36920c361682J308308J131940M46824k13299m31803k60716R3708N74191R35378
36911B22849O50537k65434q70924m82327K32229K10080l81346m83026J98404R47110
36901b1848J252369J156370N45083o58595j584989j052136N99265J558291Q81267
$$ plain form
36965 1637441 879600 434218 1399206 2824291 3154597 2497351 2103447 2195077 1826593
36956 1826593 807244 266887 875448 1703247 1617649 947718 779233 1115057 917523
36947 917523 -33916 -496759 495893 2098319 2681298 1905018 805593 54401 -688600
36938 -688600 -1485153 -1444767 -153789 1139066 927968 -398662 -1006905 -112729 1133984
36929 1133984 1429942 870112 229318 -393144 -1436938 -2861589 -3975560 -4157761 -3361682
36920 -3361682 -2053374 -921434 -474610 -687909 -1119712 -1380428 -1286720 -712529 222849
36911 222849 873386 607952 -262972 -745299 -513070 -302990 -684336 -1167362 -968958 -21848
36901 -21848 1230521 2386891 2931974 2273379 688390 -363746 235519 1793810 2675077
36892B675077l56442p49784k75590L30354P96123J025713N35836p23170j638656
36883A619461j183480o133L68031k65880o03247L5856O22940J06788q02236o35562
36873g43462N09527R90488J18932p08572j48048R68333R43242j38408p52627n35686
36863E03719n45257q65729k44321J200511J319424o15495k052586q09428J319267
36854g89895J186633q62977j731309m04451J006770R69342L78213K95949L65911
36845D14186J45561m1997j48447n00293o33342Q2276O70045l47296k051660j953473
36835d364440L6367J317029P92901K51232O68550M89729r25445j453187J25505
36826c061759J620164J016512j76176J39665R02208J53661j098568o57508Q23139
$$ plain form
36892 2675077 2318635 1568851 1293261 1623615 2419738 3445451 3981287 3258117 1619461
36883 1619461 435981 429848 797879 531999 -71248 -35392 587548 694336 -107900 -743462
36873 -743462 -233935 756553 875485 166913 18865 987198 1930440 1792032 1039405 503719
36863 503719 -41538 -907267 -1151588 48923 1368347 752852 -1299734 -2109162 -789895
36854 -789895 396738 -466239 -2197548 -2601999 -1595229 -625887 -247674 48275 414186
36845 414186 559747 517750 369303 -130990 -764332 -682056 -12011 -359307 -2410967 -4364440
36835 -4364440 -4328073 -3011044 -2218143 -1966911 -1298361 -808632 -1734077 -3187264 -3061759
36826 -3061759 -1441595 -425083 -601259 -461594 440614 594275 -504293 -1161801 -338662
36817c38662R79562j87135o31342J15425O89924O74777P77098P50195j41909j097028
36807A590905q41140r5791k87996n98818O07793K103100J147190j616754k443104
36798d34615k34039J666252O43343j499543j746258j20506J203175J145672L14605
36789I38086l65117l18811M01473Q23387J04371r22835p09731M58441P44215k48440
36779I05039r02275l99845J41248m1242j82452J20904Q0495l59089j8219J119243
36769D63807J306037k1147r90299l06175P48466P67836L91350L78635j52931j579137
36759A006442k059152l17996J721513J572553j06659r40751n63941k64701r5509
36750d8201P88654J648535R00189r38543j681417q17459R451n3145j7177O93165
$$ plain form
36817 -338662 640900 453765 -177577 -62152 627772 1302549 2079647 2829842 2687933 1590905
36807 1590905 749765 653974 365978 -232840 374953 2478053 3625243 2008489 -434615
36798 -434615 -668654 997598 1640941 141398 -1604860 -1725366 -522191 623481 938086
36789 938086 572969 254158 655631 1479018 1583389 660554 -49177 409264 1153479 905039
36779 905039 2764 -397081 -255833 -297075 -479527 -358623 -278128 -637217 -655436 463807
36769 463807 1769844 1748697 758398 452223 1200689 1968525 2359875 2738510 2585579 1006442
36759 1006442 -1052710 -1370706 350807 1923360 1816701 875950 312009 47308 -48201
36750 -48201 740453 2388988 3289177 2350634 669217 -148242 -138791 -191936 -209113 484052
36740D84052J130295N97086k61562p54205r89066r33152j49329R61731J103494
36731A189344k5660j017088o70121M18086R35621O51212L03102K74003J78496
36722B236995l82638j127442j246828l06798R69591J228924J23044j091158j125039
36713g21349k65370L28827L30675K26127P5183m44731r58154o63166K61248P45266
36703a085444N08685M45363R76321J205301L67266q30186j151332n26031L2459
36694e7598p7798l75140j36662O05085J139104R54417K78453l28373o68808q67140
36684D65540p85871j12193Q11714R52538j03648j327023j397149l74698M53847
36675a416943K62365m25809n83482Q2960R47832J301628J137196R48008Q03169
$$ plain form
36740 484052 1614347 2211433 1949871 1195666 206600 -726552 -875881 85850 1189344
36731 1189344 1163684 146596 -523525 -105439 830182 1481394 1784496 2058499 2236995
36722 2236995 1854357 726915 -519913 -826711 142880 1371804 1494848 403690 -721349
36713 -721349 -986719 -657892 -327217 -101090 -25907 -470638 -1428792 -2091958 -1830710 -1085444
36703 -1085444 -576759 -131396 844925 2050226 2417492 1587306 435974 -90057 -57598
36694 -57598 -135396 -510536 -647198 -42113 1096991 2051408 2329861 2001488 1332680 465540
36684 465540 -320331 -432524 379190 1331728 1228080 -98943 -1496092 -1870790 -1416943
36675 -1416943 -1154578 -1580387 -2163869 -2080909 -1133077 168551 1305747 2253755 3056924
36666C056924J49997j056058j662673p13756Q96304J445400Q41991M85048O87617
36657D130794K47704r39325j133917K13170R31344n33989k243965j622943L65566
36648e85561P54238o75748j291330o232J298118J144103M42861K79715J83378
36639A543542l04659m84516j34952l50617j414376j665830p2339J684912J527775
36630C28940J07755l75803M36560R87783O28982L17507M34128J7797j168082j608061
36620A07506k62771J421005J240373o06037j690307p53417O12023M43371o80407
36611a68661o68319P30635J455362K84964j300861j356124j13988R43159J469142
36602A275309J974850J997100O44634j267619j757315n96340K76443k19952p91271
$$ plain form
36666 3056924 3206921 2150863 488190 -225566 670738 2116138 2958129 3443177 4130794
36657 4130794 4378498 3439173 2305256 2518426 3449770 2915781 671816 -951127 -585561
36648 -585561 168677 -507071 -1798401 -1804633 -506515 637588 1080449 1360164 1543542
36639 1543542 1238883 754367 619415 268798 -1145578 -2811408 -2883747 -1198835 328940
36630 328940 436695 60892 497452 1485235 2114217 2431724 2865852 2883649 1715567 107506
36620 107506 -155265 1265740 2506113 1900076 209769 -543648 68375 511746 -168661
36611 -168661 -836980 -106345 1349017 1633981 333120 -1023004 -1136992 -193833 1275309
36602 1275309 3250159 5247259 5891893 4624274 2866959 2270619 2547062 2327110 1535839
36593A535839j20598J060196J434899J100556P29175O7963j141639j826501r45295
36584A894595N09209O73841m12332r86211l75503J90358j65281o23425k48306
36575D56945M89717O73307L88456K37666J41598l37335q93864p30640J51531P73510
36565A350891M79228k14812m06573j2203K91737J51340j4405J74315L15548j46759
36555A968307q11263o59693L39418Q56842L2633j065851q13420N54589J147672
36546A549234J15577j132856r65365K60192R12956L45385n68126p99262j26536
36537d08801J077462K077629J884937J83290j696320j799882J892J557990J111066
36528C989263m25334q26750L97450J515889J001535o82203j954997j886005o92867
$$ plain form
36593 1535839 1415241 2475437 3910336 5010892 5740067 5808030 4666391 2839890 1894595
36584 1894595 2403804 3077645 2665313 1679102 1303599 1493957 1328676 705251 456945
36575 456945 946662 1619969 2008425 2246091 2387689 2050354 1156490 425850 577381 1350891
36565 1350891 1830119 1615307 1208734 1196531 1488268 1639608 1625203 1799518 2115066 1968307
36555 1968307 1157044 497351 836769 1693611 1726244 660393 -153027 401562 1549234
36546 1549234 1664811 531955 -433410 -173218 739738 1085123 516997 -282265 -408801
36537 -408801 668661 2746290 4631227 4814517 3118197 1318315 1320207 2878197 3989263
36528 3989263 3563929 2737179 3134629 4650518 5652053 4969850 3014853 1128848 435981
36519D35981Q07527J692270J341533j3146j277054j484160p82510j04957Q5788
36510G01272K49419P62988R80753L2834j512827j812240j77194J558925J293379
36501B077309l18915p78648M14387R54632n12749k014227j253674P68160J381970
36492G18245L37505k96469K43069N93790J19202o3488N27600P39902O4625k96861
36482B687120K58801M66958m24161j025697k45478N01477l91019j700076j120256
36473i92331R14721J747549N09136q76075q98836l87738n07426p58505j45448
36464a394953R51960J348064P84709Q12n23110q82933r64449l49131P32369J190247
36454H93585M41337n70399n68301J82324L28356l10755m34777L55817O11977m30289
$$ plain form
36519 435981 1243508 2935778 4277311 4264165 2987111 1502951 720441 615484 701272
36510 701272 950691 1713679 2694432 2727266 1214439 -597801 -774995 783930 2077309
36501 2077309 1758394 979746 1394133 2348765 1836016 -178211 -1431885 -663725 718245
36492 718245 1055750 759281 1002350 1596140 1715342 1651854 2179454 2919356 2983981 2687120
36482 2687120 2945921 3412879 2988718 1963021 1717543 2219020 1828001 127925 -992331
36473 -992331 -77610 1669939 2179075 1303000 404164 16426 -491000 -1249505 -1394953
36464 -1394953 -442993 905071 1689780 1690592 1167482 284549 -679900 -1029031 -296662 893585
36454 893585 1334922 764523 196222 378546 706902 396147 -38630 317187 929164 498875
36444D98875j103342J10585J717102J292708n90001j244169j24353P29980L80767
36435A668152N1940K13452k48491j228674q90012R45876J881152P58050m88518
36426B662927k95064J08366m97127r27304n5579R36516Q53157N26849N76440j59165
36416C730016j799327j991529J57032J711865L96259j501155r90998O91142P06316
36407A109621m43556n63432o0119m91946q90847L12584J621902R23373l23346
36398A194234L56711J700637J081152l64458J16118J526155J141761P7139J180126
36389H009575K966856J717194j579790k618365j184630q11284j828407j374121
36381C297028K66865J64134r30441J91337K231580J209963j360034m16387K966810
$$ plain form
36444 498875 -604467 -493882 1223220 2515928 1925927 681758 557405 1287385 1668152
36435 1668152 1720092 1933544 1685053 456379 -433633 512243 2393395 3151445 2662927
36426 2662927 2367863 2476229 1979102 1051798 996219 1932735 2785892 3312741 3889181 3730016
36416 3730016 1930689 -60840 96192 1808057 2204316 703161 -287837 403305 1109621
36407 1109621 666065 102633 42514 -449432 -1340279 -1027695 594207 1517580 1194234
36398 1194234 1550945 3251582 4332734 3968276 4084394 5610549 6752310 6829449 8009575
36389 8009575 10976431 12693625 11113835 8495470 7310840 6499556 4671149 3297028
36381 3297028 3563893 3728027 2797586 2988923 5220503 6430466 5070432 4654045 7620855
36372G620855K962195p2854p5308L015233L107151L73352J535252O173876O536064
36363C1175816L469499O692906J5409013J7939635J7680330L5317518O9225349
36356A96910066P7908743K9775582m4568508q1952846o3095008k8030152j5252442
36349G1695435j8840072j5882214n842583k318728n576768n589561j937677j841415
36341A3866417m502640l176199J104335J419699k044087k745740J97406J344445
36333E463636o66804j579643j33419K59939j246427j459087M37884J410252K85169
36324B771500n90776p6786K34088k60502k61418K37381k31259j360360j217264
36315g55396K75603J246255J101781Q42628O04081j63227p21936j83418K81894
$$ plain form
36372 7620855 10583050 10510196 10434888 13450121 16557272 16930624 18465876 24639752 31175816
36363 31175816 34645315 41338221 56747234 74686869 92367199 127684717 196910066
36356 196910066 274818809 304594391 260025883 178073037 114978029 86947877 71695435
36349 71695435 52855363 36973149 31130566 28811838 23235070 17645509 15707832 13866417
36341 13866417 9363777 6187578 7291913 8711612 6667525 3921785 4119191 5463636
36333 5463636 4796832 3217189 3083770 3343709 2097282 638195 1076079 2486331 2771500
36324 2771500 2180724 2103938 2338026 2077524 1816106 2053487 1822228 461868 -755396
36315 -755396 -479793 766462 1868243 2710871 3314952 3151725 2429789 2246371 2528265
36306B528265o53075j543130m26268J279363Q44077r26200r76895O40806J012710
36297A779653l59805r26500O1949L88988p33963j187217P895Q84967K17738l35070
36287b01365N58235J472104Q43470m06943p02256k74718j04038m8616L77530O81720
36277B195123K38601n43109r36014q82303n59088Q1414P71607Q98726M57129R1044
36267A813130l9653l66125p59560n25204K50542O24331L07827j360m540j94915
36257A104473o12067n50900J38048P12547Q08870Q10360P19384K9733r60124j138643
36247A061681l41678K72249J19129J4330M29145M24530o41840j629446j158725
36238a450625K21074P89702J34997m39388N0024R32851R43759p9845j099425j239640
$$ plain form
36306 2528265 1875190 332060 -94208 1185155 2029232 1103032 126137 766943 1779653
36297 1779653 1419848 493348 555297 944285 210322 -976895 -969000 -84033 133705 -201365
36287 -201365 356870 1828974 2672444 2265501 1563245 1288527 1184489 1135873 1513403 2195123
36277 2195123 2433724 1890615 954601 72298 -486790 -405376 366231 1264957 1722086 1813130
36267 1813130 1773477 1407352 647792 122588 373130 997461 1305288 1303928 1299388 1104473
36257 1104473 492406 -58494 79554 792101 1600971 2411331 3130715 3160448 2200324 1061681
36247 1061681 720003 992252 1111381 1125711 1554856 1979386 1337546 -291900 -1450625
36238 -1450625 -1229551 -439849 -304852 -744240 -694216 238635 1182394 1102549 3124 -1236516
36228a236516p24000k84457m5238M56341J211232J421557N86403o37693j155195
36219d07566o81335J41214N98238N18403K35555J42460J36263l13513j123105
36210g53386j123858L26624J703972R56220j248182j984294k83633J414349J126118
36201A33930K60777Q48169J944853J326002o91017j847910j500413r03507m85491
36192i14607M49512J430489R24708q76494j741458n80488R83436J027081k41867
36183D60312j252736j074915M35R98802J005133O4424o52896k82321N02022N85742
36173C54002J32856j9596j1543m45263p83037o7354J082349J077490j36054r99650
36163A84200p66580k45116n4129J60721O15248R88148J172987J131951L62464
$$ plain form
36228 -1236516 -1960516 -2244973 -2290211 -1833870 -622638 798919 1385322 747629 -407566
36219 -407566 -1088901 -947687 -349449 168954 404509 546969 683232 369719 -753386
36210 -753386 -1877244 -1550620 153352 1109572 -138610 -2122904 -2406537 -992188 133930
36201 133930 394707 1242876 3187729 4513731 3822714 1974804 474391 -429116 -914607
36192 -914607 -465095 965394 1890102 1013608 -727850 -1308338 -324902 702179 460312
36183 460312 -792424 -1867339 -1866904 -868102 137031 201455 -451441 -733762 -231740 354002
36173 354002 486858 467262 455719 10456 -772581 -839935 242414 1319904 1183850 184200
36163 184200 -582380 -827496 -881625 -720904 -105656 882492 2055479 3187430 3549894
36154C549894j055816j618793m48591P16411p3580j502497q70070J218499J592272
36145A507729j74820j108133l3086O48617l48797p82973P85601J975624O05865
36136C075627j408763j250289K60105N37030l60717m72322L77284P63296M95166
36127B016417M36199M04537p5589J52099K243377M467943L842897M27597k643682
36118A1271795l378493k711307j990026j160902m4424O24686L20959l97489p36601
36109A798198n27903p5248J32850k64630q15191m46643Q91939J694999J006032
36100C394403q5883l30191l30987r71691j269006q1577J238358O10997j146546
36091A027877j376730J58278J109317N44378l9688J4190m62520j409252q29044
$$ plain form
36154 3549894 2494078 875285 426694 1143105 1069525 -432972 -1303042 -84543 1507729
36145 1507729 1332909 224776 191690 840307 491510 -291463 494138 2469762 3075627
36136 3075627 1666864 416575 676680 1213710 852993 380671 757955 1521251 2016417
36127 2016417 2452616 2857153 2781564 2933663 5177040 9644983 13487880 13915477 11271795
36118 11271795 7893302 5181995 3191969 2031067 1986643 2611329 2932288 2534799 1798198
36109 1798198 1270295 1195047 1327897 1063267 248076 -198567 693372 2388371 3394403
36100 3394403 3308520 2978329 2647342 1675651 406645 325068 1563426 2174423 1027877
36091 1027877 -348853 -190575 918742 1463120 1423432 1437622 975102 -434150 -1263194
36082a263194J453450K432881L26917k288229k114765K05156J636689J306884
36074A695789P13144M40725l91449j654890j853496o69558K47175k01691q78185
36065b552436k55598J152662J452923J03249j169090o09606J080844J509938q4457
36056F28429j529648p07471J227595J426851l40573j311501l2474J458126J010187
36047A829521l25861l87284M01612j5869j571227j989806m18159J300155J469137
36038B92219O41541J16988L5806m7420k1334K57821K53969l97806j023386q37141
36028g28743j98245n1333n10846q40825n86546K8283O62249J126317J187742P25670
36018H13723P0268l08362l98866m76971m67292p6313M58460M37812k68944q46157
$$ plain form
36082 -1263194 190256 2623137 2950054 661825 -1452940 -1247784 388905 1695789
36074 1695789 2408933 2849658 2458209 803319 -1050177 -1719735 -1472560 -1674251 -2552436
36065 -2552436 -2808034 -1655372 -202449 -99200 -1268290 -1877896 -797052 712886 628429
36056 628429 -901219 -1608690 -381095 1045756 705183 -606318 -638792 819334 1829521
36047 1829521 1503660 1116376 1517988 1502119 -69108 -2058914 -2477073 -1176918 292219
36038 292219 933760 1050748 1086554 1039134 1017800 1275621 1529590 1131784 108398 -728743
36028 -728743 -926988 -978321 -1489167 -2329992 -2916538 -2888255 -2226006 -1099689 88053 813723
36018 813723 883991 575629 176763 -300208 -767500 -843813 -385353 52459 -216485 -1062642
36008a062642n45516L31564Q54332N88644p0714n09726m83862j71849J03613K23967
35998g42189L94217P33913P94217N514j210356j495491k97094J113217J248619
35989E44567M77364K59799O78027L82021q44719j347007k74020P55392J05471
35980G36895j188243j093170P6311L12235n32165m52538J107843J957062N91789
35971A516019j253941j197917K96396J027421N35932K39808N98585M42122o72364
35962A532061j449664r15654N0826J75669l28942l45473L96777J093873J024975
35953A234448K29185p22776j114758n29115N98949J132780M57165o19018p00751
35944c3891M71834J591169J238353m60649j875428j611464m1836J168969J023274
$$ plain form
36008 -1062642 -1608158 -1276594 -422262 166382 95668 -414058 -897920 -1069769 -966156 -742189
35998 -742189 -347972 385941 1180158 1185672 -24684 -1520175 -1817269 -704052 544567
35989 544567 1021931 1281730 1959757 2341778 1497059 150052 -123968 631424 736895
35980 736895 -451348 -1544518 -1468207 -1155972 -1688137 -2140675 -1032832 924230 1516019
35971 1516019 262078 -935839 -639443 387978 923910 1163718 1762303 2204425 1532061
35962 1532061 82397 -833257 -782431 -606762 -935704 -1281177 -884400 209473 1234448
35953 1234448 1463633 740857 -373901 -903016 -304067 828713 1285878 666860 -33891
35944 -33891 437943 2029112 3267465 2806816 931388 -680076 -721912 447057 1470331
35935A470331J59704l28365l11032k25473J338N21719N77605n55989j803428j258097
35925a751687P83709J712504L49068j190331p62633N60947N59812l84884k58409
35916c81904P85773O34942q72677j343734J59406J364068M20253j135355r21335
35907a290563O21257J234970L24003o72523p22540j60127M49444Q50424P42039
35898A376384J65391q0224M26622O87088l13852j695198j700056k71583R84969
35889d20459J193204Q96925M53896m55409j480894j505110m07768N59213O73940
35880d92462N91724P69895N78886k46502p27109k17457L71961K8698p22917p66396
35870h31679j11796M47175O63853P34098M85641k44429q93896q10874k14212K74083
$$ plain form
35935 1470331 1630035 1301670 990638 765165 766503 1288222 1865827 1309838 -493590 -1751687
35925 -1751687 -967978 744526 1093594 -96737 -859370 -298423 261389 -123495 -381904
35916 -381904 403869 1038811 166134 -1177600 -1018194 345874 766127 -369228 -1290563
35907 -1290563 -669306 565664 889667 217144 -505396 -665523 -216079 634345 1376384
35898 1376384 1541775 1461551 1888173 2575261 2261409 566211 -1133845 -1405428 -420459
35889 -420459 772745 1669670 2123566 1668157 187263 -1317847 -1725615 -1166402 -492462
35880 -492462 99262 869157 1448043 1201541 474432 256975 628936 657634 -65283 -831679
35870 -831679 -943475 -496300 167553 901651 1387292 1142863 248967 -561907 -776119 -502036
35860e02036N55645P52870O02361J0744m12207k71475j52244m99021n32254M91400
35850D3783J682087J634647N63528k47962o28112j342531k048224j501393N3325
35841a790852P93241J32462l77396K36781P27200p6894j088198o99726O18558
35832a524824J216598Q07244L40447L2100o30940j281648r10150L02197J038424
35823f10552Q65736O41241O89611K21989r09601j463672o80362M11225N71520
35814b62865J42771J43641M88235L79899j41364l31790o6389J40279J79615L03362
35804I75394K56857l71405j059078q56412j4735J96982m76185p98954j13370M78390
35794a782516q2098r30662m63566J199365K209957J356579n29071j655784j150206
$$ plain form
35860 -502036 53609 806479 1408840 1419584 1007377 735902 583658 84637 -447617 43783
35850 43783 1725870 3360517 3924045 3676083 3047971 1705440 -342784 -1844177 -1790852
35841 -1790852 -997611 -865149 -1242545 -1005764 -278564 -355458 -1443656 -2143382 -1524824
35832 -1524824 -308226 499018 839465 871565 240625 -1041023 -1951173 -1648976 -610552
35823 -610552 255184 896425 1586036 1808025 898424 -565248 -1245610 -834385 -262865
35814 -262865 -120094 23547 511782 891681 750317 418527 352138 492417 672032 975394
35804 975394 1232251 860846 -198232 -1054644 -1069379 -872397 -1348582 -2147536 -2260906 -1782516
35794 -1782516 -1864614 -2795276 -3258842 -2059477 150480 1507059 977988 -677796 -1828002
35785a828002K76211J179042Q33540o7505l25256K12290N39473J9352p47060r36436
35775h44351o00416k04447J71260N04881M50255M6521M4737O24256O18715p57665
35765E3746k128626j470412Q86164K376597J442941p17632j910601j297434K89652
35756b475605J391326J037939l50886j156795m69918N08095J51493r16727o05170
35747b886248J225854K228280J046878o84986r24613n4076K95308j13462k75896
35738a42961J52594O42236R16345R93351N64682n00768j425248j352867n70183
35729g22819N715J31715J50340R0791j85197l63058j23724J88540J84469J89573
35719d53655M78155L89641o26651j609159j097734O56624J809072J276176j46758
$$ plain form
35785 -1828002 -1551791 -372749 460791 393286 68030 280320 819793 839145 92085 -844351
35775 -844351 -1444767 -1649214 -1477954 -973073 -522818 -476297 -431560 192696 811411 53746
35765 53746 -2074880 -3545292 -2659128 -282531 1160410 442778 -1467823 -2765257 -2475605
35756 -2475605 -1084279 -46340 -397226 -1554021 -2023939 -1515844 -1364351 -2281078 -2886248
35747 -2886248 -1660394 567886 1614764 929778 5165 -48911 246397 132935 -142961
35738 -142961 9633 651869 1568214 2561565 3126247 2625479 1200231 -152636 -722819
35729 -722819 -717104 -585389 -435049 -344258 -529455 -892513 -1016237 -827697 -643228 -453655
35719 -453655 24500 414141 -212510 -1821669 -2919403 -2262779 -453707 822469 675711
35710F75711j099716j075420l98378L00324L94335k31122q48039o24705L21852
35701b585158J129843J274856Q78954K00726n20877r36524r12440p26997m66204
35692b663821K27884J208812J431656M37875n90780m68493R7808k54819j103593
35683a677471q86298L73501J023025M91781R732K73564L99285j37604m15414J21807
35673d24092M57976k14147r59179o69969L8519n0939o72114o08718K90376J056305
35663a755982J215956J165412J086923O71531k8428m37416l25158j46793l56708
35654A089337q56618j193386r82762k17104N77491P15000J79121k46514l7144
35645i72579L13830J26990k96668j15140O42946R68328K99216o67905r30395m24085
$$ plain form
35710 675711 -424005 -1499425 -1897803 -1597479 -1203144 -1434266 -2282305 -2907010 -2585158
35701 -2585158 -1455315 -180459 698495 899221 378344 -558180 -1470620 -2197617 -2663821
35692 -2663821 -2435937 -1227125 204531 642406 51626 -416867 -319059 -573878 -1677471
35683 -1677471 -2563769 -2190268 -1167243 -675462 -665730 -392166 7119 -130485 -545899 -424092
35673 -424092 33884 -180263 -1139442 -1809411 -1770892 -1821831 -2493945 -3102663 -2812287 -1755982
35663 -1755982 -540026 625386 1712309 2383840 2355412 1917996 1592838 1446045 1089337
35654 1089337 232719 -960667 -1943429 -2160533 -1583042 -868042 -688921 -935435 -972579
35645 -972579 -658749 -531759 -828427 -943567 -300621 667707 966923 299018 -631377 -1055462
35635a055462J21789K58698K36817M05300O73988P62611O41129L85980j66209
35626B264641j120476j931951j727883m45935Q69211J236508P57707J40237k59325
35617b17266m33152k89615J40090M54880M48796N07961Q30239P92423r5393j126669
35607A012294j260272o08340l0602K93313O74392P44250l3298r17706o23757M78390
35597b71336O39366n16736j307710o37819M14123N23912O5206L4009L63144M88772
35587b05069M99442N80031K91239n10016r90941o56429l30990o56944o78029O16596
35577b041110K202371K140108L18949j455064j839842j067870N8393R23734R94177
35568B33846K31270m18941m2844Q46036R66316J03080q23012j249732j288872
$$ plain form
35635 -1055462 -933673 -674975 -438158 -32858 641130 1403741 2044870 2430850 2264641
35626 2264641 1144165 -787786 -2515669 -2961604 -2092393 -855885 -98178 42059 -217266
35617 -217266 -650418 -940033 -799943 -345063 103733 611694 1441933 2234356 2138963 1012294
35607 1012294 -247978 -856318 -886920 -593607 80785 825035 791737 -125969 -749726 -271336
35597 -271336 368030 -148706 -1456416 -2094235 -1680112 -1156200 -1090994 -1056985 -693841 -205069
35587 -205069 294373 874404 1165643 655627 -335314 -991743 -1322733 -1979677 -2657706 -2041110
35577 -2041110 161261 2301369 2620318 1165254 -674588 -1742458 -1684065 -760331 233846
35568 233846 465116 46175 3331 849367 1815683 1918763 1095751 -153981 -1442853
35559a442853p85517M89515J710875J548464J00906j049838j010879m98861k49894
35550a188082O8698P23620J011508M04939m02691n49486l12352m20484p13928
35541a378258m90533K23579P17544P18584O20446O21174L81175k86621r18762
35532B08328r03136k67179K90028J73429m38622q62369p76662m58487p3550O58198
35522b450022J642417J912653Q33557o17144q79040L3962O19963J73248l84219
35513H85375l00444j67654n37879p15677p3916N33466R7341o15858j16954J225176
35503B12976J450474j9949j376346j006853K93183O64782k19332j048155r02110
35494a951330k76637m4385k25503j61730M45398J068322R99874L10568j37278
$$ plain form
35559 -1442853 -2228370 -1738855 -27980 1520484 1621390 571552 -439327 -938188 -1188082
35550 -1188082 -1119384 -395764 615744 1020683 617992 68506 -243846 -664330 -1378258
35541 -1378258 -1868791 -1645212 -927668 -209084 411362 1032536 1413711 1127090 208328
35532 208328 -694808 -961987 -671959 -498530 -937152 -1799521 -2576183 -3034670 -3108220 -2450022
35522 -2450022 -807605 1105048 1938605 1321461 442421 476383 1096346 1269594 885375
35513 885375 584931 417277 -120602 -836279 -910195 -376729 -279388 -895246 -1012200 212976
35503 212976 1663450 1643501 267155 -739698 -446515 218267 -1065 -1049220 -1951330
35494 -1951330 -2227967 -2272352 -2497855 -2659585 -2214187 -1145865 -145991 164577 27299
35485B7299K02094P48033N38823l94000j016425o68787K16123R21791J249920
35476A824871J180747M76562p62219j678986j506674n39177L16638O58138O93068
35467F62968N70414K77730k6054k14873n05220r53099r95377k71865M58710K28157
35457g68509n50958n79419K81251P46777J27337o79582o91149j42531L49364Q05702
35447a101717J250329J054880o0337j097167r03847K22209R61703O66858j41646
35438H51265o76439o12515j33966K86138L87095N32931J066068J290177K09444
35429C200198j522373j907446n01130O69886J75853n74195J96682J503577J146395
35420B387447o78384j716672j064498N1505O17316P78172N93084m6748l39501
$$ plain form
35485 27299 229393 977426 1516249 1122249 105824 -562963 -346840 574951 1824871
35476 1824871 3005618 3482180 2719961 1040975 -465699 -1004876 -688238 -30100 662968
35467 662968 1233382 1511112 1485058 1270185 764965 -188134 -1183511 -1455376 -996666 -768509
35457 -768509 -1319467 -1898886 -1617635 -870858 -743521 -1423103 -2114252 -2256783 -1907419 -1101717
35447 -1101717 148612 1203492 1143155 45988 -857859 -635650 326053 992911 851265
35438 851265 174826 -437689 -571655 -285517 101578 634509 1700577 2990754 3200198
35429 3200198 1677825 -229621 -730751 -60865 114988 -459207 -262525 1241052 2387447
35420 2387447 1709063 -7609 -1072107 -1020602 -403286 374886 967970 921222 581721
35411E81721M96556J313672K91821j895059k583700j024443P02374J098204R82831
35402c6023J112955P35455l40475p10940J64657O81368k61699j404260j416952
35393a475914r77002r29943m79420Q98847J734119Q89101j91146J57022Q81266
35384E06930J58353j201906j089448K45673P46402P7062k51370Q5265j16789r14658
35374a754486q91594J88616Q39864M39477J02288L81108K80251n73651p97069
35365a785196M86812J841599J413254l86220j482126r22374J57381L40835k23364
35356e59399k95818M77990R25447J67926p26201k06270J068323R33570p03080
35347A082488j341426J35666J465148O70257o87854l37075P48144K80517j067004
$$ plain form
35411 581721 1078277 2391949 2683770 788711 -1794989 -2819432 -2117058 -1018854 -36023
35402 -36023 1076932 1812387 1471912 760972 925629 1606997 1345298 -58962 -1475914
35393 -1475914 -2452916 -3382859 -3862279 -2963432 -1229313 -340212 -531358 -374336 506930
35384 506930 665283 -536623 -1626071 -1380398 -633996 -556934 -808304 -723039 -839828 -1754486
35374 -1754486 -2646080 -2457464 -1617600 -1178123 -1075835 -694727 -414476 -988127 -1785196
35365 -1785196 -1298384 543215 1956469 1570249 88123 -834251 -676870 -336035 -559399
35356 -559399 -855217 -377227 548220 716146 -10055 -216325 851998 1785568 1082488
35347 1082488 -258938 -123272 1341876 2012133 1324279 987204 1735348 2015865 948861
35338I48861q76530M89838M06376j224616j581304K03844J490241N76659o20737
35329a87368L0237J544932J760882N10021r01914j730743j812777r79890K90820
35320a475800R11855P49853P74555J079940N70345p18819j131567j93069L51930
35311I19223m33305r30132J12034J164435N10349p30415n59750N15550O30096
35302A198085j10063j22368N56770L17200j098171k070414j641062o27074J9092
35293c578005L26434N45486O39249P14488Q46452N36700n12837j300700n77415
35284b360148J043493J495639P1670j493212j325070K01110J135509M78808p21589
35275a473790q22783L03983J089150L72415q74415p83255P21203J745970J139265
$$ plain form
35338 948861 72331 562169 968545 -256071 -1837375 -1633531 -143290 433369 -187368
35329 -187368 -157131 1387801 3148683 3658704 2756790 1026047 -786730 -1766620 -1475800
35320 -1475800 -563945 185908 960463 2040403 2610748 1891929 760362 567293 919223
35311 919223 485918 -444214 -332180 832255 1342604 612189 52439 567989 1198085
35302 1198085 1088022 965654 1522424 1839624 741453 -1328961 -2970023 -3597097 -3578005
35293 -3578005 -3251571 -2706085 -2066836 -1352348 -505896 30804 -482033 -1782733 -2360148
35284 -2360148 -1316655 178984 250654 -1242558 -2567628 -2366518 -1231009 -752201 -1473790
35275 -1473790 -2296573 -1992590 -903440 -531025 -1405440 -2188695 -1467492 278478 1417743
35266A417743l7975l71617m7701L1570j27555r5467j61116o64929r41041k69247
35256a267335O87631P16883r1856n80514l04316J02955J66598J17513K50870N22427
35246C20856P04438M78990k68943r39890p28083J6084K7533p54406p71954N49030
35236a366345J483031P25321k78963K73671J323040O53665j201943j648824k23288
35227b60635Q06300J92034o90012n78200j59469k36070k34779L16824O28535J28684
35217h6788l96079k29979M1225k39944n66494k70329L13862N89408N98337M44100
35207A97319p5532n69901r4521J090550J258399j97477j426612q33649L22614
35198c28810q941j154687p33188J248705K022375K89694j609108j095485Q90229
$$ plain form
35266 1417743 1379768 1008151 960450 992020 864465 768998 607882 -57047 -998088 -1267335
35256 -1267335 -579704 137179 45323 -535191 -839507 -736552 -569954 -452441 -201571 320856
35246 320856 1025294 1504284 1235341 295451 -432632 -416548 -389015 -1143421 -1915375 -1366345
35236 -1366345 116686 842007 563044 836715 2159755 2813420 1611477 -37347 -260635
35227 -260635 545665 737699 47687 -530513 -689982 -926052 -1160831 -844007 -215472 -86788
35217 -86788 -482867 -712846 -671621 -911565 -1478059 -1748388 -1434526 -845118 -246781 197319
35207 197319 121787 -448114 -542635 547915 1806314 1608837 182225 -651424 -328810
35198 -328810 -337751 -1492438 -2225626 -976921 1045454 1335148 -273960 -1369445 -479216
35189d79216J424746q3911j261012m15160J165625J383250K84346n40456n82014
35180H96198o79396r57182m68697O83689Q24289o13501j624709n13344J198285
35171a254368R42799p73810j100112N81765J710477P26889o10660l85868M69975
35162C07087K23729n51941k03189R64804J247721M15619k25813k61634m88354
35153A428029r21441o10362L50760O34312n3825m03105J87309N87753J13068j32952
35143A179546O20286J029864k62633k031923k037095m23197O33438L66079K02390
35134g23245Q81254J108057J1657j071328p33395J22933j50341j050732o93192
35125b298332R26729J613666K49420j507584j652279m70051M24615N65152O70337
$$ plain form
35189 -479216 945530 861619 -399393 -814553 351072 1734322 2018668 1478212 896198
35180 896198 216802 -740380 -1209077 -525388 298901 -314600 -1939309 -2452653 -1254368
35171 -1254368 -311569 -1085379 -2185491 -1603726 106751 833640 222980 -162888 307087
35162 307087 530816 -21125 -224314 740490 1988211 2403830 2178017 1916383 1428029
35153 1428029 506588 -103774 246986 881298 827473 424368 611677 1199430 1312498 1179546
35143 1179546 1799832 2829696 2567063 535140 -1501955 -1925152 -1291714 -925635 -723245
35134 -723245 158009 1266066 1277723 206395 -527000 -404067 -554408 -1605140 -2298332
35125 -2298332 -1371603 242063 491483 -1016101 -2668380 -3138431 -2713816 -2148664 -1478327
35116a478327Q17178K54688q68939j127001J23780J411735R87144o16690j195404
35107a691836R736J241260Q49680l33681m78080L37418M69243l66846n95076L94468
35097a63714J006658J20062q64250l06410Q61770O98011m77558p78577r5264j03395
35087a02667j008968j014954M15040J334264M15056r53658j016255j98324J92584
35078a937882J71489L44608L35213l42995q86233l37950O70960Q32123J38708
35069a011959l87914k76813L03854J235980J976219J309260r57690k868653k471444
35060c149160m61853Q59226O59998J2884k09235j68859n8583J99426L68244K30906
35050a717006K15321O12749P63785J82987l11365P4390O05069L80583J05640O36210
$$ plain form
35116 -1478327 -661149 -406461 -1275400 -2402401 -2278621 -866886 120258 -496432 -1691836
35107 -1691836 -1682100 -440840 408840 75159 -402921 -65503 403740 36894 -558182 -163714
35097 -163714 842944 963006 98756 -207654 654116 1352127 874569 95992 728 -102667
35087 -102667 -1111635 -2126589 -1711549 -377285 37771 -915887 -1932142 -2130466 -1937882
35078 -1937882 -1766393 -1421785 -1086572 -1429567 -2315800 -2653750 -1982790 -1150667 -1011959
35069 -1011959 -1399873 -1676686 -1372832 -136852 1839367 3148627 2190937 -677716 -3149160
35060 -3149160 -3611013 -2751787 -2091789 -2078905 -2288140 -2456999 -2515582 -2316156 -1947912 -1717006
35050 -1717006 -1501685 -888936 -125151 57836 -253529 -179139 425930 806513 912153 1548363
35040A548363R21239l06856j804666j448222J68673O84097k4074r128P92574L77963
35030H99963j199983j281321P71924K000482N48052j346156j127838K12061M50877
35021g1939j93297l01878q6845l07854j21395J227267K036421L98422k214866
35012C64036k591676m78816J205443P64957l25452k30944P70097J355642J003145
35003A836432N504j139620j754929j309688j62576O75250P12988L64201J78403
34994e94035K65038M27354L94318M8475k78416j01066L91943M42826n2960l09307
34984F34170n1974n1001n98879p12159J66335R06013M12465m68486k50903Q53043
34974H38624J445281J106246M92277j59399j029776j622987j223589k27312L22180
$$ plain form
35040 1548363 2469602 2162746 358080 -1090142 -921469 -237372 -261446 -270574 522000 899963
35030 899963 -300020 -1581341 -809417 1191065 1739117 392961 -734877 -522816 -71939
35021 -71939 -265236 -567114 -653959 -961813 -1083208 144059 2180480 2578902 364036
35012 364036 -2227640 -2706456 -1501013 -736056 -1061508 -1292452 -522355 833287 1836432
35003 1836432 1841936 702316 -1052613 -2362301 -2524877 -1849627 -1136639 -772438 -594035
34994 -594035 -328997 98357 492675 541150 262734 161668 553611 996437 943477 634170
34984 634170 582196 531195 -67684 -779843 -613508 292505 704970 236484 -14419 838624
34974 838624 2283905 3390151 3882428 3723029 2693253 1070266 -153323 -380635 -58455
34965e8455K48814Q3749j31702n54214o08121J51275P81652K17545p11131l99938
34955i80526P49400P87126n66550j361226m71549Q29392J046580M36047l6875
34946D31819j97595k38932o1205J61312j28355p34043n90429N34716J343732P79290
34936A300310n09064j222058j012320k94114O49950J537462J761656J009809k12624
34927C009007j164319j533169j296095n82013J00310K27566J1067j5472j06432
34918a349550q40522j558171q67680R13170J627739M34853p11706l5672J289966
34909a097573J139196j21577l89743O86598J295073M62435o54332q89247o67251
34900b36421p37210p45757p0509Q57904J053435L26925n67484q62785m22858K68600
$$ plain form
34965 -58455 190359 274108 142406 -411808 -1019929 -868654 -87002 130543 -580588 -980526
34955 -980526 -231126 556000 -10550 -1371776 -1843325 -1013933 32647 468694 431819
34946 431819 234224 -4708 -65913 95399 -32956 -766999 -1357428 -822712 521020 1300310
34936 1300310 791246 -430812 -1443132 -1737246 -1087296 450166 2211822 3221631 3009007
34927 3009007 1844688 311519 -984576 -1566589 -1466279 -1238713 -1227646 -1243118 -1349550
34918 -1349550 -2190072 -3748243 -4615923 -3702753 -2075014 -1640161 -2351867 -2387539 -1097573
34909 -1097573 41623 -79954 -469697 216901 1511974 1974409 1320077 430830 -236421
34900 -236421 -973631 -1719388 -1789897 -931993 121442 448367 -119117 -981902 -1404760 -1136160
34890a136160M93430K706n15843j62942Q10516J057795k4087j225598j058814
34881a758997J50855P33544Q6776n40257j5528R74620J013596N7856o43703m92712
34871d33950k15374l91632m68356Q1448N27083j32784j409341j715968n15364
34862d674238R51123J334614P17016P1216p7055J31951M72906P57822O69678J14073
34852D69106l94145k72673K49358L70556j12149m90736k52893J17035j3451k61672
34842e91664K02516J059320R31526m98772j546928o97629J051944J451365K78908
34833A640586l85457N27117J346980L33933j476566j796533n16364L59257r0975
34824e8022n63249Q7097J060857J031178R6051o47423o84189l66399j29299j26150
$$ plain form
34890 -1136160 -642730 -640024 -1155867 -1318809 -508293 549502 525415 -700183 -1758997
34881 -1758997 -1608142 -874598 -787822 -1328079 -1343607 -368987 644609 702465 58762 -433950
34871 -433950 -649324 -1040956 -1509312 -1427864 -900781 -1033565 -2442906 -4158874 -4674238
34862 -4674238 -3723115 -2388501 -1671485 -1600269 -1677324 -1545373 -1072467 -314645 355033 469106
34852 469106 74961 -197712 51646 422202 310053 -180683 -433576 -316541 -329992 -591664
34842 -591664 -389148 670172 1601698 1102926 -444002 -1141631 -89687 1361678 1640586
34833 1640586 1255129 1782246 3129226 3463159 1986593 190060 -326304 32953 -58022
34824 -58022 -621271 -534174 526683 1557861 1653912 1006489 322300 -44099 -173398 -299548
34814b99548l05618l81374o6800L85116L80745m3688j49685K72009M49779l7132
34804B03804l80295J69821R55043R39240M48700N73607J200007J103931Q38r66129
34794D248567j089196j029336j295461j167688j35188P44891K86616p77883p34048
34785i48726M63801J092194L13998o36063m64130L44527N74462J16113k94092
34776E62084m19362n09395m56770n6593K51797j8410l47812J00154R23794Q96052
34766I25539m1782n52465K4447O83292M05152l72072o95263n11720k64211J04230
34756b94853P51409J126652N68741n75819j239135q66633J70832J092788J175012
34747A908994J64726j212019j631343o68961N30864O82035m6839n35506l09733
$$ plain form
34814 -299548 -605166 -986540 -1053340 -668224 -287479 -331167 -480852 -208843 240936 203804
34804 203804 -176491 -6670 948373 1887613 2336313 2909920 4109927 5213858 5214696 4248567
34794 4248567 3159371 2130035 834574 -333114 -468302 276589 563205 -214678 -948726
34785 -948726 -484925 607269 921267 285204 -178926 165601 740063 856176 562084
34776 562084 142722 -366673 -823443 -880036 -628239 -646649 -994461 -894307 29487 925539
34766 925539 883757 331292 355739 1039031 1444183 1072111 376848 -134872 -399083 -294853
34756 -294853 456556 1583208 2151949 1576130 336995 -529638 -358806 733982 1908994
34747 1908994 2073720 861701 -769642 -1438603 -907739 -225704 -272543 -808049 -1117782
34738a117782J59957L96169L64421J92286N1372J16416K41689O2593k92753k69988
34728i5620O098k96465j076010r16800O43954J811919R94370o02675p19664M89176
34718B38283R24243L910p12358l82230m850k11939j31468O72874J038318J32426
34708A567209r79389r54444j95091Q135m87944p04348j19175P42570J075172N81659
34698E34354k78871o03775L608P70219O48989j90696o28061l03296J7711j16572
34688a46390k44339q7825k4343j09512J22759M83048J09241q19687q13973O26752
34678i04269J815777J121267o85338j550798q02683M77856J125575Q36110j22354
34669A311143j164791j574339j094613j73889O15640R65377O51535j67087m75896
$$ plain form
34738 -1117782 -957825 -561656 -197235 -4949 46423 162839 404528 467121 174368 -95620
34728 -95620 -89522 -385987 -1461997 -2378797 -1734843 77076 1071446 468771 -250893 238283
34718 238283 1162526 1166436 454078 71848 66998 -144941 -276409 396465 1434783 1567209
34708 1567209 587820 -366624 -561715 -553580 -1041524 -1745872 -1865047 -1122477 -47305 534354
34698 534354 255483 -348292 -344684 425535 1074524 883828 255767 -47529 -29818 -146390
34688 -146390 -390729 -478554 -502897 -612409 -489650 -6602 102639 -717048 -1531021 -904269
34678 -904269 911508 2032775 1347437 -203361 -1006044 -528188 597387 1433497 1311143
34669 1311143 146352 -1427987 -2522600 -2696489 -2080849 -1115472 -463937 -631024 -1106920
34660a106920N23637J726087J118734j069129k093317n31224J509007J450967
34652A527842k25563j345216j390251j276335r27723L81655J801869J561776j14133
34643f079j000713j27142R67415P92253q8845m50609l21519m20453o49428k70410
34633a575530P69774J489521R33601o20895j659647r64572P70012J520932M85748
34624A148944q56830r14448j16227K73571L72885R68500J365309J78517j856748
34615E63473k211440k44458J550632J007158p65317j267479j17484R52783Q52014
34606C19882K34653J862P1475n1336l75414n59652m98164l66666k42538P463L90352
34595a068083N42674J12788n99846p73436q7677P14024P01025k2888m67140n9754
$$ plain form
34660 -1106920 -583283 1142804 2261538 1192409 -900908 -1432132 76875 1527842
34652 1527842 1302279 -42937 -1433188 -2709523 -3637246 -3255591 -1453722 108054 -6079
34643 -6079 -1006792 -1133934 -166519 625734 536889 86280 -235239 -655692 -1305120 -1575530
34633 -1575530 -805756 683765 1617366 996471 -663176 -1627748 -857736 663196 1148944
34624 1148944 292114 -622334 -738561 -464990 -92105 876395 2241704 2420221 563473
34615 563473 -1647967 -1892425 -341793 665365 -99952 -1367431 -1484915 -532132 319882
34606 319882 554535 556397 627872 576536 201122 -358530 -856694 -1223360 -1465898 -1458435 -1068083
34595 -1068083 -525409 -412621 -1012467 -1785903 -1873580 -1159556 -458531 -481419 -948559 -1008313
34585a008313O70199Q12628J45334o98778j007739p44046l70638p965P08517J596939
34575I6138J489657j84869j896216j583864L50017J390918N85049j80884M98007
34566E63953J108221j19622j890254j617664M93349J719341Q45337n02612o97758
34557i7709j00607L14520M82362O25916M81797q2951n98892o42005k62920L75762
34547D95273J061250J295547Q10562J38429j45124l36777q33083j099538o29833
34538G56706j69788m77019p05517J16849R01983J44517j041467m53550J085617
34529A58331O59119j504020j681545J245996L310237J352792k001963k327663
34521g88716K44709K077061J662143O68164K92986n6837o50970q42078p09867
$$ plain form
34585 -1008313 -338114 474514 619848 -78930 -1086669 -1830715 -2201353 -2209318 -1500801 96138
34575 96138 1585795 1400926 -495290 -2079154 -1729137 -338219 246830 65946 563953
34566 563953 1672174 1552552 -337702 -1955366 -1462017 257324 1102661 600049 -97709
34557 -97709 -198316 116204 598566 1224482 1706279 1623328 1024436 382431 119511 495273
34547 495273 1556523 2852070 3662632 3801061 3655937 3319160 2486077 1386539 756706
34538 756706 586918 109899 -595618 -478769 423214 567731 -473736 -927286 158331
34529 158331 817450 -686570 -2368115 -1122119 2188118 3540910 1538947 -788716
34521 -788716 -544007 1533054 3195197 3863361 4156347 4099510 3448540 2606462 1896595
34512A896595r94192j313192n52166Q94080J302583K53739p95957q53790n38239
34503g00539n01738l55888K58374Q72333J023324Q31063L79537m67951j352562
34494a4047j491670p54396J30958N49067M36814r5430o81447n13728O43361J535243
34484b55275Q40969o95207j104419j10150N69747P3377m05816K0859L14996m61624
34474a212543j100304n307J961585K349182O02139j094557q39245N05900P25373
34465A892223o63306j886908j439808n9250M99324l33j52747P10446J417817Q88130
34455A205588r9554k40084J69018l8817o78255n07080M87788R55855M58659M9991
34445A763109K17847J10957n32724n77708L75201Q48876j50447j267125r71878
$$ plain form
34512 1896595 902403 -410789 -962955 -68875 1233708 1487447 691490 -162300 -700539
34503 -700539 -1202277 -1558165 -1299791 -427458 595866 1426929 1806466 1338515 -14047
34494 -14047 -1505717 -2260113 -2129155 -1580088 -1143274 -1238704 -1920151 -2433879 -1790518 -255275
34484 -255275 585694 -109513 -1213932 -1324082 -754335 -680958 -1086774 -1065915 -750919 -1212543
34474 -1212543 -2312847 -2318154 -356569 1992613 2594752 1500195 660950 1166850 1892223
34465 1892223 1228917 -657991 -2097799 -2157049 -1657725 -1658058 -1810805 -1100359 317458 1205588
34455 1205588 1106034 865950 1034968 996151 317896 -189184 298604 1254459 1713118 1763109
34445 1763109 1980956 2091913 1559189 981481 1356682 2205558 2055111 787986 -183892
34436a83892j56969m98016j351833p51686J049662J676869M03570p19525k34222
34427g66042N42075j7212j110918r81940J80304P55042M34997N24879J562687
34418A123872K333744J681119P4028j205337j594345j412443j111957r28097r10057
34409a949473q57222m36050L68579J110963J339205R75003K23328n31780p34408
34400d91855r7853Q17693J047137M71145j1078J21945K28090k83920p43650k14386
34390H43268Q18380R72086M6314o66987l75729O1510m38381j462698j626417m49563
34380b278217R84571J268216K56935o97579k19627J331192K024760P33671j218552
34371B185370j706104o76655j1284n51319r46425o1832J080852R41588j68473
$$ plain form
34436 -183892 -340861 -838877 -2190710 -2942396 -1892734 -215865 187705 -531820 -766042
34427 -766042 -223967 -241179 -1352097 -2334037 -2153733 -1398691 -963694 -438815 1123872
34418 1123872 3457616 5138735 5212763 4007426 2413081 1000638 -111319 -1039416 -1949473
34409 -1949473 -2806695 -3242745 -2874166 -1763203 -423998 551005 774333 242553 -491855
34400 -491855 -589708 227985 1275122 1746267 1735189 1857134 2085224 1801304 1057654 843268
34390 843268 1661648 2633734 2680048 2013061 1637332 1698842 1260461 -202237 -1828654 -2278217
34380 -2278217 -1293646 -25430 231505 -466074 -685701 645491 2670251 3403922 2185370
34371 2185370 479266 -197389 -208673 -759992 -1706417 -1768249 -687397 254191 85718
34362H5718p73332m67881J0198L82533R31921J249615M91784r62815j557887o81779
34352a291925M71466P01836L63021L78607O25952L28277m46161p71412k99599
34343F0062K44180K86433L20776R36131J461276O72459j084792j744290k76110
34334H76125J491001J216232n06666j025155J79082N96889j200885k972974k100794
34325c447145M02564J538926P71862J73256O70272R19970J34796n12300q5914
34316E66287N63907M30343j14492l70716m81724o39211m19710J75684K35933n97393
34306f51092j327023j124273m91693n4857M96049J234610J164403r6474j054375
34297a904725l43617J047973J247369K98918l38623l60938o13572r33266k26286
$$ plain form
34362 85718 -687614 -1155495 -1145297 -762764 169157 1418772 1910556 947741 -610146 -1291925
34352 -1291925 -820459 -118623 244398 623005 1248957 1577234 1131073 359661 60062
34343 60062 304242 590675 911451 1847582 3308858 3981317 2896525 1152235 876125
34334 876125 2367126 3583358 3076692 2051537 2230619 2827508 1626623 -1346351 -3447145
34325 -3447145 -3044581 -1505655 -733793 -560537 109735 1029705 1164501 652201 566287
34316 566287 1130194 1560537 1446045 1075329 593605 -45606 -465316 -289632 -53699 -651092
34306 -651092 -1978115 -3102388 -3594081 -3648938 -3152889 -1918279 -753876 -850350 -1904725
34297 -1904725 -2248342 -1200369 47000 345918 7295 -353643 -967215 -1900481 -2126767
34288b126767J231460J712391O99958k89213j92737R3815m01315j006827p91929
34279a071164l13804n49355j056287p10607L30656Q92154P03216O25906R69099
34270a80186R27306L7622r18933j033328m69546O6525M13509P77269R05354L18431
34260H44023o89467j078745l51362P25081J009472K49141q33008j373017r74694
34251b472576J57159J260522J477582P48733K895j6318K40781n7780p20791r08907
34241b88700o29735o08124p19602o7018J081261J139611k16246j036144L6705
34232a307992J462340J167105j01333r1798J085345J104869o23524j875893j153949
34223c34830J22889J32582o67688q36179l06180J42129M97692R77201Q91529k70224
$$ plain form
34288 -2126767 -895307 817084 1517042 1227829 1035092 1128907 727592 -279235 -1071164
34279 -1071164 -1384968 -1934323 -2990610 -3701217 -3370561 -2478407 -1775191 -1149285 -180186
34270 -180186 747120 784742 -134191 -1167519 -1637065 -1570540 -1157031 -379762 525592 844023
34260 844023 154556 -924189 -1275551 -550470 459002 708143 -124865 -1497882 -2472576
34251 -2472576 -2315417 -1054895 422687 1171420 1174315 1157997 1398778 1340998 620207 -288700
34241 -288700 -918435 -1526559 -2246161 -2313179 -1231918 -92307 -308553 -1344697 -1307992
34232 -1307992 154348 1321453 1220120 1128322 2213667 3318536 2695012 819119 -334830
34223 -334830 -211941 -79359 -747047 -1583226 -1889406 -1747277 -1249585 -272384 619145 348921
34213C48921j400872j097603J44777P02824L15596Q4002K97138J44299l73561
34204h34479j52847R52507J495951N89521p49362j236986j036046q62542n08704
34195b342987N29300J689756J838721P84866o33160j659894k001979j472129k15101
34186c482607Q87729R71295L43113Q6547M98280P61046L21884k72627l30798p4406
34176b90544j03297k94652m9123N23603N52392k10013p48171j95071O74243M03352
34166B62719q23838j135066K64960J585598Q66578j067412j734370o31475K28155
34157b184151l82916j099016l61636J105051J609661J026012M57400K69478O9388
34148E09271J3729M81933Q41419K03848p94118o55029N52934J141014L59374o70633
$$ plain form
34213 348921 -1051951 -2149554 -2004777 -1301953 -986357 -902355 -605217 -460918 -834479
34204 -834479 -987326 -34819 1461132 2050653 1301291 64305 -971741 -1834283 -2342987
34195 -2342987 -1813687 -123931 1714790 2499656 1866496 206602 -1795377 -3267506 -3482607
34186 -3482607 -2594878 -1623583 -1280470 -1193923 -695643 65403 387287 114660 -216138 -290544
34176 -290544 -393841 -688493 -737616 -214013 338379 128366 -619805 -814876 -140633 262719
34166 262719 -561119 -1696185 -1431225 154373 1020951 -46461 -1780831 -2412306 -2184151
34157 -2184151 -2567067 -3666083 -4027719 -2922668 -1313007 -286995 170405 439883 509271
34148 509271 523000 1004933 1846352 2050200 1256082 601053 1153987 2295001 2654375 1983742
34138A983742r30737p20989l85004M27164J414546J259339k59922j327258o25422
34129H35459N48078K87508r53604j244344k35928O15248N00869M9747k50025o32394
34119d79386r06824m06200N51323O75352k92895r76698m34687M29493L86828k60636
34109a714330l97595P4089K60066j91939n80125k10153O87647J268294R84064
34100A80018Q2017o98615q84470o48992l73153q4213L66776Q26136R97946Q99208
34090F62658O75102J99814n51582j012347o71720j0240Q6065k84863k11071N11136
34080f07048J075589R69592N26751N9064m67297p65236m49457p9248n83413j410738
34070a731441r36897P81185J593664N52137m28222K77206J158302R3417j814021
$$ plain form
34138 1983742 1053005 332016 -52988 374176 1788722 3048061 2788139 1460881 835459
34129 835459 1383537 1671045 717441 -526903 -762831 -147583 353286 403033 153008 -479386
34119 -479386 -1386210 -1792410 -1241087 -565735 -858630 -1835328 -2270015 -1840522 -1453694 -1714330
34109 -1714330 -2111925 -2037836 -1777770 -1969709 -2549834 -2759987 -2072340 -804046 180018
34100 180018 262035 -436580 -1321050 -1970042 -2343195 -2427408 -2060632 -1234496 -236550 662658
34090 662658 1337760 1537574 985992 -26355 -698075 -708315 -622250 -907113 -1118184 -607048
34080 -607048 468541 1438133 1964884 2023948 1556651 791415 341958 262710 -320703 -1731441
34070 -1731441 -2668338 -1887153 -293489 258648 -169574 107632 1265934 1359351 -454670
34061d54670j698369N00935J823261O82845j160894j607648q89715k70768M4626
34052c030397M56579P59709O17153L88995N21202P48472O10291J64368l30214
34043I06158q02670j038704o79469O4384M54320L26205L14962O35465O17636n2569
34033G45718o32146m94132n1428J90378N30498J160604J284637K57042j067749
34024A923422j292848l91042M14946M34591J53760J67227L66354L27751p5376
34015B028785n76201p43134l95495M7875l5595n54932p07128j53955M60164N37440
34005i2176L23966J93305j9330l13528p1698P89035J093625M642j362616j278416
33995g33191P9318Q61792J77029q60644q50255K23791J304102J473032O79986
$$ plain form
34061 -454670 -2153039 -1652104 171157 854002 -306892 -1914540 -2804255 -3075023 -3030397
34052 -3030397 -2573818 -1814109 -1196956 -807961 -286759 461713 1072004 1236372 906158
34043 906158 103488 -935216 -1614685 -1550301 -1095981 -769776 -454814 180651 798287 745718
34033 745718 113572 -380560 -431988 -241610 288888 1449492 2734129 2991171 1923422
34024 1923422 630574 239532 654478 1089069 1242829 1410056 1776410 2104161 2028785
34015 2028785 1452584 709450 313955 361830 326235 -228697 -935825 -1089780 -629616 -92176
34005 -92176 231790 425095 405765 92237 20539 809574 1903199 1907841 545225 -733191
33995 -733191 -653873 207919 384948 -475696 -1325951 -1102160 201942 1674974 2354960
33986B354960k43297l88535N4615m2049r27268j281761l10369O07885p5186j375505
33976a626510j135829M80134J217553L67169l22032K17536P68097K44365n10432
33967b99949n38424m21841p73076q17485M4427Q20654O11737K64790P16480J064966
33957F72279J36634j202573j302217l97455m138l20512k51973M38672R65719J161030
33947a04534J381591J114316l07614j796707j478199L56833J405455P40241j04214
33938A207168O4663L93244l3220n16355k52405J85681J64110K78563R42606J067367
33928C501422k40602j752155j620980q8475J008591R46266O28903O10293L23103
33919C316366m80712j005753p06349k25056l56349q06394o98955Q0430P08627
$$ plain form
33986 2354960 2111663 1723128 1777743 1735694 808426 -473335 -783704 -175819 -251005 -1626510
33976 -1626510 -2762339 -2282205 -1064652 -697483 -1019515 -801979 -33882 210483 -299949
33967 -299949 -838373 -1260214 -2033290 -2850775 -2806348 -1985694 -1373957 -1109167 -392687 672279
33957 672279 808913 -393660 -1695877 -2093332 -2097470 -2417982 -2669955 -2231283 -1265564 -104534
33947 -104534 1277057 2391373 2083759 287052 -1191147 -834314 571141 1311382 1207168
33938 1207168 1271831 1665075 1631855 1115500 863095 1048776 1212886 1491449 2434055 3501422
33928 3501422 3260820 1508665 -112315 -200790 807801 1754067 2382970 2993263 3316366
33919 3316366 2835654 1829901 1123552 898496 542147 -264247 -963202 -882772 -174145
33910a74145N36004r2051l14331J22766N23040J71489o30260q65277j06789R40472
33900A10918J324044Q48302M8424m07658j35544O47327J009756J05216j552012
33891A998773k215418q97979J206782J985821Q56611p31481j202481n90808j09108
33882C00712l99456p36138j26423J122520J558308N22824p48821p11901K82514
33873A064139N01595n34571j274377m44376J060168J460925M71664n82994o21038
33864A101135N3718L52477l24224j336327j290131L03084J979185J825770O4352
33855B729039j120317o55351N0196l84076j057296m90662P24294Q54220j61215
33846D88832p55412k83807K65876R4133m42026p84369p73965k64326O42024J071311
$$ plain form
33910 -174145 361859 269808 -44523 78243 601283 772772 142512 -722765 -829554 110918
33900 110918 1434962 2283264 2331688 1924030 1788486 2435813 3445569 3550785 1998773
33891 1998773 -216645 -1114624 92158 2077979 2934590 2203109 1000628 409820 300712
33882 300712 -98744 -834882 -961305 161215 1719523 2242347 1493526 781625 1064139
33873 1064139 1565734 1031163 -243214 -687590 372578 1833503 2305167 1722173 1101135
33864 1101135 1154853 1507330 1183106 -153221 -1443352 -1140268 838917 2664687 2729039
33855 2729039 1608722 953371 1003567 619491 -437805 -928467 -204173 650047 488832
33846 488832 -266580 -550387 -284511 -190378 -632404 -1416773 -2190738 -2455064 -1813040 -741729
33836g41729L71192n67023l98394N10344O83413J22848K64492J209134J263438
33827B717715j06889j098995m50312N39767L06887m55045l16879L03259O9199
33818A508707p69640q33119o72N31194K91934n4177j95776m92887q12094n03480
33808a330010L32178Q44232Q29466Q89784J050373N39145o81680j407748q48371
33799B17369J81519M37448j18214n92156n58756m08232m76911m82011J0781Q43281
33789i45882J268622Q14480k5108l42384m5440O8773l32995n02708R3573O84736
33779G35667L27955n18974p18319k78898j18860k70871J25613R74716J018556
33770A276585l3458p26496o0846Q76079O15730m14580o91164j7456L09279m04031
$$ plain form
33836 -741729 -370537 -937560 -1335954 -825610 -142197 -19349 245143 1454277 2717715
33827 2717715 2610826 1511831 1061519 1601286 1908173 1453128 1136249 1439508 1508707
33818 1508707 739067 -94052 -94724 436470 728404 674227 478451 -14436 -826530 -1330010
33808 -1330010 -997832 -153600 675866 1565650 2616023 3155168 2473488 1065740 217369
33799 217369 398888 836336 718122 125966 -432790 -841022 -1317933 -1799944 -1789163 -945882
33789 -945882 322740 1137220 1112112 769728 724288 793061 460066 -42642 50931 735667
33779 735667 1063622 544648 -173671 -452569 -571429 -842300 -716687 258029 1276585
33770 1276585 1243127 516631 455785 1331864 1947594 1533014 841850 824394 1133673 729642
33760G29642j264969j153236j64831O84731P02789J38338k53205r7860K09143
33751d69458J38091j24541J0372M02372K12052o27770r31970M4244J271166J275117
33741A199675J79987o76639p14573m95300m00391k05233N6279L6381j7769M82444
33731e55139J128769P47205o47557j486465q96455j3041j05891n91073j96984
33722b616631P87299R71125J45462m25877j0702O23920N56188p898k52545J20560
33712a09099O75398P62845J12092p82272r80756k41489M48428J55002n39112l65303
33702h64266N31639O70715l52489r71840M0845J545287J485752k94293j896104
33693a04754j774672k81219J155759J517196P48196m64790j204450j010792k55501
$$ plain form
33760 729642 -535327 -1688563 -1853394 -1168663 -465874 -327536 -580741 -678601 -469458
33751 -469458 -331367 -455908 -445536 -43164 168888 -458882 -1390852 -1346608 -75442 1199675
33741 1199675 1379662 703023 -11550 -506850 -907241 -1112474 -1056195 -1019814 -1037583 -555139
33731 -555139 573630 1320835 673278 -813187 -1709642 -1722683 -1828574 -2419647 -2616631
33722 -2616631 -1829332 -858207 -712745 -1138622 -1149324 -525404 30784 22886 -229659 -109099
33712 -109099 566299 1329144 1441236 658964 -321792 -563281 -114853 40149 -498963 -864266
33702 -864266 -332627 338088 -14401 -986241 -945396 599891 2085643 1791350 -104754
33693 -104754 -1879426 -2160645 -1004886 512310 1260506 795716 -408734 -1419526 -1675027
33684a675027L32163M47748L14799K05399J99172K72592K82395j301n13068p27494
33674h62622k73614M38588O34416J20666n79522r28288q01264l30450K21459M81273
33664a879358K96249J4190L9587K09369Q1899k56593k76818Q8360K83299N0034
33654a349782j28891J60960N74025N86694L32679K76332L27670k4508p01625q55456
33644h01902l1761R83963J043647J53503n36363l40051N0824l00471j077118j102618
33634a958347m1736J101524J288685N62034l41326q50209p60077j78546L76883
33625h01115L44218j14585k60669N1862J01024l97375o01500J06120R04392O96289
33615B8661j12864k06934N60775R33914J70858r01099j096114l59849L70520L63994
$$ plain form
33684 -1675027 -1342864 -895116 -580317 -374918 -175746 96846 379241 377940 -135128 -862622
33674 -862622 -1136236 -697648 -63232 57434 -522088 -1450376 -2251640 -2582090 -2360631 -1879358
33664 -1879358 -1583109 -1568919 -1529332 -1319963 -1238064 -1494657 -1771475 -1683115 -1399816 -1349782
33654 -1349782 -1478673 -1317713 -743688 -156994 175685 452017 779687 755179 53554 -801902
33644 -801902 -833663 150300 1193947 1347450 811087 471036 521860 221389 -855729 -1958347
33634 -1958347 -2000083 -898559 390126 952160 610834 -239375 -999452 -1177998 -801115
33625 -801115 -456897 -571482 -832151 -780289 -679265 -1076640 -1678140 -1572020 -667628 28661
33615 28661 -84203 -291137 269638 1203552 1374410 473311 -622803 -982652 -612132 -248138
33605b48138j67980m11141J8694M55782J1126r57026j027278K40427J430157J212797
33595E57420J94629k66678k04539n73769j265244j214804k53336O61273R81943
33586a383105J000455Q72961N41505M18619P68546P25860m91709j756698j296756
33577f00322M52167J359035Q61003L68123L50234k69553j351438j127340M45469
33568D87378R18171n51139j320790M15006K274808J432544p03474r03061N51598
33559B601041O87788q95384j423527K79866J818855R07346j527263k988866k373670
$$ plain form
33605 -248138 -416118 -827259 -808565 -352783 -341657 -1298683 -2325961 -2085534 -655377 557420
33595 557420 752049 485371 280832 -292937 -1558181 -2772985 -3026321 -2365048 -1383105
33586 -1383105 -382650 490311 1031816 1450435 2218981 2944841 2453132 696434 -600322
33577 -600322 -148155 1210880 2071883 2440006 2790240 2520687 1169249 41909 487378
33568 487378 1405549 854410 -466380 -51374 2223434 3655978 2952504 2049443 2601041
33559 2601041 3288829 2393445 969918 1249784 3068639 3975985 2448722 -540144 -2913814
$$ [...]
##END NTUPLES=NMR SPECTRUM
##END=
