##TITLE=31Pdec_SR50_Cl
 CDCl3, 124 sc
 8.04.2021
##JCAMPDX= 6.0         $$ Bruker NMR JCAMP-DX V2.0
##DATA TYPE= NMR SPECTRUM
##DATA CLASS= NTUPLES
##ORIGIN= UXNMR, Bruker Analytische Messtechnik GmbH
##OWNER= root
$$ XWIN-NMR		Version 3.5
$$ Thu Apr  8 14:18:24 2021 Russian Standard Time (UT+4h)  she@DPX200
##.OBSERVE FREQUENCY= 81.013821
##.OBSERVE NUCLEUS= ^31P
##.ACQUISITION MODE= SIMULTANEOUS
##.ACQUISITION SCHEME= undefined
##.AVERAGES= 124
##.DIGITISER RES= 16
##SPECTROMETER/DATA SYSTEM= spect
##.PULSE SEQUENCE= zgpg30
##.SOLVENT NAME= CDCl3
##.SHIFT REFERENCE= (INTERNAL, CDCl3, 0, 248.564)
##AUDIT TRAIL= $$ (NUMBER, WHEN, WHO, WHERE, WHAT)
$$ ##TITLE= Audit trail, XWIN-NMR		Version 3.5
$$ ##JCAMPDX= 5.01
$$ ##ORIGIN= Bruker BioSpin GmbH
$$ ##OWNER= she
$$ F:/spectra/data/she/nmr/P31/1/pdata/1/auditp.txt
$$ ##AUDIT TRAIL=  $$ (NUMBER, WHEN, WHO, WHERE, WHAT)
(   1,<2021-04-08 14:16:15.21 +0400>,<she>,<DPX200>,
      <continue with go, POWCHK disabled, PULCHK disabled
       configuration hash MD5:
       00 E9 B6 7A A2 85 ED C7 34 08 36 98 17 FE 4E 26
       data hash MD5: 32K
       22 EA 99 6A 57 C3 B0 94 82 06 AB F9 F1 19 7B 49>)
(   2,<2021-04-08 14:16:34.28 +0400>,<she>,<DPX200>,
      <Start of raw data processing
       efp BC_mod = 2 LB = 1 FT_mod = 6 PKNL = 1 PHC0 = -4679.524 PHC1 = -176.1976 SI = 64K 
       data hash MD5: 64K
       63 17 5C 0D DF 2C D3 D3 76 7D AE 9B 38 06 1D C3>)
(   3,<2021-04-08 14:17:21.50 +0400>,<she>,<DPX200>,
      <pk PHC0 = -528.3104 PHC1 = 670.7997 
       data hash MD5: 64K
       2F 6A F4 C8 2C F0 FE 98 7E F2 DB F6 29 48 C4 6C>)
(   4,<2021-04-08 14:17:25.28 +0400>,<she>,<DPX200>,
      <abs ABSG = 5 
       data hash MD5: 64K
       6E 19 53 1C 21 6F E7 A4 03 5B 82 21 74 F1 35 AB>)
$$ ##END=
$$ 
$$ hash MD5
$$ 52 1A 62 7D 7D 97 C6 2D 17 93 B6 39 93 8C 29 A6
##$RELAX= 
##$RELAX= 
##$RELAX= 
##$RELAX= 
##$RELAX= 
##$RELAX= 
##$RELAX= 
##$RELAX= 
$$ Bruker specific parameters
$$ --------------------------
##$DU= <F:/spectra>
##$EXPNO= 1
##$NAME= <P31>
##$PROCNO= 1
##$TYPE= <nmr>
##$USER= <she>
##$AMP= (0..31)
100 100 100 100 100 100 100 100 100 100 100 100 100 100 100 100 100 100 
100 100 100 100 100 100 100 100 100 100 100 100 100 100 
##$AQSEQ= 0
##$AQ_mod= 1
##$AUNM= <au_zg>
##$AUTOPOS= <>
##$BF1= 81.014009
##$BF2= 200.13
##$BF3= 200.13
##$BF4= 200.13
##$BF5= 200.13
##$BF6= 200.13
##$BF7= 200.13
##$BF8= 200.13
##$BYTORDA= 1
##$CFDGTYP= 0
##$CFRGTYP= 5
##$CHEMSTR= <none>
##$CNST= (0..31)
1 1 145 1 1 1 1 1 1 1 1 1 1 1 1 1 1 1 1 1 1 1 1 1 1 1 1 1 1 1 1 1 
##$CPDPRG= <waltz16>
##$CPDPRG1= <>
##$CPDPRG2= <waltz16>
##$CPDPRG3= <>
##$CPDPRG4= <mlev>
##$CPDPRG5= <mlev>
##$CPDPRG6= <mlev>
##$CPDPRG7= <mlev>
##$CPDPRG8= <mlev>
##$CPDPRGB= <>
##$CPDPRGT= <>
##$D= (0..31)
0 1 0 0 0 0 0 0 0 0 0 0.03 2e-05 3e-06 0 0 0 0 0 0 0 0 0 0 0 0 0 0 0 0 
0 0 
##$DATE= 1617876804
##$DBL= (0..7)
120 120 120 11 120 120 24 19 
##$DBP= (0..7)
150 150 150 150 150 150 150 150 
##$DBP07= 0
##$DBPNAM0= <>
##$DBPNAM1= <>
$$ [...]
##$SUBNAM3= <"">
##$SUBNAM4= <"">
##$SUBNAM5= <"">
##$SUBNAM6= <"">
##$SUBNAM7= <"">
##$SUBNAM8= <"">
##$SUBNAM9= <"">
##$SW= 501.771253377433
##$SWIBOX= (0..15)
0 1 3 0 0 0 0 0 0 0 0 0 0 0 0 0 
##$SW_h= 40650.406504065
##$TD= 32768
##$TD0= 1
##$TE= 0
##$TE2= 300
##$TE3= 300
##$TEG= 300
##$TL= (0..7)
0 120 53 12 22 120 120 120 
##$TP= (0..7)
150 150 150 150 150 150 150 150 
##$TP07= 0
##$TPNAME0= <>
##$TPNAME1= <>
##$TPNAME2= <>
##$TPNAME3= <>
##$TPNAME4= <>
##$TPNAME5= <>
##$TPNAME6= <>
##$TPNAME7= <>
##$TPOAL= (0..7)
0.5 0.5 0.5 0.5 0.5 0.5 0.5 0.5 
##$TPOFFS= (0..7)
0 0 0 0 0 0 0 0 
##$TUNHIN= 0
##$TUNHOUT= 0
##$TUNXOUT= 0
##$USERA1= <user>
##$USERA2= <user>
##$USERA3= <user>
##$USERA4= <user>
##$USERA5= <user>
##$V9= 5
##$VALIST= <valist>
##$VCLIST= <CCCCCCCCCCCCCCC>
##$VD= 0
##$VDLIST= <DDDDDDDDDDDDDDD>
##$VPLIST= <PPPPPPPPPPPPPPP>
##$VTLIST= <TTTTTTTTTTTTTTT>
##$WBST= 1024
##$WBSW= 4
##$XGAIN= (0..3)
0 0 0 0 
##$XL= 0
##$YL= 0
##$YMAX_a= 19049
##$YMIN_a= -16851
##$ZGOPTNS= <>
##$ZL1= 120
##$ZL2= 120
##$ZL3= 120
##$ZL4= 120
##$ABSF1= 248.5645
##$ABSF2= -253.2056
##$ABSG= 5
##$ABSL= 3
##$ALPHA= 0
##$AQORDER= 0
##$ASSFAC= 0
##$ASSFACI= 0
##$ASSFACX= 0
##$ASSWID= 0
##$AUNMP= <proc_1d>
##$AZFE= 0.1
##$AZFW= 0.5
##$BCFW= 0
##$BC_mod= 2
##$BYTORDP= 0
##$COROFFS= 0
##$CY= -3
##$DATMOD= 1
##$DC= 0
##$DFILT= <>
##$DTYPP= 0
##$F1P= 0
##$F2P= 0
##$FCOR= 1
##$FTSIZE= 65536
##$FT_mod= 6
##$GAMMA= 0
##$GB= 0
##$INTBC= 1
##$INTSCL= 5.30512e-09
##$ISEN= 30
##$LB= 1
##$LEV0= 0
##$LPBIN= 0
##$MAXI= 10000
##$MC2= 0
##$MEAN= 0
##$ME_mod= 0
##$MI= 50
##$NCOEF= 0
##$NC_proc= -6
##$NLEV= 6
##$NOISF1= 182.463
##$NOISF2= 159.3651
##$NSP= 0
##$NTH_PI= 0
##$NZP= 0
##$OFFSET= 248.5645
##$PC= 4
##$PHC0= -5207.834
##$PHC1= 494.6021
##$PH_mod= 1
##$PKNL= yes
##$PPARMOD= 0
##$PSCAL= 0
##$PSIGN= 0
##$REVERSE= no
##$SF= 81.014009
##$SI= 65536
##$SIGF1= 159.3651
##$SIGF2= -187.1042
##$SINO= 113.3802
##$SIOLD= 16384
##$SREGLST= <1H.CDCl3>
##$SSB= 0
##$STSI= 65536
##$STSR= 0
##$SW_p= 40650.406504065
##$SYMM= 0
##$S_DEV= 0
##$TDeff= 32768
##$TDoff= 0
##$TI= <>
##$TILT= no
##$TM1= 0
##$TM2= 0
##$TOPLEV= 0
##$USERP1= <user>
##$USERP2= <user>
##$USERP3= <user>
##$USERP4= <user>
##$USERP5= <user>
##$WDW= 1
##$XDIM= 65536
##$YMAX_p= 486274236
##$YMIN_p= -28280525
$$ End of Bruker specific parameters
$$ ---------------------------------
##NTUPLES= NMR SPECTRUM
##VAR_NAME=  FREQUENCY,     SPECTRUM/REAL,   SPECTRUM/IMAG
##SYMBOL=    X,             R,               I
##VAR_TYPE=  INDEPENDENT,   DEPENDENT,       DEPENDENT
##VAR_FORM=  AFFN,          ASDF,            ASDF
##VAR_DIM=   65536,         65536,           65536
##UNITS=     HZ,            ARBITRARY UNITS, ARBITRARY UNITS
##FACTOR=    0.620285442955139, 1,           1
##FIRST=     20137.2065510759, 0,            0
##LAST=      -20513.1999529892, 0,           0
##MIN=       -20513.1999529892, -28280525,   0
##MAX=       20137.2065510759, 486274236,    0
$$ Real data points
##PAGE= N=1
##DATA TABLE= (X++(R..R)), XYDATA
$$ [...]
##PAGE= N=2
##DATA TABLE= (X++(I..I)), XYDATA
13002E3635R76031K468806J584044J264826L372588N138037K400789m504566r580260
12993C173930p106401J139742O559598L282499m746418q819520n949982o47980
12985a3114532K582949L624713L415900J587561o75719j39527L248625M669061
12977E199031J386700k290466j265896K303353K600910k95931r13010J842991
12969H567682K397089j914481n514308l194233J212488J029286j851985L01343
12961A032881P583320J0302279L055899o531191q361352l467455k91829j269865
12953B052687j317963J597170K888930j87972l688188l438866o89048J668821
12945a114429L417573M425824K698014j407255l679237k498294j847939l703660
$$ plain form
13002 53635 1029666 3498472 5082516 6347342 9719930 14857967 17258756 12754190 3173930
12993 3173930 -3932471 -2792729 3766869 7049368 2302950 -6516570 -12466552 -13114532
12985 -13114532 -10531583 -6906870 -3490970 -1903409 -2579128 -2718655 529970 5199031
12977 5199031 6585731 4295265 3029369 5332722 7933632 7637701 6724691 8567682
12969 8567682 10964771 9050290 3535982 341749 1554237 2583523 731538 1032881
12961 1032881 8616201 18918480 21974379 15443188 7081836 3614381 3322552 2052687
12953 2052687 734724 2331894 5220824 5032852 1344664 -2094202 -2783250 -1114429
12945 -1114429 2303144 6728968 9426982 8019727 4340490 1842196 -5743 -3709403
12937c709403l144260L000759Q229049N136745k179720l966194k65067K74273
12929C376182l751780l831931K959018P558276L387958l000352l155019j8313
12921C524039r13365l944231k046966L392015M169396p41422l544715q24919J589789
12912F59621m37717k763383j604836n95530l215432m838425J88787P922852R220508
12903D536445K652710m222078n568992k579691J522306M890983M889373m85977
12895E635079p142723p463157j013533L819226K272111Q1617K614915M614537
12887C418072o30031p590286n309038M436851Q199535J343393m800559r80935
12879a912998N896252M788223j992867l783554R51884L419162m95537m437822
$$ plain form
12937 -3709403 -6853663 -3852904 4376145 9512890 7333170 3366976 3101909 3376182
12929 3376182 -375598 -4207529 -1248511 6309765 9697723 6697371 3542352 3524039
12921 3524039 2610674 -1333557 -3380523 11492 4180888 3439466 -105249 -930168 659621
12912 659621 221904 -2541479 -4146315 -4741845 -7957277 -12795702 -12606915 -4684063 4536445
12903 4536445 7189155 2967077 -2601915 -5181606 -3659300 1231683 6121056 5635079
12895 5635079 -1507644 -8970801 -9984334 -6165108 -3892997 -3811380 -1196465 3418072
12887 3418072 2788041 -4802245 -10111283 -5674432 2525103 3868496 -932063 -1912998
12879 -1912998 3983254 8771477 6778610 2995056 3946940 7366102 6870565 2432743
12871B432743k634376J570998J864217j948737m832492l220093J925441O508620
12863A666321O316251R93896m202876l483115J921445M619026O62731n263445
12855C230234o233571j488326M053435O150007M331329N04603k637771k765829
12847E144111R0259L013929L218382J054006j097975j877143j530843o12793J45250
12838G547183m82850k716346m429485l354034n42417N70522q47692j294773J993229
12829c556663N927154M726456j648408n774653j904895N649714P275667N58659
12821A1253031o489272n939110M82314N077326M202512Q37425j027982n93401
12813G802843P51361J459750O91236q12359j025076O30173K008106J496948O81900
$$ plain form
12871 2432743 -201633 1369365 3233582 1284845 -3547647 -6767740 -4842299 1666321
12863 1666321 7982572 8976468 4773592 1290477 3211922 7830948 8493679 3230234
12855 3230234 -3003337 -4491663 -438228 5711779 10043108 10547711 7909940 5144111
12847 5144111 5234370 8248299 11466681 12520687 11422712 9545569 8014726 7401933 7547183
12838 7547183 7064333 4347987 -81498 -3435532 -3977949 -3407427 -4255119 -5549892 -3556663
12829 -3556663 2370491 7096947 5448539 -326114 -2231009 3418705 10694372 11253031
12821 11253031 4763759 -1175351 -693037 4384289 8586801 9424226 8396244 7802843
12813 7802843 8554204 10013954 10705190 9892831 8867755 9497928 11506034 13002982 13684882
12804A3684882J202320J139631j784557n193552m771298j056228J268329N66314
12796E055841k70696J63015l93769k658675l439636q55135K180113K342590M98093
12787B621741n60782j31965R53732K384887L697129L662414K054684J05983j670733
12778A3117090l564495m097723j103398L434717L922183j118119n858221m823749
12770i1715l10828J511571o88647k538877n25376L774792N687278K168002m589773
12761D396427p974912l643891M392235P713032L983767q48668j809853q24578
12753E383559j108488j623234r59646j133181k717096j543903M024691P695290
12745H017992M085617j571703r22027L702403K757596m446968p683659j700670
$$ plain form
12804 13684882 14887202 16026833 14242276 9048724 4277426 3221198 4489527 5055841
12796 5055841 4785145 4948160 4554391 1895716 -1543920 -2399055 -218942 2123648 2621741
12787 2621741 2060959 1928994 2882726 5267613 8964742 12627156 14681840 14787823 13117090
12778 13117090 9552595 5454872 4351474 7786191 11708374 10590255 4732034 -91715
12770 -91715 -402543 1109028 420381 -2118496 -2643872 1130920 6818198 8986200 4396427
12761 4396427 -3578485 -7222376 -2830141 4882891 8866658 8017990 6208137 5383559
12753 5383559 4275071 2651837 1692191 559010 -2158086 -3701989 322702 8017992
12745 8017992 12103609 10531906 9609879 13312282 16069878 11622910 3939251 2238581
12737B238581N256600L332525n352542j0498399o999426N06255M651457L085201
12729c779748o15162j813401P3550J757961J199290J22219J14155l27741j863974
12720e132851j292671K844467N426837K014048k232509P15181P724737P170580
12712A7237819l307667j1740860q278449J890425P269376M712014n41005l927486
12704C314167m415617k160527J032400J652299p39715j725246J147211L703875
12696A808847J897352r78070K71228L475121K259086l273833o202991l266741
12688d010001P22630N12786k596509l823663j565570J604149K855642J959173
12680d341363O60264L35832P30035J030334J246764J289085k12822l627673n708440
$$ plain form
12737 2238581 7495181 10827706 5475164 -5023235 -12022661 -11516406 -6864949 -3779748
12729 -3779748 -4394910 -6208311 -6134761 -4376800 -3177510 -3055291 -2941136 -3268877 -5132851
12720 -5132851 -6425522 -3581055 1845782 3859830 1627321 2342502 10067239 17237819
12712 17237819 13930152 2189292 -6089157 -4198732 3070644 7782658 7241653 3314167
12704 3314167 -1101450 -3261977 -2229577 -577278 -1316993 -3042239 -1895028 1808847
12696 1808847 3706199 2728129 2999357 6474478 8733564 5459731 -743260 -4010001
12688 -4010001 -3287371 -2774585 -5371094 -9194757 -10760327 -9156178 -6300536 -4341363
12680 -4341363 -3681099 -3345267 -2615232 -1584898 -338134 950951 738129 -2889544 -8597984
12671h597984l032266K047776L503506M08103j643342M91094K942427K098755
12663a781931M74393J230210K402275J480443N80923J731338K074833m42846j898783
12654E850855N24746J874375k262683o281307k928231L606964L941632q50193
12646C476158k035169Q50483M01786l164249j579136N011482O238440k39266l826500
12637E134029O077J160001o217136j1075320l353315Q022505Q786865J171554
12629C635260k479856l15694J9230k317534j407527J976214J398223k163071j607517
12620c262272K795670L987670J485088J324382L102998N21600m816977m252641
12612H85518J784481K975380k702845m813602J081485N648694K639783r51567
$$ plain form
12671 -8597984 -11630250 -9582474 -6078968 -5670865 -7314207 -6823113 -3880686 -1781931
12663 -1781931 -1307538 -77328 2324947 3805390 4386313 6117651 8192484 7749638 5850855
12654 5850855 6375601 8249976 5987293 -294014 -3222245 384719 4326351 3476158
12646 3476158 1440989 2291472 2693258 -470991 -2050127 2961355 9199795 8960529 5134029
12637 5134029 5140106 6300107 82971 -10992349 -14345664 -6323159 2463706 3635260
12629 3635260 1155404 839710 858940 -1458594 -2866121 -889907 508316 -1654755 -3262272
12620 -3262272 -466602 3521068 5006156 6330538 9433536 9955136 5138159 885518
12612 885518 2669999 5645379 2942534 -1871068 -789583 4859111 7498894 6547327
12604F547327O61500J462301l160177n928683j325949K692709j080912m807524
12596d939408O00760Q048357O383115P23791K847523Q324902L183733j0099899
12588A5072874j4077664m398357L569645K26434m562213l86103O912950O704874
12580I062440l34808o861086r924461r086160k268807Q151428J2742022O825523
12572H306091j380519k002771K933864M532593K39592n331176q268354p217055
12564h187735j547525N848573P957105K127879m685851n077762j215117O50622
12556d129811R17531L876845P707058O149168q94026o313288n628786j619537
12548F5154J324197K252102K421110K966353M168279M547069J744738l492569
$$ plain form
12604 6547327 7208827 8671128 5510951 -417732 -1743681 949028 -131884 -4939408
12596 -4939408 -4338648 3709709 10092824 10816615 13664138 21989040 25172773 15072874
12588 15072874 995210 -3403147 166498 392932 -4169281 -4555384 2357566 9062440
12580 9062440 8727632 1866546 -8057915 -17144075 -19412882 -11261454 1480568 8306091
12572 8306091 6925572 4922801 7856665 12389258 12628850 7297674 -970680 -8187735
12564 -8187735 -9735260 -3886687 4070418 6198297 1512446 -3565316 -4780433 -4129811
12556 -4129811 -3212280 664565 8371623 14520791 13626765 7313477 1684691 65154
12548 65154 1389351 3641453 6062563 9028916 13197195 17744264 19489002 15996433
12540A5996433o595986n087731k104802r65435j51794K279887L531936N24618
12532G427126m033321n473260l941317k206789k45997K547130L638557J782789
12524e05082R85581L582732M237730j312492o639245l617640L212241K956983
12516B900808l523243m820549J855760O114812J646595m306204l567119J218678
12508b480462L177899J320301j424061l528642l602008J29866N305435O283223
12500E181551K434130o02232o4328P22634K07908J155509K773523n6896o000662
12491E751137o139241J243878N623618P89814m651461k239934J731546j789572
12483C19785p272635l358663P119463J0656753L747134l787552n156180l464607
$$ plain form
12540 15996433 9400447 4312716 2207914 1242479 1090685 3370572 6902508 7427126
12532 7427126 3393805 -2079455 -6020772 -8227561 -8473558 -5926428 -2287871 -505082
12524 -505082 480499 4063231 8300961 6988469 349224 -3268416 -56175 2900808
12516 2900808 -622435 -5442984 -3587224 2527588 4174183 -132021 -3699140 -2480462
12508 -2480462 697437 2017738 593677 -2934965 -6536973 -6407107 -1101672 5181551
12500 5181551 7615681 7013449 6949121 7671755 7879663 9035172 11808695 11751799 5751137
12491 5751137 -388104 855774 6479392 7269206 2617745 377811 2109357 319785
12483 319785 -6952850 -10311513 -3192050 7464703 11211837 7424285 2268105 -1196502
12475a196502j930943P14244L371792J813948k870877m274440j041418J458853
12467c955343J229682K118624M384309K777545k795999m630705J60279L736898
12459C025290J75667m447320j929887M985563P563928M194853M97135l98953j44276
12450A3522000J14663N13759n23456l874954n730837k284781K688929J844934
12442F270257m081813n862950J049344R461536J0076330L049837m362913p575225
12434H024403o882500k881129L843253Q968769O820182j566525p696668n740918
12426B888867N11623L913663L264351K039303J186971r84829l508906l613105
12418E697938k333834k971976l966688m49559N998677P185097R29171m222599
$$ plain form
12475 -1196502 -3127445 -2413201 958591 2772539 -98338 -4372778 -5414196 -3955343
12467 -3955343 -2725661 -607037 3777272 6554817 3758818 -871887 -711608 3025290
12459 3025290 3200957 -1246363 -3176250 1809313 9373241 13568094 14065229 13666276 13522000
12450 13522000 13636663 14150422 13626966 9752012 4021175 1736394 4425323 6270257
12442 6270257 2188444 -3674506 -2625162 6836374 16912704 19962541 15599628 8024403
12434 8024403 1141903 -1739226 2104027 11072796 17892978 16326453 8629785 2888867
12426 2888867 3400490 7314153 10578504 12617807 13804778 12819949 9311043 5697938
12418 5697938 3364104 392128 -3574560 -4024119 1974558 9159655 10088826 5866227
12410E866227j803162K744510J776892j947699j116269K903956K759621j869943
12402I314133m211124k364457j455017l365063l655340m55920J959042Q74358
12394c359388r35313j247389j400944j237052J702368N607260M646159j263228
12386B512473m648495j988289R67033k21498j165611K239361N172135K167423
12378E034532k544717j796364K414305K754116j103837l217655k097510j548517
12370b105647k059891l12365K900896K862254k15127o57924K793488M289592N10729
12361H006005l979588m213539j619016J73036J043484K105520K208727O88457
12353D413086p1637J352688K117538k56201k791155j028449L682574N395450J709332
$$ plain form
12410 5866227 4063065 6807575 8584467 6636768 5520499 8424455 11184076 9314133
12402 9314133 5103009 2738552 1283535 -2081528 -5736868 -6192788 -4233746 -3359388
12394 -3359388 -4294701 -5542090 -6943034 -8180086 -6477718 -870458 3775701 2512473
12386 2512473 -2136022 -4124311 -3157278 -3378776 -4544387 -2305026 2867109 5034532
12378 5034532 2489815 693451 3107756 5861872 4758035 1540380 -557130 -2105647
12370 -2105647 -4165538 -4477903 -1577007 1285247 1070120 412196 3205684 7495276 8006005
12361 8006005 4026417 -187122 -1806138 -1633102 -589618 1515902 3724629 4413086
12353 4413086 4341449 5694137 7811675 7555474 4764319 3735870 7418444 12813894 14523226
12344A4523226l124526l984132j125137P27915j547203n536522n886128p80313
12336f732820N209580O034777J331363l215933k664091J989197N781094N171306
12328A2904473Q31976l581912m875797l166144r82097P11626L369412O245960
12320A1457497M597919l208361r899176p240474J521380M991472j18395m799654
12312b697792k465399J406049n1518l194695r99924M144841M645333Q95757j03647
12303A579005K407378K030890k563374m762880j533583J691261J127679O99244
12295F75620L121200L324912k471031q019907n526798J891240M761975J345697
12287h97092j401023L06523K639358K134596N92671P3737p24623k432730k458367
$$ plain form
12344 14523226 11398700 7414568 6289431 7017346 5470143 -66379 -5952507 -6732820
12336 -6732820 -1523240 4511537 5842900 2626967 -37124 1952073 7733167 12904473
12328 12904473 13736449 10154537 5278740 2112596 1130499 1842125 5211537 11457497
12320 11457497 16055416 12847055 2947879 -4292595 -2771215 2220257 2101862 -2697792
12312 -2697792 -5163191 -3757142 -3808660 -7003355 -8003279 -3858438 786895 1682652 1579005
12303 1579005 3986383 6017273 3453899 -1308981 -2842564 -1151303 -23624 675620
12295 675620 3796820 7121732 4650701 -3369206 -8896004 -7004764 -2242789 -897092
12287 -897092 -2298115 -1991592 647766 2782362 3375033 3448770 2724147 291417 -2166950
12278b166950M79803L205433K483118m24553k237293k185203j657821j444702
12270c948168j486199j655007j166272R61266L574929L787776J139846j199294
12262H877j178310j055894l375959o270631n928488k047622K254853M668677M882223
12253h042274K904167l58155j651576J672155P016361Q299582L365723l073419
12245A0132564n166950k482623N63184L22970k502213m292050k639444Q99901
12237e164661K413281L99534k023340j033593K604922M250802J269427l827387
12229a111015o472212m628583j6596L706522L818110J080043o47498J029016L403120
12220A60907K118938k133585m026023j417051J415579N81578j462608o00611J571259
$$ plain form
12278 -2166950 -1687147 1518286 4001404 3576851 1339558 -845645 -2503466 -3948168
12270 -3948168 -5434367 -7089374 -8255646 -7294380 -3719451 68325 1208171 8877
12262 8877 -1169433 -2225327 -5601286 -11871917 -17800405 -19848027 -17593174 -12924497 -8042274
12253 -8042274 -5138107 -5496262 -7147838 -5475683 1540678 9840260 13205983 10132564
12245 10132564 4965614 2482991 3046175 3369145 866932 -3425118 -6064562 -5164661
12237 -5164661 -2751380 -2351846 -4375186 -5408779 -2803857 1446945 2716372 -1111015
12229 -1111015 -7583227 -12211810 -12228406 -8521884 -4703774 -3623731 -4271229 -3242213 160907
12220 160907 2279845 146260 -3879763 -5296814 -3881235 -3299657 -4762265 -5362876 -3791617
12211c791617M72397k915141k555986K824826O611584L937854p83369q01484K290225
12202E289289J383878m034965o149380r85808M555498K472258m502817p145401
12194i117448l008499J789134L347504M614595P187301O163897j646457r830327
12186e00300r359641o98681P267444Q631433M745555j290679p133659q368135
12178f706663j469601Q157783R149027m48095q120198l571163N994514O150745
12170I136349l477171r282956m336849K801117L334819J379778M353150Q452097
12162A2360334M464132n651868r518455k367713N899856N328802r72978m148752
12154E393358l143446k932580l541680l47947N599437O961754J759069k642236
$$ plain form
12211 -3791617 -3319220 -6234361 -8790347 -5965521 646063 4583917 3800548 2999064 5289289
12202 5289289 6673167 2638202 -3511178 -4496986 58512 2530770 -1972047 -9117448
12194 -9117448 -12125947 -10336813 -6989309 -2374714 4812587 10976484 9330027 -500300
12186 -500300 -9859941 -10558622 -3291178 5340255 10085810 8795131 1661472 -6706663
12178 -6706663 -8176264 -18481 9130546 8682451 562253 -3008910 2985604 9136349
12170 9136349 5659178 -3623778 -7960627 -5159510 -1824691 -444913 3908237 12360334
12162 12360334 16824466 11172598 1654143 -713570 5186286 10515088 9542110 5393358
12154 5393358 2249912 -682668 -4224348 -4572295 1027142 7988896 9747965 7105729
12146G105729j013407J582353j213354n945552m805212J546872M988314K373578
12138D619321j209960j848337j489710j572935K11962L534030L159794k050462
12130C353703m539477R86091P515896N040886l667198o430708j09744M723396
12122F872845L59727o182399m110441M773807Q811940L062429m701343n347476
12114C539089K85990M302759K489476j568467k427303J93888J941713K60378k347547
12105F669976k635536j696038k523085l924941j748349L285629M587140n68758
12097A446038n505142l251455K885182M328536K66030k009511O86009L061514
12089A907201J089438j576627q13082Q79923k35314j851843L5912L172141K151069
$$ plain form
12146 7105729 6092322 7674675 6461321 515769 -4289443 -2742571 2245743 4619321
12138 4619321 3409361 1561024 71314 -1501621 -1289659 2244371 5404165 3353703
12130 3353703 -1185774 -199683 7316213 12357099 8689901 2259193 2149449 6872845
12122 6872845 7232572 1050173 -3060268 1713539 10525479 13587908 8886565 3539089
12114 3539089 3825079 8127838 10617314 9048847 6621544 6815432 8757145 9017523 6669976
12105 6669976 4034440 2338402 -184683 -4109624 -5857973 -2572344 2014796 1446038
12097 1446038 -4059104 -7310559 -4425377 -96841 169189 -1840322 -1154313 1907201
12089 1907201 2996639 1420012 606930 1486853 1251539 -600304 -564392 2607749 4758818
12080D758818k571695n306236l831262j297255L09497K408770M775120M194230
12072C439987J64994k933566j849697J105846J839282m23491l547360n071596
12064g275601l148639J887387N895071M617131P3049j144164K552855N062505
12056H519594K041075k527310l209754j352659j141974j924801q57406K34368
12048b18867k031552m698211j670971N445023P716425J808075m660353m000378
12040b310809J210664L218539L47728k124167n64945K349859K052758j732760
12032B446867m633906k857011K039327M553937J929069k121879k248118J427043
12024E35329M105791L364282J349143k05090k344933m560257l005222L145591
$$ plain form
12080 4758818 2187123 -3119113 -6950375 -8247630 -7938133 -5529363 -754243 3439987
12072 3439987 3604981 671415 -1178282 -72436 1766846 1343355 -2204005 -7275601
12064 -7275601 -10424240 -8536853 -2641782 1975349 2048398 904234 3457089 8519594
12056 8519594 10560669 8033359 4823605 3470946 2328972 404171 -453235 -218867
12048 -218867 -2250419 -6948630 -8619601 -3174578 4541847 6349922 1689569 -2310809
12040 -2310809 -1100145 2118394 2466122 341955 -222990 2126869 4179627 2446867
12032 2446867 -2187039 -5044050 -3004723 1549214 3478283 1356404 -891714 535329
12024 535329 4641120 8005402 9354545 9149455 6804522 2244265 -760957 2384634
12016B384634P344451L118093n720214q236053n77165Q278300P845742o85483
12008A3752305o936133m946294R88251M295654M382381L961870K606939j715941
12000A6389032o628101o806354j907407K161540J470164j003581r51072R17691
11992C641912J200003p88571l133816m279512l168233P94820N339131O133640
11984E739374K792616L03707J279088J509516k267084n438905k882239J452620
11976B488693O36010l036103j710709L891977M870237p24052m142530l66510L953585
11967E860598K048207k318389k311503Q46708J590652q6318J37692K724171L934674
11958A2426492K233136j61709j273962j183520q47984j666272m455580o953151
$$ plain form
12016 2384634 9729085 12847178 7126964 -1109089 -1686254 6592046 14437788 13752305
12008 13752305 6816172 1869878 2858129 7153783 11536164 15498034 18104973 16389032
12000 16389032 9760931 2954577 1047170 3208710 4678874 3675293 2724221 3641912
11992 3641912 4841915 4053344 919528 -3359984 -6528217 -5733397 -394266 5739374
11984 5739374 8531990 8835697 10114785 11624301 9357217 3918312 1036073 2488693
11976 2488693 3124703 88600 -1622109 2269868 7140105 6416053 2273523 1907013 5860598
11967 5860598 7908805 5590416 3278913 4125621 5716273 5629955 5767647 8491818 12426492
11958 12426492 14659628 14497919 13223957 12040437 11192453 9526181 5070601 -1882550
11950a882550n236604K54059L878060K705357Q77747K273862L488097k87126n929026
11941A41876n818626O37218N454710K862832l331622n123116j63387N879972O219113
11932F758970J032183k777767q35667K336383J78141m967709m909308N30265J961641
11923f92868m085098p879629j432444P783760P593502m67587m513521o74626L366287
11914a002224K375619K4156j83584o15695k937070l810847j090898J823323J473632
11905c943588p21294j939625j820061l89599L186262P116736O824292J390108
11897I703231l804434m035210j296389k47363j398568j902949o53640R84520K012348
11888f38454K404673J908253M81963r64473j863589k813076l751254k946878M16080
$$ plain form
11950 -1882550 -7119154 -6865095 -2987035 -281678 596069 2869931 6358028 6070902 141876
11941 141876 -5676750 -5039532 415178 3278010 -53612 -5176728 -5340115 539857 6758970
11932 6758970 7791153 5013386 4177719 6514102 6692243 1724534 -3184774 -2654509 -692868
11923 -692868 -4777966 -12657595 -14090039 -6306279 1287223 819636 -3693885 -4368511 -1002224
11914 -1002224 1373395 1397551 1213967 598272 -2338798 -6149645 -7240543 -5417220 -3943588
11905 -3943588 -4664882 -6604507 -8424568 -8814167 -5627905 1488831 8313123 9703231
11897 9703231 5898797 1863587 567198 319835 -1078733 -2981682 -3635322 -2650802 -638454
11888 -638454 1766219 3674472 4156435 3191962 1328373 -1484703 -5235957 -8182835 -7766755
11879g766755M052338M984064L251925J362125O32412K0856j392895k574390k109626
11870D60054n76382J00131m72861o04478M30634P63611p14487j310596J680414
11861b43960N275201L668499k801901o746095l658846K101539M015504J541857
11853C151798j752732l843429m125294j627974K458441M085301K078119N35270
11845I59500J675142J560656k096878m038044k58560L350328o535n662939m599247
11836i116577J182199K383555r42132J84870O532922P674054p68958r176318q138854
11827a0185239n02577N708696P444492N107332n30618n325370l817610J668629
11819d32265K431735k568515l996031K105977O989336M008504n85250Q609J023124
$$ plain form
11879 -7766755 -3714417 1269647 4521572 5883697 6516109 6536965 5144070 2569680 460054
11870 460054 -116328 -16197 -489058 -1093536 -662902 100709 -613778 -1924374 -243960
11861 -243960 5031241 8699740 5897839 -848256 -4507102 -2405563 1609941 3151798
11853 3151798 1399066 -2444363 -6569657 -8197631 -5739190 -1653889 424230 959500
11845 959500 2634642 4195298 2098420 -1939624 -2198184 1152144 1145609 -4517330 -9116577
11836 -9116577 -7934378 -5550823 -6492955 -6308085 224837 7898891 7129933 -2046385 -10185239
11827 -10185239 -10687816 -4979120 2465372 7572704 7042086 1716716 -2100894 -432265
11819 -432265 1999470 -569045 -4565076 -2459099 4530237 8538741 7953491 7962100 8985224
11810H985224l246442o776811k217199M292880K453960m186983l971997L161716
11802a505652O308895J980149k340730k738158l262702m559671j237601O439005
11794i16465R996674N814757M96762o67283q11628k872919l520032r68878l8777
11785F512211l380193n534466k262052J403752k58974l309959p73130M977496
11777b625315N556364P4098l486176n14228M175196M440359J088221j147199j093479
11768F467841j578389l537058l509983J228231P027133O910668r889n914640m033203
11759C050711K117023L959835J08961k992535k172219j729918m441278n631071
11751g730491r17038N528418O365755J577018k219682j415744Q94868P00788j747092
$$ plain form
11810 8985224 5738782 -1038029 -3255228 1037652 3491612 -695371 -4667368 -1505652
11802 -1505652 4803243 6783392 4442662 1704504 -1558198 -6117869 -7355470 -916465
11794 -916465 9080209 14894966 15391728 14724445 13912817 11039898 7519866 6550988 6512211
11785 6512211 3132018 -2402448 -4664500 -3260748 -3519722 -6829681 -7602811 -2625315
11777 -2625315 2931049 3005147 -481029 -995257 3179939 7620298 8708519 7561320 6467841
11768 6467841 4889452 1352394 -2157589 -929358 6097775 13008443 12998554 7083914 3050711
11759 3050711 5167734 9127569 9236530 6243995 4071776 2341858 -2099420 -7730491
11751 -7730491 -8647529 -3119111 3246644 4823662 2603980 1188236 2083104 2783892 1036800
11742A036800l401742k349814O03776K938001K850354J329927J073443K867110
11734F947855M562869M333005K875139J309624o97784l096098m164299l142738
11726H927573j962449k124040j980266L55133L268479L528784N98960l098858
11718G513316m805514k744492K734678P322282N307296k846774q680420n609999
11710a809627K261767O013369L774146P05626o34225k301077l850662j662784
11702B496533K792860K152600n435686j1107667o965390K482654O903284M205913
11694b474899J043061J451582K280744J35616l220857m140211j773020K040701
11686d657283M850346M846477K407194M92881J133448K128595L20944k662097
$$ plain form
11742 1036800 -2364942 -4714756 -4110980 -1172979 1677375 3007302 4080745 6947855
11734 6947855 11510724 15843729 18718868 20028492 19330708 16234610 12070311 8927573
11726 8927573 6965124 4841084 2860818 3215951 6484430 10013214 10612174 7513316
11718 7513316 2707802 -36690 2697988 10020270 15327566 12480792 3800372 -1809627
11710 -1809627 452140 6465509 10239655 10945281 10311056 8009979 4159317 2496533
11702 2496533 5289393 7441993 2006307 -9101360 -16066750 -13584096 -6680812 -2474899
11694 -2474899 -1431838 19744 2300488 2436104 -784753 -4924964 -6697984 -4657283
11686 -4657283 193063 5039540 7446734 7939615 9073063 11201658 11522602 8860505
11678H860505k201278J726455L629823N60769l592046m340756k933119k961149
11670a250796l965786k821365K79203J719948K29872q77029J708554O549256Q571596
11661A0143453M454247l422406q638849p040022j102698L260600L595924K149036
11653C399285P66810j306759l586819l109995J99701J434394j874670m212883
11645h290936M00482Q079632R030988J167238o920846p641114l060215M32545
11637f802226J038646J443948K896906L349783R09243l089985m858581k030531
11629g142797K917093M534411J278873j543735J151241O258886O439440J076230
11621A4969642k721121q25720K404263J841767q02125j096608O05575N27254k134853
$$ plain form
11678 8860505 6659227 8385682 12015505 12576274 8984228 4643472 1710353 -1250796
11670 -1250796 -5216582 -8037947 -7758744 -6038796 -5808924 -6685953 -4977399 1571857 10143453
11661 10143453 14597700 11175294 2536445 -4503577 -5606275 -2345675 1250249 3399285
11653 3399285 4166095 2859336 -727483 -3837478 -3637777 -2203383 -4078053 -8290936
11645 -8290936 -7890454 189178 9220166 10387404 3466558 -4174556 -7234771 -6802226
11637 -6802226 -5763580 -4319632 -1422726 1927057 2836300 -253685 -5112266 -7142797
11629 -7142797 -4225704 308707 1587580 43845 1195086 7453972 13893412 14969642
11621 14969642 12248521 11422801 13827064 15668831 14866706 13770098 14375673 14902927 12768074
11612A2768074m556018m823210l635179k114586o33288M49342O43774k57474k128851
11603d287416l875679l106231J205191N736185N769568J692710j191018k88970
11595A654340J239771P42161L72725K111607L236368R63728k263645k742538j551051
11586C763466j850799k978837k357063r86923j581402k845378j271053K189347
11578g918642K907928J40481j528944O50190L573939L265855N32938n90165J489546
11569B523126L420553M55442o888189j0749463m182609Q020560J2543024M694151
11561I836595m259044l000682L191822J642749o377826o974117L458934J0989977
11553H508408N363606m035947l125535N032726N839931l735527j0958764o957301
$$ plain form
11612 12768074 8212056 3388846 -246333 -2360919 -2994207 -2544865 -1901091 -2158565 -4287416
11603 -4287416 -8163095 -11269326 -10064135 -4327950 1441618 3134328 1943310 1654340
11595 1654340 2894111 3636272 4008997 6120604 9356972 10320700 8057055 5314517 3763466
11586 3763466 1912667 -1066170 -3423233 -4410156 -5991558 -8836936 -10107989 -7918642
11578 -7918642 -5010714 -4870233 -6399177 -5748987 -2175048 1090807 1623745 1033580 2523126
11569 2523126 5943679 6399121 -489068 -11238531 -15421140 -7400580 5142444 9836595
11561 9836595 5577551 2576869 5768691 7411440 1033614 -5940503 -2481569 8508408
11553 8508408 13872014 9836067 6710532 11743258 17583189 13847662 2888898 -4068403
11545d068403J176025K657059j337164j734685L464238O715627L022971k711104
11537G184564l270387O46677K268738j141073m777747l439462J560114M662075
11529C693499L058457r29101l538411l568853k576886k167106j678684R17983
11521f789102N448120Q195975O080268J202425j632362j395312j194225k264067
11513G651720k279659o73823m30455k288934k347174J265921M335836L227206
11505H460638O77804J27680p01720m516833p467790m865185p6651O25623q43113
11496h579547K109596P776948P243734p80080o536979l564700K586447M077317
11488D332736J413189n51560q54108j414581k446489l271511l915698k935309
$$ plain form
11545 -4068403 -2892378 -235319 -1572483 -3307168 157070 6872697 9895668 7184564
11537 7184564 3914177 4560854 6829592 5688519 910772 -2528690 -968576 3693499
11529 3693499 6751956 5822855 2284444 -1284409 -3861295 -6028401 -7707085 -6789102
11521 -6789102 -1340982 6854993 12935261 14137686 12505324 11110012 9915787 7651720
11513 7651720 5372061 4698238 4267783 1978849 -368325 897596 5233432 8460638
11505 8460638 9138442 9266122 8564402 4047569 -3420221 -8285406 -8362057 -7736434 -8579547
11496 -8579547 -6469951 1306997 8550731 7770651 1233672 -2331028 255419 4332736
11488 4332736 5745925 5194365 4340257 2925676 479187 -2792324 -6708022 -9643331
11480i643331J743565P104496N914728k743374r452352o046778L452462Q850907
11472h19677O705475J599295k126877l782588l448613j389195M23803M94417N41365
11463a802595K419703L884226J544830l073877m707435j482411K647273L137347
11455B567061J93599j857420K57569M392458M654517r42677o085963l470213M310220
11446D019151P156212J681071l945714k427224K379460K745344j349962m437828
11438E820510m875216m933451m670690k536513M9029R30988J942296N310433P734145
11429D771531M907010o0632m81541K725007K174098l188585n239754N93092P469423
11420A3669649O645699o43207n974937n048431j293551L85846o40097j721617
$$ plain form
11480 -9643331 -7899766 -795270 5119458 2376084 -7076268 -13123046 -9670584 -819677
11472 -819677 5885798 7485093 5358216 1575628 -1872985 -3262180 -2838377 -2343960 -1802595
11463 -1802595 617108 4501334 6046164 2972287 -1735148 -3217559 -570286 2567061
11455 2567061 2760660 903240 1160809 5553267 10207784 9265107 3179144 -291069 4019151
11446 4019151 11175363 12856434 8910720 6483496 8862956 11608300 10258338 5820510
11438 5820510 945294 -3988157 -8658847 -11195360 -11146331 -10215343 -8273047 -2962614 4771531
11429 4771531 9678541 9617909 9136368 11861375 14035473 10846888 5607134 6200226 13669649
11420 13669649 20315348 19672141 13697204 8648773 7355222 7741068 7100971 5379354
11412E379354j389290j128155k301897k776103L78535M689874L600170l428193
11404C024295p512077k321848N340503M558940l428527p405379l395039Q66977
11396a0272155M6853j094829J568756L159314p91365m549863p13930O727065P428566
11387A508412K37954n527378m042744K26640J316742N9693J61156J371819J060328
11378c627378m82419p15550N25751R99054M70312J463795M378312N082418L21559
11369H415854o272237p543057k152388L613419M700452L471147L937777M194411
11361A2365378J22916n948897p090656k039022K826448K915515Q49432L96534
11353D397648O86885l27940j460989j086189n04627r78749j038503k09501j391512
$$ plain form
11412 5379354 3990064 2861909 560012 -2216091 -1837556 2852318 6452488 3024295
11404 3024295 -4487782 -6809630 -1469127 3089813 -338714 -7744093 -11139132 -10272155
11396 -10272155 -10225302 -11320131 -9751375 -6592061 -7383426 -11933289 -12647219 -5920154 1508412
11387 1508412 1746366 -3781012 -7823756 -7597116 -6280374 -6220681 -6059525 -4687706 -3627378
11378 -3627378 -4109797 -4825347 -4299596 -3300542 -2830230 -1366435 3011877 8094295 8415854
11369 8415854 2143617 -5399440 -7551828 -3938409 762043 4233190 8170967 12365378
11361 12365378 12488294 6539397 -551259 -2590281 236167 3151682 4001114 4397648
11353 4397648 5084533 4756593 3295604 2209415 1704788 726039 -312464 -521965 -1913477
11344a913477n277371o517877j054318N972915O250857L44547l330856j096970
11336f622550J783741Q34467p67979J362253M878067M229781o21749l878517j752837
11327e55323K923419M573044J315504l406481m895472k148556J516077K540703
11319A862915Q52565j084816j772181j800976k188925l132522l966463l120666
11311a4351069Q72510O576909R107896N072957k491226o875392n202151n85850
11303g875416K752888L345601J627192j012737j760185J279289N256174M862757
11295H475563k81693m537953m187952j990223j339789p71595J782121L735259
11287H83738K098230m48161L58754K684951J424368k780968m109171q53005K428842
$$ plain form
11344 -1913477 -7190848 -13708725 -14763043 -8790128 -2539271 -2194724 -5525580 -6622550
11336 -6622550 -4838809 -4004342 -4772321 -3410068 1467999 5697780 5076031 1197514 -555323
11327 -555323 2368096 6941140 8256644 4850163 -45309 -2193865 -677788 1862915
11319 1862915 2715480 1630664 -141517 -1942493 -4131418 -7263940 -11230403 -14351069
11311 -14351069 -13478559 -6901650 2206246 7279203 4787977 -2087415 -7289566 -7875416
11303 -7875416 -5122528 -1776927 -149735 -1162472 -2922657 -1643368 3612806 8475563
11295 8475563 8193870 3655917 -532035 -2522258 -3862047 -4633642 -2851521 883738
11287 883738 2981968 2533807 2892561 5577512 7001880 4220912 111741 -741264 1687578
11278A687578K539816J105187m18536k649020l824227m14686N470410O451976
11270I948498J049631k835693k83856K259323k361342r623995j0242815m648770
11262a6739019q81430r01072P72631N532075P835194N111548J661447O05005q7730
11253B908649j264512j92244K678362K470178j000398r39278M780805P804600
11245A7246162J830128o230410o105255K76977K776180o90649k301990J634988
11237H436131M717983J130912n307343o968502k673667J904545J938596j318546
11229A860109k649337O11238M632897L451955k351908n233936j375548L019840
11221A965310J098056l483158k287607L814452N571616K09819m211249j738507
$$ plain form
11278 1687578 4227394 5332581 4914045 2265025 -1559202 -1973888 3496522 9948498
11270 9948498 10998129 8162436 7878580 10137903 7776561 -1847434 -12090249 -16739019
11262 -16739019 -17620449 -18521521 -17748890 -12216815 -4381621 729927 2391374 2996379 2908649
11253 2908649 1644137 1451893 4130255 6600433 5600035 4660757 9441562 17246162
11245 17246162 19076290 12845880 6740625 7017602 9793782 9103133 6801143 8436131
11237 8436131 13154114 14285026 8977683 2009181 -664486 1240059 3178655 1860109
11229 1860109 -789228 -177990 4454907 7906862 5554954 321018 -1054530 1965310
11221 1965310 3063366 -419792 -2707399 1107053 6678669 6888488 2677239 938732
11213I38732K875107K846539n99609k293960j526874n17241J114605M241433N799499
11204A2878231K613265k315725l164237O9178J693877j053788m529846m682933
11196A508022k371314r56162j386063j695227j97283K230229L006781P87401k648765
11187a722381m136076k681650j35120J546577J943202J195384j82028l62027J953698
11178b580421M362304L010757j238276l218352j350615J15853q70023q0903M652539
11169B802863P255098K320497m760398m962381M05268K289351j199767k790029
11161A360502M74310K377963o90815k987923K05763L913357K130769j635027o07958
11152D540941L459719L619775j47721j404554J049376J165238l242526n796434
$$ plain form
11213 938732 3813839 6660378 6060769 3766809 2239935 1722694 2837299 7078732 12878231
11204 12878231 15491496 13175771 10011534 10080712 11774589 10720801 6190955 1508022
11196 1508022 -863292 -1819454 -3205517 -4900744 -5098027 -2867798 138983 926384 -1722381
11187 -1722381 -5858457 -8540107 -8675227 -7128650 -5185448 -3990064 -4172092 -4534119 -2580421
11178 -2580421 1781883 4792640 3554364 336012 -1014603 -898750 -1768773 -1849676 2802863
11169 2802863 10057961 12378458 7618060 2655679 3060947 5350298 4150531 1360502
11161 1360502 1834812 4212775 3521960 534037 739800 4653157 6783926 5148899 4540941
11152 4540941 8000660 11620435 11472714 10068160 11117536 12282774 9040248 3243814
11144C243814j674842M160625L998163j641744n513789l834336K62373K734367
11136A734631L235325K775407P66172l086789o095574m792496M26224N122719
11128H5619N807324L342519N39358j607086l248227k939736Q11162N267112M904569
11119A2962614q92326n263066k555043L138405L077397l594005q295332n142336
11111f563692J166495L063069Q94294L81156K123760Q45580m560064p317683k451886
11102a2418971N158028P362050L863203J000092J438003J648926m45768k138721
11094E466842k068463l251536o511810o730732p96067N449974M669935q31665
11086d603522k693051N90119K285724r09195l733771j113575M526916P754448
$$ plain form
11144 3243814 1568972 5729597 9727760 8086016 2572227 -1262109 -999736 1734631
11136 1734631 4969956 7745363 8511535 5424746 -670828 -5463324 -5037100 85619
11128 85619 5892943 9235462 9774820 8167734 4919507 1979771 2790933 8058045 12962614
11119 12962614 12070288 6807222 4252179 7390584 10467981 6873976 -1421356 -6563692
11111 -6563692 -5397197 -2334128 -1439834 -1058678 1065082 1910662 -2649402 -9967085 -12418971
11102 -12418971 -7260943 101107 3964310 4964402 6402405 8051331 7605563 5466842
11094 5466842 3398379 146843 -6364967 -13095699 -13891766 -8441792 -3771857 -4603522
11086 -4603522 -7296573 -6706454 -4420730 -5329925 -9063696 -10177271 -5650355 2104093
11078B104093O715455K520943k947173n949759k846719L730956N886338J101457
11070A0315591l598328k204061J479913J075465j997933k425610p81300j443459
11062D20278l681053k892108Q77014L152979K692241J959386J170187j092508
11054B606416k635844n54994J892927m42156m491014k484593M529177P003083
11046E423002K074952k275664j084823M67682j701202k885077M67219K785789
11038C271878p93830m819354k274513L828532O197371M619410K890728R1848n495013
11029G517057q535186l192968N503003P222514J587286k115527K18902K782392
11021A0987473P78748k828185l636848j911663j85810J03450j456889l477607
$$ plain form
11078 2104093 8819548 11340491 8393318 2443559 -403160 3327796 9214134 10315591
11070 10315591 6717263 4513202 5993115 7068580 5070647 2645037 1863737 420278
11062 420278 -3260775 -6152883 -5275869 -2122890 569351 2528737 3698924 2606416
11054 2606416 -29428 -584422 1308505 866349 -3624665 -6109258 -1580081 5423002
11046 5423002 7497954 5222290 4137467 4605149 2903947 18870 486089 3271878
11038 3271878 2478048 -2341306 -4615819 -787287 5410084 10029494 12920222 13012070 7517057
11029 7517057 -1018129 -4211097 1291906 8514420 10101706 7986179 8205081 10987473
11021 10987473 11766221 8938036 5301188 3389525 3203715 3307165 1850276 -1627331
11013a627331k539597J793947L844215n20334n781587l837625L074190N470982
11005a23140J498921j242153Q47946K507534M96160o57842K186732M551987K130557
10996A2196702k294980m335202m101940k722009Q97460N475092N769268M93370
10988A1377761l739350j437400L703697M749228J216263k040491k057146L09661
10980A2082223K522730J440494l976461q827608o272578K155838O548821K318502
10972G991961l227104k707612N72581L60751j254982R38389M253339K235091l405914
10963E756500m908772j118827J324754n62265k221063n26507J006049j248468
10955b498599m914126n042623k65701O231268R567728O843465L80467l524627
$$ plain form
11013 -1627331 -4166928 -2372981 1471234 950900 -4830687 -8668312 -5594122 -123140
11005 -123140 1375781 133628 981574 3489108 3985268 3327426 5514158 10066145 12196702
10996 12196702 9901722 5566520 1464580 -1257429 -359969 5115123 10884391 11377761
10988 11377761 7638411 6201011 9904708 14653936 15870199 13829708 11772562 12082223
10980 12082223 14604953 16045447 12068986 3241378 -3031200 -875362 5673459 7991961
10972 7991961 4764857 2057245 2629826 2990577 1735595 2673984 6927323 9162414 5756500
10963 5756500 847728 -271099 1053655 491390 -1729673 -2256180 -1250131 -2498599
10955 -2498599 -7412725 -12455348 -12721049 -6489781 3077947 9921412 10301879 6777252
10947F777252j761689J442603Q89890j730313j343282J513373J775279j017583
10939F545530j908399M78499J308983j810121m115068j411612K744537K414554
10931D246903j690861l686141j281797J799671K073562P67484O53529J375058
10923D257408M56288k247548l887437k744050n62658N99397J631566M025249O020023
10914G548238M597339O09839j852778j200198K79003Q22183Q49364N4036k331602
10905I375424l825159q77411M038090L952449j807554n479585k937447j18981
10897B319826k114037l818335O86937O262021M214560k850602m566255R82930
10889A117045N356087L733617M17317q82544k378769m897211m043190J862291
$$ plain form
10947 6777252 5015563 6458166 7348056 5617743 4274461 5787834 7563113 6545530
10939 6545530 4637131 5115630 6424613 4614492 499424 -912188 1832349 4246903
10931 4246903 2556042 -1130099 -2411896 -612225 1461337 2228821 2882350 4257408
10923 4257408 4713696 2466148 -1421289 -4165339 -4727997 -4128600 -2497034 1528215 7548238
10914 7548238 12145577 12755416 10902638 9702440 9981443 10803626 11652990 11707026 9375424
10905 9375424 5550265 4672854 8710944 12663393 10855839 5376254 2438807 2319826
10897 2319826 205789 -3612546 -2925609 3336412 7550972 4700370 134115 1117045
10889 1117045 6473132 10206749 10624066 9741522 7362753 2465542 -1577648 284643
10881B84643O870030N291544n13887m530795n076463m333886l375315j792401
10873g176530j48993N73217P72881J379344K344607L125561L308248K344174M71547
10864F994056k47154J623642L629859J971456k493184m667384k588433l21709
10856C901149j518030l756857k406437K260715N319071L868048N31514m30303
10848G768870J229418J687849j298565m552670l346220J697681M771966K527318
10840A0485647j870441l771439k577149j30929K586243M143451J981626k935032
10832G911977m555476J46034M911413K264192m744804o305836n21742L744607
10824B850365L63839m976897l351141M433363Q719859L730456m724808o018859
$$ plain form
10881 284643 7154673 12446217 11932330 7401535 2325072 -2008814 -5384129 -7176530
10873 -7176530 -7325523 -6752306 -5979425 -4600081 -2255474 870087 4178335 6522509 6994056
10864 6994056 6746902 8370544 12000403 13971859 11478675 6811291 4222858 3901149
10856 3901149 2383119 -1373738 -3780175 -1519460 3799611 7667659 8199173 7768870
10848 7768870 8998288 10686137 9387572 4834902 1488682 3186363 7958329 10485647
10840 10485647 8615206 4843767 2266618 2135689 4721932 8865383 10847009 7911977
10832 7911977 3356501 3502535 8413948 10678140 5933336 -372500 -894242 2850365
10824 2850365 3214204 -1762693 -5113834 -680471 8039388 11769844 7045036 1026177
10816A026177K115680J0116095Q209384j119595p112482n860029l842339m973632
10808a440741l589100M008546R802222N135982m575914p011074j185489K786529
10800C930961N84816j424101Q57405K576314l34000l899550l279888l58388N13357
10791h33074o10012p36067J084110L066061K731969j120715n961895o037298P01143
10782g715778P664158O889330o7999m629290l477845j214783j077671r03158N94087
10773c938949J147898N31358J836864M818225M528796n70943n050857m154603
10765h52211o9180K267748J440831o99394k033298j285650R83791K167949J102388
10756C022974L77494J634164J464494k630931n604027j581541N531407O900582
$$ plain form
10816 1026177 3141857 13257952 21467336 20347741 13235259 7375230 3532891 -1440741
10808 -1440741 -5029841 -1021295 8780927 13916909 9340995 2329921 1144432 3930961
10800 3930961 4515777 3091676 3949081 6525395 6191395 2291845 -988043 -1346431 -833074
10791 -833074 -1443086 -2179153 -1095043 1971018 4702987 3582272 -2379623 -8416921 -7715778
10782 -7715778 -51620 6837710 6769711 2140421 -1337424 -2552207 -3629878 -4533036 -3938949
10773 -3938949 -2791051 -2259693 -422829 4395396 8924192 8353249 3302392 -852211
10765 -852211 -921391 1346357 2787188 2087794 54496 -1231154 -247363 1920586 3022974
10756 3022974 3400468 5034632 6499126 3868195 -1735832 -3317373 2214034 9114616
10748I114616K398491j17472J776367K500320m54754k960538k884611k881651
10740F490768l505644k619986j990162m749742o634300j052476P158200O141691
10732g61651l515693p913562j404897N616862N083955K499115L402136L200362
10724F206627j274173l572149r9733J794270k425654n048078l94760L964278J266848
10715D17476j682672J828938M445120j269149o654467j427617N933992J308083
10707B899704r180194p353326O586609J3258855M454587n877209n389333l0826
10699f31133O44000k71836L888189Q573649M358342o745661j1989609m871470
10691g045529N965000P703306m44285o648424k541747N320589N252440j983016
$$ plain form
10748 9114616 11513107 11395635 13172002 15672322 15217568 12257030 9372419 6490768
10740 6490768 2985124 365138 -1625024 -6374766 -13009066 -14061542 -6903342 -761651
10732 -761651 -4277344 -12190906 -13595803 -7978941 -2894986 -395871 3006265 6206627
10724 6206627 4932454 1360305 1260572 3054842 629188 -4418890 -4813650 -849372 417476
10715 417476 -1265196 563742 5008862 3739713 -2914754 -4342371 1591621 2899704
10707 2899704 -6280490 -13633816 -7047207 6211648 10666235 4789026 -600307 -631133
10699 -631133 12867 -258969 3629220 12202869 16561211 9815550 -2174059 -7045529
10691 -7045529 -1080529 6622777 6178492 -469932 -3011679 2308910 7561350 5578334
10683E578334m627818J162370N161762p7920p279203o850827j818320o95551k772849
10674a2220022j321549L432443N181547K506194k69550r94233o14717J200793
10666c099094M118852M006198j105767n529969l554676J579189L678229L558593
10658C651555M621706L925282k141310p776094m706516L709258O717085K611290
10650A0612256n12114M78149L1279m033214n739876j122397N446723Q122179O225985
10641A9508970K051344k225302m163103k684578o82460j571172l784597l265400
10633C183702j83433J747046J302355L09041l12162p14820l56179J48127j512360
10624C611317m407679l483721K070637N321415J985386j993074j01405L952737
$$ plain form
10683 5578334 950516 2112886 7274648 7196728 -82475 -6933302 -8751622 -9447173 -12220022
10674 -12220022 -13541571 -10109128 -4927581 -2421387 -2690937 -3685170 -4299887 -3099094
10666 -3099094 1019758 5025956 3920189 -1609780 -5164456 -3585267 92962 3651555
10658 3651555 8273261 12198543 10057233 2281139 -2425377 1283881 8000966 10612256
10650 10612256 10100142 10578291 10609570 6576356 836480 -285917 5160806 13282985 19508970
10641 19508970 21560314 19335012 15171909 12487331 11804871 10233699 6449102 3183702
10633 3183702 3000269 4747315 6049670 6358711 6046549 5331729 4975550 5123677 3611317
10624 3611317 -796362 -4280083 -2209446 3111969 5097355 3104281 3002876 6955613
10616F955613L321305p0188N4359K912612L164565P93712n08682r91049k466907
10607A3165340k705532m47992o15751n642319p943755j315566O709951N716057
10599F920433n82460j443634K240162J251348l804818l585284K177049L608248
10591F781044j892143n669561l166363m2118k43981Q3591L369655N554543L775641
10582H550308Q77105l35712n40258m45463O2957l73756k175587k138839J159007
10573D639762L015246R6605k808188r83003J459692k07473j366611L152683P348737
10564A4347450L285001m233522n220673j126026m65028k984017j946770K264643
10556C921058M201167M432148N809779M390215k650742o812835m45651P986180
$$ plain form
10616 6955613 10276918 10206730 10261089 13173701 16338266 17131978 16623296 15632247 13165340
10607 13165340 10459808 10011816 9396065 3753746 -4190009 -5505575 1204376 6920433
10599 6920433 6337973 4894339 7134501 8385849 4581031 995747 3172796 6781044
10591 6781044 4888901 -780660 -3947023 -3989141 -4233122 -4149531 -779876 4774667 8550308
10582 8550308 9427413 9091701 8551443 8105980 8168937 7795181 5619594 3480755 4639762
10573 4639762 7655008 7751613 4943425 3960422 5420114 5212641 3846030 6998713 14347450
10564 14347450 17632451 13398929 8178256 7052230 6587202 3603185 1656415 3921058
10556 3921058 8122225 12554373 18364152 22754367 20103625 13290790 12845139 20831319
10548B0831319O220577j679958l907316j635843l272868n911229j918937L261913
10540A1987658J21103n208232j218209O228822L667335m482375l729158L628124
10532A0995068L854582k021811k325465J080947j553195m750167K478731J0981790
10524A8740480M669263p921691o488109L974116K790252o704098l973169P774922
10516A2861966O750972n093507n683892M107400L419013n266615p17445J1621850
10508B1999742P068227p603542l225959J3790665J0210033q172143l986351J6971026
10500D7051698J1284190j6083810j3238105J9213146K2054296q882701p027358
10493E4371356L4208421L4326068j6549216q291101Q8498411J11321656n8997798
$$ plain form
10548 20831319 27051896 25371938 21464622 19828779 16555911 10644682 8725745 11987658
10540 11987658 12108761 6900529 5682320 11911142 15578477 11096102 7366944 10995068
10532 10995068 14849650 12827839 10502374 11583321 10030126 5279959 7758690 18740480
10524 18740480 23409743 15488052 8999943 12974059 15764311 9060213 5087044 12861966
10516 12861966 19612938 14519431 8835539 12942939 16361952 11095337 10377892 21999742
10508 21999742 29067969 21464427 18238468 32029133 42239166 34067023 30080672 47051698
10500 47051698 58335888 42252078 29013973 48227119 70281415 61398714 54371356
10493 54371356 88579777 122905845 106356629 98065528 186563939 297885595 238887797
10486B38887797k62629249k47378652l0762850J24891081Q5090456j1762222j3721813
10479a17385452L5369751L0589868q720356o593816K3480043J9601102r180429
10472c2839289j0493120J0166419Q526134j0984292r043078J0878083J1975796
10465b1813347n415450q158358O505782J0246598j802486p119088p27873J066286
10457b7217936l081557L82105Q707204P549944P34537K403642P386217J471493
10449a664351p778768l172793P762021M052535r886577j0511741L677157J0318271
10441g204246J929789m628955M681M247846q17580p352979o303230K99689O504937
10432a3320048Q710491M503478l384215n237684K504754Q649410L517983n044394
$$ plain form
10486 238887797 -23741452 -271120104 -301882954 -176991873 -91901417 -103663639 -117385452
10479 -117385452 -82015701 -51425833 -60146189 -66740005 -43259962 -23658860 -32839289
10472 -32839289 -43332409 -33165990 -24639856 -35624148 -44667226 -33789143 -21813347
10465 -21813347 -27228797 -35387155 -28881373 -18634775 -20437261 -27556349 -28284222 -27217936
10457 -27217936 -30299493 -29917388 -21210184 -13660240 -12925703 -10522061 -3135844 -1664351
10449 -1664351 -9443119 -12615912 -4853891 -801356 -10687933 -21199674 -17522517 -7204246
10441 -7204246 -5274457 -9903412 -9898731 -5650885 -6468465 -13821444 -20124674 -19824985 -13320048
10432 -13320048 -4609557 -106079 -3490294 -8727978 -6223224 2426186 5944169 899775
10424H99775n326349j074010j673047l671104M86184N235656J822836l839701
10416g139760j977872J768754k435122p617987j769286P825182N268107n320212
10408a1398196n987606M227965Q861995K851128j705714P62908K051608r94865
10400a330777q75668L671730L542768l663697q515715n695887r33034J031436
10392a2768844K344079L760139K736057J107066L158092O017025L422486k166522
10384G609578l282214j148133k541029n328073j670770N822000O388714o31214
10376E218859m789185k320684l16915j943960j852427J519917K434882p13574
10368b763087k377696n03351O33657m17646n53027J26118j169714k487864l65930
$$ plain form
10424 899775 -4426574 -5500584 -7173631 -10844735 -10358551 -5122895 -3300059 -7139760
10416 -7139760 -9117632 -7348878 -9784000 -17401987 -19171273 -11346091 -6077984 -11398196
10408 -11398196 -17385802 -13157837 -4295842 -1444714 -3150428 -2387520 -335912 -1330777
10400 -1330777 -2206445 1465285 5008053 1344356 -7171359 -12867246 -13800280 -12768844
10392 -12768844 -10424765 -6664626 -3928569 -2821503 336589 6353614 9776100 7609578
10384 7609578 4327364 3179231 638202 -4689871 -6360641 -538641 5850073 5218859
10376 5218859 429674 -1891010 -2207925 -4151885 -6004312 -4484395 -2049513 -2763087
10368 -2763087 -5140783 -5644134 -5010477 -5428123 -5981150 -5855032 -7024746 -9512610 -9878540
10359i878540J779274n00424k124775L305170Q978821M006645o387827p394968
10351h216624O39478L367873j590867q78353Q894550J2865492K780710q945762
10343H916497r707439m581808l039554k689490J667930N194375J964494k656423
10335d931418n96064N105811N827166J132255k503579k460090j376336r76930
10327g79185p79992m48415N60459K737463L953459J558018j961592j354257K522335
10318F008293L248879p82867m349880m711449m360890l567082J26809L726040
10310d662147J013088n098626m470430L032527N475945j297043n977321j175940
10302a3159947L822615l5390n032564k24038Q897728R159164J069665l563511
$$ plain form
10359 -9878540 -8099266 -8599690 -10724465 -7419295 1559526 5566171 -821656 -8216624
10351 -8216624 -7577146 -4209273 -5800140 -6678493 2216057 15081549 17862259 8916497
10343 8916497 -790942 -5372750 -8412304 -11101794 -9433864 -4239489 -2274995 -4931418
10335 -4931418 -5527482 -421671 5405495 6537750 4034171 1574081 197745 -779185
10327 -779185 -1559177 -2007592 -1447133 1290330 5243789 6801807 4840215 3485958 6008293
10318 6008293 9257172 8474305 4124425 -587024 -4947914 -8514996 -8388187 -4662147
10310 -4662147 -3649059 -8747685 -13218115 -10185588 -4709643 -6006686 -11984007 -13159947
10302 -13159947 -9337332 -9372722 -14405286 -14629324 -5731596 3427568 4497233 933722
10294I33722j158385R16555p24831j307383J047312J968043K60760M68295L467585
10285E871673L445861k188658p182385n071816J666496N348433K856011j799490
10277B946125l092884K18395M414378N005217J713996j340007j089009M27262
10269I203473o90996m229262n834627k782936K582299N730075M681713J123645
10261I783384k149873l720568l601914k174040j97858R07725N82539M18195J582555
10252A430145J682924j876370n631264l094473M328129O697878k5419o463909
10244b952359l530000L441175L765117j109667j224473L933128M701199j294615
10236E729505m506394L97610N961686M779271L22808j411215j818173l970028
$$ plain form
10294 933722 -224663 691892 -32939 -1340322 -293010 1675033 1935793 2404088 5871673
10285 5871673 9317534 7128876 -53509 -5125325 -3458829 1889604 4745615 2946125
10277 2946125 -146759 71636 4486014 9491231 11205227 9865220 8776211 9203473
10269 9203473 8512477 4283215 -1551412 -4334348 -1752049 3978026 8659739 9783384
10261 9783384 7633511 3912943 311029 -1863011 -2060869 -1153144 -570605 -152410 1430145
10252 1430145 3113069 1236699 -4394565 -7489038 -3160909 3536969 3511550 -2952359
10244 -2952359 -6482359 -3041184 723933 -385734 -1610207 2322921 7024120 5729505
10236 5729505 1223111 1620721 7582407 12361678 12684486 11273271 9455098 5485070
10228E485070m875127j473414J865661j5608l790711l032526J006588K149433
10220b680634J30566K93088L378771L721310j070547n303709l187549K629620
10212b089084M382675n00393n947232n036606J104150N149093L740857J288364
10204B091824J764644K104421j257689m123398p20511M819497L131195m621256
10196C188727o688800R15472P025148K080406p311741q925780k889394P63357
10188a1842605j592409l520070l98102M014459M720624K682061J860921K994846
10180a080275L423111J561810p32882o01921J680701K302103j095428n138034
10172C19185m209500J886864O936056N719999m12500o117867p415539l922810
$$ plain form
10228 5485070 609943 -863471 1002190 986582 -2804129 -5836655 -4830067 -2680634
10220 -2680634 -2550068 -2256980 1121791 4843101 3772554 -1531155 -4718704 -2089084
10212 -2089084 2293591 1793198 -4154034 -9190640 -8086490 -2937397 803460 2091824
10204 2091824 3856468 5960889 4703200 579802 -140709 4678788 7809983 3188727
10196 3188727 -3500073 -2584601 4440547 6520953 -790788 -9716568 -12605962 -11842605
10188 -11842605 -13435014 -16955084 -17353186 -13338727 -8618103 -5936042 -4075121 -1080275
10180 -1080275 2342836 3904646 3171764 2569843 4250544 6552647 5457219 319185
10172 319185 -3890315 -2003451 4932605 10652604 10240104 4122237 -3293302 -7216112
10164g216112J289605L607979J608689l63343J915800N047751K217027n119239
10156B988157p311571o36267O377620N300175m13237k289094R6664P28355j607119
10147C233683k108407Q61539L019335J600247o80196j045585r28325k126417k742064
10138i16190m95400K460105J997931j600812l598219j703148O08611k67717k330419
10129e845258j598138Q75971J011983k10719K359265P804598P714264q33272q403771
10120B874923n989263J685467M039626O92564m56077K113028K134703j966032
10112E128939m297401k238731J77314J101908L085682M686945N74610p059560
10104A159706q321053j246592L544161k94707m558265r95751M603092L210380
$$ plain form
10164 -7216112 -5926507 -2318528 -709839 -1073182 842618 5890369 8107396 2988157
10156 2988157 -4323414 -4959681 1417939 6718114 6304877 4015783 4112447 4840802 3233683
10147 3233683 1125276 1986815 5006150 6606397 5926201 4880616 3952291 1825874 -916190
10138 -916190 -1411590 1048515 3046446 1445634 -2152585 -3855733 -3247122 -3514839 -5845258
10129 -5845258 -7443396 -6567425 -5555442 -5766161 -3406896 4397702 12111966 11278694 2874923
10120 2874923 -3114340 -1428873 2610753 3303317 2847240 4960268 7094971 5128939
10112 5128939 831538 -1407193 -1229879 -127971 2957711 7644656 8219266 1159706
10104 1159706 -7161347 -8407939 -4863778 -5158485 -9716750 -10712501 -6109409 -2899029
10096b899029j473319j43885N292555N168863j101522m577692k260141q01660
10088b795830l461820m402698N34691O324928O723507L188903J027345J313107
10080H452133J319817l8965j426340k120913k456577j997342m0285K130119J891616
10071E713263r05397k600595k21592L511875K745059l230276p784020n470724
10063h242407O04234L771267L132745K642500L070398J430970k227719m076472
10055A05516k842532q06330J480646M795208N850697N20343o853969o659124J324920
10046c084625O169947K195346k942043j631291K266594K280786L66028P62225
10038F382967Q49881k778785n944504l857800l76655r07386j929868K271496P646788
$$ plain form
10096 -2899029 -4372348 -4516233 776322 5945185 4843663 265971 -1994170 -2795830
10088 -2795830 -6257650 -10660348 -10125657 -3800729 2922778 6111681 7139026 8452133
10080 8452133 9771950 9732985 8306645 6185732 3729155 1731813 1691528 3821647 5713263
10071 5713263 4807866 2207271 1985679 5497554 8242613 5012337 -2771683 -8242407
10063 -8242407 -7638173 -3866906 -734161 1908339 4978737 6409707 4181988 105516
10055 105516 -2737016 -3543346 -2062700 2732508 8583205 9103548 2249579 -4409545 -3084625
10046 -3084625 3085322 5280668 2338625 707334 2973928 5254714 5620742 6382967
10038 6382967 7232848 4454063 -1490441 -5348241 -5724896 -6632282 -8562150 -6290654 1356134
10029A356134O045269j091098n382653m555455k499670J17991M293453N271753
10021C555724j132364p598060l864209N617609O853708j430545o145342j841500
10013e984979K034681k6310j84275N937717Q718478J389162o053207k620251M786057
10004G997073K656440o801004r883250l404136K532877K155572L80591Q74831
9996c491006N47884j424554k49204M890635P304267L352750j478862j706745K47795
9987G992960L15241P2944J778940K131784j938244n903632l803824J490022K438400
9978D574591n62457K79498O575614R702393L572427n896850r130555n537239k056001
9969A521421k287347l185801j727480N27796P61558o68330j121251L59290J681966
$$ plain form
10029 1356134 7401403 6310305 927652 -3627803 -6127473 -6009482 -1716029 3555724
10021 3555724 2423360 -5174700 -9038909 -3421300 3432408 2001863 -4143479 -5984979
10013 -5984979 -3950298 -3976608 -4160883 1776834 10495312 11884474 5831267 3211016 7997073
10004 7997073 10653513 3852509 -6030741 -9434877 -6902000 -4746428 -4365837 -3491006
9996 -3491006 -2943122 -4367676 -4616880 273755 7578022 10930772 9451910 7745165 7992960
9987 7992960 8308201 8381145 10160085 12291869 10353625 4449993 646169 2136191 4574591
9978 4574591 4012134 4291632 10867246 20569639 24142066 18245216 9114661 3577422 1521421
9969 1521421 -765926 -3951727 -5679207 -5151411 -4389853 -5058183 -6179434 -5820144 -4138178
9960d138178O63388j436770j054731K244808L979061J135675k163078k89276M230680
9951C171579L575068k682775n899741j838882K678160J211187k505476k755602
9943e046482j936643l906256m291371J890224Q327845N377785l352025n411505
9935h348428Q00314M397371R21794j189790L148279O268298J319427n712621n856047
9926d251403q55959J472246k43230j166170O70112K496527K213901Q16489M33837
9917A586350K275144M891382M167157j709164p753121p362485j353945L714278
9909a544404N068851M844324L358794l24702k607136J50806K839306j414988p154865
9900C215986l346362O561095P915753n28355l964790K647139O309098L40282l958154
$$ plain form
9960 -4138178 -3474790 -4911560 -5966291 -3721483 257578 1393253 -769825 -1059101 3171579
9951 3171579 6746647 4063872 -1835869 -3674751 -996591 214596 -2290880 -5046482
9943 -5046482 -6983125 -10889381 -15180752 -13290528 -4962683 415102 -2936923 -8348428
9935 -8348428 -7548114 -3150743 -2228949 -3418739 -270460 5997838 7317265 1604644 -4251403
9926 -4251403 -5107362 -3635116 -3878346 -5044516 -4374404 -1877877 336024 1152513 1586350
9917 1586350 3861494 8752876 12920033 11210869 3457748 -3904737 -5258682 -1544404
9909 -1544404 3524447 8368771 11727565 11402863 8795727 8946533 11785839 10370851 3215986
9900 3215986 -130376 6430719 14346472 13818117 9853327 12500466 18809564 19149846 15191692
9891A5191692L59321L147653j328178k224928M528381N054631k640125M088133
9883B6176580K9152573L1114235j9990912q0497863p8060784j2123493M2018693
9876f2210971L5066820k63928j1659949J018508O484301o62254j421504P674250
9868b5974727J1417213N300064K96428J153177J407804j402081k681363j717696
9860a2201181k001649k578512m85702J479915p1921p15986M347717R477154O615426
9851C865261m96638k074156J489371J400668l880310o724118l429930J199696
9843h650156K533057Q81650k048774m350225l043856J451446K947007j553427
9835a1833278m949849m99077N866848M326478j960406j477691O288289R825075
$$ plain form
9891 15191692 15551013 18698666 17370488 15145560 19673941 24728572 22088447 26176580
9883 26176580 55329153 86443388 66452476 -14045387 -92106171 -104229664 -62210971
9876 -62210971 -27144151 -27408079 -39068028 -38049520 -31565219 -32227473 -33648977 -25974727
9868 -25974727 -14557514 -9257450 -8961022 -7807845 -6400041 -7802122 -10483485 -12201181
9860 -12201181 -14202830 -16781342 -17267044 -15787129 -15859050 -16575036 -12227319 -2750165 3865261
9851 3865261 3368623 1294467 2783838 4184506 304196 -6419922 -9849852 -8650156
9843 -8650156 -6117099 -5235449 -7284223 -11634448 -14678304 -13226858 -10279851 -11833278
9835 -11833278 -16783127 -17282204 -11415356 -7088878 -9049284 -10526975 -4238686 5586389
9827E586389M380920j690559j989165q03396k416257l318892j051135n24039m331843
9818f157977n612465J074371Q810167P463293j106919o353920m637731k097474
9810h618655k660240k401437J930468O284437N642192K156632J557075L607118
9802G497590J977146n418402j0992417o548399M477619R543397K909322o460229
9794c014373o958176L0003L374600o85798l490391J551856P812010N381560l338903
9785F62388o838871j381528M583870M085245P61503K65311N14149k516882n145916
9776e010731j242661N775521O119315j241293o319341l159814K143442K638192
9768b97370Q97429J794550K582312j180664n372668k995191K987558L042372l359470
$$ plain form
9827 5586389 9967309 8276750 6287585 5484189 3067932 -250960 -1302095 -1826134 -6157977
9818 -6157977 -11770442 -10696071 -1885904 5577389 4470470 -1883450 -6521181 -8618655
9810 -8618655 -11278895 -13680332 -11749864 -5465427 176765 2333397 3890472 7497590
9802 7497590 9474736 4056334 -6936083 -13484482 -9006863 536534 3445856 -3014373
9794 -3014373 -9972549 -9942546 -6567946 -7253744 -10744135 -9192279 -1380269 4001291 662388
9785 662388 -6176483 -7558011 -2974141 1111104 1872607 2137918 2652067 135185 -5010731
9776 -5010731 -6253392 -477871 5641444 4400151 -1919190 -5079004 -2935562 -297370
9768 -297370 600059 2394609 4976921 3796257 -1576411 -4571602 -1584044 1458328 -1901142
9759a901142o120723m44337N359484K628748m749109o691913j521749K804593
9751a0636148O61350m082814m243407J078878N980618N846162K799390J565901
9743a030070K493456K345284O30653o4242k3210k316119n429662l506152K847903
9734d052159M335146k888187r169996n285711L302299N833588K995901K656953
9726b272166M490582K256136k215805j580911K288799P37492m937017m331177
9718e564067L268099O412012Q47405l948543k143222l61485k983624l318333K614671
9709e177087O960279L622182j185146j045778k87475l381646m980099q17136K512407
9700c779499n09803l429771j87712K697343j109017l959394K242961R054539M597039
$$ plain form
9759 -1901142 -8021865 -8466202 -3106718 -477970 -5227079 -11918992 -13440741 -10636148
9751 -10636148 -9974798 -14057612 -18301019 -17222141 -11241523 -5395361 -2595971 -1030070
9743 -1030070 1463386 3808670 4439323 4375081 4351871 2035752 -3393910 -6900062 -4052159
9734 -4052159 282987 -2605200 -11775196 -17060907 -13758608 -7925020 -4929119 -2272166
9726 -2272166 2218416 4474552 2258747 677836 2966635 3704127 -1232890 -5564067
9718 -5564067 -2295968 4116044 4963449 1014906 -1128316 -1489801 -4473425 -7791758 -5177087
9709 -5177087 1783192 5405374 4220228 3174450 2886975 -494671 -5474770 -6291906 -3779499
9700 -3779499 -4289302 -7719073 -7906785 -5209442 -6318459 -10277853 -8034892 1019647 5616686
9691E616686n057872n638098J062310J969861k912649j491836O551795P538925
9683G639122k382815j0017126o266756J774944N025769M108883J585843l730018
9675b262154q892014o071188M054737R842662N626922k71877m85699L81539k889168
9666i66240n289894j412961L552959K666375p34759J90923L442145K604193j352519
9657B700222k419196k00928P29237k83057J75865K364892L005640J159610j126265
9648F106020k813110l812448k894853k09901N79138k476066m887838j592791M784263
9639g217586P206790M030638j05250j799683j554797J33541L372818N606166L443824
9630A3116461j535967l905295k181393n22698j436581k099791l46429P35999j843798
$$ plain form
9691 5616686 558814 -5079284 -4016974 -2047113 -4959762 -6451598 100197 7639122
9683 7639122 5256307 -4760819 -11027575 -9252631 -4226862 -117979 1467864 -2262154
9675 -2262154 -11154168 -17225356 -13170619 -3327957 2298965 2027088 1541389 1922928 -966240
9666 -966240 -6256134 -7669095 -4116136 -1449761 -2184520 -1993597 1448548 4052741 2700222
9657 2700222 281026 80098 809335 526278 702143 3067035 6072675 7232285 6106020
9648 6106020 3292910 -519538 -3414391 -3624292 -3045154 -5521220 -10409058 -12001849 -7217586
9639 -7217586 -10796 4019842 3914592 2114909 560112 693653 4066471 9672637 13116461
9630 13116461 11580494 7675199 5493806 4971108 3534527 1434736 1088307 1824306 -19492
9621a9492m839642k999644K551917N387264K836233j058270k524565k999354m538191
9612h203744m820870j233588L054344K755658r42445j457424L083179O829644
9604i35246N169077R86250j101084j531763k698943l533290k023960L36089J342970
9595c989900K045293L318486K412370j507876k664846L093934Q898761M851399
9587A6457621o260296j1258219n148004K501892K373045k546366m238611j528510
9579i647448R97611Q79996o38164j623594l18781L972146Q263916P710218K319241
9570A1915141k142329k135142o54489j049663j700557l84372J009330N02901M07652
9561E768472K764648M100755K38716o112115q042268l651977J938376L411039
$$ plain form
9621 -19492 -4859134 -7858778 -5306861 80403 2916636 1858366 -666199 -3665553 -8203744
9612 -8203744 -13024614 -14258202 -11203858 -8448200 -9390645 -10848069 -7764890 -935246
9604 -935246 4233831 5220081 4118997 2587234 -111709 -3644999 -5668959 -5332870 -3989900
9595 -3989900 -1944607 1373879 3786249 2278373 -386473 2707461 11606222 16457621
9587 16457621 10197325 -1060894 -6208898 -3707006 -1333961 -3880327 -8118938 -9647448
9579 -9647448 -8649837 -7769841 -8408005 -10031599 -10350380 -6378234 1885682 9595900 11915141
9570 11915141 9772812 7637670 6983181 5933518 4232961 3848589 4857919 5360820 5768472
9561 5768472 8533120 12633875 12872591 6760476 -1281792 -4933769 -2995393 415646
9553D15646P10248k086421j113622L493218O983714M775410j413175n117115l851159
9544B796744k156467l766547n476949k754678K501648M731493K642929l54526
9536a836353j787371j859093j069145J0076L3867o92956O95205M466480N283538
9527C244248m38168o781135m732672M493760R781938M903613l727662o841584
9519i7662m016701j252491j055749n99449J724048L319772J945350n90081j464317
9510b087280j175765j972287l155734j585010K685316N074869K860889n69500
9502G5498j136714m31552j842525l202678j30582M656322L714514k604495m969549
9493e871761M90993N531188K895973k374703k260626J020328O67278j536785R98385
$$ plain form
9553 415646 1125894 -960527 -2074149 1419069 8402783 13178193 11765018 6647903 2796744
9544 2796744 640277 -3126270 -8603219 -11357897 -8856249 -4124756 -1481827 -1836353
9536 -1836353 -3623724 -5482817 -6551962 -6541886 -6508019 -7200975 -6505770 -2039290 3244248
9527 3244248 2806080 -3975055 -8707727 -4213967 5567971 10471584 6743922 -97662
9519 -97662 -4114363 -5366854 -6422603 -7022052 -5298004 -1978232 -32882 -622963 -2087280
9510 -2087280 -3263045 -5235332 -8391066 -9976076 -7290760 -2215891 644998 75498
9502 75498 -1061216 -1492768 -3335293 -6537971 -6668553 -2012231 1702283 -902212 -5871761
9493 -5871761 -5380768 150420 3046393 671690 -1588936 -568608 98670 -1438115 -439730
9484d39730O006955M685345k821119o275891j594132L032997J062692k686175
9476I70942j839459J008708O56442j070984q281J524101r61825m753385l560313
9467h034054J484830K927335j173283m330640j753855L422162O221970O330565
9459E095030N457960K931360k085735o772984o931608k242228L079631M496907
9451C028333J081699l815240n355815k055070K017089J810857j976606l698025
9443h962778p90376K769413K780029O66982k5097M94722O4408m18000J225879
9434b194818L267512K133577q85719p86252K647229L442568j303820o242415n349280
9425e271418l28799K750136J962098J94667m64312n25943m22211J36499P26341
$$ plain form
9484 -439730 5567225 10252570 7431451 1155560 -438572 2594425 3657117 970942
9476 970942 -868517 140191 796633 -274351 -282632 1241469 279644 -4473741 -8034054
9467 -8034054 -6549224 -3621889 -4795172 -9125812 -10879667 -7457505 -1235535 5095030
9459 5095030 10552990 13484350 11398615 4625631 -2305977 -4548205 -1468574 3028333
9451 3028333 4110032 294792 -5061023 -7116093 -5099004 -3288147 -5264753 -8962778
9443 -8962778 -9753154 -6983741 -4203712 -3536730 -3561827 -3067105 -3002697 -3420697 -2194818
9434 -2194818 1072694 3206271 2320552 1534300 4181529 7624097 6320277 77862 -5271418
9425 -5271418 -5600217 -2850081 -887983 -693316 -1157628 -1683571 -2105782 -1969283 -1242942
9416a242942R84759J751083K948670K288026q65853k789950o15620K177748O10122
9407E246043l412162l754151r6969J697244l88839j554790Q67132K777289J030805
9398B411602q97972L55783J518136j286384m610784k550802L340034N805705K355417
9389F440735k063509k604067L71856L729319M663368J491368m388065p576161
9381F4844m202057J756686K601035k312437n417408k022901L055782K987428j654889
9372e143917n035182m250303j026503K497935N220216N492145K392711j477373
9364a330271j991370J273198M464300M321844J143159l056265o399182o792257
9356h366844l009530K510660M787310K086579j693192k312588n01508M67838K27545
$$ plain form
9416 -1242942 -258183 1492900 4441570 6729596 5863743 3073793 2458173 4635921 5246043
9407 5246043 1833881 -1920270 -2017239 -319995 -708834 -2263624 -1396492 1380797 2411602
9398 2411602 1513630 1869413 3387549 2101165 -2509619 -5060421 -1720387 4085318 6440735
9389 6440735 4377226 1773159 2145015 5874334 10537702 12029070 7641005 64844
9381 64844 -4137213 -2380527 220508 -2091929 -7509337 -9532238 -6476456 -3489028 -5143917
9372 -5143917 -10179099 -14429402 -15455905 -12957970 -7737754 -2245609 147102 -1330271
9364 -1330271 -3321641 -2048443 2415857 6737701 7880860 4824595 -1574587 -8366844
9356 -8366844 -11376374 -8865714 -4078404 -1991825 -3685017 -5997605 -6499113 -6031275 -5803730
9347e803730Q50709K279641K192130L39340p00023J65125P33413p17572k619954
9338c280921k672610j057643M41717Q20966J48042q45152n96308J818689M183414
9329a039806K678136k649478o576773m894476K89175L541078K526719m77250j706624
9320h309299J013767O248838Q820015M608212l157419o278872k241879K305818
9312C009181J828955n8813J901079M593973J769125m351806n675006j097251K101828
9303D021265J24298k342542p16190L022488M847620L920104J324435j491149k049530
9294A0660799L27372J157288l450155q179800l960285P188918J2304209N337800
9286B1386146m533229o786086k704936Q68855K281271K650060L47442m328012
$$ plain form
9347 -5803730 -4953021 -2673380 -481250 -141910 -841933 -676808 56605 -660967 -3280921
9338 -3280921 -5953531 -7011174 -6569457 -5748491 -5600449 -6445601 -7041909 -5223220 -1039806
9329 -1039806 1638330 -1011148 -7587921 -12482397 -12193222 -8652144 -6125425 -6602675 -8309299
9320 -8309299 -7295532 -1046694 7773321 12381533 9224114 2945242 703363 3009181
9312 3009181 4838136 4779323 6680402 11274375 13043500 8691694 3016688 1919437 4021265
9303 4021265 4145563 1803021 1086831 4109319 8956939 12877043 14201478 12710329 10660799
9294 10660799 10988171 12145459 8695304 515504 -3444781 3744137 16048346 21386146
9286 21386146 16852917 10066831 7361895 8230750 10512021 13162081 13509523 9181511
9278I181511n389452M7100N015379K700070k549620k840232J64778m13515l852367
9269B063652m200702k248266l692346o989854m698645K914082O822088L406934
9261f623057o62482k16600J404336M86668p94797m22677j027578l758505m416403
9252a6031095l48146M537460N799648M232014K138484m34705k266827q8344M692434
9243B230923M996783j093870n307473j468994L835374J426770n058365m562778
9235e001630L340000P371436K122501m205251l076355K553848N003368L203065
9227A1310982P84040j795524n813466q241767m919072J295768K943377q48984
9219e284646k571232K074513P173123N173013k462610q047119p617233l080943
$$ plain form
9278 9181511 3792059 3839159 8854538 11554608 9004988 6164756 6329534 5916019 2063652
9269 2063652 -2137050 -4385316 -8077662 -15067516 -19766161 -16852079 -10029991 -6623057
9261 -6623057 -7285539 -7502139 -6097803 -5611135 -6405932 -6828609 -7856187 -11614692 -16031095
9252 -16031095 -16379241 -11841781 -6042133 -1810119 328365 -106340 -2373167 -2461511 2230923
9243 2230923 7227706 6133836 826363 -642631 3192743 4619513 -438852 -5001630
9235 -5001630 -1661630 5709806 7832307 3627056 550701 3104549 8107917 11310982
9227 11310982 12095022 10299498 4486032 -3755735 -8674807 -7379039 -4435662 -5284646
9219 -5284646 -7855878 -5781365 1391758 6564771 4102161 -3944958 -11562191 -14643134
9211a4643134K745046P647399Q416834L700517k149666l455269r03787M58360
9203A816300j67085N82618K101243j7471m587925m470586J490899M990868J164778
9194B903639l537358k148369K185860L242774J835869J126819q38721n006768
9186b36255m883359L239772J0042530N317934m841102o533580Q1777K404199k927894
9177A664022o057082k425114Q79894L90532K065588O829058N854225k578149o446556
9168A76418N48185O892016K005404n681450l225519M762414M500405l530891o223086
9159B23896K42541N792479L702350j107608k663257j597116l3043J928793K702802
9150I191837R7415l193777k386077Q90368P39365k422809k296807J672008K730776
$$ plain form
9211 -14643134 -11898088 -4250689 4166145 7866662 5716996 2261727 1357940 1816300
9203 1816300 1649215 2231833 4333076 4315605 -272320 -4742906 -3252007 1738861 2903639
9194 2903639 -633719 -2782088 -596228 2646546 4482415 5609234 4770513 -236255
9186 -236255 -5119614 -1879842 8162688 13480622 8639520 2105940 2187717 4591916 1664022
9177 1664022 -4393060 -6818174 -5938280 -5547748 -3482160 3346898 9201123 6622974 176418
9168 176418 724603 7616619 9622023 3940573 715054 5477468 9977873 6446982 223896
9159 223896 466437 6258916 9961266 8853658 6190401 4593285 4560242 6489035 9191837
9150 9191837 9289252 6095475 3709398 4599766 5339131 2916322 619515 2291523 5022299
9141E022299j043807k769048J284630M803365J935270k920545k404165K366367
9133F274366M521930J924400j552391l147622l855183m559662m142832k023412
9125f560406K51219Q16879k47519r20990M28688K625428K774167O49304k74885
9116d58115J577936K240293j636082n710652l276144L749412O655014L099554
9108F241216K75287K586008M467199L24853n473001n320514k01251K634523J010613
9099F544933n72240K59685M24377k005790l735040j669533J389343K75250m571320
9090c660335o312702l45138Q340437R781956J574097o996703o410138O44307L579835
9081A95616q79661m736205j146690N935664Q104203L456299k956062n977036l781587
$$ plain form
9141 5022299 3978492 1209444 2494074 7297439 9232709 6312164 3907999 6274366
9133 6274366 10796296 12720696 11168305 8020683 4165500 -394162 -4536994 -6560406
9125 -6560406 -6309187 -5492308 -5739827 -6660817 -6232129 -3606701 -832534 -183230 -458115
9116 -458115 1119821 3360114 1724032 -3986620 -7262764 -3513352 3141662 6241216
9108 6241216 6516503 9102511 13569710 13894563 8421562 3101048 2899797 5534320 6544933
9099 6544933 5972693 6232378 6656755 4650965 915925 -753608 635735 910985 -3660335
9090 -3660335 -9973037 -10318175 -1977738 7804218 9378315 2381612 -4028526 -3384219 195616
9081 195616 -684045 -5420250 -6566940 -631276 7472927 10929226 7973164 1996128 -1785459
9072a785459K337004P796526P178927N44906n336955n419016k804695k838237
9064c26999m407538k637880K188511M583942K048544k039498l794546k702256
9056g087720j03858K318956K650706P92071j79202J851679L773602J395873l316033
9047B096074m346277o47381K437959J361619j369262k407959j990439j273083
9039f138749J03549J507026O23659k099908k251178K199324O714258N925184J020741
9030G603906k377887k119468j364263k704081l887869j021334N365721R488457
9022H983182O514687j266240o635509o084788l283962k484580k424102l23251
9014g004563J961943J393452L87625K890451N656150K012127n748464p278592
$$ plain form
9072 -1785459 551545 8348071 15526998 16071904 10734949 5315933 2511238 -326999
9064 -326999 -4734537 -7372417 -5183906 -599964 1448580 -590918 -4385464 -7087720
9056 -7087720 -7191578 -4872622 -2221916 -1429845 -1609047 242632 4016234 5412107 2096074
9047 2096074 -2250203 -2897584 -459625 901994 -467268 -2875227 -4865666 -6138749
9039 -6138749 -6035200 -4528174 -3904515 -6004423 -8255601 -6056277 657981 6583165 7603906
9030 7603906 5226019 3106551 1742288 -961793 -4849662 -5870996 -505275 8983182
9022 8983182 15497869 14231629 7596120 1511332 -1772630 -4257210 -6681312 -7004563
9014 -7004563 -5042620 -3649168 -3261543 -371092 5285058 7297185 1548721 -5729871
9006e729871L41667P533725O629570K052797L25785r57550n830241r285223m463634
8997i382975M297564O574976J552420j962101k15886J313736p84028k417859n74702
8988a598855J242959k8583j496020K07385L291321M222288K319665j616926o514877
8979B8357q597191l341741O833997J2224102P355366j676869n652479l621814
8971C551728j005936m14478m50364j050561l437760n451259k944002L323971P022347
8962h56314M239305j315191l208186j67666L238265K932185O2957j428884n35149
8953B961322j3642j156588j035418K268516M563551O93108o384337p817984j114787
8944g036259N889535N800508Q53737k296479k062376j473964j864774j969852
$$ plain form
9006 -5729871 -5388204 2145521 8775091 10827888 11153673 10196123 4365882 -4919341 -9382975
8997 -9382975 -5085411 1489565 3041985 1079884 863998 2177734 1393706 -1024153 -1598855
8988 -1598855 -355896 -384479 -1880499 -1673114 1618207 5840495 8160160 6543234 28357
8979 28357 -8568834 -11910575 -5076578 7147524 14502890 12826021 7173542 3551728
8971 3551728 2545792 2131314 1680950 630389 -2807371 -8258630 -11202632 -7878661 -856314
8962 -856314 3382991 2067800 -1140386 -1308052 1930213 4862398 4925355 3496471 2961322
8953 2961322 2947680 1791092 755674 3024190 7587741 8280849 1896512 -5921472 -7036259
8944 -7036259 -1146724 4653784 5507521 3211042 1148666 -325298 -2190072 -4159924
8936d159924j049412J095870M848548P993023N564901k984970r802134p456771
8928e950869P01142N033694K549653j188476j894518j092833n88895N19030J738290
8919a73782M09300k712589k771812J552755M879454K874244j336459k280594K2877
8910D63394J485980N60894p61723j081942j001764r35550l47847Q24633J738542
8901I44617J553335j7786k322482l440655j628553K159724M662188L998761J485966
8892G395115q01745k358418l291671l154150k043943j068580l86110J437568M616498
8883C44564O425451M281721m80085l804239l494126j168841K78494P0758j24555
8874B329142R94030K136080J216300j017530j579502q0849L32882j275922j088315
$$ plain form
8936 -4159924 -5209336 -4113466 735082 8728105 14293006 11308036 1505902 -5950869
8928 -5950869 -5249727 -216033 2333620 1145144 -749374 -1842207 -2431102 -1912072 -173782
8919 -173782 235518 -2477071 -5248883 -3696128 1183326 4057570 2721111 440517 463394
8910 463394 1949374 2510268 1748545 666603 -335161 -1270711 -1618558 -793925 944617
8901 944617 2497952 2480166 157684 -3282971 -4911524 -2751800 1910388 5909149 7395115
8892 7395115 6593370 4234952 943281 -2210869 -4254812 -5323392 -5709502 -4271934 344564
8883 344564 6770015 11051736 10571651 6767412 3273286 2104445 2382939 2453697 2329142
8874 2329142 3323172 5459252 6675552 5658022 4078520 3997671 4330553 3054631 1966316
8865A966316K526442L908841j765131q634806o974318J451878M856396m57912
8857c122294m157863J483526R113340Q049304N44348l244720j349777p52222m351869
8848B211773o960208m570560K12307L165941K985861K68142k918266k650076K451665
8839e803421P123043N436451r7454k058873P0581k14142m266059n331564o79681
8830e821119K541493j016836n302448k285902M893277O717932J888385j524103
8822I0679J262929N624319N314261N03043m151548n524155l937679j417052L49675
8813a885528J278048K260409K648102J02411m990482p261881k495641N192976
8805e151586P239967J985717k935514j293247L531338M443231Q21986k129754
$$ plain form
8865 1966316 4492758 8401599 6636468 -1998338 -8972656 -7520778 -2664382 -3122294
8857 -3122294 -7280157 -5796631 3316709 11366013 11910361 8665641 7315864 6563642 2211773
8848 2211773 -4748435 -9318995 -9106688 -5940747 -2954886 -2686744 -5605010 -8255086 -5803421
8839 -5803421 1319622 6756073 6658619 4599746 4670327 4456185 190126 -5141438 -5821119
8830 -5821119 -3279626 -4296462 -9598910 -11884812 -6991535 -273603 1614782 90679
8822 90679 1353608 6977927 12292188 12795231 8643683 3119528 -818151 -2235203 -1885528
8813 -1885528 -607480 1652929 4301031 4403442 -587040 -7848921 -10344562 -5151586
8805 -5151586 2088381 4074098 1138584 -154663 3376675 7819906 8641892 6512138
8797F512138k152733k298946m233986m633584q91451L572510L708866L48509j133873
8788a202550J057254K996782J688279p57949j654598k152285l696054l693413
8780g414534N13205N665745O006597J735960j341335n11060R71007L10298j083575
8771D852308j677624k146212j771737J685868O016395M861502k176217o380935
8763C263348k400682K601678j87196o844856o968272p04641J928918j851734l116152
8754a4279589L315954R693465P333510l60707l828310q55729K651953K113226
8746E783773j342942m055406l200566J279619N319591L953069j745477m734383
8738A257278j732759K005124J507183R3221K682629O120983M000548k092123m708977
$$ plain form
8797 6512138 4359405 2060459 -2173527 -6807111 -7698562 -4126052 -417186 -68677 -1202550
8788 -1202550 -145296 2851486 4539765 3781816 2127218 -25067 -3721121 -7414534
8780 -7414534 -6901329 -1235584 4771013 6506973 5165638 4654578 5625585 5935883 4852308
8771 4852308 3174684 1028472 -743265 942603 6958998 11820500 9644283 3263348
8763 3263348 862666 3464344 3277148 -3567708 -10535980 -11240621 -9311703 -11163437 -14279589
8754 -14279589 -10963635 -1270170 6063340 5702633 1874323 1018594 3670547 5783773
8746 5783773 4440831 385425 -2815141 -1535522 3784069 7737138 5991661 1257278
8738 1257278 -475481 1529643 3036826 3130047 5812676 11933659 15934207 13842084 9133107
8729I133107k495835j433450l984505n251939j677216L536715O044659N427264
8721I298800K564695k211318o109620m910369K36730K663531j28653k324025R29696
8712I467N690182N510715R18769k719802l221551k255834r20350L91013J91960
8703C594569j566057j876592K41577P40585k383474l550413J848949P540486M333356
8694H922986m487417o758001m05939L218367j920082o601050j940109N665821
8686d305424N236531p66348j205448M915897P192597J217756m766895l678926
8678C839740J94645J45875j901852k96791L821430M485796P00317k511881j960141
8669F517138K85361J127730k27101k956803m990345l429789J653793N022566K325860
$$ plain form
8729 9133107 6637272 5203822 1219317 -4032622 -5709838 -2173123 3871536 9298800
8721 9298800 11863495 9652177 3542557 -1367812 -1131082 1532449 1403796 -920229 9467
8712 9467 5699649 11210364 12129133 9409331 6187780 3931946 3011596 3402609 3594569
8703 3594569 2028512 151920 393497 1134082 -1249392 -4799805 -2950856 4589630 8922986
8694 8922986 4435569 -2322432 -2728371 489996 -1430086 -8031136 -9971245 -4305424
8686 -4305424 931107 164759 -1040689 3875208 11067805 12285561 7518666 3839740
8678 3839740 4034385 4180260 2278408 1981617 5803047 10288843 10989160 8477279 6517138
8669 6517138 6802499 7930229 7703128 4746325 -244020 -3673809 -2020016 3002550 5328410
8660E328410k805556l152097J255794L207934k43618l644457k575776M8488O79198
8651a901680J034310K493040J558244k793764l934183K138056P279312K083508
8643G956843q099711r826902j974731L504813J411950j5150M428428P524296L422130
8634H331966j388913k3458K233048j753386o584561l127313M206196L163092o000069
8625i43398j0240368m297427K209325J569618p95179J920291N562548L118147
8617a896443k168554j544600N042028Q636356M437761k318765m728678k555006
8609B904099Q7893J144739J509497J671032P27337j419951l175563l294115k331700
8600b176732j038285J211628M446203N838546K771001j980904k410715J939730
$$ plain form
8660 5328410 2522854 -629243 626551 3834485 3590867 -53590 -2629366 -2580878 -1901680
8651 -1901680 -867370 1625670 3183914 390150 -3544033 -1405977 5873335 7956843
8643 7956843 -142868 -9969770 -11944501 -8439688 -7027738 -7042888 -2614460 4909836 8331966
8634 8331966 6943053 6919595 9152643 7399257 814696 -2312617 1893579 5056671 -943398
8625 -943398 -11183766 -15481193 -13271868 -11702250 -12497429 -10577138 -5014590 -1896443
8617 -1896443 -4064997 -5609597 -567569 8068787 12506548 10187783 5459105 2904099
8609 2904099 2991992 4136731 5646228 7317260 8044597 6624646 3449083 154968 -2176732
8600 -2176732 -3215017 -2003389 2442814 8281360 11052361 9071457 6660742 8600472
8592H600472L994552q82778p292048p128545j246089K411814O23416j918614j147586
8583c985406J263091K675967L473539M075488L022509M37254j141173j597229
8575H224040l999017p828840p029236P68109Q099306O861983J29275k317131J579439
8566D487928M124119Q35789k648680l45091L904242K288308m486983p813677l843134
8557c497179J358200J416639j485602j554510J189768K229484R57230J241874
8549A855904L819974M483805J275879k166987k680227j820139j458542l61697
8541B947970J554729Q95665l023700m801779r61227L474738K492009j279384j532533
8532b33512R56896P12436k074569k496143p69350j790221m960940l891291K351813
$$ plain form
8592 8600472 12595024 11712246 4420198 -2708347 -3954436 -1542622 -919206 -2837820 -3985406
8583 -3985406 -2722315 -46348 3427191 7502679 10525188 10962442 9821269 8224040
8575 8224040 4225023 -3603817 -10633053 -9864944 -1765638 5096345 5225620 2908489 4487928
8566 4487928 8612047 9447836 6799156 6454065 10358307 12646615 8159632 345955 -3497179
8557 -3497179 -2138979 -722340 -2207942 -3762452 -2572684 -343200 614030 1855904
8549 1855904 5675878 10159683 11435562 9268575 6588348 4768209 3309667 2947970
8541 2947970 4502699 5398364 2374664 -2427115 -3388342 86396 2578405 1299021 -233512
8532 -233512 723384 1435820 -638749 -3134892 -3904242 -5694463 -10655403 -14546694 -12194881
8523a2194881O611421M750268J266425P05460J075076l04940j234671M98977K229780
8514C402915R61875j498684j911768n51125L44939m8586j407669k757010j787244
8505e252357K388822N588297K829518l440111n482857j380109K655535K241605
8497A48343J2464q16532q69730o56446P43651J540311p82146k724676R75540O043041
8487C613820L057825n540893o707096J460133M954813k495178p713890n52869
8479i923335Q056530M858672l128350k066656M192905K499916n004423n180059
8471e694800K182517N010105J105424p1744K800031Q44325n821181n903232K398356
8462c150199O484701M87290n315799k855411J344176M0366k326153l4973K995707
$$ plain form
8523 -12194881 -5583460 -833192 433233 1138693 2213769 1908829 674158 1173135 3402915
8514 3402915 4364790 2866106 954338 403213 748152 699566 -708103 -3465113 -5252357
8505 -5252357 -2863535 2724762 5554280 2114169 -3368688 -4748797 -2093262 148343
8497 148343 160807 -655725 -1525455 -2181901 -1438250 102061 -680085 -3404761 -2429221 3613820
8487 3613820 6671645 1130752 -5576344 -4116211 838602 -1656576 -9370466 -9923335
8479 -9923335 -1866805 2991867 -136483 -2203139 1989766 4489682 -514741 -5694800
8471 -5694800 -3512283 1497822 2603246 2531502 5331533 6175858 354677 -5548555 -3150199
8462 -3150199 3334502 3821792 -1494007 -4349418 -3005242 -2964876 -5291029 -5326002 -2330295
8453b330295J849740O5932J698036K878595k98282l514614j911056J123699L76371
8444f1874k408361k958113j669679m51675J599929M231241M129921J422427Q06173
8435D639989K195487q14815q248325r814170o66389Q984410Q564329K076855j101362
8426E816009j243458l070785l683963J632621P522532N490437j308063k789742
8418H365588J391064K339100k387163n624194l267352O74163K523724K958576
8410F973506J779205k450632o564239m963713J164576M467079K263350o22113
8402B047019p56448l04550r26427o52005J134480J804111M94507l62866J52293
8393B630114J70788o91896p92256m09132j078639j343626J087962L632515J967739
$$ plain form
8453 -2330295 -480555 -414623 1283413 4162008 3863726 349112 -1561944 -438245 -61874
8444 -61874 -2470235 -5428348 -7098027 -7549702 -5949773 -1718532 2411389 3833816 4639989
8435 4639989 6835476 6020661 -2227664 -12041834 -12708223 -3723813 4840516 6917371 5816009
8426 5816009 4572551 1501766 -2182197 -549576 6972956 12463393 11155330 8365588
8418 8365588 9756652 12095752 9708589 4084395 817043 1491206 4014930 6973506
8410 6973506 8752711 6302079 -262160 -5225873 -4061297 405782 2669132 2047019
8402 2047019 1290571 986021 59594 -592411 542069 2346180 2840687 2477821 2630114
8393 2630114 2800902 2109006 1316750 907618 -171021 -1514647 -426685 3205830 5173569
8384E173569j640088q71435L547151L894537j735943n531732k214227L027714
8376C649546L539963R81831M32856J427308Q1953l604140o152389n867497l472248
8367h982817J76061L493681L771402O51353k277222k104315l08383N98174J040371
8358c941695K096030K337317L98970j814198j901959q23827p60379j142173j11066
8349e662980J739550K333200J569201R55738R28513J042072J508703K062379Q08381
8340G284757k927327n847739l969201J810699O215851N614119J405983k373869
8332G213273k912581m36306J956337P28102l924349o969010m010814K499866N553340
8323c02142K623271r41676L29711L835608K566395m000663p904477l637125L507143
$$ plain form
8384 5173569 3533481 2662046 6209197 10103734 8367791 2836059 621832 3649546
8376 3649546 7189509 8171340 8604196 10031504 10113457 6509317 356928 -5510569 -8982817
8367 -8982817 -8806756 -5313075 -1541673 -890320 -3167542 -5271857 -5580240 -4982066 -3941695
8358 -3941695 -1845665 491652 890622 -923576 -2825535 -3649362 -4409741 -5551914 -5662980
8349 -5662980 -3923430 -1590230 -21029 934709 1863222 2905294 4413997 6476376 7284757
8340 7284757 4357430 -1490309 -5459510 -3648811 2567040 8181159 9587142 7213273
8332 7213273 4300692 3864386 5820723 6548825 2624476 -4344534 -8355348 -5855482 -302142
8323 -302142 2321129 1379453 1709164 5544772 8111167 4110504 -3793973 -7431098 -3923955
8314c923955M624928j44394k638765K20226K103091j307187m219261n7757O895586
8305A552512P344427J200756l034703j995823j065165l190684l694142J54507
8297b728315L112906J150777p30229K908381P332210M300555m159893p900697
8289C285695l503207J903391K504064J103508J801799K658795K27437l848866
8281F132616n799043n629777n196879l296176J971724P659782Q355702L862243
8273H060192l89320r52822J52320K49233l85034j053184k126605k192171J262071
8264B624680N742110M145234m333764r594649l708323O239280P194278j074705
8256G234141o639698l999176m29281j686675l019632L96835M363049M038876K622961
$$ plain form
8314 -3923955 700973 556579 -2082186 -1861960 241131 -1066056 -5285317 -5343074 1552512
8305 1552512 8896939 10097695 7062992 5067169 4002004 811320 -2882822 -2728315
8297 -2728315 384591 1535368 805139 3713520 11045730 15346285 11186392 3285695
8289 3285695 -217512 1685879 4189943 5293451 7095250 9754045 9981482 6132616
8281 6132616 333573 -5296204 -10493083 -13789259 -11817535 -4157753 4197949 8060192
8273 8060192 7670872 6718050 6870370 7119603 6734569 5681385 3554780 1362609 2624680
8264 2624680 8366790 12512024 8178260 -1416389 -5124712 1114568 8308846 7234141
8256 7234141 594443 -3404733 -3834014 -5520689 -8540321 -8143486 -3780437 258439 2881400
8247B881400L658157K757754l578725q112182l033564N470571N252766k557495
8239B738682n420425O95175O443848N173988J277315l32903j507378l589138l266618
8230B212546k92977J35918k711714k312275L002484N024530r12679p061731n422338
8221h338236Q8832K200823K601036N655125P254637J658079n786775n026748K626204
8212B932977O518784K979687j636422l233520m005227m128585p34822L519588
8204B212460J879598m197132n050447J484533N481185J153235l324683R8706N284068
8195E021523K292536n391449o260906L29439L500626j012705m458668m62302L960393
8186b481513o93p972306q605784j156433L560757K79460k707633K714798J0835973
$$ plain form
8247 2881400 6539557 9297311 5718586 -2393596 -5427160 43411 5296177 2738682
8239 2738682 -2681743 -1986568 4457280 9631268 10908583 10575680 9068302 5479164 2212546
8230 2212546 1919569 2055487 -656227 -2968502 33982 5058512 4145833 -2915898 -8338236
8221 -8338236 -8249404 -6048581 -3447545 2207580 9462217 11120296 5333521 306773 2932977
8212 2932977 9451761 12431448 10795026 7561506 3556279 -572306 -1307128 2212460
8204 2212460 4092058 -105074 -5155521 -3670988 1810197 2963432 -361251 -262545 5021523
8195 5021523 7314059 1922610 -4338296 -4008857 -508231 -1520936 -5979604 -6441906 -2481513
8186 -2481513 -2482206 -10454512 -19060296 -20216729 -16655972 -16376512 -19084145 -16369347 -5533374
8177e533374J0310383J416403m544260k102797J915533P78665k527860k679082
8169b966389j123197j356528j376023J617821L946971J262691k234841K32361
8161a997134N378271L769783m041253o552830J129276R326305Q147773P89473
8153A5949664l846548m392776n191748o477704m769486o15736J543602O64528
8145g136204K62975K134566L783990K862319M75750r25587n49851M79849L84229
8136A772036j701738m309094m421288p64194M462204P842593P591809L938711
8128A4411039j167967m175529k517481J719982L440827J034895j893047k567192
8120H285527k792746m389040n190769l134385m70510L54733J451541M949750O811196
$$ plain form
8177 -5533374 4777009 6193412 1649152 -453645 1461888 2240553 -287307 -2966389
8169 -2966389 -4089586 -5446114 -6822137 -5204316 -1257345 5346 -2229495 -1997134
8161 -1997134 3381137 7150920 3109667 -3443163 -2313887 7012418 15160191 15949664
8153 15949664 12103116 7710340 2518592 -3959112 -8728598 -9344334 -7800732 -7136204
8145 -7136204 -6873229 -4738663 -954673 1907646 2383396 1457809 907958 1387807 1772036
8136 1772036 70298 -4238796 -8660084 -9424278 -4962074 2880519 10472328 14411039
8128 14411039 13243072 9067543 6550062 8270044 11710871 12745766 10852719 8285527
8120 8285527 5492781 1103741 -4087028 -7221413 -7691923 -7337190 -5885649 -935899 5875297
8111E875297J789489o735958r021835k147606N184785L857278l984829q139739
8103a3323118l100312N928076R779455N753038l55152k234082n40374j62383j976804
8094b31656k087966M91168J139571k713431o413245m775392K44956L389507L874543
8085g081945L873205K617342j452738m960378l067180K330618M582968K015241
8077a142867p97992j194707j072069j139399L93992K307413N61155m113095n493768
8068a1691337j253208L166083L014694Q03731R95512L137094L877419J997967
8060D047955j231562l368698j461244M178645O828315M67022r454358j0667433
8052a0661358j464900O060749L958817o45267J116119N514121M232256j271086
$$ plain form
8111 5875297 7664786 928828 -8093007 -10240613 -5055828 -1198550 -5183379 -13323118
8103 -13323118 -16423430 -10495354 -715899 5037139 4681987 2447905 1907531 1745148 -231656
8094 -231656 -2319622 -1828454 -688883 -3402314 -9815559 -14590951 -14345995 -10956488 -7081945
8085 -7081945 -3208740 -591398 -2044136 -7004514 -10071694 -7741076 -3158108 -1142867
8077 -1142867 -1940859 -3135566 -4207635 -5347034 -4953042 -2645629 -2084474 -6197569 -11691337
8068 -11691337 -12944545 -9778462 -6763768 -5960037 -4964525 -1827431 2049988 4047955
8060 4047955 2816393 -552305 -2013549 2165096 8993411 9460433 6075 -10661358
8052 -10661358 -12126258 -6065509 -2106692 -2751959 -1635840 3878281 8110537 6839451
8044F839451l648439k042185n48241P49228L321091L494191j511245n452478k057356
8035h55983K450087j423407q574354n708233N980596J1009648L939253l212031
8027C605576k166717m05016m460143o770000k65723O680464L168510n617152o578103
8018a2808304O78503N069851K401271n02205R22620L025966K202135m6158j665003
8009g21324k522750j648733J717257M359500K539382j237355j322114J785978
8001B949841K286263q73695k409773k37205J024113j422832l384052p57162L606483
7992G81981M334680J129348j920740k224646p82740J95106k84377j234762q35431
7983h41581Q53310J374386j50477o57187J926524L845480P40981m159274l728536
$$ plain form
8044 6839451 3191012 1148827 600586 1349814 4670905 8165096 6653851 1201373 -855983
8035 -855983 1594104 170697 -8403657 -14111890 -8131294 2878354 6817607 3605576
8027 3605576 1438859 1033843 -3426300 -10196300 -10462023 -3781559 -613049 -6230201 -12808304
8018 -12808304 -12129801 -7059950 -4658679 -5160884 -4238264 -1212298 989837 943679 -721324
8009 -721324 -3244074 -4892807 -3175550 1183950 3723332 2485977 1163863 2949841
8001 2949841 5236104 4362409 1952636 1715431 2739544 1316712 -2067340 -2824502 781981
7992 781981 5116661 6246009 4325269 2100623 1317883 1512989 1228612 -6150 -841581
7983 -841581 11729 1386115 1235638 578451 2504975 6350455 7091436 2932162 -796374
7974g96374J728718M345827Q85870k767359j892410K2696j211234k871701q77936
7965c433903K607515L338676K345647K778835L110483L12441k981433j790442
7957F287819K252369K575119j957684n381703m191468j900795k014634k436501
7949f767478j76302L030014L752990K364841J583558J535287R2356k712628m092618
7940a389980k640789m04457K50990J01941J726210N280614P443232N298345L0898
7931A5697004m598707o588313o606368n254061k359623O81529J378468M93573
7923g156498K260945P434237R688802L581419o222698r499352l862666K364189
7915a411622K084955j500736j300928K593999L679968o12511m847458l320456
$$ plain form
7974 -796374 932344 5278171 6164041 3396682 1504272 1526968 315734 -2555967 -3433903
7965 -3433903 -826388 2512288 4857935 7636770 10747253 11059694 8078261 6287819
7957 6287819 8540188 11115307 9157623 3775920 -415548 -2316343 -4330977 -6767478
7949 -6767478 -6943780 -3913766 -160776 2204065 3787623 5322910 5415266 2702638 -1389980
7940 -1389980 -4030769 -4435226 -4184236 -4082295 -2356085 2924529 10367761 15666106 15697004
7931 15697004 11098297 4509984 -2096384 -7350445 -9710068 -9028539 -7650071 -7156498
7923 -7156498 -4895553 2538684 12227486 15808905 9586207 86855 -3775811 -1411622
7915 -1411622 673333 -827403 -2128331 465668 4145636 3533125 -1314333 -4634789
7907d634789J925914M034986Q82108k134621j32336L593955J811733n585724r732890
7898i971664m148021O063231J0266741N202615k521287n599627l158785J064815
$$ plain form
7907 -4634789 -2708875 1326111 2208219 73598 -58738 3535217 5346950 -238774 -9971664
7898 -9971664 -14119685 -8056454 2210287 7412902 4891615 -708012 -3866797 -2801982
$$ [...]
##END NTUPLES=NMR SPECTRUM
##END=
