##TITLE=31Pdec_SR4_K_TFA
 CDCl3, 24 sc
 23.12.2019
##JCAMPDX= 6.0         $$ Bruker NMR JCAMP-DX V2.0
##DATA TYPE= NMR SPECTRUM
##DATA CLASS= NTUPLES
##ORIGIN= UXNMR, Bruker Analytische Messtechnik GmbH
##OWNER= root
$$ XWIN-NMR		Version 3.5
$$ Mon Dec 23 14:27:06 2019 Russian Standard Time (UT+4h)  she@DPX200
##.OBSERVE FREQUENCY= 81.013821
##.OBSERVE NUCLEUS= ^31P
##.ACQUISITION MODE= SIMULTANEOUS
##.ACQUISITION SCHEME= undefined
##.AVERAGES= 24
##.DIGITISER RES= 17
##SPECTROMETER/DATA SYSTEM= spect
##.PULSE SEQUENCE= zgpg30
##.SOLVENT NAME= CDCl3
##.SHIFT REFERENCE= (INTERNAL, CDCl3, 0, 182.463)
##AUDIT TRAIL= $$ (NUMBER, WHEN, WHO, WHERE, WHAT)
$$ ##TITLE= Audit trail, XWIN-NMR		Version 3.5
$$ ##JCAMPDX= 5.01
$$ ##ORIGIN= Bruker BioSpin GmbH
$$ ##OWNER= she
$$ F:/spectra/data/she/nmr/P31/1/pdata/1/auditp.txt
$$ ##AUDIT TRAIL=  $$ (NUMBER, WHEN, WHO, WHERE, WHAT)
(   1,<2019-12-23 14:26:08.93 +0400>,<she>,<DPX200>,
      <created by zg, POWCHK disabled, PULCHK disabled
       configuration hash MD5:
       00 E9 B6 7A A2 85 ED C7 34 08 36 98 17 FE 4E 26
       data hash MD5: 32K
       06 AF EB 06 17 94 27 F6 4D A9 34 4B 79 C1 EF 0C>)
(   2,<2019-12-23 14:26:12.14 +0400>,<she>,<DPX200>,
      <Start of raw data processing
       efp BC_mod = 2 LB = 1 FT_mod = 6 PKNL = 1 PHC0 = -1690.493 PHC1 = 99.4012 SI = 64K 
       data hash MD5: 64K
       E5 FA 09 BB 76 C3 39 59 23 4B C0 1B 78 23 D0 35>)
(   3,<2019-12-23 14:26:27.35 +0400>,<she>,<DPX200>,
      <pk PHC0 = 21.76834 PHC1 = 0 
       data hash MD5: 64K
       28 BF 46 63 49 83 1B 09 D8 23 5B 0B 6E 71 8B 09>)
(   4,<2019-12-23 14:26:33.84 +0400>,<she>,<DPX200>,
      <abs ABSG = 5 
       data hash MD5: 64K
       B2 2E 51 25 56 89 A6 0E 0E 3D 17 A9 B6 89 5C 7F>)
$$ ##END=
$$ 
$$ hash MD5
$$ FF BB 60 09 10 AD C9 5B C7 7D 39 C8 D0 B6 A7 43
##$RELAX= 
##$RELAX= 
##$RELAX= 
##$RELAX= 
##$RELAX= 
##$RELAX= 
##$RELAX= 
##$RELAX= 
$$ Bruker specific parameters
$$ --------------------------
##$DU= <F:/spectra>
##$EXPNO= 1
##$NAME= <P31>
##$PROCNO= 1
##$TYPE= <nmr>
##$USER= <she>
##$AMP= (0..31)
100 100 100 100 100 100 100 100 100 100 100 100 100 100 100 100 100 100 
100 100 100 100 100 100 100 100 100 100 100 100 100 100 
##$AQSEQ= 0
##$AQ_mod= 1
##$AUNM= <au_zg>
##$AUTOPOS= <>
##$BF1= 81.014009
##$BF2= 200.13
##$BF3= 200.13
##$BF4= 200.13
##$BF5= 200.13
##$BF6= 200.13
##$BF7= 200.13
##$BF8= 200.13
##$BYTORDA= 1
##$CFDGTYP= 0
##$CFRGTYP= 5
##$CHEMSTR= <none>
##$CNST= (0..31)
1 1 145 1 1 1 1 1 1 1 1 1 1 1 1 1 1 1 1 1 1 1 1 1 1 1 1 1 1 1 1 1 
##$CPDPRG= <waltz16>
##$CPDPRG1= <>
##$CPDPRG2= <waltz16>
##$CPDPRG3= <>
##$CPDPRG4= <mlev>
##$CPDPRG5= <mlev>
##$CPDPRG6= <mlev>
##$CPDPRG7= <mlev>
##$CPDPRG8= <mlev>
##$CPDPRGB= <>
##$CPDPRGT= <>
##$D= (0..31)
0 1 0 0 0 0 0 0 0 0 0 0.03 2e-05 3e-06 0 0 0 0 0 0 0 0 0 0 0 0 0 0 0 0 
0 0 
##$DATE= 1577096768
##$DBL= (0..7)
120 120 120 11 120 120 24 19 
##$DBP= (0..7)
150 150 150 150 150 150 150 150 
##$DBP07= 0
##$DBPNAM0= <>
##$DBPNAM1= <>
##$DBPNAM2= <>
$$ [...]
##$SUBNAM3= <"">
##$SUBNAM4= <"">
##$SUBNAM5= <"">
##$SUBNAM6= <"">
##$SUBNAM7= <"">
##$SUBNAM8= <"">
##$SUBNAM9= <"">
##$SW= 369.568048894756
##$SWIBOX= (0..15)
0 1 3 0 0 0 0 0 0 0 0 0 0 0 0 0 
##$SW_h= 29940.119760479
##$TD= 32768
##$TD0= 1
##$TE= 0
##$TE2= 300
##$TE3= 300
##$TEG= 300
##$TL= (0..7)
0 120 53 12 22 120 120 120 
##$TP= (0..7)
150 150 150 150 150 150 150 150 
##$TP07= 0
##$TPNAME0= <>
##$TPNAME1= <>
##$TPNAME2= <>
##$TPNAME3= <>
##$TPNAME4= <>
##$TPNAME5= <>
##$TPNAME6= <>
##$TPNAME7= <>
##$TPOAL= (0..7)
0.5 0.5 0.5 0.5 0.5 0.5 0.5 0.5 
##$TPOFFS= (0..7)
0 0 0 0 0 0 0 0 
##$TUNHIN= 0
##$TUNHOUT= 0
##$TUNXOUT= 0
##$USERA1= <user>
##$USERA2= <user>
##$USERA3= <user>
##$USERA4= <user>
##$USERA5= <user>
##$V9= 5
##$VALIST= <valist>
##$VCLIST= <CCCCCCCCCCCCCCC>
##$VD= 0
##$VDLIST= <DDDDDDDDDDDDDDD>
##$VPLIST= <PPPPPPPPPPPPPPP>
##$VTLIST= <TTTTTTTTTTTTTTT>
##$WBST= 1024
##$WBSW= 4
##$XGAIN= (0..3)
0 0 0 0 
##$XL= 0
##$YL= 0
##$YMAX_a= 5786
##$YMIN_a= -6927
##$ZGOPTNS= <>
##$ZL1= 120
##$ZL2= 120
##$ZL3= 120
##$ZL4= 120
##$ABSF1= 182.463
##$ABSF2= -187.1042
##$ABSG= 5
##$ABSL= 3
##$ALPHA= 0
##$AQORDER= 0
##$ASSFAC= 0
##$ASSFACI= 0
##$ASSFACX= 0
##$ASSWID= 0
##$AUNMP= <proc_1d>
##$AZFE= 0.1
##$AZFW= 0.5
##$BCFW= 0
##$BC_mod= 2
##$BYTORDP= 0
##$COROFFS= 0
##$CY= -3
##$DATMOD= 1
##$DC= 0
##$DFILT= <>
##$DTYPP= 0
##$F1P= 0
##$F2P= 0
##$FCOR= 1
##$FTSIZE= 65536
##$FT_mod= 6
##$GAMMA= 0
##$GB= 0
##$INTBC= 1
##$INTSCL= 5.30512e-09
##$ISEN= 30
##$LB= 1
##$LEV0= 0
##$LPBIN= 0
##$MAXI= 10000
##$MC2= 0
##$MEAN= 0
##$ME_mod= 0
##$MI= 50
##$NCOEF= 0
##$NC_proc= -9
##$NLEV= 6
##$NOISF1= 182.463
##$NOISF2= 159.3651
##$NSP= 0
##$NTH_PI= 0
##$NZP= 0
##$OFFSET= 182.463
##$PC= 4
##$PHC0= -1668.725
##$PHC1= 99.4012
##$PH_mod= 1
##$PKNL= yes
##$PPARMOD= 0
##$PSCAL= 0
##$PSIGN= 0
##$REVERSE= no
##$SF= 81.0140089999434
##$SI= 65536
##$SIGF1= 159.3651
##$SIGF2= -187.1042
##$SINO= 113.3802
##$SIOLD= 16384
##$SREGLST= <1H.CDCl3>
##$SSB= 0
##$STSI= 65536
##$STSR= 0
##$SW_p= 29940.119760479
##$SYMM= 0
##$S_DEV= 0
##$TDeff= 32768
##$TDoff= 0
##$TI= <>
##$TILT= no
##$TM1= 0
##$TM2= 0
##$TOPLEV= 0
##$USERP1= <user>
##$USERP2= <user>
##$USERP3= <user>
##$USERP4= <user>
##$USERP5= <user>
##$WDW= 1
##$XDIM= 65536
##$YMAX_p= 398277875
##$YMIN_p= -261468062
$$ End of Bruker specific parameters
$$ ---------------------------------
##NTUPLES= NMR SPECTRUM
##VAR_NAME=  FREQUENCY,     SPECTRUM/REAL,   SPECTRUM/IMAG
##SYMBOL=    X,             R,               I
##VAR_TYPE=  INDEPENDENT,   DEPENDENT,       DEPENDENT
##VAR_FORM=  AFFN,          ASDF,            ASDF
##VAR_DIM=   65536,         65536,           65536
##UNITS=     HZ,            ARBITRARY UNITS, ARBITRARY UNITS
##FACTOR=    0.456856943014862, 1,           1
##FIRST=     14782.0589164792, 0,            0
##LAST=      -15158.0608439998, 0,           0
##MIN=       -15158.0608439998, -261468062,  0
##MAX=       14782.0589164792, 398277875,    0
$$ Real data points
##PAGE= N=1
##DATA TABLE= (X++(R..R)), XYDATA
$$ [...]
48123 3720115 26778002 27979950 16713938 12688507 17853074 19466809 13213321 7543169
48115 7543169 6702096 3959183 -4990568 -13027143 -11931577 -4463204 298814 -581037
48107 -581037 -2140920 -277670 2802830 1604281 -7363379 -22553667 -36662490 -40022763
48099 -40022763 -28821154 -10438921 2760063 5709921 3570174 2091569 91682 -5652498
48091 -5652498 -12616994 -14729669 -10197235 -2694350 3422941 4900053 -608268 -10516205
48083 -10516205 -15345497 -8487197 2785255 4570626 -4765196 -12221201 -8820589 -579655
48075 -579655 3468841 4116721 6328616 10046675 14612678 23567028 35402701 37728305
48067 37728305 22423813 228421 -12410289 -15578015 -20963706 -29168616 -28644731 -16608476
48059 -16608476 -4319760 942138 4010462 8500372 10099712 7742727 6927861 6357075
48051 6357075 -3545121 -21244743 -28884065 -17334412 -2347179 -2317958 -12001581 -13742800
48043 -13742800 -5200853 1284229 737273 -521257 -192472 -3011033 -8855435 -12044899
48035 -12044899 -12645558 -15403763 -17685229 -12552273 -4821520 -8836401 -26044848 -38918916
48027 -38918916 -34090836 -19817646 -12254310 -13948958 -15377386 -11203687 -5295746 -2322340
48019 -2322340 -1725983 373978 6734299 15286169 19213726 14288495 5872476 2369455
48011 2369455 1520993 -7428530 -24799845 -34591778 -25327198 -7941847 -1977520 -9459401
48003 -9459401 -14940861 -9720287 -3010855 -6097566 -16454723 -24492754 -28831346 -35580512
47995 -35580512 -44523325 -45392425 -31788084 -13520220 -8423561 -21827695 -39586283 -44274480
47987 -44274480 -34348862 -22838363 -19807455 -22445601 -22438487 -16562877 -7209683 2811405
47979 2811405 12009465 19115829 23289516 24315771 21541813 14822885 7325234 4111030
47971 4111030 6270798 9652335 11316950 13673346 19243022 24431790 22637989 12584065
47963 12584065 562522 -5597347 -3765221 385644 -1628954 -11921978 -22197850 -22489561
47955 -22489561 -14500416 -11415731 -21966868 -39032337 -47688883 -41259893 -25521362 -9835794
47947 -9835794 1060411 7189724 9365155 6894021 -546102 -8666135 -9040059 1961121
47939 1961121 16553334 24351823 26865021 33875431 43886087 40371290 14927909 -15928890
47931 -15928890 -28115835 -18119403 -3072628 2547309 -1262614 -8295137 -13318421 -10843165
47923 -10843165 1577348 16452783 22015921 16878908 10931100 10650625 12666711 13534800
47915 13534800 15920828 21405854 25701232 24874427 18943564 7024168 -11768106 -29292253
47907 -29292253 -31116173 -14707403 4213571 10578862 6938118 4145352 3775272 -378809
47899 -378809 -9629907 -19230240 -25423426 -25145317 -13986014 6011960 21309318 20031774
47891 20031774 6786584 -5130977 -11703139 -17231479 -20321481 -15402455 -6688270 -5546531
47883 -5546531 -12740603 -17496670 -16270476 -17321010 -22470542 -20243138 -5011060 11435122
47875 11435122 17633876 18985709 24522969 28754733 21752009 8944575 4141476 7386297
47867 7386297 6463377 -1229856 -5027942 -614825 2753637 -661294 -3001374 2918073
47859 2918073 11018618 12503055 9794509 10273192 13032896 12187329 8875529 9462803 13556113
47850 13556113 13533288 6591359 -852217 -2848096 -1661885 -2800071 -6497102 -7377529
47842 -7377529 -878030 11567134 22854620 25846685 19962404 11245449 4676817 -745030
47834 -745030 -6276588 -6849483 2830186 16965453 22004200 13641636 3205926 2866617
47826 2866617 10459004 14548685 10032044 2172768 -2221412 -1048964 4578326 11937971
47818 11937971 16483495 14856337 8693570 2032397 -4048586 -9879109 -12038593 -6240683
47810 -6240683 4643417 12139842 12805503 10973025 10129205 9282648 9523285 14665729 21345860
47801 21345860 18911661 6371221 -778047 8609748 22260331 20355794 5073658 -2168777
47793 -2168777 8031488 21397897 22875408 15656122 10402764 8401620 4795291 -481127
47785 -481127 -4059185 -5238374 -4160216 -260001 2529510 -2486489 -12349374 -14266383
47777 -14266383 -5346820 -662398 -11038453 -25101295 -27768718 -24751639 -29470970 -34868609
47769 -34868609 -22502820 3473041 17416670 10326454 1738674 5743913 9512329 -847533
47761 -847533 -14643400 -15273641 -7876870 -7400028 -11175897 -6091196 4173286 2719771
47753 2719771 -11394048 -20027464 -15296377 -11996289 -23130669 -39246918 -42774117 -31825275
47745 -31825275 -18550068 -10396182 -3454219 7751684 21416001 29971953 27526853 16258806
47737 16258806 6056009 5591263 13285629 19488457 17057087 6622278 -7163842 -19662332
47729 -19662332 -27169345 -29119303 -29293675 -30043088 -26604956 -13600477 3929573 14364602
47721 14364602 15146182 15714658 22274638 28597096 26947985 20620101 18826112 23733912
47713 23733912 28789991 27406778 18904889 7952415 1170860 1960409 6489801 7327050
47705 7327050 2126021 -4559780 -8104169 -7584443 -3109892 3791220 6974259 1641738
47697 1641738 -5135009 -506659 14099501 21292203 12876517 4028158 11415696 28249125
47689 28249125 35568126 30241092 24811945 23942318 19597828 10265580 7110112 15541044
47681 15541044 24944844 24293856 17233595 13959718 16383100 18693822 16386506 8727490
47673 8727490 -1948658 -8355336 -2253175 13683140 24002046 17107883 -1086005 -16290935
47665 -16290935 -23467353 -27959740 -33195030 -35902154 -32468996 -23223555 -10631056 1884862
47657 1884862 10380747 13857104 15373064 16008463 11676636 1255840 -7379761 -8086586
47649 -8086586 -8922146 -22016816 -42176355 -49443479 -36366224 -19295221 -15111881 -18460498
47641 -18460498 -13218442 2119037 14369497 16524820 14134164 11471359 5956228 -187055
47633 -187055 3726214 21145377 38769931 41587460 30406308 16073120 3453390 -8021569
47625 -8021569 -13467887 -6061599 9468522 19959121 22192195 25926062 35308013 40268317
47617 40268317 33348586 23162754 20650637 21396077 14846993 4940041 5942248 18761641
47609 18761641 26720423 18908498 5234011 1377947 8158544 14310465 13494715 9152772
47601 9152772 5064919 -105802 -7925204 -15991655 -21013946 -22803801 -23262918 -23261227 -22060164
47592 -22060164 -19012038 -14856030 -11383850 -9715408 -8330213 -2980885 9999497 28721844
47584 28721844 44172594 46014751 32341939 13037102 1123928 1051747 7596037 14436494
47576 14436494 18684694 17557184 8415217 -4781531 -12433985 -11904208 -12394410 -20697075
47568 -20697075 -29167681 -27132517 -17966755 -12689809 -10900935 -2745559 11275540 18329213
47560 18329213 13323961 5289271 -676893 -11123907 -25926521 -29425774 -13536298 4164459
47552 4164459 2431006 -13471870 -21940121 -18136576 -16061889 -20302303 -18144167 -3621461
47544 -3621461 10743585 14349072 13938830 18476561 23168101 21325617 20372180 30497429
47536 30497429 44575031 45697942 32228978 20202668 19943352 24097841 22628092 17172402
47528 17172402 13326451 8510906 -2135017 -12954834 -11996485 2227816 17359188 22810318
47520 22810318 21163924 19936064 18828432 12456916 1921714 -5318720 -6969712 -8642408
47512 -8642408 -12745740 -13040567 -5346388 3678650 5937235 4338973 6369302 9032266
47504 9032266 1994280 -14296011 -25623675 -22479471 -10739695 1121388 14237345
47497 14237345 29901492 37899593 28032723 8471227 -2540485 -3076888 -9873581 -29267781
47489 -29267781 -41125087 -24330775 10992994 32881022 27228026 12574155 11746565
47482 11746565 23235146 30289266 27504195 23703489 22927780 18918030 10620769 8075408
47474 8075408 15432832 20347725 11528834 -1709453 -1082361 14017889 26204783 25592956
47466 25592956 20246212 17837896 12361256 -1780130 -14692500 -13434422 -2942379 -124690
47458 -124690 -8569700 -13054736 -2802732 11387467 11489062 -2638953 -12587153 -5674620
47450 -5674620 8693487 11702001 -856806 -15090862 -19066301 -16982050 -18204708 -20713040
47442 -20713040 -16426496 -8585466 -9237779 -18227497 -20224876 -9328618 -1684320 -11215772
47434 -11215772 -24787318 -19005934 4383066 19204999 10979157 -5845136 -11495094
47427 -11495094 -5742094 -573137 -442684 -1006469 -178252 78284 -485833 -409586 282878
47418 282878 1868151 6124030 11435822 11750434 5225198 -1843467 -5278195 -10555481
47410 -10555481 -22691875 -35146950 -38414789 -34486205 -31705877 -29138114 -19161628 -4621952
47402 -4621952 770437 -7634455 -17444699 -16722452 -9223891 -5368447 -6768659 -8247274
47394 -8247274 -8759538 -10492847 -10367245 -2356260 11252128 18882339 13092435 300550
47386 300550 -6620427 -3423164 1638286 -438180 -7314348 -9098997 -3182316 1523999
47378 1523999 -1312859 -3815781 5712129 24773842 39175844 42390646 41242660 40667208
47370 40667208 34760411 18700787 -137486 -10470404 -9635474 -1642975 9780826 18968649
47362 18968649 16843553 1408459 -15259598 -19582446 -12143260 -3145800 2126862 4034980
47354 4034980 733004 -8498609 -15759726 -12281425 -851629 10985066 25613306 48183845
47346 48183845 67975483 66082830 43997174 25818817 26175080 33576095 33801240 31911344
47338 31911344 38096712 46474439 43983097 30457086 14610766 -1987953 -21530885
47331 -21530885 -36736516 -37071819 -25439651 -14749469 -9911405 -5847081 -745829 2139792
47323 2139792 4186028 9310122 13185940 8259689 -950017 -2017277 5408749 8896334
47315 8896334 4015453 -612980 -2484793 -11328367 -28592811 -38544315 -31618267 -21483131
47307 -21483131 -24248432 -32981385 -29665341 -13595610 198554 5580881 9942839 15870509
47299 15870509 16303747 10451972 8449382 14694080 19752325 15723158 8919621 9626997
47291 9626997 17872245 27320811 36140873 45131313 50073162 45379727 33391470 22010803
47283 22010803 13741096 4435658 -6343455 -10973952 -3703674 9123046 13809714 4268502
47275 4268502 -10905472 -18011101 -13273709 -5163951 -1537362 466624 7128403 14671935
47267 14671935 11910310 -2760842 -16149697 -16857381 -9504188 -5370359 -5397043 -2504499
47259 -2504499 3092412 3142928 -3735752 -8185594 -4646127 437836 56635 -2913112 -3140788
47250 -3140788 -2193999 -2490686 212459 8312535 12872814 4478421 -10812583 -18974592
47242 -18974592 -18363040 -18500794 -20025889 -12396797 5703588 20380390 23608118 25028796
47234 25028796 33160369 38542270 28097427 5678400 -14874825 -28337387 -36119519
47227 -36119519 -34053459 -18468831 575995 8775878 7980531 11490951 20771682 23706617
47219 23706617 16588489 10602269 12999535 17799608 19860714 22408141 24101028 14241424
47211 14241424 -9537235 -31729962 -37578773 -30891842 -24004843 -20706057 -19536887 -23615755
47203 -23615755 -34452954 -43473514 -41901126 -33384769 -26411307 -20959071 -13685365 -8798370
47195 -8798370 -10526399 -11354325 -3009269 5422425 -2682336 -24699276 -38758906 -33007655
47187 -33007655 -19791433 -15915620 -21703458 -26068133 -22193469 -11289418 1846696 10980990
47179 10980990 11505371 5690525 661416 -745847 -1838323 -4064806 -4470158 -3079291
47171 -3079291 -5052831 -11972428 -17655583 -16509359 -10454663 -4167867 1263628 6725699
47163 6725699 11862774 15937680 17356337 11516098 -4052794 -20594777 -22580492 -6022757
47155 -6022757 14492978 22725901 19019125 15253247 16177380 14017704 1648582 -14829593
47147 -14829593 -20073504 -6046786 16963153 29637928 26006635 21069277 29725102 43678438
47139 43678438 41218389 18443213 -3729433 -7256046 2226978 9315076 10247194 8784915
47131 8784915 895365 -20585283 -48802045 -64557620 -57795067 -38753688 -25048871
47124 -25048871 -23540533 -27381611 -26911706 -20508623 -14959182 -15590184 -18095725 -14006879
47116 -14006879 -3192149 5912576 9690502 14543011 24721255 33406781 32596477 25033921
47108 25033921 18712522 15302840 12195940 10754168 12981285 13525258 5224602 -8116018
47100 -8116018 -13177461 -2472391 16950001 29780091 24192315 978318 -24301318
47093 -24301318 -32786103 -21572485 -6476495 10398 5386553 22167448 44386347
47086 44386347 53446914 43631714 27003584 14054204 4049215 -4507895 -8054965 -5870544
47078 -5870544 -1962854 3731793 14962944 28139171 33687461 30502729 26375507 22272919
47070 22272919 11450492 -2240963 -3031169 11809409 23098018 17337937 6978100
47063 6978100 8482605 15058486 10015784 -3839343 -9618126 -4992722 -3747012 -10527582
47055 -10527582 -14696255 -10808718 -5941592 -2859634 5594501 18794725 22422637 10122807
47047 10122807 -3493465 -3253784 5054847 6709633 2045500 3164496 11978927 17092064
47039 17092064 11827154 1991979 -5700754 -11024319 -13147763 -7709549 3011181 6598936
47031 6598936 -3837901 -16461158 -13555281 4289270 17358357 12611380 1086264
47024 1086264 2455327 17296259 24723393 9226598 -18120988 -31478734 -19892904
47017 -19892904 2127961 14192336 12852901 9692093 11313742 10729409 1026108 -10595644
47009 -10595644 -10894649 -366375 4865225 -5592455 -21160477 -24204633 -14646242 -9787012
47001 -9787012 -18632474 -27605002 -19083840 3248586 18583884 16793639 10524844 15351701
46993 15351701 26984123 27454042 10761653 -7780796 -10495329 1576626 12041389
46986 12041389 9508722 -2221583 -12996959 -17641001 -16236883 -10007233 -2387494 111760
46978 111760 -4985756 -9826115 -4132023 10051062 18172584 10229052 -7384416 -20400043
46970 -20400043 -22445817 -18009789 -13389542 -10448521 -8288082 -6052187 -3383488 -1312511
46962 -1312511 -2960011 -10118388 -18305444 -18529516 -6699777 9823733 17828832 11408286
46954 11408286 -1877240 -9661232 -8668750 -6657142 -9678439 -12261751 -5310578 8723416
46946 8723416 15595971 5474688 -15848909 -33719163 -38030378 -28440899 -11863655 1900469
46938 1900469 6562900 5077739 5621040 9857071 10676966 4611107 -776420 2030895
46930 2030895 8526278 9555892 5823843 5525947 10579888 15279917 17114304 18483498
46922 18483498 17816790 9953451 -2716591 -9977999 -8118140 -4934142 -6197612 -6679644
46914 -6679644 -589379 7753132 11150480 10388040 9913744 8551140 2965841 -4248178
46906 -4248178 -8464553 -11091981 -14960905 -15169455 -4610239 13184047 27185689 34434001
46898 34434001 41287212 47648251 42398424 20769348 -3788788 -14466286 -11960831 -10842514
46890 -10842514 -18060765 -25068814 -21990845 -10936829 -1712359 -553227 -7840166 -22153554
46882 -22153554 -39658471 -51146673 -47659443 -31804806 -17748831 -15395626 -18485590
46875 -18485590 -13805396 829043 14693549 18658202 13377493 2819836 -10733502
46868 -10733502 -22046750 -23071375 -14107299 -6806965 -8736549 -12748319 -10306233 -6484774
46860 -6484774 -9197454 -11547123 -2233554 10847685 8325472 -8394863 -15383164 -3946069
46852 -3946069 2836831 -13857267 -35932222 -33654316 -10806209 537807 -14339782
46845 -14339782 -36327526 -42527199 -31243782 -12617737 6087506 18062559 16470244
46838 16470244 6385915 4339889 16346418 27702317 23999810 11086938 3583413
46831 3583413 4262673 7389148 13294891 24819785 35080179 33608941 21797160 9416585
46823 9416585 -963253 -12601712 -20813577 -16726681 -5124705 -2167582 -11662567 -18928102
46815 -18928102 -14314646 -8137231 -12719607 -21919408 -21071199 -9388229 578465 1860848
46807 1860848 -599273 -1622161 -3188553 -8013823 -13190938 -13855504 -9591817 -4615869
46799 -4615869 -2912031 -4332858 -5544369 -4936332 -5151314 -8602063 -12589719 -13404555 -13288089
46790 -13288089 -16222252 -17910932 -10145963 3064423 5815325 -7253444 -20469443 -18595819
46782 -18595819 -8487465 -6470011 -11942709 -9469822 6009423 22159286 28176350 26288161
46774 26288161 21584223 13921844 5108425 2313135 7225167 10818040 6008544 -1695867
46766 -1695867 -2918805 2324212 6551285 5080063 -1115309 -8010216 -9186199 501004
46758 501004 16318664 24233122 16495678 1881507 -6020461 -5595314 -4603606 -5585810
46750 -5585810 -3781050 2295124 8093979 11491156 15572604 21174478 23879391 21182190
46742 21182190 16840810 15044129 14890770 13810796 12703837 14087209 17347669 19153573
46734 19153573 18039609 16510583 18214604 23428772 27529603 24584791 12849347 -3989723
46726 -3989723 -20761620 -34091854 -42082917 -44417071 -43893282 -43952762 -43187570 -37068806
46718 -37068806 -26921031 -20303980 -18619008 -12990789 -100606 6934750 -3639072 -19809738
46710 -19809738 -18380677 935140 12931201 3565704 -9276468 -3255797 15210251
46703 15210251 21896103 10033789 -3762840 -6026556 -1344570 1378170 2307843 4434409
46695 4434409 5525156 3706286 2710594 4304248 2499096 -6627252 -14894448 -11225630
46687 -11225630 1959169 11249770 10881783 9136323 13143032 16126798 7093434 -11201195
46679 -11201195 -22625765 -16867240 -2023490 5485986 450042 -5970566 -562310 15761054
46671 15761054 28504155 25849362 11889028 1472711 2737028 8679728 8187789 1338305
46663 1338305 -2168035 1627233 5198931 1673627 -5229069 -9396705 -13663817 -23409220
46655 -23409220 -32685821 -28682163 -10630980 7068124 13790281 13985077 14556765 12395794
46647 12395794 3611426 -4323127 -2081462 5693506 7230777 2753284 2544693 7080840
46639 7080840 5021439 -5744178 -10684034 -169165 14290413 15919455 5457613 -3250458
46631 -3250458 -3344706 1503099 8604741 17999889 24409921 20437981 9242885 3042942
46623 3042942 6421086 10883288 9131604 4944119 3900706 3388628 -679308 -3729797
46615 -3729797 2085603 15129432 24313942 21582716 9884475 -621239 -1423447 7345408
46607 7345408 16098716 14889042 6205906 4428303 17847239 35566523 39142704 24620095
46599 24620095 5573123 -4097482 -1950896 8124818 22742551 36794019 42439405
46592 42439405 36764886 26395999 19568946 16908480 14181938 10300189 7194760 4531289
46584 4531289 473659 -3590230 -4605683 -3567559 -4410598 -7278714 -8394697 -7428127
46576 -7428127 -9143572 -15139890 -19143570 -14998439 -6287814 -3048833 -9606420 -19544003
46568 -19544003 -23333400 -18633323 -12252321 -12730223 -20828476 -27323229 -22196781 -7117546
46560 -7117546 4146517 784596 -12046642 -19878032 -17119828 -12091381 -12658371 -14058839
46552 -14058839 -6430927 9966395 24216251 28387668 25019281 19826796 13148981 2608254
46544 2608254 -9325414 -15459898 -11545720 -1122018 7880585 10540727 9171643 10262062
46536 10262062 16063897 19664523 11730285 -6489812 -20969978 -19879871 -8336440 -2681456
46528 -2681456 -10363640 -21501122 -22516287 -12725983 -2930609 -996482 -4560653 -6982429
46520 -6982429 -4644765 2857845 14405192 25684555 29496836 22833902 12806373 10896156
46512 10896156 20331483 32414932 36385208 29706128 17226387 4066440 -7305527
46505 -7305527 -15627462 -20710491 -23777280 -24768674 -20862696 -11275778 -1353858 3455059
46497 3455059 6135607 13693596 24680680 29938519 27688109 27648193 34514520 37456922
46489 37456922 26057970 9126742 4362049 12559325 16215915 4539021 -13395340
46482 -13395340 -23744793 -23800262 -17392097 -6194979 6039949 10278916 3610969 -2791332
46474 -2791332 2757954 16271036 25254083 26150265 22860197 13677544 -4277635 -19805841
46466 -19805841 -15849719 3210312 11288228 -3147287 -17835561 -8368781 15197586
46459 15197586 23520474 11299127 1669613 8068915 16239123 11833476 3951128 6173388
46451 6173388 10618635 774682 -19123276 -28921502 -23761165 -19270017 -23112470 -22112319
46443 -22112319 -6800615 8721176 6113595 -9349620 -16811958 -10112541 -3793040 -9748102
46435 -9748102 -22401506 -29660491 -26734562 -15258853 739796 12585446 9845606 -7032211
46427 -7032211 -22826314 -23168015 -10063277 3542847 9770200 9555766 4678640 -4714249
46419 -4714249 -14831725 -18501230 -13367676 -5235909 -1159102 -2387355 -5369794 -6481492
46411 -6481492 -4168166 847012 5426381 5663406 423491 -7252196 -12838126 -13806623
46403 -13806623 -10616359 -5605275 -1133822 2269483 5819274 9265551 8574110 41453
46395 41453 -12163002 -16340250 -5503879 11940902 19359153 11532837 1592853 3404906
46387 3404906 11744111 9069071 -8771904 -24809120 -23513593 -11025818 -4130229 -6741128
46379 -6741128 -9261492 -7057705 -5818296 -8759446 -12114524 -16102135 -27096358 -43096969
46371 -43096969 -49330013 -37520686 -20553262 -17644410 -30488415 -43081003 -40942102
46364 -40942102 -23058247 348555 14356093 9038471 -8885756 -19132802 -11243765
46357 -11243765 997790 -1048114 -13541394 -16708751 -5296061 4633279 1215907 -7186100
46349 -7186100 -7875392 -2481853 -617141 -4173376 -7923901 -10502236 -15615011 -23946667
46341 -23946667 -30283929 -29006763 -19729950 -8006739 -1164647 -1687545 -4650848 -3752627
46333 -3752627 1323512 6383297 9019105 8997469 5300917 -1242278 -5029872 -2068744
46325 -2068744 3494662 6145993 7750103 10332881 6016482 -12101586 -32952130 -38025878
46317 -38025878 -27605026 -18332913 -14594992 -4147574 13660255 20091374 8380677
46310 8380677 -813568 8071937 18408678 7725460 -15882448 -27415918 -22200757 -14799677
46302 -14799677 -10829854 -5954408 -5671555 -18169378 -30828583 -22291285 2036525 14998317
46294 14998317 10153701 8433225 16206755 10676037 -17639589 -39841198 -30054420 -6330542
46286 -6330542 -1202237 -10569115 -5381428 16432217 25442678 8049796 -14126959 -20081001
46278 -20081001 -17605947 -22636289 -31814518 -32781023 -27768267 -28860194 -36753795 -40345158
46270 -40345158 -35299103 -29644801 -29533774 -29564554 -21179666 -4998665 9066044 12047810
46262 12047810 4762923 -2737219 -992819 8430299 13856841 6815576 -7554401 -16582974
46254 -16582974 -14880898 -8612309 -5492269 -6151976 -7393921 -8630526 -10414674 -9882919
46246 -9882919 -3669502 5350503 9963482 8230435 5968462 7488894 8982530 5226626
46238 5226626 -952931 -1476281 6183248 16141486 21989549 23015539 21785303 19723142
46230 19723142 17318485 16092088 17604724 20946597 22638992 19385455 10932268 225466
46222 225466 -9461498 -17001174 -22132110 -23257376 -19653494 -15029432 -14017260 -14611771
46214 -14611771 -10184939 -1085187 3094222 -2500330 -9003151 -6020040 3468810 9476180
46206 9476180 11150868 15436130 22476863 24464379 18757729 10789295 3418866 -5092420
46198 -5092420 -11709910 -10395211 -5886783 -11145437 -25192963 -28396985 -9899763 13230411
46190 13230411 17524675 4027775 -7187979 -6612535 -2995236 -4175848 -6709465 -6662361
46182 -6662361 -7027570 -9819152 -11325437 -10419153 -13153510 -23287708 -34313761 -36506562
46174 -36506562 -28094435 -15450755 -5803408 -3360085 -9043457 -19357996 -26990712 -26442763
46166 -26442763 -19188721 -11303762 -6345762 -2480856 3120367 8939418 10368909 6622376
46158 6622376 3487449 5699985 7889378 -1154469 -23178143 -44646226 -50558240 -40728683
46150 -40728683 -27514264 -19823824 -15308472 -8258264 403302 3876583 -1766010 -11883083
46142 -11883083 -17000327 -12295778 -2217569 5773426 10110808 14181091 18532302 20533600
46134 20533600 21468136 25349111 28301137 18816909 -5374075 -29059344 -36298130 -28906795
46126 -28906795 -19596650 -13143738 -5575397 2229483 3344668 -2775282 -8087868 -8130424
46118 -8130424 -6891282 -7087255 -4390287 4532973 14528113 16757185 7948469 -6365175
46110 -6365175 -14888827 -8153347 11784186 29973096 32184569 19241483 3432516 -6354543
46102 -6354543 -9741396 -9091275 -7591654 -10549745 -18955677 -23832203 -17308386 -6801226
46094 -6801226 -5651804 -11623635 -10323137 -576341 1774462 -9385355 -18006500 -9987442
46086 -9987442 5906942 13613118 12957873 12821733 11878629 2908665 -9736207 -13096423
46078 -13096423 -3964638 8432219 16147419 17556919 11330532 -2119382 -13730827 -12263011
46070 -12263011 687080 11479776 11628535 6205994 4243470 8230203 14033273 14883424
46062 14883424 5645301 -10488949 -20650409 -14905934 573109 10319447 8519094 3085311
46054 3085311 1692014 3160466 3750146 2995761 980100 -2349099 -2845704 5022743 17798205
46045 17798205 22597488 11486463 -8598151 -23933172 -28318069 -26715090 -27696541 -34152774
46037 -34152774 -39820912 -35728254 -22208219 -11182261 -11975369 -19123776 -21137435 -16657104
46029 -16657104 -12096684 -7396771 2469738 13078860 13134288 4167476 2330465 14570008
46021 14570008 27257430 26890988 19002562 15801003 16544967 13285054 7534638 7121214
46013 7121214 11723293 14659996 15292482 17110955 16520646 6638573 -8844330 -18321953
46005 -18321953 -19338691 -21056219 -27958215 -32722256 -29029676 -21263677 -16313783 -13909786
45997 -13909786 -10719480 -7650373 -7138940 -7184850 -3015394 7211218 20486591 30462667
45989 30462667 30878968 21704759 11743030 9583805 11919132 7899149 -3961726 -11926296
45981 -11926296 -7423548 3375536 9855568 10814871 10622604 8680867 2778393 -1507266
45973 -1507266 3559479 13486488 14214715 2183992 -8009522 -2240043 13473498 20116698
45965 20116698 10106720 -3618984 -4730664 6548969 15735581 13563358 6435612 5718046
45957 5718046 12463003 18200324 17859135 14795119 13080727 12162291 11447458 13087193 15830272
45948 15830272 12723793 1551806 -7872439 -5660083 2338133 1466736 -9290265 -13948759
45940 -13948759 -3094144 10259955 7898764 -7284084 -14432057 -3206925 12723488
45933 12723488 15150816 5444456 834368 10459538 24702663 29892093 25745272 22821016
45925 22821016 27152237 34448134 38585638 39135724 38933350 39615248 42048124 46490040
45917 46490040 49428859 45002345 33351954 22827667 19057765 16747386 8930567 -313257
45909 -313257 -1678405 3322265 3007012 -7155363 -18570262 -23764556 -26262424 -30837576
45901 -30837576 -33076895 -26690264 -15352709 -9154308 -12128549 -19006090 -21555499 -14174219
45893 -14174219 2243543 17490160 18727656 5903400 -5087130 -1456552 10021232
45886 10021232 13794422 7044924 79124 -521556 2723151 7662984 15144544 21873123
45878 21873123 21887898 16590578 13395738 13626350 12163975 9558428 11993947 16963791
45870 16963791 12746769 -2476680 -14009016 -10837359 -1006613 2266851 -308347 472952
45862 472952 5780457 9136636 8350544 6772453 5691359 3408058 -1161259 -9498681
45854 -9498681 -22606232 -33660000 -29910349 -10086872 8941477 13360954 11283479 17159019
45846 17159019 25946700 20692836 1383422 -13754337 -16411822 -18068898 -26487339 -30292123
45838 -30292123 -17323697 4383478 16020862 11610342 2372087 1089246 9287991 18424571
45830 18424571 19835954 14167420 10575813 13812320 15506913 5612508 -10265450 -15781713
45822 -15781713 -6151585 6049887 9498048 6710262 4128734 1463929 -2760918 -5130953
45814 -5130953 -3933306 -3663022 -6794598 -9036239 -8337964 -9970105 -16701608 -22802245
45806 -22802245 -23859193 -23052593 -21548815 -14071115 -2235105 156823 -13180655 -26830126
45798 -26830126 -22601004 -3692912 13671412 23673758 30194679 30736908 19701613 3609609
45790 3609609 -4891554 -5832935 -7827949 -8418784 2096612 18640244 24569360 18537507
45782 18537507 15990806 19753476 13291638 -7526102 -20245106 -8746500 10728834
45775 10728834 15900780 12933317 20971159 35519590 35168804 19615377 13027071 27134882
45767 27134882 45298119 49636019 42603576 32736235 19274829 4264301 2184279 19187230
45759 19187230 35095426 27182567 5247483 257236 18565914 31208216 16439065
45752 16439065 -8455076 -13357135 1890494 11411615 2842907 -8886572 -7962209 1972080
45744 1972080 10148207 14915662 18073442 16185106 9169886 7185172 16148182 24721651
45736 24721651 19808962 8527129 8778563 21402006 28594120 20010038 4141998 -8392035
45728 -8392035 -16828469 -21437559 -18898235 -13504738 -17966830 -33686143 -43655998 -35779438
45720 -35779438 -20819072 -14793748 -15476961 -11670043 -5609643 -7336055 -12583051 -6310223
45712 -6310223 12605295 28596047 32843997 32129665 31078960 23544077 8938510 823537
45704 823537 8095889 19912265 21309537 14260057 10861966 13397094 14656950 12919718
45696 12919718 12580354 12226817 5964619 -2902909 -2494248 10283343 23858761 27315196
45688 27315196 21660324 11542280 -3403361 -21295435 -31412329 -25580395 -10866413
45681 -10866413 -659656 2891291 6688141 10493929 7222478 214608 4440588 23126169
45673 23126169 36139579 23582305 -6917598 -29196599 -30291836 -20016714 -10777562
45666 -10777562 -2795710 6704550 12494446 8368053 -1750419 -8152701 -7567943 -4545892
45658 -4545892 -2629523 54137 6432930 15427992 21949926 21029675 12888045 4097066
45650 4097066 1589336 5440371 10164657 12119537 11139675 6145334 -3452315 -11283126
45642 -11283126 -8020584 4469111 11631564 4370467 -9409312 -17900534 -21169148 -24375701
45634 -24375701 -23374801 -10466714 9286404 21125417 19611997 12896078 8014183 3926490
45626 3926490 434521 1341072 4602300 501482 -14571193 -31318130 -39654347 -39210567
45618 -39210567 -32874193 -19454793 -122496 16096027 22123812 22468861 25257344 30132870
45610 30132870 32028624 31483246 32129809 32427527 29539813 27699588 32158016 37370007
45602 37370007 32753888 19578122 10328246 10226357 11563503 9505000 10624797 18654871
45594 18654871 23084733 12950966 -4966990 -13656793 -8612805 -1910561 -3766562 -10406598
45586 -10406598 -13056386 -10624402 -8572719 -10496276 -15629574 -21258137 -23334183 -17415842
45578 -17415842 -3563926 10984743 18080359 17281839 15155617 16471618 19345915 19162241
45570 19162241 14134696 6253911 -772518 -3819077 -2726633 -726409 -302086 1050472
45562 1050472 7542925 17302359 22130853 16834853 5221358 -5008115 -9530520 -7756086
45554 -7756086 -1099719 5363146 4514809 -4087860 -10972572 -8209721 -714246 604780
45546 604780 -6193217 -13955439 -18601400 -21431161 -20155322 -9521497 6087745 11754286
45538 11754286 -124288 -19210111 -30588808 -31569499 -28847651 -26304061 -23995960 -23721733
45530 -23721733 -26239453 -26050440 -17420799 -3480844 8160144 16077360 22631259 23284799
45522 23284799 9675891 -14538152 -30845061 -24655291 -1880656 17607101 19805415
45515 19805415 6911209 -8764581 -16981904 -15971859 -9379369 292477 12325085 22530284
45507 22530284 23439502 13775464 3018536 813270 5477304 9335779 11445073 16398252
45499 16398252 23190651 25729215 24257321 25675019 30701235 30881843 21474407 7629691
45491 7629691 -5919387 -20758126 -34468698 -35081049 -15823750 11102958 25536765
45484 25536765 20904131 7402548 -2336889 -3095328 3519336 10720912 9572536 -1834450
45476 -1834450 -13730073 -16097276 -12317929 -13399111 -20886516 -25529577 -22936959 -19813908
45468 -19813908 -21295010 -21368737 -12034918 3752305 14633323 13900923 5603681 -1249106
45460 -1249106 -1776814 1164668 1603853 -1241605 -1345259 4909628 10898779 7062766 -4961236
45451 -4961236 -12927674 -10471768 -5897820 -10143097 -21193035 -26469802 -18800051 -4792024
45443 -4792024 3400823 1895393 -1130871 4249861 16857941 25229089 22600174 15958476
45435 15958476 15122403 17792352 14501428 5765334 2147593 5723747 4568566 -8144755
45427 -8144755 -21382974 -22509621 -17063263 -19451997 -29259784 -31069098 -17308448 1626850
45419 1626850 12640686 14578149 13235956 10587823 5291383 -1523666 -7096612 -11101462
45411 -11101462 -14730072 -17433240 -17227843 -12711019 -3545965 8521672 18040803 18657033
45403 18657033 9759706 -1954342 -8932801 -8314912 -635153 12265120 25144476 29430562
45395 29430562 20913650 7039727 2484821 15238435 37120264 49039654 38115255
45388 38115255 11783364 -7128739 -3252719 14837167 25945510 22172202 14994004
45381 14994004 14736801 15616096 8516492 -731408 1965504 17584945 31457255 32708639
45373 32708639 25898394 20536724 17979318 13703703 6313546 -1277305 -6145273 -6911612
45365 -6911612 -3911048 -456133 -244983 -822861 5737099 21429786 35771968 36332966
45357 36332966 23520449 9471042 3580794 4274046 4380656 -482315 -9223644 -16697747
45349 -16697747 -17242743 -10129087 -1383492 3013789 4714506 9618948 18168369 24597451
45341 24597451 25366303 21837951 14492405 2781813 -7047363 -3550442 14309213 30659712
45333 30659712 29825063 14767405 650334 -4808756 -4906842 -2001627 5770124 15959648
45325 15959648 21362401 20240413 17553491 14523791 7561730 -2348 2361678 14920612
45317 14920612 21686040 10811200 -8607275 -20009956 -21011260 -20280914 -20595078 -18442540
45309 -18442540 -14971516 -12975266 -7000801 7968681 20593652 13879256 -7359858 -18706683
45301 -18706683 -10651674 -1912650 -9051843 -20795753 -17355487 -1649101 6854197 1973380
45293 1973380 -3172930 2561272 16060629 28841076 36019586 35685296 29227735 22801494
45285 22801494 20573404 18032430 10190106 2979871 5481858 13275641 12584848 931441
45277 931441 -9684708 -11918196 -11920139 -15576007 -19348947 -20546544 -24095245 -31429535 -33877040
45268 -33877040 -26241962 -17462790 -17877431 -23934414 -25903491 -23784054 -24263608 -27115224
45260 -27115224 -26299418 -21295915 -16172635 -9658450 2535949 16125236 19939232 10679728
45252 10679728 -2729463 -10665998 -10748248 -4075305 6995455 15323323 12575968 333485
45244 333485 -9929910 -11903554 -12145201 -17921518 -24552042 -22135509 -10516904 8185
45236 8185 1392203 -4685927 -11336717 -13271953 -8847562 205333 9375269 14104515 13436254
45227 13436254 10076304 6752505 3999643 1761808 936897 1320609 -663079 -8373428
45219 -8373428 -17702991 -17483188 -1937507 19286175 30240384 28246688 26447725 33594099
45211 33594099 40080255 31922003 12025563 -3481164 -7288120 -7284410 -10205542 -10987883
45203 -10987883 -3573811 7003027 11104675 8031902 5834078 9570808 15224185 15113480
45195 15113480 6401500 -5834621 -13354454 -13484195 -12099118 -15392043 -20908814 -21871437
45187 -21871437 -18165031 -14841818 -10226853 3509286 24368420 36107465 27396394 7402444
45179 7402444 -5997213 -7022228 -2615531 1067307 2148659 -2317632 -13303246 -23201015
45171 -23201015 -23184202 -16385232 -13322120 -15055357 -12813716 -5159861 -2195796 -8416575
45163 -8416575 -13871128 -9501623 -795371 2374570 484412 -969916 -3753700 -11774257
45155 -11774257 -18942455 -16053853 -8412719 -12233216 -30207620 -43236710 -33701666 -8279165
45147 -8279165 10981861 13053755 6701503 5299408 11366167 17366319 16220010 8743749
45139 8743749 3145123 7434579 20045085 29142550 24935206 11500218 1286480 -1420594
45131 -1420594 -4114842 -11264584 -14776986 -6210357 7738598 12057560 4003822 -3204800
45123 -3204800 942676 10667507 13251835 5162182 -6884224 -16116746 -20196017 -17975168
45115 -17975168 -9143945 1726885 6058738 -420258 -11797507 -17036685 -11556621 -2529493
45107 -2529493 -820607 -7845235 -13867449 -11259343 -4846864 -3786344 -7197427 -6726638
45099 -6726638 -1946983 -2029422 -9810713 -15764154 -13413670 -9702819 -11630926 -12951481
45091 -12951481 -5915508 2160929 -1064411 -11085098 -10995040 2696019 14514054 13341081
45083 13341081 7073716 8122390 15782395 20298189 16214273 5390061 -6560017 -12053863
45075 -12053863 -6723899 2843886 3784222 -6555970 -16747170 -18022435 -15319825 -15621986
45067 -15621986 -15632683 -10355464 -5490526 -10019831 -21425302 -28290678 -24017649 -10000044
45059 -10000044 9687341 28031921 35311252 29895633 23723536 26051313 27343918 12988629
45051 12988629 -11162003 -23496982 -16748539 -6861105 -8508022 -17025036 -20500271 -16189212
45043 -16189212 -7166022 5782653 19928090 27298323 24476147 18788340 17404673 17438109
45035 17438109 14073701 10528805 10954545 10618719 3702581 -4462693 -4129269 3289305
45027 3289305 7467312 5141196 2674605 2579382 -1587593 -13913234 -28239294 -35771148
45019 -35771148 -35105708 -31420953 -29622270 -30559154 -31144016 -27219934 -18602602 -10372311
45011 -10372311 -6072432 -1921068 7266205 18691277 24673497 23596093 20137625 15420401
45003 15420401 6105869 -5605274 -10857159 -6302266 1756514 9395675 20928972 35820431
44995 35820431 40267438 23895234 -1244050 -12101190 -3836324 4960853 -1931532 -18527136
44987 -18527136 -27163365 -20188965 -5022602 6689736 8856259 3244723 -2994470 -4007737
44979 -4007737 -2208195 -5440299 -14791918 -20504720 -15147591 -6042150 -6499476 -16433575
44971 -16433575 -20596371 -8084233 13590269 28007991 28666160 23436913 22520905 26658954
44963 26658954 27940255 20273575 7884350 2415879 10500696 25812253 36549226 39346783
44955 39346783 40289835 42148212 38701331 26139732 12854052 9659442 14126677 14056322
44947 14056322 5855281 -111451 4773878 14198886 14722504 2427526 -13146177 -19849359
44939 -19849359 -14629753 -5698116 -4489418 -13836645 -24122567 -24258423 -15705100 -9820473
44931 -9820473 -10848039 -9883236 131311 11743706 13226467 5723401 509903 1993175
44923 1993175 3514179 -137749 -5563553 -7983200 -7434880 -4837464 1004803 8743563
44915 8743563 12791932 10305181 5025582 726929 -4067712 -10873183 -15852942 -14642296
44907 -14642296 -8555886 -1173839 7266478 16827039 23377362 23750453 22212103 24377232
44899 24377232 26815153 20969927 6868894 -5622827 -10271757 -10859059 -11900067 -11657162
44891 -11657162 -8721409 -7258696 -8757164 -5133643 10738020 31045544 39337433 30762850
44883 30762850 17745286 13980086 20052631 27573046 30770793 29306451 24329803 17200955
44875 17200955 9902264 2724186 -6398941 -16966811 -23506007 -22792936 -20438363 -23559209
44867 -23559209 -28414397 -23787311 -8077344 5803000 7322128 2450465 3336029 9656047
44859 9656047 10823940 4810291 2622064 10718289 19623393 17623006 8531859 5923042
44851 5923042 13091180 19504862 17540505 12122223 9517415 6057100 -3414162 -11861419
44843 -11861419 -6652527 10251290 20238450 11510735 -4155907 -7094779 2984263 7359524
44835 7359524 -3693728 -15687685 -9606646 11954670 28921520 29950797 22493110 16102743
44827 16102743 8179160 -6894175 -23105915 -27636422 -17582321 -2980359 6639546
44820 6639546 10738029 11308083 5994927 -6912312 -21159300 -26929560 -22382211 -16181583
44812 -16181583 -17025222 -23315058 -25505779 -18019885 -6499421 -1653630 -6728579 -13722762
44804 -13722762 -13085980 -4556899 4125760 6813098 2869158 -6994644 -22064080 -36722396
44796 -36722396 -40682400 -29932747 -14392781 -8360240 -13793220 -18580559 -12229861 1941475
44788 1941475 12664503 14262391 9965849 4107585 -3294443 -12864518 -20898220 -21718065
44780 -21718065 -14176078 -3076050 5832311 9570278 6383121 -5068670 -21292016 -31963810
44772 -31963810 -28878899 -17200505 -11388983 -17436507 -25240859 -23011242 -13159009 -6237083
44764 -6237083 -3172684 5767669 23574162 38354268 37666815 24178157 11160570 7003317
44756 7003317 9948467 14510530 16558450 13747172 6962680 1014593 -773827 -1947093
44748 -1947093 -8196126 -18002406 -23225194 -19024230 -8142639 4658235 16532228 24087507
44740 24087507 23639349 16806707 10507167 8389328 7396845 5600308 6662112 11405432
44732 11405432 11875796 2205891 -9186029 -8423061 4232749 13705519 9991237 -702663
44724 -702663 -7251266 -6931756 -2943912 3027282 8967769 9374935 1505396 -9245452
44716 -9245452 -17043560 -24510233 -35913327 -45259354 -41800577 -26840424 -14041910 -10580904
44708 -10580904 -8315054 1543822 14640332 21958975 24327987 28369768 32634094 29175365
44700 29175365 18008744 8945073 6919806 5420396 -1110829 -7360773 -6857824 -4659826
44692 -4659826 -10288844 -20816832 -21809295 -6953726 12137645 20280067 16342366 10501407
44684 10501407 8588716 7211471 3212723 -388314 -313860 1704587 3739636 8429315
44676 8429315 17008989 22513130 17248237 6445261 5316008 18996954 33006257 30083987
44668 30083987 11636360 -5273342 -9760179 -7255072 -7256332 -9481744 -6787603 3131286
44660 3131286 14445816 20344790 20184437 19350814 22496346 26435655 21918778 5960285
44652 5960285 -10380865 -13923235 -8110744 -9051748 -19901770 -22343267 -3017075 23250947
44644 23250947 31972391 23622738 21029986 34024284 47392698 48418803 45677421 49393159
44636 49393159 51213650 40202122 25627227 23811622 30426333 27426847 14052227 8262552
44628 8262552 15839626 20980901 14583592 9928461 17469798 23264459 11119544 -7241600
44620 -7241600 -5981516 17201759 38313399 40567088 31121292 22364455 15222184 7521483
44612 7521483 3192699 3777234 2454299 -4052438 -7196148 258072 11089717 13752171
44604 13752171 8962276 5779472 6718973 7919479 9914520 16004399 21735285 18380936
44596 18380936 7675342 1749704 5885526 11366712 9038164 956324 -5822523 -8794209
44588 -8794209 -7896170 -1025042 11532074 22782786 25334847 19382259 10532096 3228292
44580 3228292 -156069 1831163 7332368 11549151 13516579 17973604 26156579 30338468
44572 30338468 23723318 10735719 251774 -6649027 -13550167 -17613692 -12654272 -1679481
44564 -1679481 5309757 6987859 12619730 25019148 32908934 27130715 15960568 15475184
44556 15475184 29022881 43926663 46571197 34910857 17262530 3642239 -1601339
44549 -1601339 -1419830 -916419 -927993 1232815 5963201 11432994 19306514 33034447 48089282
44540 48089282 52138363 40616059 25547080 21713799 28834049 34951460 33529462 28491219
44532 28491219 24153876 18996713 10368484 -1114861 -13273000 -23979282 -30568416 -31257770
44524 -31257770 -26999171 -19462211 -9470070 -381899 1434920 -5076333 -11318580 -9985887
44516 -9985887 -5825016 -6650961 -8353684 -1363977 10090877 10440166 -2909956 -12652709
44508 -12652709 -5798095 7941093 11482210 3914194 -2732159 -3266754 -3418742 -6976400
44500 -6976400 -9956476 -7982725 -1793134 5106610 8947594 6784365 111739 -4316603
44492 -4316603 -2642845 -843094 -7297304 -19786455 -26654508 -21139696 -8835299 -299306
44484 -299306 -1043583 -9096120 -17594123 -18942320 -10657121 1480746 8487490 6428239
44476 6428239 -2010906 -11785207 -17922597 -16741343 -10171618 -6937738 -13014679 -21623267
44468 -21623267 -19503745 -3852187 13169519 18242050 10027684 -2304269 -8068685 -1636926
44460 -1636926 13545276 25193210 22228662 7202441 -6802478 -13737385 -21493633 -36528641
44452 -36528641 -49497619 -45519586 -25290068 -6077045 -1033412 -5519546 -6791419 -1017003
44444 -1017003 4192024 990526 -9986608 -21528472 -26461148 -21623990 -8861131 5243926
44436 5243926 12724220 11254612 7745116 11002804 19813204 22913276 13910079 1838711
44428 1838711 1065477 12619526 22155135 17166148 624296 -14471497 -19485128 -16136115
44420 -16136115 -11351708 -9615213 -9602618 -6752920 629091 8512884 12188336 12799166
44412 12799166 14937037 18101811 15894960 5669590 -5772907 -9767705 -6116913 -2127393
44404 -2127393 -3094054 -7332932 -10094683 -9230588 -6192059 -3261233 -1286300 -94519
44396 -94519 98576 -823816 -1290559 723548 4213463 5552884 3448806 186364 -3222097
44387 -3222097 -7968259 -10988152 -4773588 10406056 21286207 17697814 7706435 5130136
44379 5130136 7477946 1795882 -10410595 -13568848 -5976026 -6594325 -24982376 -43572916
44371 -43572916 -44003370 -34866405 -34985082 -41533541 -36880905 -20549444 -10699865 -13594457
44363 -13594457 -13650628 220054 16680084 19749066 10924772 3156828 2552632 6524767
44355 6524767 13262616 22381893 29153784 26865494 14763704 -1356535 -15494716 -24508227
44347 -24508227 -26508705 -20723287 -9222890 3802939 14910324 22597830 26285529 25388954
44339 25388954 19805181 11355125 3932840 101550 -2626921 -8587917 -15570519 -14496067
44331 -14496067 -1493444 14191003 20309689 16339159 11128063 8343750 3076318 -6780498
44323 -6780498 -14754165 -15303106 -13138543 -17672475 -29751652 -37645484 -28237220 -2962809
44315 -2962809 19782137 23217364 12487865 8082294 17355524 24711049 16856959 4094650
44307 4094650 3042403 9709937 8213147 -1357890 -5135824 -1603183 -1971410 -4380374
44299 -4380374 6678150 29593964 39890562 26197989 8428901 5572408 7678668
44292 7678668 -1294131 -13047391 -11269642 -2918426 -6212234 -17046457 -15259005 -30533
44284 -30533 8650376 4503414 4395040 17656917 29883701 27448472 18753282 18587809
44276 18587809 25896410 29896216 27851941 24834699 22943375 20928777 19736918 20732442
44268 20732442 22326144 23651590 26985047 32247215 34453628 30747457 24530734 19160692
44260 19160692 13962546 10066225 12246419 19313138 20536559 9868573 -1884509 1495253
44252 1495253 20441670 38313873 40957452 30400176 17948182 10040036 5023505 1033386
44244 1033386 1469238 9901408 21998917 27972337 24646594 19951421 21833999 28171856
44236 28171856 33465709 39582610 50213591 58435333 52056069 31578331 11502270 2137201
44228 2137201 977483 3694866 10486432 16702909 10720691 -9716611 -29198611 -32556017
44220 -32556017 -23263881 -14740284 -11065197 -7124814 -1639070 2215446 5971448 14084106
44212 14084106 23849248 27011202 21847225 15648882 14472661 16849965 18149680 15988359
44204 15988359 11189322 7021339 6204160 6064617 509825 -9795918 -15177505 -10233030
44196 -10233030 -2339689 816687 4439740 15955532 27672757 25528026 13194765 11127366
44188 11127366 28573003 50511347 57746289 48449663 33812493 22748391 18273703
44181 18273703 20583637 25402898 24766836 16478943 8780571 10228266 18711441 24643495
44173 24643495 20863132 6457973 -13061013 -25586735 -20030260 -349650 14813705
44166 14813705 13764563 6388088 8416765 17920662 20163031 12244501 7485291 13178047
44158 13178047 18772019 13813003 6283241 11616219 29494778 43932593 45203743 40146113
44150 40146113 38179642 37598033 32448706 25534618 24911296 30570658 34692801 35251677
44142 35251677 39213877 49012684 55642098 51775280 43646960 40960720 41381659 36302017
44134 36302017 27779768 25957813 30078163 27053058 13216997 3451851 10072859 23895186
44126 23895186 27696116 20742232 17169894 24099293 34134487 38821629 38038928 34601506
44118 34601506 29506665 25345695 26121903 30416415 31927202 29798706 30653559 36078964
44110 36078964 36460148 24934905 11122304 10322462 21089816 24892541 10991772 -7828636
44102 -7828636 -11145813 3487257 19748915 25235807 24751964 28226485 34786744 36568680
44094 36568680 32684247 29348425 27874444 23124333 15327453 12822787 18357901 22237767
44086 22237767 16472663 7917124 8153124 16280432 22176755 22571818 22364636 22528297 19471606
44077 19471606 16447899 22497659 37160001 48129765 48354557 44398572 42980209 40738183
44069 40738183 34095534 28025669 26327572 23572031 16716635 14461135 22658821 29926117
44061 29926117 23431582 12143806 16091448 35068125 46850449 38320370 21036706
44054 21036706 11360815 10886787 13474686 18060497 25711517 33802015 40284206 45474198
44046 45474198 45566402 35369427 21708570 20274636 32408673 40190519 34072848 28741909
44038 28741909 37388722 46611053 36979796 16178101 8045964 16012028 22242014 19925651
44030 19925651 20711346 28736228 32647040 29032301 29942794 38453468 39267031 25232668
44022 25232668 12321764 14086854 20705498 20341559 23072199 42010226 64495281 66464010
44014 66464010 47745176 29655128 21869971 14805248 3822478 -2147401 167097 815526
44006 815526 -5185361 -8737244 -2669093 7691377 16818489 27728803 40080919 42766124
43998 42766124 29563203 12971120 11397416 28077930 50586737 65216087 64638954
43991 64638954 48504422 25942789 12765072 16842239 28637530 33202763 28243631
43984 28243631 23128398 23763193 27599145 32148778 38790200 46196245 47662289 39205052
43976 39205052 26190659 17774719 16168400 14641337 6855670 -3811226 -7070068 1545355
43968 1545355 14192251 20171367 18894949 18244546 22198867 27195796 30161704 31896282
43960 31896282 31540192 26821410 22409120 27952636 42676799 51931705 46732453 37433939
43952 37433939 37709010 42885844 37681950 21238180 9660630 13175153 23907200 29755178
43944 29755178 29423697 28484765 29239220 30984880 34555307 40357472 45450030 47702703
43936 47702703 50295284 57411310 66936247 71856738 69325652 65358791 68635483 80099764
43928 80099764 90660389 91033746 82645399 74962395 72182870 68930020 62006822 58790642
43920 58790642 66549348 79105688 84388427 82558150 85265446 97019991 109489837 117189021
43912 117189021 126365118 141463149 153586339 153042242 146671419 150768237 168911543 187568827
43904 187568827 194797350 194742263 200416262 217730787 240200595 256300884 259301854 251688275
43896 251688275 242346857 239481170 245305047 256035861 264722172 264188050 251299239 231172540
43888 231172540 214646649 208531830 209862084 211365192 209218657 202819330 191651217 177590492
43880 177590492 166507003 161149146 155536346 143924646 132528434 132486508 142021434 147211300
43872 147211300 142715820 139452818 145914769 153674342 151217784 142994884 142418176 151625874
43864 151625874 161180286 166901374 173637828 182376547 186409345 182986990 178126992 176616641
43856 176616641 176600532 176864186 179800403 184021719 184191599 181771984 184752769 192201391
43848 192201391 192015901 180973666 172817328 175834596 176847611 162779794 145434987 144882974
43840 144882974 156997303 160654424 153268748 153968827 169299911 180900270 176107067 169266270
43832 169266270 179493959 203665097 225423897 238097910 244878226 247130336 246763082
43825 246763082 251887657 266611076 281892394 288782708 293804191 308237080 328502456
43818 328502456 341513473 345433330 350945749 363864162 379232519 391406910 398277875
43811 398277875 396806697 385851406 372317893 363303978 353524973 332418056 302729795
43804 302729795 279201962 268349672 262332847 254256680 246327397 239678360 229039306
43797 229039306 212953997 198518540 190120965 182652486 171434024 160225108 153248788
43790 153248788 146616532 134050706 115879190 97544500 83809462 77617201 79327988
43783 79327988 83997298 84389351 78879636 71600979 64654769 57128448 51798053 53602602
43775 53602602 59798165 61127890 55307650 49764682 48393384 46529865 42930905 44391357
43767 44391357 51444790 50961553 32979073 6945661 -8493410 -6410143 5304880 15986411
43759 15986411 19963247 17382927 13771935 14427091 15716926 9402001 -1003339 403242
43751 403242 18975897 37722613 38999157 27705530 20607392 21956252 24156133 24868230
43743 24868230 26635463 24045116 9136409 -10697002 -16575887 -2780679 15440671
43736 15440671 21737015 15240178 4857490 -1981245 -1212496 7625162 18536846 23276638
43728 23276638 21208872 19044737 19939116 19887571 15747390 9527319 3850975 99405
43720 99405 844587 6253240 8963462 2505760 -5118719 1790258 23408517 39846384
43712 39846384 35474015 17530738 3558031 -426527 -367269 -274823 907522 1473428
43704 1473428 -3438384 -13010428 -18715517 -14168282 -3056320 5865168 9709719 13713631
43696 13713631 22062846 30618230 33135447 32088690 35341833 41306040 37729368 20864028
43688 20864028 5592409 6141435 14720045 13015836 53964 -7396055 -1407365 6589782
43680 6589782 5241826 -1622643 -5188703 -4013040 976928 12065772 26497735 32621215
43672 32621215 24377040 12110826 9032801 13310886 14145622 10553277 12007128 21726229
43664 21726229 30496961 29309046 20204732 11420855 7310723 6935039 9463846 16166596
43656 16166596 25888442 31441021 25251727 10409376 1413728 8480271 23751390 29954227
43648 29954227 21424665 8515591 1305574 -1154596 -2364585 1006686 13137294 29497550
43640 29497550 39866992 38165800 25955232 10154198 106017 1844071 11536694
43633 11536694 18934590 20129774 21591980 28478378 35432530 34164154 24984934 15033223
43625 15033223 8618788 4576888 776642 -2970473 -5078244 -3319660 2015543 5880425
43617 5880425 3367538 -3401821 -8625205 -12139628 -17759663 -22763250 -19165421 -7324707
43609 -7324707 2144887 2870577 -1759690 -10327712 -26672635 -45248079 -48267728 -28744716
43601 -28744716 -4397928 4110698 -1273820 -5545459 -5865038 -10506350 -18781612 -20373557
43593 -20373557 -14102166 -11513477 -19108132 -29047992 -30987404 -24322458 -15611733 -9960416
43585 -9960416 -7147384 -3187268 3878894 9057580 6544347 2123833 9217650 27255098
43577 27255098 36511920 24709453 6591322 2883911 10656069 12417427 6203185 5204345
43569 5204345 11187080 10842289 464111 -5966961 1448692 15161837 24006237 26096667
43561 26096667 22990515 14608539 5403438 3413571 8239783 11200561 10919020 16130935
43553 16130935 28723080 37311070 34005994 25587749 20849489 17294327 8005574 -6442566
43545 -6442566 -19336489 -24598582 -18643025 -2833494 13544338 20852831 20991056 23062148
43537 23062148 27893855 28428526 24740262 24120737 25356861 19153459 6841074 1417907
43529 1417907 5767043 7954095 3761151 4206805 12480644 14046444 1499563 -10490072
43521 -10490072 -9498317 -5921986 -12217288 -18667727 -9893167 7783332 15920238 10938573
43513 10938573 3085039 -1801724 -1691952 9618887 30200291 39773839 23260528 -3663560
43505 -3663560 -14324724 -8579150 -7052019 -14590038 -16230451 -7298222 -226350 678316
43497 678316 5460684 14619405 13198494 -3575132 -20049995 -23862781 -20451478 -15726989
43489 -15726989 -4136534 15071368 27594367 23186126 10982986 3640016 -1109094
43482 -1109094 -10664942 -20467291 -20154982 -9954135 116617 3180966 857399 331890
43474 331890 9332307 26983349 38495942 29740981 8618983 -2109020 3600290 7617819
43466 7617819 -2023191 -12447797 -9098689 490441 2238566 143277 6493304 17820085
43458 17820085 19892140 10202738 -2097432 -13306299 -24914042 -30639231 -21783404 -4034638
43450 -4034638 7534583 9586092 11059342 13483486 7976111 -6047671 -15876897 -14151070
43442 -14151070 -8274542 -5703788 -3046268 3531265 9054738 8877168 7061524 7494514
43434 7494514 5542293 -2478627 -9040247 -4767559 6746597 13376650 11182844 7601200
43426 7601200 8565292 10624617 7469934 -1615685 -12105280 -19006350 -19043221 -11096502
43418 -11096502 2317460 14506702 18128397 11218802 -51839 -6048267 -2508713 5590933
43410 5590933 9738841 6303584 -1911164 -10224662 -14856860 -12704246 -3661408 5690020
43402 5690020 5809012 -4837396 -15797106 -16078042 -8028679 -4920310 -14362320 -28906686
43394 -28906686 -35567548 -30949825 -22966972 -19903885 -22992198 -29234072 -35366743 -36968890
43386 -36968890 -29377910 -13792773 1389335 9518507 12293208 13272748 10177021 838238
43378 838238 -7864396 -7203920 -770025 -277888 -6990566 -9274240 -1573635 6120015 3545997
43369 3545997 -5431624 -11005835 -11312305 -10296040 -9392195 -9741662 -15901879 -28232559
43361 -28232559 -36918809 -32455669 -17902017 -3233975 7262029 14204035 16046131 12519911
43353 12519911 10180923 14810793 22568289 27259099 30234277 33406956 30433836 17592778
43345 17592778 5507909 4484553 5607665 -4731157 -17896956 -14066569 2407421
43338 2407421 5894692 -8668395 -15232333 1594993 21173796 19960169 6602934 2404056
43330 2404056 5682295 1210800 -7767533 -4910951 7419345 8723080 -6205150 -17783511
43322 -17783511 -11119351 3515018 7183903 -4256544 -20158700 -28536617 -24320177 -12390854
43314 -12390854 -5826837 -13556933 -27816031 -31711742 -20284863 -5378612 1247469 -288291
43306 -288291 -4967206 -11077267 -17111790 -19000642 -15384816 -9859054 -5178039 -790046
43298 -790046 2862355 4118365 4336105 5029039 2009646 -7917609 -16027569 -10650817 2608740
43289 2608740 5650444 -3515564 -5012204 11304772 26261495 17848065 -6743180 -23115933
43281 -23115933 -23755589 -20876037 -21089011 -17778787 -8677473 -2599234 -4526256 -8177787
43273 -8177787 -8024796 -6793706 -6546914 -3452741 3133720 6227628 2030059 -3043908
43265 -3043908 -2405056 881624 895376 -1010607 -688576 -1208996 -9500618 -23885040 -32481485
43256 -32481485 -26330220 -10210511 2299086 3393048 -1613898 -2516152 2273030 4886180
43248 4886180 1239843 -1734503 2601828 8005020 3224922 -10369760 -19620197 -18057040
43240 -18057040 -12679311 -9842395 -5499801 4448452 13015150 9863597 -4322956 -18238142
43232 -18238142 -22457925 -17151251 -9880908 -8974550 -16318772 -24739218 -25945264 -21356950
43224 -21356950 -19084777 -19995385 -16099201 -5628252 958041 -3811347 -12788494 -15355785
43216 -15355785 -11269434 -5038813 3971030 15163600 19614169 12814672 7218315 16608005
43208 16608005 32907691 35545787 21859448 10364226 12316317 17429679 12989099 1957915
43200 1957915 -5587628 -7337303 -7168415 -7416074 -9242257 -13697929 -17912820 -16903753
43192 -16903753 -11497886 -6756946 -2350328 4581983 7163489 -4952092 -23655958 -24900144
43184 -24900144 -1927875 21147645 21494876 7778024 2518906 7747879 7885445 -1546880
43176 -1546880 -8776341 -6604173 -795859 1883419 -142750 -7744570 -18688250 -23089740
43168 -23089740 -14596751 -3104345 -1952492 -5977733 782240 17639113 26506510 19250720
43160 19250720 6504792 -3254346 -13196492 -21996863 -19650857 -8041147 -4852970 -15033742
43152 -15033742 -18391924 -1255072 18186787 16178908 -359674 -7654831 -4430252 -10670620
43144 -10670620 -30947121 -46012072 -44442223 -38948826 -42687491 -48416242 -42515489 -25795332
43136 -25795332 -9049887 1518718 3970530 -4839111 -22680273 -36361883 -34406667
43129 -34406667 -21848600 -12468918 -9532115 -5203911 2068951 1901545 -12430940 -31885202
43121 -31885202 -41425069 -36737159 -25566949 -16294644 -11488451 -10631029 -12060689 -11500479
43113 -11500479 -5046845 3685644 4668046 -6125008 -19350274 -22640323 -15950546 -10775234
43105 -10775234 -14866452 -23538411 -26845243 -20450897 -8222396 1815099 3404377 -1812154
43097 -1812154 -3958203 4097537 15451708 15793945 2579780 -10493939 -11360221 -3649724
43089 -3649724 1923285 1682825 -2644513 -11642461 -24224777 -31352069 -24919167 -10483500
43081 -10483500 -860754 1444247 5005461 13175693 18300204 14652786 7225733 3129372
43073 3129372 1611682 -2631434 -11484808 -22603708 -32373785 -36879535 -33745144 -25044529
43065 -25044529 -15036043 -4807054 5934478 12165587 6465723 -8774306 -19354934
43058 -19354934 -14359244 1360000 13818131 15067190 7953984 -822353 -8012250 -14712913
43050 -14712913 -21414194 -22661732 -10704457 11302057 24973206 15200462 -9346122
43043 -9346122 -25743838 -26121492 -23406041 -26263380 -25964391 -15816397 -6096308 -6214347
43035 -6214347 -6734257 3782210 15817789 12886959 65803 -4122415 265426 -3907039
43027 -3907039 -16290368 -12921478 16229793 47093199 53087724 38122281 22259445
43020 22259445 11570043 2098943 75393 13548999 30248199 28500784 9820757
43013 9820757 -2183396 1912920 5117731 -4570746 -13022478 -4373138 11553989 14923189
43005 14923189 6699176 3118594 6396660 2874434 -10704475 -20291750 -18092289 -14167197
42997 -14167197 -16678206 -17233849 -7165839 5663919 10545653 13330263 25066306 38381608
42989 38381608 34952438 15453030 2415002 8448159 18785433 14589087 -179795
42982 -179795 -7594833 -2213530 5184153 6133665 3754539 3479821 4862241 4968395 3026992
42973 3026992 -546533 -5156223 -9134261 -11716395 -15380709 -21467498 -24345140 -16410398
42965 -16410398 115617 12873074 13798024 8824887 9362234 17695627 25188930 23148181
42957 23148181 11428312 -3322235 -14288945 -18041145 -14123648 -4625597 5259536 9559720
42949 9559720 7658628 6206171 10340804 14371606 8360550 -5234068 -11043597 -1882145
42941 -1882145 9332353 7865310 -1119034 -2424199 3301050 820930 -12851173 -21506879
42933 -21506879 -15377412 -6511020 -7971296 -12365463 -6026750 5975442 7005293 -3905658
42925 -3905658 -10417538 -4747903 1954519 -331546 -5041500 -2182694 4086677 1894230
42917 1894230 -10323862 -22367699 -26226746 -23014995 -16887888 -9642618 -2626550 1582541
42909 1582541 1777584 -587450 -4005940 -8452977 -13653596 -18284560 -21537059 -22886038
42901 -22886038 -19765112 -9247692 5722037 15676169 14800899 9318540 9433454 13606315
42893 13606315 9250489 -7785656 -23253252 -21905614 -8534987 -602814 -3120601 -4509734
42885 -4509734 1466102 4861021 -2386936 -11056462 -9037263 -1136817 -88833 -4482577
42877 -4482577 -2499364 4905183 3114886 -10878950 -20195785 -13384063 -3004185 -6567936
42869 -6567936 -19889954 -24418759 -15062805 -4781003 -2138002 860342 13786078 31193197
42861 31193197 38512392 29888549 14235279 4994945 7394774 15550235 20244238 18509423
42853 18509423 14715746 13197670 13835568 16284194 22638660 30677300 29918026 13581092
42845 13581092 -7722126 -15060521 -5416183 3821883 -885220 -10751782 -9015204 3766027
42837 3766027 10485266 1129314 -15871931 -27643742 -32381307 -35863543 -39258283 -37465561
42829 -37465561 -27531870 -13507745 -2988726 -1380273 -8369321 -17179814 -18474558 -8703976
42821 -8703976 5091081 11696898 7530702 -547866 -4712271 -5033673 -6950760 -13159883
42813 -13159883 -21783705 -30900086 -40195479 -47606493 -48524883 -40732431 -27948230 -16497544
42805 -16497544 -9924092 -8065638 -9132922 -10564760 -9665061 -5792747 -631871 5315292
42797 5315292 13757371 23280868 26579449 18623194 5460491 -2362071 -4719700 -11357974
42789 -11357974 -24063494 -29542030 -17613003 1013860 5769314 -8478233 -28022270
42782 -28022270 -40712387 -47317624 -50491814 -45874935 -32225983 -20429557 -21196159 -29169132
42774 -29169132 -30402070 -22526141 -15595169 -13389587 -6801346 9978503 27248767 30764678
42766 30764678 18381833 -8022 -13161357 -13643913 562678 21404710 32895627
42759 32895627 26946167 13545685 6758525 5554847 282001 -5964586 670993 19562104
42751 19562104 30095640 19683667 2175572 -3633790 -692700 -2609515 -5951350 4626305
42743 4626305 25771760 32848208 14521526 -8868051 -13144126 -2397763 1449894 -8293774
42735 -8293774 -17790894 -17262710 -13407984 -13599810 -12083190 -1069651 12916276 15063166
42727 15063166 2707667 -9999271 -10584826 -4557305 -7240877 -22260832 -36013038 -35732632
42719 -35732632 -26028337 -20728267 -22449672 -20400137 -9309693 149676 -4044848 -18062816
42711 -18062816 -28216820 -29435658 -28162272 -28934220 -28357727 -23819566 -19377160 -19345542
42703 -19345542 -22097870 -23475787 -21385089 -14603470 -2615503 10164666 15392392 10117267
42695 10117267 924485 -4664223 -6367285 -7311883 -7677943 -7182485 -8500969 -11853856
42687 -11853856 -10847349 -911436 12193511 20103878 23742229 27730026 27030351 12833466
42679 12833466 -8457849 -17575577 -8852418 -487722 -9544683 -28161530 -36272979 -29483980
42671 -29483980 -20689547 -18921690 -20849687 -21746353 -20864637 -14597577 1963694 21901202
42663 21901202 27086535 10012878 -13477799 -21925966 -12581563 720102 8882972 15762616
42655 15762616 25980676 35071492 35409468 25686331 10908249 -2720780 -9907138 -7660883
42647 -7660883 600020 4595102 -3604895 -19168861 -27588938 -20566678 -6008771 1070479
42639 1070479 -4247159 -13179234 -16522109 -15657288 -17298351 -22069770 -23818288 -18442846
42631 -18442846 -8615977 -645990 -195041 -8589865 -18547155 -17179836 -1154975 13854125
42623 13854125 9835110 -7644156 -13861410 488851 14056224 4689194 -17910297
42616 -17910297 -25250424 -8997962 10869811 15951871 10378768 7459834 9460084 9026441
42608 9026441 2075924 -8959549 -19997263 -27363312 -28230973 -23255436 -16425387 -10412269
42600 -10412269 -5256661 -1874985 -1377371 -284501 6438649 15662058 17309948 8698520
42592 8698520 -339996 -1195843 2886361 5751205 9009672 14929189 16351903 5751103
42584 5751103 -9516077 -13634477 -3950552 4990951 1406809 -9012339 -12637963 -5668592
42576 -5668592 2592702 1152842 -11284596 -25195412 -29589934 -23125110 -14262987 -9113581
42568 -9113581 -3684945 7175655 18115148 18950287 9605639 -276782 -6331974 -13339985
42560 -13339985 -21690288 -21235037 -5454670 16367304 29345221 30201375 26603780 23706802
42552 23706802 20187462 15420886 11278950 6396909 -2821895 -13262172 -15041071 -4881910
42544 -4881910 6649325 7387274 -1008148 -6659579 -3899276 2131494 7166331 14481582
42536 14481582 25439059 31484946 24108009 8982382 1023514 5654757 13036018 12380610
42528 12380610 4872319 -573030 1223504 7815198 12762451 10998245 4104343 547423
42520 547423 5601460 11782095 7335542 -5646317 -12522305 -7948984 -3169005 -5362746
42512 -5362746 -4426854 8174549 20695865 17427962 4067265 -1629971 2013758 2018370
42504 2018370 -3036349 -206856 12944261 21903479 18622851 11793641 6970706 -4015737
42496 -4015737 -23758133 -37583338 -34445779 -24444269 -21263395 -20558514 -11671661 504908
42488 504908 3008445 -3756797 -9251459 -11542248 -15767196 -18299038 -10277629 4424903
42480 4424903 11614131 7835610 3559952 3613493 -316499 -13558750 -28444713 -36212050
42472 -36212050 -37836099 -37004484 -31978501 -21335804 -10516173 -5773106 -6088491 -6172965
42464 -6172965 -4395365 -4484901 -11491767 -26635276 -43385903 -50379056 -43154380 -30823919
42456 -30823919 -24761062 -23683721 -18764140 -10605479 -8614476 -13089514 -11782549 1101646
42448 1101646 14655820 16715140 9328162 1314315 -5356636 -12725950 -17776164 -16372686
42440 -16372686 -12073201 -12036141 -16508160 -19342757 -16545501 -8381625 3720762 15795132
42432 15795132 19891900 11509527 -2591102 -10270723 -7238629 397132 5283638 5261738
42424 5261738 2076493 -625680 1279835 7319746 9044865 -2129754 -22300221 -35508140
42416 -35508140 -29497421 -7988022 14477268 26751776 27894048 22750775 15074754 5684810
42408 5684810 -5169441 -16130542 -25735355 -33522974 -38796864 -39070744 -31722702 -17790140
42400 -17790140 -3233505 4159870 -173180 -13612124 -26448710 -28342981 -17162596
42393 -17162596 -103964 15336255 28251592 39550991 45285486 41330554 31990272
42386 31990272 26066581 24954787 22388033 16158879 11307716 9439939 3814390 -9823849
42378 -9823849 -24291689 -29125261 -23636641 -16207920 -12844787 -11066265 -4743047 7192263
42370 7192263 17099038 15198873 1981037 -9280098 -7778767 561445 2454646 -2123816
42362 -2123816 -832480 9627651 17639761 16564684 15914289 24234801 33570238 32121727
42354 32121727 22168556 12893287 3462867 -12912613 -32970916 -44848507 -43593776 -34711712
42346 -34711712 -24583908 -16748942 -14141721 -14929731 -10091978 3578063 12203457 428691
42338 428691 -23580270 -34129952 -20877956 -1240918 4755550 -1075787 -3640658 2315050
42330 2315050 7961856 5377466 -1831754 -4026708 1828531 7360381 2216327 -12365793
42322 -12365793 -24334475 -27005890 -27203214 -31841992 -34508622 -25255935 -7926979 4328631
42314 4328631 7907519 11153056 19014293 26457713 27175992 19782664 7167033 -1468363
42306 -1468363 6754139 30776126 46113136 30444152 -3793309 -21830751 -11530745
42299 -11530745 5414930 9804163 8209810 11580133 14582762 10932521 9316152 16453957
42291 16453957 20343487 9054723 -6774488 -9309032 -806713 3600858 1579384 2387833
42283 2387833 6834461 8380258 9476208 16822820 23318724 15070447 -4028473 -14388362
42275 -14388362 -8946802 -619126 1216663 2749097 8703787 11359326 5785873 1594302
42267 1594302 8772020 21935322 28119672 22665532 10095720 -3605669 -13234171 -15743688
42259 -15743688 -15035249 -18922403 -26882705 -28312780 -17788541 -4144281 1394972 -1203111
42251 -1203111 -4926146 -6237089 -5136841 -1645486 851444 -4977455 -20324450 -34941115
42243 -34941115 -38832448 -33857135 -26877881 -18127641 -5998680 2088312 -3858326 -19870225
42235 -19870225 -29245357 -22731627 -9146332 -2725016 -6413601 -11687516 -10709589 -4513572
42227 -4513572 -400710 -3445459 -10739996 -14362674 -10283813 -2462128 2905755 4169223
42219 4169223 2952801 -326184 -5459451 -9315786 -8310149 -2781486 4727658 13394891
42211 13394891 21902295 24949036 18370441 6677149 -1276231 -4022252 -7501398 -12486131
42203 -12486131 -11079782 -480434 7723799 451291 -18377648 -30857189 -26237064 -11840692
42195 -11840692 -1702042 -795406 -3623354 -3458545 1553792 8827113 13425314 10797988
42187 10797988 1215137 -8782732 -12590524 -11227890 -11627392 -16686075 -20422129 -15144199
42179 -15144199 -1666702 9659218 8146493 -6531486 -21694487 -21607458 -4097255 13513696
42171 13513696 10939788 -11222709 -30652735 -29468736 -13847249 -1393854 3326734
42164 3326734 9342119 19281977 23275114 15527539 4571595 397471 624153 -2353067
42156 -2353067 -7215257 -6036899 2934094 13317853 19215498 18133339 7689213 -11329950
42148 -11329950 -28779400 -31641011 -19401398 -5263745 768594 1830728 3157761 885953
42140 885953 -8873611 -16663124 -8490348 12839059 27633961 23832582 11072191 4773757
42132 4773757 5988512 6060451 3739630 5213454 10122168 10717556 6123678 5237609 11423049
42123 11423049 15460559 10194981 2358829 1134136 3082203 -916544 -9488408 -13094206
42115 -13094206 -9011178 -2471751 4673919 14018939 20474398 15931851 4524777 70357
42107 70357 4539926 3800765 -8506127 -18038000 -11977804 -904154 -2681009 -13335394
42099 -13335394 -12297031 6274370 24874994 26839151 14262616 -1600841 -14199788
42092 -14199788 -20028996 -14715336 614846 15883763 22121316 20528008 17169901 14383740
42084 14383740 12059334 11282044 11015253 6643063 -2201292 -7641314 -4054037 2424339
42076 2424339 2603760 -1889351 -2548425 1158016 1397922 -3781132 -6420604 -1689582 3908061
42067 3908061 2071385 -5756229 -11015704 -7954481 2290938 13249609 16108618 6061672
42059 6061672 -11164098 -23671727 -26752037 -26182438 -25940402 -21659273 -12461746 -9513752
42051 -9513752 -21085577 -35169945 -31399517 -9104500 10489474 12066238 3072971 -1736035
42043 -1736035 -142274 1040613 -403892 -1765173 -2814399 -4741018 -5738502 -4993677
42035 -4993677 -6892565 -13771017 -18538131 -13069408 -1513571 3253794 -4091916 -15320325
42027 -15320325 -18687725 -10237748 3323365 9265530 305918 -14302058 -15864039 -1038127
42019 -1038127 9524507 -1349374 -20238989 -20315178 233674 17985534 21328916 23564538
42011 23564538 33279282 36266354 20963282 1786405 -1715166 5379559 4724382 -4279774
42003 -4279774 -6281193 2631695 10479199 11133581 11105937 13189184 11254812 4846665 2265834
41994 2265834 3756328 -2594450 -20247204 -33412173 -27381402 -9492660 1018002 -3139917
41986 -3139917 -13674945 -21141920 -22624267 -18188118 -9307442 -528690 3869571 4740138
41978 4740138 5472030 6531855 6883792 7929037 10479336 10218237 2905512 -6523754 -6976901
41969 -6976901 4751585 18019956 19696050 9070246 -1401182 327895 13417008
41962 13417008 25856412 27976355 22687936 21138088 29499226 42562136 50069766 46559572
41954 46559572 34680507 21719278 13730140 10879222 8325372 3605597 1341028 6264278
41946 6264278 13499579 13163305 4945372 -632325 1841321 4928272 1772779 -2556968
41938 -2556968 -1888210 -2359365 -12628840 -26343388 -29022330 -20684811 -16428308 -22709675
41930 -22709675 -28032839 -22185476 -10334567 25424 12159421 27672029 32755405
41923 32755405 14617194 -13404035 -21953226 -2724665 20239911 21336433 2361340
41916 2361340 -16502039 -23367114 -21810497 -18124559 -12867273 -4270058 7244066 18488746
41908 18488746 24479925 22179594 15682426 13289240 16210609 16256611 9612783 5202101
41900 5202101 10887083 18515258 14910725 3364574 -342359 7420209 12869662 7374052
41892 7374052 541437 3814909 13316312 18172498 16503954 13565406 11430295 9933198
41884 9933198 11428346 15034705 11890273 -3586552 -22150590 -29845203 -26224524 -21923131
41876 -21923131 -20748830 -15895185 -3999166 7763900 10957461 4865253 -4895274 -10768731
41868 -10768731 -7332014 2269823 6028532 -2945605 -15080413 -16805306 -11239563 -13419661
41860 -13419661 -25773257 -33559011 -27708814 -17331311 -13660092 -15414728 -17937088 -23627575
41852 -23627575 -32692201 -34856236 -23143544 -7477654 -964097 957130 12498251 31671694
41844 31671694 38540785 21958929 -4794342 -20765775 -20914688 -16497825 -17560201 -22505317
41836 -22505317 -24244701 -20765953 -15744850 -9914466 2248524 22019941 36178663 27505379
41828 27505379 -1595081 -25483433 -22546807 156550 17457200 16340153 6124785
41821 6124785 952708 2940476 5033740 2608408 -2762405 -7898228 -12109416 -15801329
41813 -15801329 -16088360 -7205498 10683933 25468705 24051997 10345000 2526366 8384177
41805 8384177 14433860 7330165 -5155414 -7081938 411792 2603892 -4913790 -13131669
41797 -13131669 -19309923 -31526648 -49546911 -57453130 -43483163 -15740698 9308602
41790 9308602 24224967 29794044 27211326 20220955 17436089 23230542 31276954 34175023
41782 34175023 33743747 34595131 33947148 26952470 17327776 12798212 12624848 8873889 -1245377
41773 -1245377 -12424405 -19435588 -20487199 -13664212 1262013 16987764 22767865 16198633
41765 16198633 4696926 -5252904 -12932420 -16669884 -11809582 141968 8495862 6207414
41757 6207414 -245094 -1288269 408770 -5135129 -16825769 -20615351 -9819415 1920094
41749 1920094 -4015379 -27195913 -47953971 -50677280 -39506077 -28526712 -23428936 -18956171
41741 -18956171 -10787521 -1914680 3869962 8419522 15187777 22355330 24882562 22258573
41733 22258573 19393337 19017328 17656154 12044615 6222467 7149982 13601247 14898390
41725 14898390 3898228 -11805885 -16074207 -1536884 22164439 37840010 36427356
41718 36427356 23115080 10116888 4494972 2628998 -3187486 -13136169 -18094070 -11711562
41710 -11711562 -427032 3925453 -751510 -5978017 -6267376 -5100350 -5449500 -3369671
41702 -3369671 3388825 7406550 184540 -14474635 -22720315 -15636641 2289750 18522524
41694 18522524 23230198 16569270 7673336 4233374 2775407 -5155940 -16434503 -16073449
41686 -16073449 448810 14537755 5397842 -21863952 -40834277 -34387367 -10597190
41679 -10597190 10479895 16268245 8287108 -2133710 -4106587 1677177 4604468 1208743
41671 1208743 2565464 15841435 28784962 27893427 23239711 33981777 53429366 53943209
41663 53943209 29302754 6368182 5603086 14103872 11847223 2979080 1907153 5350080
41655 5350080 615782 -9064646 -9598845 -438837 6189554 6941993 9275578 13044270
41647 13044270 8446746 -5617642 -16481580 -14556522 -3511941 8677585 18057644
41640 18057644 22064101 18826677 11956052 8348030 10084801 14911616 22399878 30609695
41632 30609695 29799578 12122071 -12668495 -24234789 -16438361 -3278417 2097244 1519937
41624 1519937 747134 -2744056 -13011105 -25962049 -34335831 -35860134 -30709722 -18244380
41616 -18244380 -2893993 3893775 -3794347 -16071996 -17521907 -5452725 8767184
41609 8767184 14973373 14071394 12086186 10067052 3881254 -6865280 -13588283 -6627135
41601 -6627135 11159239 23817761 19191668 2417105 -12213394 -18238358 -18816788 -16066977
41593 -16066977 -9058539 -940214 2981077 4929009 11572448 19761513 17653986 4692517
41585 4692517 -1665765 12107362 35293662 44222329 29379137 3295466 -15483070
41578 -15483070 -19137064 -12770158 -5979782 -3602049 -3394019 -2412140 -2674415 -6236666
41570 -6236666 -7965985 -1539891 8512278 10713531 3056906 -5370830 -10344925 -16869960
41562 -16869960 -24228399 -22073658 -8951802 728207 -596099 1035297 17548464 33683973
41554 33683973 25888944 -1278753 -19731702 -16506667 -6273420 -3628277 -4188450 -123133
41546 -123133 3778788 149799 -8013831 -14596852 -19816331 -23123298 -17532885 -2362217
41538 -2362217 7743316 157265 -15450710 -18616719 -6950962 1231840 -6218818 -19954236
41530 -19954236 -24972996 -19439444 -10374626 -758875 8690636 11611596 2572812 -10112662
41522 -10112662 -10502518 3512855 15470597 12293849 1772923 -127779 7497503 11176968
41514 11176968 4461448 -3172022 -1100748 8048001 13372891 8970203 -2077463 -12447439
41506 -12447439 -15544599 -9418306 972244 8071792 9781646 9569689 8262874 2141386
41498 2141386 -8636427 -16887704 -17827317 -15184108 -13207847 -9333400 -1041005 6268786
41490 6268786 6133217 1203980 -1340621 -844945 -1705985 -4230518 -5563313 -7325672 -13230608
41481 -13230608 -19934354 -18870943 -7695473 6965626 18016937 22901211 21592474 16965761
41473 16965761 15723262 20533032 22138002 8809986 -15754658 -33638330 -33826056 -23328551
41465 -23328551 -15088228 -14105884 -18999709 -27939631 -37294903 -41478914 -39887473 -38681146
41457 -38681146 -41366823 -43164834 -38602890 -28570387 -15789182 -321581 14883749
41450 14883749 20847000 12477440 -2795045 -13058889 -14871137 -12214415 -7155611 604351
41442 604351 7594209 8090203 1613660 -6604917 -11914204 -12609805 -8217131 -701484 4574427
41433 4574427 4463510 2518515 2558541 1122472 -6240155 -14156447 -12883197 -4001986 325093
41424 325093 -4211220 -7853248 -3987195 -1061598 -8046110 -17258325 -14735106 -2652250
41416 -2652250 3670494 762997 2835701 16849342 26462459 13388148 -13938892 -28171412
41408 -28171412 -17232524 3394775 14148790 13904715 13294944 16395381 18280651 14791174
41400 14791174 6104059 -5950315 -17038802 -20149240 -13483770 -5672993 -5633419 -9797486
41392 -9797486 -7834901 895303 6803474 6336558 7625960 15592450 20955317 11823418
41384 11823418 -8972742 -25888688 -28216002 -19503211 -9599650 -2803267 3013413 7844636
41376 7844636 5473659 -8199183 -25094943 -30465366 -20775572 -9002065 -7233561 -11484493
41368 -11484493 -11912446 -10812396 -17739408 -30617752 -36739332 -32904631 -29687593 -32619185
41360 -32619185 -34007949 -29312364 -27043628 -33010176 -37168084 -27909597 -10122190 2959131
41352 2959131 8320034 11412964 12397005 7505507 36906 -3144475 -3630919 -7452850
41344 -7452850 -11024154 -4801709 8732119 14871145 8059123 771375 4834611 14428327
41336 14428327 16302069 9835401 7111825 15503654 28583883 35405525 33222923 28011342
41328 28011342 25003130 23001038 19339373 16670674 19510556 24740214 22646206 10487127
41320 10487127 -1289702 -1711031 6674292 12605621 10979765 5670198 266024 -5670927
41312 -5670927 -11252966 -12547125 -8153698 -2039549 713762 -1040867 -2965460 2535155
41304 2535155 18942828 37954045 44562246 34469397 20731084 17067150 21160269 22951488
41296 22951488 22645415 28055648 37687687 40181535 30744147 16332651 3805491 -5685208
41288 -5685208 -9590760 -3745074 7336650 11044019 2360375 -9594309 -14130193 -9823547
41280 -9823547 -640320 8963797 12124157 3438010 -10351849 -13173288 1108948 20058829
41272 20058829 27928602 21984094 10252390 1856877 3201488 14226606 24526165 22927438
41264 22927438 13877157 12325642 19289290 18345153 2841098 -11461183 -12048765 -9703136
41256 -9703136 -16808508 -22810560 -13372525 -975757 -9412668 -33413652 -41637027 -21539606
41248 -21539606 4026012 11088429 2815646 -6028616 -12651675 -20099081 -22407631 -12549570
41240 -12549570 2066920 6003989 -5035684 -20701009 -29081400 -26261044 -15747431
41233 -15747431 -5021617 -1001002 -4029170 -7498957 -5880938 -458527 4615668 7690137
41225 7690137 8641217 7165034 4975138 5254060 7032527 4935416 -2093427 -6804037
41217 -6804037 -2838806 5966075 9961259 4541514 -6864117 -17529342 -21738681 -17584573
41209 -17584573 -9219996 -3953333 -4442832 -6727683 -7864916 -10281180 -14517274 -13292395
41201 -13292395 -187653 18060718 25459045 13927652 -8125354 -25355362 -30143362
41194 -30143362 -26957387 -25132541 -29059179 -34800602 -35741127 -30623954 -24081182 -19711161
41186 -19711161 -16732408 -14977772 -18114977 -27267046 -34815012 -30983881 -16410517 -2768696
41178 -2768696 513377 -3699693 -5053588 2607224 16120003 26630480 25830490 11209981
41170 11209981 -10667954 -26597408 -27130447 -16810260 -10754849 -17595849 -28119632 -25643353
41162 -25643353 -6805827 13804452 20880685 14322933 5207066 1828122 4625780 10227726
41154 10227726 14472573 14420055 12472819 14724703 19928753 16240275 -1964098 -19621646
41146 -19621646 -16675496 3586721 16774116 9793901 -4385650 -9731142 -9248947 -13726399
41138 -13726399 -21461671 -23566778 -21253642 -22750914 -27378606 -27154591 -22244476 -20499459
41130 -20499459 -21143168 -13059720 6901439 26309185 33939625 33934492 35315584 35581329
41122 35581329 25284221 5480764 -9752864 -9657520 969498 8327706 4351147 -7257198
41114 -7257198 -16420813 -15288500 -3719356 10192356 15797246 9759543 443436 -1434796
41106 -1434796 3024498 1979434 -9091015 -17935371 -11796919 2679519 7215701 -2798514
41098 -2798514 -14038710 -17150499 -17945461 -21279141 -18957029 -4906269 9408361 9166892
41090 9166892 -1567783 -6550792 -1684482 2458386 374054 -1619219 230182 247893
41082 247893 -4668626 -7565288 -1744493 9212780 16316918 14544157 5557714 -2948544
41074 -2948544 -601651 15209457 32133289 34571816 22316221 7954434 -2792747
41067 -2792747 -14567194 -25497158 -23766877 -7514154 7202103 7948925 2419766 2748821
41059 2748821 5832231 2702286 -2625012 851032 12394480 21220279 22896847 21343255
41051 21343255 18445856 14338083 14272437 21994951 29177638 24894656 13345603 8329485
41043 8329485 12004401 14149006 11584631 11537598 14133740 9291723 -3820061 -10878101
41035 -10878101 -3692235 7144647 9442557 5508327 1537375 -5069437 -15293265 -18077368
41027 -18077368 -6179199 6616711 1601437 -16428725 -24180274 -12092168 4676924
41020 4676924 9460570 3884807 -393195 1491713 5568794 7075704 5540663 5477280
41012 5477280 13123752 27951321 38518889 33985544 19217117 9671527 10686165 11908847
41004 11908847 4756502 -5458987 -10071979 -9627372 -8273855 -4064361 5507033 14156049
40996 14156049 13513217 6212375 2436774 4750487 6041335 3022215 2129836 8436835
40988 8436835 16086694 15163939 4100044 -9579943 -18792059 -22843970 -24060718 -22011609
40980 -22011609 -13633049 834495 14294994 18405714 13209808 7648583 8427282 12063466
40972 12063466 11699087 8267990 8809533 14913653 19273407 14679742 1534506 -14270871
40964 -14270871 -25938287 -27595259 -17829919 -4080913 1817295 -4141744 -14576774 -21725209
40956 -21725209 -26011870 -29551389 -28197593 -18299164 -7123415 -6400697 -15799837 -22182199
40948 -22182199 -17361126 -8205446 -5117487 -8041910 -10452513 -11790523 -17046973 -25239587
40940 -25239587 -27042771 -16831151 -1360971 7801997 7265349 3065741 1303227 2744868
40932 2744868 6306584 11988111 17793033 18156411 9562795 -4541475 -17841838 -27606027
40924 -27606027 -33074932 -30824555 -18817616 -4137562 1432536 -4510818 -12171672 -13058073
40916 -13058073 -8923134 -3912842 3567443 14517889 22145638 19816795 11550850 6020694
40908 6020694 4087418 1264139 -1280133 1287128 6927529 9288552 9179531 11600495
40900 11600495 12689990 4290750 -7242183 -3695073 17458380 34284900 29341413 13625777
40892 13625777 8728230 16193323 19691427 10235533 -5936018 -19891200 -26157647 -20129803
40884 -20129803 -3819472 8207878 3372230 -9290706 -8608241 9365933 26226615
40877 26226615 26813993 14518834 -1955987 -20429196 -36987479 -41306494 -30650654
40870 -30650654 -17420405 -13093035 -14127665 -11990577 -6307751 1292945 14408477 30547539
40862 30547539 34149918 17129849 -2269026 40408 19402480 28288069 15964742
40855 15964742 1644647 3720512 15397168 20606471 18295940 17223307 16909570 9144516
40847 9144516 -4971084 -12526699 -5112182 10018517 17930658 12185931 1644997 1240379
40839 1240379 15316683 31930533 36929649 30560271 23032772 16663677 5076319 -8367817
40831 -8367817 -7219392 13996228 35856756 37981113 27123296 24695071 32496040 30831849
40823 30831849 10922801 -10625187 -16053967 -8988277 -3604015 -4363865 -7462648 -12021197
40815 -12021197 -17309456 -15964088 -2732262 14196601 21986633 19825948 15757919 10640956
40807 10640956 -1329646 -17368008 -25847302 -23525513 -19831408 -20231601 -18234220 -9536765
40799 -9536765 -1482254 -515473 -1779381 -645060 -3257619 -13355251 -18811062 -7150681
40791 -7150681 12354336 19875951 15096422 17156555 33621259 48558863 47218109 35550530
40783 35550530 26297757 20174173 11968600 3621410 -968320 -5017283 -10711633 -10235179
40775 -10235179 2063548 15599527 16226647 8281217 8693514 21399110 33106974 34635408
40767 34635408 31167749 28856044 25809392 20968849 18707378 18786892 13901269 3787211
40759 3787211 -221101 7022032 13491898 7142689 -5663721 -10640623 -6332446 -1067066
40751 -1067066 4540964 16540938 31432097 36598536 28790116 18920257 14859648 11275129
40743 11275129 1944311 -8053933 -9739812 -2722235 6561778 13622245 16638882 13471459
40735 13471459 5159222 -832558 1955203 9637859 12191537 6561045 366423 2332165
40727 2332165 13125480 25702573 31025726 23810915 7004013 -8759166 -13863886 -8708617
40719 -8708617 -948434 5670432 14221338 25001691 29835191 21591481 5763527 -3929611
40711 -3929611 -703406 9642726 17596065 18990610 15261116 11083336 13302004 25203506
40703 25203506 38146269 36018381 14866581 -7225820 -8780367 9296185 26146489
40696 26146489 27944632 20963238 15644848 10514597 67703 -10883671 -12407598 -4836755
40688 -4836755 1792218 2085551 -722829 -4523559 -11432077 -19048877 -19075894 -10187456 -4089260
40679 -4089260 -11048203 -24467308 -28054746 -15909209 2267334 15055907 20341373 21085639
40671 21085639 18250811 13088019 10829143 14471658 16858677 7347438 -11714433 -22762050
40663 -22762050 -12737799 9935217 25095484 24376198 16429362 10163039 4366509 -2475012
40655 -2475012 -3815097 4298223 12195967 7850455 -4918524 -11322365 -6885625 -1519706
40647 -1519706 -1853886 -2452758 1738181 6589611 8891244 14285284 26339528 36576442
40639 36576442 35464779 26403784 18203038 9914410 -4362680 -20040391 -25937783 -22533844
40631 -22533844 -21501405 -25295861 -22533525 -9176888 592995 -5174518 -16727523 -16795863
40623 -16795863 -6211820 -299859 -3589972 -4361883 4201565 12581262 11129749 6308513
40615 6308513 11364835 27353821 42528603 47042270 40100653 24776642 4434808 -15011407
40607 -15011407 -26739509 -29959605 -30777034 -33642858 -35369702 -29890039 -16205552 280427
40599 280427 11907938 13074534 4010494 -7317493 -10391834 -2816478 6147071 5886026
40591 5886026 -3592390 -13367081 -17236076 -16850285 -15737478 -13624986 -9121220 -4959736
40583 -4959736 -7211985 -18739018 -33861356 -40531659 -30491188 -8933848 8434574
40576 8434574 10794453 2572944 -4539884 -6487424 -8069100 -11682892 -13021001 -9052818
40568 -9052818 -2928398 1825070 5835958 9570964 10441468 7920505 5890521 5757573
40560 5757573 3076096 -3888266 -8293342 -4256394 2905794 4124617 316885 -501009
40552 -501009 2787235 3552425 -45041 -2451965 -2301940 -5780557 -13966374 -16465140 -4896243
40543 -4896243 13834084 25303181 24290029 16822803 9303081 3397325 -227051 -1250008
40535 -1250008 -3098509 -9679113 -16905207 -14146802 2164061 21370668 29718864 25360770
40527 25360770 17349793 12324946 8741742 3921816 -745713 -4598203 -10973389 -20075277
40519 -20075277 -23813897 -15835444 -3922743 -2798473 -14433549 -25446440 -26462892 -23430785
40511 -23430785 -24214399 -24671369 -18030842 -10312937 -13577071 -26787581 -35335092 -29603413
40503 -29603413 -14612913 -1500445 1717464 -8059397 -26106249 -38443443 -33608597
40496 -33608597 -16987961 -3862212 1434587 7336699 15915182 17569539 9230312 2244061
40488 2244061 4570394 9570854 11242227 15344609 23759922 23381479 6675573 -10093971
40480 -10093971 -8543934 2464260 1032309 -11550988 -13280716 2312093 17330092
40473 17330092 19054796 14327228 9068903 -2744285 -19887398 -25789435 -13842889 -2765587
40465 -2765587 -10581577 -27730164 -32877998 -23594993 -13717302 -9606216 -7351553 -7080961
40457 -7080961 -11740294 -15329089 -9745252 -1501072 -4929944 -18999779 -27104401 -21488718
40449 -21488718 -12480563 -10276963 -12158766 -12815498 -14119037 -17760544 -18868229 -14260841
40441 -14260841 -8983720 -8633848 -12240025 -17190617 -23218716 -26773606 -20113019 -2344203
40433 -2344203 15908289 24953451 26225519 24421660 17940127 5591098 -4104476 -763027
40425 -763027 13798008 27751978 33212689 30903859 23554947 12238661 -1536653 -15643619
40417 -15643619 -28260975 -35697376 -33123124 -21761170 -10387005 -4421486 551573 8137415
40409 8137415 11754932 5499955 -2999495 -3443411 -976290 -7934443 -20477823 -21410595
40401 -21410595 -7706198 3095324 -261457 -6417781 -1176369 10898656 16426333 13397365
40393 13397365 8770100 4799644 1007314 3224526 16918155 34611115 41596463 32503673
40385 32503673 13687911 -6603172 -20944705 -21190491 -6813163 8330059 10176697
40378 10176697 3259490 2777415 10529698 14006523 9098301 6577649 12330856 17771230
40370 17771230 16889091 17600378 26157635 32991212 26252831 10514982 -80962 -1127326
40362 -1127326 692946 1046893 2324923 6797239 13383596 19644027 21951989 17162801
40354 17162801 8108564 1916159 -800563 -6653087 -14448232 -11189139 7284162 23307739
40346 23307739 19153629 3032376 -2537133 8103758 21068577 26395952 25745414 19667246
40338 19667246 7376481 -764756 8553838 27888232 34254248 22962959 14331180 18566733
40330 18566733 17950511 -878496 -18900836 -11431974 12077733 20214111 4189655 -14048179
40322 -14048179 -16317742 -8168609 -1668204 1482764 2185371 -4959798 -21979453 -37530194
40314 -37530194 -36141623 -14918488 13022418 29703375 26485287 11066818 354464
40307 354464 2773207 9389559 6916143 -4193682 -11823204 -9417370 -2347874 1647165
40299 1647165 -365469 -8188179 -18330369 -22310614 -14505556 -2538720 -678501 -11459629
40291 -11459629 -22707019 -24179493 -17672744 -8538201 2425018 14123469 21012239 19375618
40283 19375618 12124432 4440595 524566 5132306 19230072 32415031 30260814 12843274
40275 12843274 -4179630 -10256454 -9883540 -7867841 234541 14152759 20204173 10121436
40267 10121436 -2718106 -854666 12290981 20415390 19224093 15784450 9392200 -6070397
40259 -6070397 -22332852 -21231390 -3205746 8281698 -1216157 -17189103 -18438864 -5538690
40251 -5538690 5061281 4977764 -1149458 -7992649 -14202844 -18030442 -18800023 -20806563
40243 -20806563 -26984424 -30908953 -24303422 -11422837 -6179026 -13328200 -21050162 -16075999
40235 -16075999 -96029 13554230 15756896 9446561 3426923 2907287 6715800 10757173
40227 10757173 12026813 9899781 5385396 109701 -4339060 -6697253 -6037003 -2468166
40219 -2468166 1094656 -621013 -9467035 -18657047 -18699672 -10825351 -8132623 -17951436
40211 -17951436 -29490119 -28508971 -19840433 -21781597 -37671990 -48173965 -38237270 -18323884
40203 -18323884 -7856448 -8024646 -5607893 2685652 7361894 7202819 15029987 35427609
40195 35427609 50914723 42330257 15463646 -4853533 -4402276 7636838 15686761 17207556
40187 17207556 20629510 30535614 41434662 44554840 36201382 19273453 -284997 -17067747
40179 -17067747 -27524926 -29698210 -23490464 -12408004 -3928299 -4724078 -13369765 -19623652
40171 -19623652 -14206475 479058 11875759 10475425 -331102 -8747243 -7169692 1546558
40163 1546558 9190631 10800173 7591208 3378666 164693 -2392325 -4288403 -3708979
40155 -3708979 580370 5951475 6761322 -745153 -14921990 -29911163 -39192060 -38654625
40147 -38654625 -29173539 -17477544 -12086238 -16100524 -24897666 -31925394 -34855358 -34628205
40139 -34628205 -31137458 -23069286 -11048137 1560942 10602324 12998377 8778330 2643284
40131 2643284 504473 2398044 2674760 15696 1713985 12385590 23890538 25155498
40123 25155498 18407727 15205828 18120634 18513269 13206098 9774674 11056831 8248788
40115 8248788 -2400126 -8709510 -449528 11664802 9549196 -5744855 -16871184 -16638517
40107 -16638517 -14790063 -17411948 -17019523 -9623436 -6457235 -17381728 -32718593 -34512083
40099 -34512083 -20651242 -5602648 726855 3105773 8721907 15113242 15211969 8153302
40091 8153302 -355041 -5289748 -5530468 -1776447 4315435 8964939 7961409 1274985
40083 1274985 -5940571 -9112533 -10228819 -15303253 -25079956 -31343500 -25877190 -11717727
40075 -11717727 -704420 1051602 -57067 3621855 8057661 3178931 -10272798 -18798685
40067 -18798685 -14198595 -5545186 -6238357 -14374058 -15408950 -3114316 11861308 16769138
40059 16769138 11752802 5266604 1064664 -3692813 -11240739 -20413423 -28704102 -32048459
40051 -32048459 -25598716 -10560264 2686492 5062023 -63474 -3441857 -4627728 -10268939
40043 -10268939 -19306198 -22055000 -15889982 -9713813 -8761182 -7362545 -3481659 -7617724
40035 -7617724 -25798158 -43455297 -40807721 -19770615 -1731147 39463 -6867992 -9345765
40027 -9345765 -4941158 767781 3709026 3071969 -1240739 -8774597 -18025083 -26372591
40019 -26372591 -28984884 -20674479 -3019766 13368382 18871369 14290234 5756162 -3981497
40011 -3981497 -11825172 -9064347 7840533 25432242 26367760 12968964 3537548 5784016
40003 5784016 9796229 8745704 8625987 12156421 10940049 2531442 -1407463 4283077
39995 4283077 4835886 -12384563 -34763903 -39985037 -25634051 -6767035 8337067 21865267
39987 21865267 30931864 27773225 15327856 5802813 2064176 -4830207 -17576459 -26289082
39979 -26289082 -23639551 -14100683 -4911989 782266 -672948 -12491838 -27893842 -32978669
39971 -32978669 -23551465 -8709071 5131423 20936987 37403716 43133082 32850200
39964 32850200 17153705 7004511 284886 -6272945 -4739307 10233609 25657818
39957 25657818 25070323 12730684 6110986 8594018 7605905 -1502582 -8445465 -7242343
39949 -7242343 -4720828 -4599994 -89721 9285110 9555536 -6270433 -21283965 -15051633
39941 -15051633 6653748 18968269 11533310 -1103706 -3295457 2677522 6287999 5211512
39933 5211512 4103158 4496171 3796580 407595 -5765813 -14733005 -24229572 -29879646
39925 -29879646 -31307927 -33306414 -36285848 -31467043 -13212181 8243609 16178159 8170900
39917 8170900 -2155853 -4490225 -2612952 -2907898 -2504952 4049921 13361776 16886592
39909 16886592 12595753 5629626 -506783 -6243612 -10087010 -7558383 1737338 10347554
39901 10347554 9540012 -1086336 -11864052 -11821758 -259270 11523974 13003247 7681399
39893 7681399 7885865 16288314 21220878 14131342 2407483 -2845384 -3642351 -8725366
39885 -8725366 -15999739 -14762734 -3640332 6975150 10822072 10954701 7252298 -6499721
39877 -6499721 -26988243 -36416670 -23251226 1430046 18139367 21464471 18177216 11038362
39869 11038362 -1756139 -15081871 -19352526 -14981584 -12603427 -17229377 -22544444 -22857394
39861 -22857394 -20023268 -15076014 -4153969 10674851 16511257 5599157 -10215679
39854 -10215679 -12647193 -2082435 2425184 -10310530 -28403581 -33884307 -25957674 -18021903
39846 -18021903 -16422621 -13809203 -4390367 5113625 5663806 -106502 -1968135 3411740
39838 3411740 9774910 11336389 7841301 153330 -10710181 -18724851 -15828967 -3677179
39830 -3677179 5243035 3382069 -2236570 -2645125 -1609704 -7663740 -16857801 -16537671
39822 -16537671 -5520620 2860031 1168628 -880470 7586450 21338811 27380892 23729789
39814 23729789 18781922 15720886 9835211 1477773 -507293 7255587 14972378 12702581
39806 12702581 4041564 -987381 -1442384 -4710076 -13016114 -20287950 -22111331 -19730403
39798 -19730403 -13497713 -2196112 8653031 8646989 -1592960 -6639134 2736266 13655721
39790 13655721 8386045 -8632334 -15942750 -5760795 5837935 2486206 -12364362
39783 -12364362 -25048678 -29903499 -29324455 -24315707 -15279835 -7772657 -8230616 -15269155
39775 -15269155 -21250732 -21082202 -15432085 -8238948 -5168060 -10592889 -21069949 -25736927
39767 -25736927 -18772624 -7457605 -1572299 733925 7923730 18974531 22995612 15869332
39759 15869332 7697614 9828185 21302231 32734779 38683532 40771437 40842995 36489489
39751 36489489 25017666 9802633 -87547 1604651 11020145 18111356 17806901 13439222
39743 13439222 8594141 1749189 -7277613 -11610343 -5023379 7789078 15881526 15784301
39735 15784301 13964775 15847874 18764320 17203651 10501243 3767587 3715756 13145949
39727 13145949 26666637 33212316 26680972 13222282 4358259 3972499 5704561 1728282
39719 1728282 -9898671 -25183255 -37225484 -40164615 -33576590 -22184625 -9760776
39712 -9760776 3251334 14424264 18134347 14073614 10167747 11092807 11423073 7676008
39704 7676008 7876496 17556023 24893900 15610314 -2922496 -10444776 -4210167 -1289693
39696 -1289693 -9686754 -17321657 -14660576 -9026147 -8322992 -8135479 -5150506 -7129382
39688 -7129382 -17321592 -23688933 -17869917 -12106830 -21080955 -36823409 -39286130 -25733975
39680 -25733975 -12372399 -9570016 -11433850 -10158644 -7304160 -8693263 -17442853 -32717086
39672 -32717086 -47860151 -51226519 -37127393 -14767469 1017434 5672766 4617504
39665 4617504 1625764 -2538440 -3395498 3349081 11592833 9675204 -2982788 -13185888
39657 -13185888 -9753412 5453720 23122728 35366264 37581794 28881894 13904482
39650 13904482 204288 -7597905 -9059564 -5617231 -863688 -14478 -4082066 -7314591
39642 -7314591 -4859231 812853 5196106 7478351 5843420 -4948862 -23735167 -39183701
39634 -39183701 -44933057 -48841547 -55933926 -53934650 -32420343 -5823599 4209671 2208820
39626 2208820 9700547 26119104 27486619 7436421 -9464561 -5706525 3863650 -272674
39618 -272674 -11497009 -12253186 -2679461 5443314 10431175 17392642 22784437 20010215
39610 20010215 13366168 10937645 10377821 6091549 3126984 8790924 17223211 17932108
39602 17932108 13741306 14296904 17079586 11877864 386907 -5999156 -5661114 -6594131
39594 -6594131 -7987792 -479943 13446454 17282421 3521266 -16233470 -29024809 -34080458
39586 -34080458 -33400162 -23808424 -6940193 5083121 3904382 -3680218 -6888320 -5758798
39578 -5758798 -6755953 -10571455 -12876109 -12198999 -9218559 -2049978 10408313 22727174
39570 22727174 26770327 20584484 9867283 1570396 -2207688 -5843057 -15982119 -32308504
39562 -32308504 -43321770 -37494020 -18992220 -4636570 -3258803 -6410694 -3114304 5017283
39554 5017283 9356597 7275670 2204363 -3270265 -6623476 -2854550 8780768 19116695
39546 19116695 18607119 10011246 3400071 685182 -5705284 -19067021 -32517956 -38652009
39538 -38652009 -37397186 -31900558 -23915873 -16839803 -16460454 -22908347 -26245979 -16481258
39530 -16481258 3537162 20192759 23532657 15859978 6733437 3706895 8154594 15588799
39522 15588799 18147384 10577748 -3017484 -10820746 -5321456 7538664 14666888 10268649
39514 10268649 106911 -7959508 -12433724 -15855074 -18832209 -19186805 -14108486 -1869401
39506 -1869401 14665721 25592662 21878624 8917366 4251061 15280127 26663376
$$ [...]
##END NTUPLES=NMR SPECTRUM
##END=
