##TITLE=31Pdec_SR49_oil
 CDCl3, 24 sc
 30.03.2021
##JCAMPDX= 6.0         $$ Bruker NMR JCAMP-DX V2.0
##DATA TYPE= NMR SPECTRUM
##DATA CLASS= NTUPLES
##ORIGIN= UXNMR, Bruker Analytische Messtechnik GmbH
##OWNER= root
$$ XWIN-NMR		Version 3.5
$$ Tue Mar 30 13:10:27 2021 Russian Standard Time (UT+4h)  she@DPX200
##.OBSERVE FREQUENCY= 81.013821
##.OBSERVE NUCLEUS= ^31P
##.ACQUISITION MODE= SIMULTANEOUS
##.ACQUISITION SCHEME= undefined
##.AVERAGES= 24
##.DIGITISER RES= 16
##SPECTROMETER/DATA SYSTEM= spect
##.PULSE SEQUENCE= zgpg30
##.SOLVENT NAME= CDCl3
##.SHIFT REFERENCE= (INTERNAL, CDCl3, 0, 248.564)
##AUDIT TRAIL= $$ (NUMBER, WHEN, WHO, WHERE, WHAT)
$$ ##TITLE= Audit trail, XWIN-NMR		Version 3.5
$$ ##JCAMPDX= 5.01
$$ ##ORIGIN= Bruker BioSpin GmbH
$$ ##OWNER= she
$$ F:/spectra/data/she/nmr/P31/1/pdata/1/auditp.txt
$$ ##AUDIT TRAIL=  $$ (NUMBER, WHEN, WHO, WHERE, WHAT)
(   1,<2021-03-30 13:08:52.53 +0400>,<she>,<DPX200>,
      <created by zg, POWCHK disabled, PULCHK disabled
       configuration hash MD5:
       00 E9 B6 7A A2 85 ED C7 34 08 36 98 17 FE 4E 26
       data hash MD5: 32K
       83 B2 FF 57 2F 2B D6 FF A5 3A F8 C9 E0 2C D6 B3>)
(   2,<2021-03-30 13:09:00.96 +0400>,<she>,<DPX200>,
      <Start of raw data processing
       efp BC_mod = 2 LB = 1 FT_mod = 6 PKNL = 1 PHC0 = -4406.358 PHC1 = 90.201 SI = 64K 
       data hash MD5: 64K
       2E 1E 86 A9 EA 17 F7 FD 1A B1 3C BE 3B 0A 41 17>)
(   3,<2021-03-30 13:09:33.85 +0400>,<she>,<DPX200>,
      <pk PHC0 = -69.0266 PHC1 = 147.4 
       data hash MD5: 64K
       98 CD 34 80 70 D0 71 AB 1F EF F0 E6 0A 15 F6 A9>)
(   4,<2021-03-30 13:09:37.43 +0400>,<she>,<DPX200>,
      <abs ABSG = 5 
       data hash MD5: 64K
       D4 2B E7 FB 65 C3 94 5F 5D 14 73 1E CE 28 E4 18>)
$$ ##END=
$$ 
$$ hash MD5
$$ E1 EB 7B 70 0F 82 3B 3F A9 C1 F9 52 78 A1 01 43
##$RELAX= 
##$RELAX= 
##$RELAX= 
##$RELAX= 
##$RELAX= 
##$RELAX= 
##$RELAX= 
##$RELAX= 
$$ Bruker specific parameters
$$ --------------------------
##$DU= <F:/spectra>
##$EXPNO= 1
##$NAME= <P31>
##$PROCNO= 1
##$TYPE= <nmr>
##$USER= <she>
##$AMP= (0..31)
100 100 100 100 100 100 100 100 100 100 100 100 100 100 100 100 100 100 
100 100 100 100 100 100 100 100 100 100 100 100 100 100 
##$AQSEQ= 0
##$AQ_mod= 1
##$AUNM= <au_zg>
##$AUTOPOS= <>
##$BF1= 81.014009
##$BF2= 200.13
##$BF3= 200.13
##$BF4= 200.13
##$BF5= 200.13
##$BF6= 200.13
##$BF7= 200.13
##$BF8= 200.13
##$BYTORDA= 1
##$CFDGTYP= 0
##$CFRGTYP= 5
##$CHEMSTR= <none>
##$CNST= (0..31)
1 1 145 1 1 1 1 1 1 1 1 1 1 1 1 1 1 1 1 1 1 1 1 1 1 1 1 1 1 1 1 1 
##$CPDPRG= <waltz16>
##$CPDPRG1= <>
##$CPDPRG2= <waltz16>
##$CPDPRG3= <>
##$CPDPRG4= <mlev>
##$CPDPRG5= <mlev>
##$CPDPRG6= <mlev>
##$CPDPRG7= <mlev>
##$CPDPRG8= <mlev>
##$CPDPRGB= <>
##$CPDPRGT= <>
##$D= (0..31)
0 1 0 0 0 0 0 0 0 0 0 0.03 2e-05 3e-06 0 0 0 0 0 0 0 0 0 0 0 0 0 0 0 0 
0 0 
##$DATE= 1617095331
##$DBL= (0..7)
120 120 120 11 120 120 24 19 
##$DBP= (0..7)
150 150 150 150 150 150 150 150 
##$DBP07= 0
##$DBPNAM0= <>
##$DBPNAM1= <>
##$DBPNAM2= <>
$$ [...]
##$SUBNAM3= <"">
##$SUBNAM4= <"">
##$SUBNAM5= <"">
##$SUBNAM6= <"">
##$SUBNAM7= <"">
##$SUBNAM8= <"">
##$SUBNAM9= <"">
##$SW= 501.771253377433
##$SWIBOX= (0..15)
0 1 3 0 0 0 0 0 0 0 0 0 0 0 0 0 
##$SW_h= 40650.406504065
##$TD= 32768
##$TD0= 1
##$TE= 0
##$TE2= 300
##$TE3= 300
##$TEG= 300
##$TL= (0..7)
0 120 53 12 22 120 120 120 
##$TP= (0..7)
150 150 150 150 150 150 150 150 
##$TP07= 0
##$TPNAME0= <>
##$TPNAME1= <>
##$TPNAME2= <>
##$TPNAME3= <>
##$TPNAME4= <>
##$TPNAME5= <>
##$TPNAME6= <>
##$TPNAME7= <>
##$TPOAL= (0..7)
0.5 0.5 0.5 0.5 0.5 0.5 0.5 0.5 
##$TPOFFS= (0..7)
0 0 0 0 0 0 0 0 
##$TUNHIN= 0
##$TUNHOUT= 0
##$TUNXOUT= 0
##$USERA1= <user>
##$USERA2= <user>
##$USERA3= <user>
##$USERA4= <user>
##$USERA5= <user>
##$V9= 5
##$VALIST= <valist>
##$VCLIST= <CCCCCCCCCCCCCCC>
##$VD= 0
##$VDLIST= <DDDDDDDDDDDDDDD>
##$VPLIST= <PPPPPPPPPPPPPPP>
##$VTLIST= <TTTTTTTTTTTTTTT>
##$WBST= 1024
##$WBSW= 4
##$XGAIN= (0..3)
0 0 0 0 
##$XL= 0
##$YL= 0
##$YMAX_a= 4656
##$YMIN_a= -4459
##$ZGOPTNS= <>
##$ZL1= 120
##$ZL2= 120
##$ZL3= 120
##$ZL4= 120
##$ABSF1= 248.5645
##$ABSF2= -253.2056
##$ABSG= 5
##$ABSL= 3
##$ALPHA= 0
##$AQORDER= 0
##$ASSFAC= 0
##$ASSFACI= 0
##$ASSFACX= 0
##$ASSWID= 0
##$AUNMP= <proc_1d>
##$AZFE= 0.1
##$AZFW= 0.5
##$BCFW= 0
##$BC_mod= 2
##$BYTORDP= 0
##$COROFFS= 0
##$CY= -3
##$DATMOD= 1
##$DC= 0
##$DFILT= <>
##$DTYPP= 0
##$F1P= 0
##$F2P= 0
##$FCOR= 1
##$FTSIZE= 65536
##$FT_mod= 6
##$GAMMA= 0
##$GB= 0
##$INTBC= 1
##$INTSCL= 5.30512e-09
##$ISEN= 30
##$LB= 1
##$LEV0= 0
##$LPBIN= 0
##$MAXI= 10000
##$MC2= 0
##$MEAN= 0
##$ME_mod= 0
##$MI= 50
##$NCOEF= 0
##$NC_proc= -6
##$NLEV= 6
##$NOISF1= 182.463
##$NOISF2= 159.3651
##$NSP= 0
##$NTH_PI= 0
##$NZP= 0
##$OFFSET= 248.5645
##$PC= 4
##$PHC0= -4475.384
##$PHC1= 237.601
##$PH_mod= 1
##$PKNL= yes
##$PPARMOD= 0
##$PSCAL= 0
##$PSIGN= 0
##$REVERSE= no
##$SF= 81.014009
##$SI= 65536
##$SIGF1= 159.3651
##$SIGF2= -187.1042
##$SINO= 113.3802
##$SIOLD= 16384
##$SREGLST= <1H.CDCl3>
##$SSB= 0
##$STSI= 65536
##$STSR= 0
##$SW_p= 40650.406504065
##$SYMM= 0
##$S_DEV= 0
##$TDeff= 32768
##$TDoff= 0
##$TI= <>
##$TILT= no
##$TM1= 0
##$TM2= 0
##$TOPLEV= 0
##$USERP1= <user>
##$USERP2= <user>
##$USERP3= <user>
##$USERP4= <user>
##$USERP5= <user>
##$WDW= 1
##$XDIM= 65536
##$YMAX_p= 297566769
##$YMIN_p= -14249630
$$ End of Bruker specific parameters
$$ ---------------------------------
##NTUPLES= NMR SPECTRUM
##VAR_NAME=  FREQUENCY,     SPECTRUM/REAL,   SPECTRUM/IMAG
##SYMBOL=    X,             R,               I
##VAR_TYPE=  INDEPENDENT,   DEPENDENT,       DEPENDENT
##VAR_FORM=  AFFN,          ASDF,            ASDF
##VAR_DIM=   65536,         65536,           65536
##UNITS=     HZ,            ARBITRARY UNITS, ARBITRARY UNITS
##FACTOR=    0.620285442955139, 1,           1
##FIRST=     20137.2065510759, 0,            0
##LAST=      -20513.1999529892, 0,           0
##MIN=       -20513.1999529892, -14249630,   0
##MAX=       20137.2065510759, 297566769,    0
$$ Real data points
##PAGE= N=1
##DATA TABLE= (X++(R..R)), XYDATA
$$ [...]
42923A420683Q60435k08548j891679j568860L73584Q94589m79760r74106L27521
$$ 1420683 2281118 2072570 180891 -1387969 -1014385 -119796 -599556 -1573662 -1246141
42914a246141Q78057n11049j316241P8286J181565j51556j333501Q85628M221943
$$ -1246141 -368084 -879133 -2195374 -2117088 -935523 -1087079 -2420580 -1534952 2686991
42905B686991L453525j564245n174096l766087j60602J369801P99430N63105Q41328
$$ 2686991 6140516 4576271 -597825 -4363912 -4524514 -3154713 -2355283 -1792178 -950850
42896i50850R030j489603j207149J169525K634078J007384j765701k217767n4157
$$ -950850 -941820 -2431423 -3638572 -2469047 165031 1172415 -593286 -2811053 -2865210
42887b865210J824959J594830N03660Q2334l26183j626759k409620q90223J544965
$$ -2865210 -1040251 554579 1058239 1140573 814390 -812369 -3221989 -4112212 -2567247
42878b567247J769293j72612q60851R69571K106147Q439k802126k480295K94350
$$ -2567247 -797954 -970566 -1831417 -861846 1244301 1252740 -1549386 -4029681 -3735331
42869c735331J768042R88048L64966R35625J034238M5856k10938J070192J991679
$$ -3735331 -1967289 -979241 -614275 321350 1355588 1401444 1190506 2260698 4252377
42860D252377J068354o16149j658018k156671k006205k21581K287938K253843
$$ 4252377 5320731 4704582 3046564 889893 -1116312 -1337893 950045 3203888
42852C203888j155295l775211j845170K222539L184130N55240j316099j57442
$$ 3203888 2048593 -1726618 -3571788 -1349249 1834881 2390121 1074022 916580
42844I16580J638584J798265J309503J261237K65965k476723m329976k505385
$$ 916580 2555164 4353429 5662932 6924169 7190134 4713411 383435 -2121950
42836b121950J354479K862335N94821k376134k643526j55785K552288L283309
$$ -2121950 -767471 2094864 2689685 313551 -2329975 -2485760 66528 3349837
42828C349837J841225k42494j246817r96874r30143j950069k855749j937955M25058
$$ 3349837 5191062 4948568 3701751 2704877 1774734 -175335 -3031084 -4969039 -4543981
42819d543981K176283K306233J602337P43758n03089j771074j689736k3004J353760
$$ -4543981 -2367698 -61465 1540872 2284630 1781541 10467 -1679269 -1702273 -348513
42810c48513R11415l46998n53645K82196Q12620P32090P80201R29721M98742j90962
$$ -348513 562902 215904 -337741 -55545 757075 1489165 2269366 3199087 3697829 3506867
42800C506867j98811Q1384n89945j704043j181744J169401K630009J265197j280141
$$ 3506867 3308056 3389440 2799495 1095452 -86292 1083109 3713118 4978315 3698174
42791C698174k297632j707770j260747j242417l59206J418215K164722O99292
$$ 3698174 1400542 -307228 -1567975 -2810392 -3169598 -1751383 413339 1112631
42783A112631j561315k293094j020222N79955Q89750K50186K21555J065117R87899
$$ 1112631 -448684 -2741778 -3762000 -3182045 -2292295 -2042109 -1820554 -755437 232462
42774B32462j137715l218130k133190J603374L872286K469866P1153l474J341005
$$ 232462 -905253 -4123383 -6256573 -4653199 -780913 1688953 1760106 1756632 3097637
42765C097637R18855j490735k930082j835722k5031J89305j214470k512033k114274
$$ 3097637 4016492 2525757 -404325 -2240047 -2265078 -2075773 -3290243 -5802276 -7916550
42756g916550K36639K954704L527745J219356j551122j869949J78065K087332
$$ -7916550 -7679911 -4725207 -1197462 21894 -1529228 -3399177 -3221112 -1133780
42748a133780K238304R81226p19791j802706j116420R81109J937505K38189j764203
$$ -1133780 1104524 2085750 1365959 -436747 -1553167 -572058 1365447 1603636 -160567
42739a60567j068739J075000J108551p35693o87765J960836L187878N93625k808335
$$ -160567 -1229306 -154306 954245 218552 -469213 1491623 4679501 5273126 2464791
42730B464791l327486j570277k18107J37370L02199J33114m75554k82479J205070
$$ 2464791 -862695 -2432972 -2651079 -2513709 -2211510 -2078396 -2553950 -2836429 -1631359
42721a631359K111542Q68738j180725j880373j252944m65836L91459J461903J779777
$$ -1631359 480183 1348921 168196 -1712177 -2965121 -3430957 -3039498 -1577595 202182
42712B02182Q55632N9328N14054J163961P07886k18685n25547n59665q29386p10362
$$ 202182 1057814 1117142 1631196 2795157 3503043 3284358 2758811 2199146 1369760 659398
42702F59398k5933J12670n24053o69570l63201j203331k357958m93963L938489
$$ 659398 633465 746135 222082 -447488 -810689 -2014020 -4371978 -4865941 -927452
42693i27452N153873M84703m366472l440689N38724J340067o23833n43006J361029
$$ -927452 4226421 4711124 344652 -3096037 -2557313 -1217246 -1841079 -2384085 -1023056
42684a023056Q61652j367725m96253K941420K897296j623929m194908j492416
$$ -1023056 -161404 -1529129 -2025382 916038 3813334 2189405 -2005503 -3497919
42676c497919J661549J031591o11363O5649Q14347q96616k226219j62435K364104
$$ -3497919 -1836370 -804779 -1416142 -1350493 -536146 -1432762 -3658981 -3821416 -1457312
42667a457312J323333j296477r97894J651322K660583J472884O41632M47296p97844
$$ -1457312 -133979 -1430456 -2428350 -777028 1883555 3356439 3998071 4445367 3647523
42658C647523k316288j828012j30316j1191j254745j238258J05477M98342M3208
$$ 3647523 1331235 -496777 -627093 -638284 -1893029 -3131287 -3025810 -2527468 -2484260
42649b484260R52299K558194J573168j912980l502890j070005K023582K243631
$$ -2484260 -1531961 1026233 2599401 686421 -2816469 -3886474 -1862892 380739
42641C80739N98701k80846l78271q08108q31830N24807J760668R03126r68067
$$ 380739 979440 698594 320323 -487785 -1319615 -794808 965860 1868986 900919
42632I00919j149660L83065R86664l32295j317382J8746K416559L252510J988739
$$ 900919 -248741 134324 1120988 788693 -528689 -509943 1906616 5159126 7147865
42623G147865K05739r77984j822655k521370k564406j977506j680536j759986
$$ 7147865 7353604 6375620 4552965 2031595 -532811 -2510317 -4190853 -5950839
42615e950839p61181J966531M333480L713079N10532k297338k870191j868074
$$ -5950839 -6712020 -4745489 -412009 3301070 3811602 1514264 -1355927 -3224001
42607c224001l59881J346828K519113J983903J31463r87703l96838P00826J108428
$$ -3224001 -3583882 -2237054 282059 2265962 2397425 1409722 1012884 1713710 2822138
42598B822138R25571J27151j672770l187175k039629J204680K599386M41422j704154
$$ 2822138 3747709 3874860 2202090 -985085 -3024714 -1820034 779352 1220774 -483380
42589d83380l71807K283206J991698q09348j982588l53761J069918M17298o05918
$$ -483380 -855187 1428019 3419717 2610369 627781 274020 1343938 1761236 1155318
42580A155318k63097O40447P62658J51241p15043j595292j667528k39228J388143
$$ 1155318 892221 1532668 2295326 2446567 1731524 136232 -1531296 -1770524 -382381
42571c82381J114537n99089j154169j9792M08090r53748j836075m32037J474518
$$ -382381 732156 133067 -1021102 -1040894 -632804 -1586552 -3422627 -3854664 -2380146
42562b380146J356951k01243q70796k42956K61351J01421o7786j80901p44497
$$ -2380146 -1023195 -1224438 -2095234 -2338190 -2076839 -1975418 -2043204 -2224105 -2968602
42553b968602j306574q29524M64055J299035J436932J886732K757902K612698
$$ -2968602 -4275176 -5104700 -4640645 -3341610 -1904678 -17946 2739956 5352654
42545E352654P33101j415004k154704j935008k175352k509774j242259J359865
$$ 5352654 6085755 4670751 2516047 581039 -1594313 -4104087 -5346346 -3986481
42537c986481K526062R09379r21384K8456K574193K946919L77578k055529k388255
$$ -3986481 -1460419 -551040 -1472424 -1443968 1130225 4077144 4454722 2399193 10938
42528A0938k154930k567958j772429J526321M418566L253184p33449k792924j108786
$$ 10938 -2143992 -4711950 -6484379 -4958058 -539492 2713692 1980243 -812681 -1921467
42519a921467J444285K002607R98570L6341o96767j454544j350448M53475K798323
$$ -1921467 -477182 1525425 2523995 2560336 1863569 409025 -941423 -487948 2310375
42510B310375L189389N31005l227305m536174j879549K103057L279797J053572
$$ 2310375 5499764 6030769 2803464 -1732710 -3612259 -1509202 1770595 2824167
42502B824167j054611o04566M49429m71534k012830j224170J332578K532697J718403
$$ 2824167 1769556 1164990 1614419 1142885 -869945 -2094115 -761537 1771160 3489563
42493C489563Q81106M09761j070041k591007j234663K366182L484139J85871l378096
$$ 3489563 4370669 4780430 3710389 1119382 -115281 2250901 5735040 5920911 2542815
42484B542815l133005p76937r9313q48509k85247J362528J412210k39820p80530
$$ 2542815 -590190 -1367127 -1466440 -2314949 -2600196 -1237668 174542 -65278 -845808
42475h45808P05202J745611P35106l63189P29695K722117K330290r89730l935872
$$ -845808 -140606 1605005 2340111 1976922 2706617 5428734 7759024 6769294 2833422
42466B833422l424843l63932J802433J567098N79354K99459k09153j724910k344836
$$ 2833422 -591421 -955353 847080 2414178 2993532 3292991 3083838 1358928 -985908
42457i85908k50278K397378J781944j720455l651050j884334O61702R19490j36284
$$ -985908 -1236186 1161192 2943136 1222681 -2428369 -4312703 -3651001 -2731511 -2867795
42448b867795j12806Q55651J156391O14791J21587j36678l22838k55328l14941
$$ -2867795 -2980601 -2124950 -968559 -353768 -232181 -368859 -691697 -947025 -1261966
42439a261966j255339k096653o39600K630472M057266K041839l61273m01148J63412
$$ -1261966 -2517305 -4613958 -5253558 -2623086 1434180 3476019 3114746 2713598 2877010
42430B877010j077220k420788j196699J047640J086194l61193l79939M94903l37561
$$ 2877010 1799790 -620998 -1817697 -770057 316137 -45056 -424995 69908 -267653
42421b67653j759118l73498K655875K395043j536785l565753q24835K545063K326759
$$ -267653 -2026771 -2400269 255606 2650649 1113864 -2451889 -3276724 -731661 1595098
42412A595098J80503n95465n09943j165082j134135J031265K830299J408583j284815
$$ 1595098 1775601 1180136 670193 -494889 -1629024 -597759 2232540 3641123 2356308
42403B356308j426443N39604J228695K48209M7847P57041M3426k018412k627677
$$ 2356308 929865 1469469 2698164 2946373 2994220 3751261 3794687 1776275 -851402
42394h51402j257416n44570j319945j090067J095776K443530J151485m53694j02819
$$ -851402 -2108818 -2653388 -3973333 -5063400 -3967624 -1524094 -372609 -826303 -929122
42385i29122N44602o20445j803891l03938K291122K210289l10428j344161L42487
$$ -929122 -384520 -1004965 -2808856 -3112794 -821672 1388617 1078189 -265972 76515
42376G6515J512440j7982j932521j355648P74260J649177P90382k07388p13135
$$ 76515 1588955 1570973 -361548 -1717196 -942936 706241 1496623 1289235 576100
42367E76100j269158j496453l14618J727828K491203J132874o96702j269661j040271
$$ 576100 -693058 -2189511 -2504129 -776301 1714902 2847776 2151074 881413 -158858
42358a58858j464793k485187k505687p18104J652687K800957K354480J333886
$$ -158858 -1623651 -4108838 -6614525 -7332629 -5679942 -2878985 -524505 809381
42350H09381M95321l51482j212909j138258N23453K655390L321982K082014K65654
$$ 809381 1304702 953220 -259689 -1397947 -874494 1780896 5102878 7184892 7450546
42341G450546j043037k001646k713363k423574q87062O20668P87769P507l96950
$$ 7450546 6407509 4405863 1692500 -731074 -1618136 -997468 -209699 -202192 -599142
42332e99142n0330L87239M58058K11887k96780q82108r78618l24422N37165J079417
$$ -599142 -649472 -262233 195825 407712 110932 -771176 -1749794 -2074216 -1537051 -457634
42322d57634J418357J463744N15249j297939k383117j837606r93699j156659j190851
$$ -457634 960723 2424467 2939716 1641777 -741340 -2578946 -3572645 -4729304 -5920155
42313e920155L56691J999645J257398p98535n87915K094352L083535J75934l057680
$$ -5920155 -5563464 -3563819 -2306421 -3104956 -3692871 -1598519 1485016 1660950 -1396730
42304a396730k283643J423976L515572K406627O31005J60872o2443j256332k202578
$$ -1396730 -3680373 -2256397 1259175 3665802 4296807 4457679 4395236 3138904 936326
42295I36326j247740O50649J003043m15380r45287R56539K876094J608601j782598
$$ 936326 -311414 339235 1342278 926898 -18389 938150 3814244 5422845 3640247
42286C640247k988967p89124J044669k06757j777611k50279K172467R74727k782073
$$ 3640247 651280 -137844 906825 700068 -1077543 -1327822 844645 1819372 -962701
42277i62701l499349J08251K920086J453509j387798j910006j022669r05258o85053
$$ -962701 -4462050 -4353799 -1433713 19796 -1368002 -3278008 -4300677 -5205935 -5890988
42268e890988P84568J623467N24354J85309K533296L794341l0562n231775m540343
$$ -5890988 -5106420 -3482953 -2958599 -2773290 -239994 3554347 3523785 -1707990 -6248333
42259f248333J751091N705664L364057k98524j88677J362956j75109l465581l590224
$$ -6248333 -4497242 1208422 4572479 4273955 4085278 5448234 5273125 1807544 -1782680
42250a782680j4714K676461J506195j369036k448687j381226l99913q02068j431318
$$ -1782680 -1797394 879067 2385262 1016226 -1432461 -2813687 -3213600 -4015668 -5446986
42241e446986n31317J687688L023216K006431j19180j046987m57526j5043n33817
$$ -5446986 -5978303 -4290615 -1267399 739032 619852 -427135 -884661 -899704 -1433521
42232a433521q89964j35039R41134J158467N86829j7453l61576l68890K27067
$$ -1433521 -2323485 -2458524 -1517390 -358923 227906 210453 -151123 -520013 -292946
42223b92946J102833J045495m24841j735208q84460J677398L024347J173247k192401
$$ -292946 809887 1855382 1430541 -304667 -1189127 488271 3512618 4685865 2493464
42214B493464l357635r33786K371815L010402Q59060j074781r04387N0571n8954
$$ 2493464 -864171 -1797957 573858 3584260 4443320 3368539 2464152 2514723 2455769
42205B455769q34627r27686n26968o24427q36757j05953R62459O50854j040039
$$ 2455769 1621142 693456 166488 -457939 -1294696 -1400649 -438190 212664 -827375
42196h27375k134946j517525k28870M90699Q15895J331280J763408J568378R50946
$$ -827375 -2962321 -4479846 -4708716 -4218017 -3402122 -2070842 -307434 1260944 2211890
42187B211890N87606P13002P96822M3268j500710k270781o63449K260054L099299
$$ 2211890 2799496 3512498 4309320 4352588 2851878 581097 -82352 2177702 5277001
42178E277001M96975k411514k064464L76862Q23268j561423l377110k363884l62635
$$ 5277001 5773976 3362462 1297998 1674860 2498128 936705 -2440405 -4804289 -5166924
42169e166924J72339l06915l0421J212999K460039L125337K747595P88721j957300
$$ -5166924 -4994585 -5301500 -5331921 -4118922 -1658883 1466454 4214049 5002770 3045470
42160C045470l300333k345084p44762R635P68154K476343L538666J906615j213889
$$ 3045470 -254863 -2599947 -3344709 -3335074 -2566920 -90577 3448089 5354704 4140815
42151D140815k428548p94430R93737N39874j113364j352047K73595J613311R68965
$$ 4140815 1712267 917837 1911574 2451448 1338084 -13963 259632 1872943 2841908
42142B841908o31771q84262N49735J399531r3114k416036k524522k2942K081231
$$ 2841908 2210137 1325875 1875610 3275141 3182027 765991 -1758531 -1781473 299758
42133B99758J307381j073215j856473q9467J929205J760278k06247j534753j005264
$$ 299758 1607139 533924 -1322549 -1412016 517189 2277467 2071220 536467 -468797
42124d68797r89j38391n79155O29043K832985K829105m16287l502889l015340
$$ -468797 -469786 -608177 -1187332 -558289 2274696 5103801 4687514 1184625 -1830715
42115a830715k33579J177618O22086M72413J412777J549381K18091q14860n92594
$$ -1830715 -2064294 -886676 -264590 207823 1620600 3169981 3388072 2573212 1980618
42106A980618k81574m83529k83975J60986o89387k342872j969880Q19909K388526
$$ 1980618 1699044 1215515 931540 1092526 403139 -1939733 -3909613 -3089704 -701178
42097g01178N64617j651894r07769J041163N34517j637252j566100J221457L083944
$$ -701178 -136561 -1788455 -2696224 -1655061 -1120544 -2757796 -4323896 -3102439 -18495
42088a8495K129604O07613N78346Q13853l48482j861332j804148n93692k07277
$$ -18495 2111109 2718722 3297068 4110921 3762439 1901107 96959 -496733 -704010
42079g04010j071633j642587r31015J14270K00936l83000l38051N99749J327587
$$ -704010 -1775643 -3418230 -4349245 -4234975 -4034039 -4417039 -4755090 -4155341 -2827754
42070b827754J249799J202814J710465J607553o0059j751692j177092J124377
$$ -2827754 -1577955 -375141 1335324 2942877 2882818 1131126 -45966 1078411
42062A078411K321809J374673M6607m27021q60751j532513j065773O39005J143786
$$ 1078411 3400220 4774893 4821500 4394479 3533728 2001215 935442 1574447 2718233
42053B718233q72536l077217k784593p31613O80813R92139J143345J072153L62300
$$ 2718233 1845697 -1231520 -4016113 -4747726 -4066913 -3074774 -1931429 -859276 -496976
42044d96976j32907L12240O45310j8306m40901L64299O83051j092309k967979
$$ -496976 -629883 -317643 327667 309361 -131540 232759 915810 -176499 -3144478
42035c144478k014476Q37913K190096J312997L24082J17372j45882j68668R35051
$$ -3144478 -5158954 -4321041 -2130945 -817948 -493866 -376494 -522376 -691044 244007
42026B44007J681538p1212k656040k240301Q88288K366329P79305l47930R12940
$$ 244007 1925545 1854333 -801707 -3042008 -2153720 212609 991914 643984 1556924
42017A556924J487784q92120l095712j531006J834267K518620K14460j603756
$$ 1556924 3044708 2152588 -943124 -2474130 -639863 1878757 2093217 489461
42009D89461j268466l54209k13021l05087M1891N14849N47012j47809j308009
$$ 489461 -779005 -1133214 -1346235 -1651322 -1609431 -1094582 -547570 -695379 -2003388
42000b003388j616881J91480K833672L145049O27151j168449J38644J875782O40623
$$ -2003388 -3620269 -3428789 -595117 2549932 3177083 2008634 2147278 4023060 4663683
41991D663683k009034k124228J57859J220608J89015j98739R87751J284941l21653
$$ 4663683 2654649 530421 688280 1908888 2097903 1899164 2886915 4171856 3850203
41982C850203j293502m889J424723Q53633n68631j057224j172842j658736j127603
$$ 3850203 2556701 2551812 3976535 4830168 4261537 3204313 2031471 372735 -754868
41973g54868J147713K619494J033254j384774j055959J106869J123666j532803
$$ -754868 392845 3012339 4045593 2660819 1604860 2711729 3835395 2302592
41965B302592l258374k321898j106226j231529p16188J792302L627877K079999
$$ 2302592 -955782 -3277680 -4383906 -5615435 -6331623 -4539321 -911444 1168555
41957A168555q71876j329576O27348J438419k05091j646461o52867J409907J889106
$$ 1168555 296679 -1032897 -405549 1032870 827779 -818682 -1471549 -61642 1827464
41948A827464L56891j394236j713943n48085Q28468J090997K54248l76298r7765
$$ 1827464 2184355 790119 -923824 -1471909 -643441 447556 701804 325506 227741
41939B27741J21758n49492j012548o400J231008M93718j577194k010164r1144
$$ 227741 349499 -199993 -1212541 -1218941 12067 505785 -1071409 -3081573 -3172717
41930c172717J481211Q75312l42194l68104l5075m64612l91248J428014L037908
$$ -3172717 -1691506 -816194 -1158388 -1526492 -1561567 -2026179 -2417427 -989413 2048495
41921B048495J674667j742449l623927k742892j282686q72855m94236R93802K659843
$$ 2048495 3723162 1980713 -1643214 -4386106 -5668792 -6541647 -7035883 -6042081 -3382238
41912c382238K917476J509479p08394k597598k890431j062932J388121K092991
$$ -3382238 -464762 1044717 336323 -2261275 -5151706 -6214638 -4826517 -2733526
41904b733526Q52471q0466N38430J120704J50919r86516j67698J763791K026029
$$ -2733526 -1881055 -1961521 -1423091 -302387 -151468 -1137984 -1305682 458109 2484138
41895B484138K47320q73761K33881J596414Q31881j202295j907795r30121k40136
$$ 2484138 2731458 1857697 2091578 3687992 4519873 3317578 1409783 479662 239526
41886B39526n50126k32216J501429K656706J250606j550489k953499k214335r09752
$$ 239526 -310600 -542816 958613 3615319 4865925 3315436 361937 -1852398 -2762150
41877b762150j99751J77072M35184K71717Q164M50058J359676J653984J273787
$$ -2762150 -2961901 -2784829 -2349645 -2077928 -2069764 -1619706 -260030 1393954 2667741
41868B667741J148605J136401J566k031602k776695j139278J055753J436500q3623
$$ 2667741 3816346 4952747 4954313 2922711 146016 -993262 62491 1498991 1415368
41859A415368j823185k388637j331135R50219L035586L300076J601960p45292
$$ 1415368 -407817 -2796454 -4127589 -3177370 -141784 3158292 4760252 4014960
41851D014960k701719l779806k978279J40006L246187L075038R1856j748824p75977
$$ 4014960 1313241 -2466565 -5444844 -5304838 -2058651 1016387 1108243 -640581 -1416558
41842a416558L62955k34404o15268Q05234J890263Q27276q7824J440521K976867
$$ -1416558 -1053603 -1288007 -1903275 -1098041 792222 1619498 1531674 2972195 5949062
41833E949062J165775k232719k877245o25110R67735O12196M3387k32249j235957
$$ 5949062 7114837 4882118 2004873 1379763 2347498 2959694 3003081 2770832 1534875
41824A534875k118940j032187R27881J048258p8890M44179K133723J461057j718734
$$ 1534875 -584065 -1616252 -688371 359887 280997 725176 2858899 4319956 2601222
41815B601222l161042q55096J935202J842063l50099k145340k482589j158667
$$ 2601222 -559820 -1414916 520286 2362349 2012250 -133090 -2615679 -3774346
41807c774346J495272L322550K111426o12115j166089M96068Q37704q70433j251296
$$ -3774346 -2279074 1043476 3154902 2542787 1376698 1872766 2710470 1840037 588741
41798E88741P85737J729108k09647j684683j79318J470018K57053j527294l11089
$$ 588741 1374478 3103586 2893939 1209256 1029938 2499956 2757009 1229715 918626
41789I18626K567025L068727N71359k092997k961955k118185k23821J417912J076609
$$ 918626 3485651 6554378 7125737 5032740 2070785 -47400 -271221 1146691 2223300
41780B223300q82327j676185j35307J514741J642626J673112K397101J639789
$$ 2223300 1340973 -335212 -470519 1044222 2686848 4359960 6757061 8396850
41772H396850j459269l656172k606863j010302j816153k852056p95628K581329
$$ 8396850 6937581 3281409 674546 -335756 -2151909 -5003965 -5799593 -3218264
41764c218264L103264P54775j213980j643908j364671N2748K692124L620492Q31241
$$ -3218264 -115000 639775 -574205 -2218113 -3582784 -3530036 -837912 2782580 3613821
41755C613821k192967j099782K160697K465663j5514q24184N60909L58671j924398
$$ 3613821 1420854 321072 2481769 4947432 4931918 4107734 4668643 5027314 3102916
41746C102916k451407k85377Q90299m12943j112452K75294R56471m40924r80520
$$ 3102916 651509 366132 1256431 843488 -268964 6330 962801 521877 -458643
41737d58643J080794K797393J483542j062249k134976k120751k175580j462339
$$ -458643 622151 3419544 4903086 3840837 1705861 -414890 -2590470 -4052809
41729d052809N09581J900768J460680O28594O23148M14328m45775k32840J538475
$$ -4052809 -3543228 -1642460 -181780 446814 1069962 1484290 1038515 805675 2344150
41720B344150K380212Q39735r46437j074703r49454j910748k124046M1173K454110
$$ 2344150 4724362 5564097 4617660 3542957 2593503 682755 -1441291 -1400118 1053992
41711A053992K334567M65649p68641j153585j460847j004256M46419P98497r33948
$$ 1053992 3388559 3854208 3085567 1931982 471135 -533121 -86702 711795 -222153
41702b22153j837151N01508L224794K218054j072598j762209O91374K037371M14346
$$ -222153 -2059304 -1557796 1666998 3885052 2812454 1050245 1741619 3778990 4193336
41693D193336j149025l48967Q76906K87262r02073n69186O08213M66437j161161
$$ 4193336 3044311 2695344 3572250 3859512 2957439 2388253 2996466 3462903 2301742
41684B301742k391554j989435o13133L31809K03960l62534j40644J262277K702513
$$ 2301742 -89812 -2079247 -2692380 -2360571 -2156611 -2519145 -2659789 -1397512 1305001
41675A305001K625992P43807j768839l351347k989052q27448J510862K037587
$$ 1305001 3930993 4674800 2905961 -445386 -3434438 -4261886 -2751024 -713437
41667g13437N93791q79939r27613k39704J54132P59921K103179K788077J262587
$$ -713437 -119646 -999585 -1927198 -2166902 -2012770 -1252849 850330 3638407 4900994
41658D900994j345316k439176j542319m33725N9583R73640K572182L112758J331046
$$ 4900994 3555678 1116502 -425817 -859542 -799959 173681 2745863 5858621 7189667
41649G189667j362201k383768r72617J121152J630423J08133j600585j367670
$$ 7189667 5827466 3443698 2471081 3592233 5222656 5330789 3730204 2362534
41641B362534N94433J788610N95545j587298k347553j422537l88712Q5893P56961
$$ 2362534 2956967 4745577 5341122 3753824 1406271 -16266 -404978 -319085 437876
41632D37876J659361J413495o02626k707929k575561R582K715451L007814P67324
$$ 437876 2097237 3510732 2908106 200177 -2375384 -2365802 349649 3357463 4124787
41623D124787j621117k019394r89081o47601j402860j444760K02331K028094K420406
$$ 4124787 2503670 484276 -504805 -1152406 -2555266 -4000026 -3797695 -1769601 650805
41614F50805J906220J623761J239496J29091q61327q10333n51468j018858j119117
$$ 650805 2557025 4180786 5420282 5549373 4688046 3877713 3326245 2307387 1188270
41605A188270L29149J844507J361774k305L75152J830546J157977j746266l084886
$$ 1188270 1517419 3361926 4723700 4721395 5096547 6927093 8085070 6338804 3253918
41596C253918j084629J159286O50112j150894j491888r54638j669809k876811
$$ 3253918 2169289 3328575 3978687 2827793 1335905 381267 -1288542 -4165353
41588d165353j872902J337566L625425L130623J398763M68091L9824j158963k598618
$$ -4165353 -6038255 -4700689 -1075264 2055359 3454122 3922213 3962037 2803074 204456
41579B04456k261526L82757L027789K980660N23170j326807p23729O27030J26466
$$ 204456 -2057070 -1674313 1353476 4334136 4857306 3530499 2806770 3433800 3560266
41570C560266j809265k451741r02063P97483R47445K74922n1190k96094q08120
$$ 3560266 1751001 -700740 -1602803 -805320 142125 417047 365857 69763 -738357
41561g38357p23595M18753J335436Q68646j76332o01778p33408j010287k83566
$$ -738357 -1461952 -1043199 292237 1160883 984551 382773 -350635 -1360922 -1644488
41552a644488K136191M062660K897118k33540j785481r68744m54445j639491k546354
$$ -1644488 491703 4554363 7451481 7217941 5432460 4463716 4009271 2369780 -176574
41543a76574j602061l93759o52692j026579N05209K730607K708624L77913j299406
$$ -176574 -1778635 -2172394 -2825086 -3851665 -3346456 -615849 2092775 2470688 1171282
41534A171282q09482P2556l54505j012619k51663J075430R00420n56995q64303
$$ 1171282 361800 434356 79851 -932768 -1184431 -109001 791419 234424 -629879
41525f29879R40410K758041K365454M17543p97445o08268l37561q03096j175695
$$ -629879 310531 3068572 5434026 5851569 5054124 4445856 4108295 3305199 2129504
41516B129504o49039K01396M41207R6349l24018p44865j164021j180377p36883
$$ 2129504 1480465 1681861 2123068 2219417 1895399 1150534 -13487 -1193864 -1930747
41507a930747n39963q07325m93357J029779K409843K010760M63436l58209l92443
$$ -1930747 -2470710 -3278035 -3771392 -2741613 -331770 1678990 2142426 1784217 1391774
41498A391774j120208k355081k040921O3909J291348J70405q79412P58298L426942
$$ 1391774 271566 -2083515 -4124436 -4060527 -2769179 -2598774 -3478186 -2719888 707054
41489G07054L277809j56266l322797l355992q98412J856466L512970L393556J386489
$$ 707054 3984863 3828597 505800 -2850192 -3748604 -1892138 1620832 5014388 6400877
41480F400877j152818k075873j007116J50263M9314l18380K73226R48892J17107
$$ 6400877 5248059 3172186 2165070 2315333 2364647 2046267 2319493 3268385 3385492
41471C385492j755748k520256j292706L72097N19890q07928j605602j57168K836309
$$ 3385492 1629744 -890512 -2183218 -1811121 -1291231 -2099159 -3704761 -3861929 -1025620
41462a025620M606517L204128j73377k456101k166016o48917J22075k58187r39541
$$ -1025620 3580897 6785025 6611648 4155547 1989531 1340614 1462689 1204502 264961
41453B64961j155957p34940j26274j41409p66069m80605J710903L865005L044284
$$ 264961 -890996 -1625936 -1752210 -1893619 -2659688 -3140293 -1429390 2435615 5479899
41444E479899j15047j667366j16091J329691R1374j557901o34068J147184K65421
$$ 5479899 5364852 3697486 3581395 4911086 5002460 3444559 2810491 3957675 4223096
41435D223096k217962j979170J463906L750596K295721m25968j432700j192011
$$ 4223096 2005134 25964 1489870 5240466 7536187 7110219 5677519 4485508
41427D485508j243752j225214n04903j40856r08279j482158p44415K9115m79396
$$ 4485508 3241756 2016542 1511639 1370783 462504 -1019654 -1764069 -1734954 -2214350
41418b214350q78183P62261L267578L630312J350038j009992j527997r49938o65173
$$ -2214350 -3092533 -2330272 937306 4567618 5917656 4907664 3379667 2429729 1764556
41409A764556o13956j55571K47480m77864k086445k671071q96246J847344K644831
$$ 1764556 1150600 995029 1242509 764645 -1321800 -3992871 -4889117 -3041773 -396942
41400c96942P42205j246452q25164R90028J508037N11340Q5816P91906R15993
$$ -396942 345263 -901189 -1726353 -736325 771712 1283052 1368868 2160774 3076767
41391C076767j86799r16590m24081m2945n82997q18785o6450L27270k72798j59801
$$ 3076767 2889968 1973378 1549297 1506352 923355 104570 38120 365390 92592 -67209
41381f7209J562583K681696J181065j337324k191936j598210j242464p86525Q40351
$$ -67209 1495374 4177070 5358135 4020811 1828875 230665 -1011799 -1798324 -957973
41372i57973K158352R54333j402853j378760J082881K195084K36855j826790j092070
$$ -957973 1200379 2154712 751859 -626901 455980 2651064 2887919 1061129 -30941
41363c0941R71023J107194q49700k077772r22589J051484J350732k23674j344823
$$ -30941 940082 2047276 1197576 -880196 -1802785 -751301 599431 375757 -969066
41354i69066j45312K168505K614686L23640k248732k584876j096841K11342N95343
$$ -969066 -1114378 1054127 3668813 3992453 1743721 -841155 -1937996 -1726654 -1131311
41345a131311N54037J73510p34136j602398j736513j279816m58978R66545K390361
$$ -1131311 -577274 -403764 -1137900 -2740298 -4476811 -5756627 -6215605 -5249060 -2858699
41336b858699K211747N15804j24574J481182K709047J158343j176791j105293
$$ -2858699 -646952 -131148 -255722 1225460 3934507 5092850 3916059 2810766
41328B810766M59409L91815j062071j086459L42837O63791j81508K17369J626509
$$ 2810766 3270175 3661990 2599919 1513460 1856297 2520088 2338580 2555949 4182458
41319D182458J196241r11776j228017O15789O86406k141524l418575m53619K664037
$$ 4182458 5378699 4466923 3238906 3854695 4541101 2399577 -1018998 -1472617 1191420
41310A191420J362674k218819k892886k98201J540384O86803r39247j337675m84396
$$ 1191420 2554094 335275 -2557611 -2855812 -1315428 -628625 -1567872 -2905547 -3389943
41301c389943Q68190J801574J207801q15345k330385j862128j76006J385284K505681
$$ -3389943 -2521753 -720179 487622 -327723 -2658108 -4520236 -4696242 -3310958 -805277
41292h05277K688900R75358j556545j877243M15555J733646R3711j471073k61088
$$ -805277 1883623 2858981 1302436 -574807 -159252 1574394 1668105 197032 -64056
41283f4056J086285p03832l141927j687092K366479L581401Q87298j374929p61064
$$ -64056 1022229 318397 -2823530 -4510622 -2144143 1437258 2324556 949627 188563
41274A88563L88944l0755q82399q48220l78732L23232J558312J945236p1012k294364
$$ 188563 577507 546752 -335647 -1183867 -1562599 -1239367 318945 2264181 2193169 -101195
41264a01195r13292K876326L495222m25233l422104j547571J805155J817224n17281
$$ -101195 -1014487 1861839 5357061 4931828 1509724 -37847 1767308 3584532 3067251
41255C067251j267468j63640K50929l64768l94287J04583m2019k92135K45908
$$ 3067251 1799783 1636143 1887072 1522304 1128017 1232600 1190581 898446 1144354
41246A144354R1634k051624l413804m57002M538062N259434M15265l886456k687362
$$ 1144354 1235988 -815636 -4229440 -4686442 -148380 5111054 5526319 1639863 -1047499
41237a047499J187667K002446p16653k721176j878051l39606j50106l66833L89510
$$ -1047499 140168 2142614 1425961 -1295215 -3173266 -3512872 -3662978 -4029811 -3640301
41228c640301J220880N70412r95218j483294l06346J144979J563627J071677M81620
$$ -3640301 -2419421 -1849009 -2844227 -4327521 -4633867 -3488888 -1925261 -853584 -371964
41219c71964L19490P21225J339384J275918J30464r06593l72099R74939Q35118
$$ -371964 -52474 668751 2008135 3284053 3414517 2507924 2135825 3110764 3945882
41210C945882r10150j444899O18615K448106R54139k287961l206399j240733L64382
$$ 3945882 3035732 1590833 2209448 4657554 5611693 3323732 117333 -1123400 -759018
41201g59018j9151n01536J56256K89677j030486j457867Q78026L535163K852380
$$ -759018 -778169 -1279705 -1123449 -833772 -1864258 -3322125 -2444099 1091064 3943444
41192C943444m76324k138367k10589K417222K199160o17636k834861k415353m90476
$$ 3943444 3467120 1328753 1118164 3535386 5734546 5116910 2282049 -133304 -623780
41183f23780N69180J66419j36881Q11318J823132R91374j363178k878096k272309
$$ -623780 -54600 111819 -25062 786256 2609388 3600762 2237584 -640512 -2912821
41174b912821p36746J24652K50543M51341J085781J972410K499890J639361o93269
$$ -2912821 -3649567 -3524915 -3274372 -2823031 -1737250 235160 2735050 4374411 3681142
41165C681142k293949q23739K381883L284041P43043j815423j731782p66449j107577
$$ 3681142 1387193 563454 2945337 6229378 6972421 5156998 3425216 2658767 1551190
41156A551190j224094O65851J975768n36784m272521l581597J363285M207684
$$ 1551190 327096 992947 2968715 2431931 -1840590 -5422187 -4058902 148782
41148A48782J845596j351752r54385J002282N20987j424612j192828P70456O10087
$$ 148782 1994378 642626 -311759 690523 1211510 -213102 -1405930 -635474 -25387
41139b5387k227920l685427j181150K731480M197870K760958N63200r99084j822405
$$ -25387 -2253307 -5938734 -7119884 -4388404 -190534 2570424 3133624 2134540 312135
41130C12135j652167k57607J314912J458396K47796l47002Q46802K196029J079266
$$ 312135 -1340032 -1597639 -282727 1175669 1423465 1076463 1923265 4119294 5198560
41121E198560k398021m760619l111902R88120L073890J301624j257219q57380
$$ 5198560 2800539 -1960080 -5071982 -4083862 -1009972 291652 -965567 -1822947
41113a822947J885002L174505J531603m86439n28556J72477o14716k065287j482022
$$ -1822947 62055 3236560 4768163 4281724 3753168 3925645 3310929 1245642 -236380
41104b36380J150162K633420J069996j518207k280033j294830n46263n83015l18092
$$ -236380 913782 3547202 4617198 3098991 818958 -475872 -1022135 -1605150 -1923242
41095a923242N66074J141704R74813M31827o47084k489784l493727j351656K966731
$$ -1923242 -1357168 -215464 759349 1191176 544092 -1945692 -5439419 -6791075 -3824344
41086c824344M925493K044276k216494k778175K06736J981558K53480j889899
$$ -3824344 1101149 3145425 928931 -1849244 -1642508 339050 592530 -1297369
41078a297369j129528J174541J557586q3979o73226R34525K073383M00479k392538
$$ -1297369 -2426897 -1252356 305230 221251 -451975 482550 2555933 2956412 563874
41069E63874k816502l38616K137275K254911P21986n39985r59576r79300n68606
$$ 563874 -2252628 -2591244 -453969 1800942 2522928 1982943 1023367 44067 -524539
41060e24539L91322J069474O55684r6966R3342Q13737N66400n68025r60287l03377
$$ -524539 -133217 936257 1591941 1494975 1588317 2402054 2968454 2400429 1440142 1136765
41050A136765j35821q63595p65722P58621J447538l04323k310029j572536J111819
$$ 1136765 1000944 137349 -628373 130248 1577786 1273463 -1036566 -2609102 -1497283
41041a497283K388093J245961k27813n46296l74955l82674k50386j13993n29595
$$ -1497283 890810 2136771 1908958 1362662 987707 605033 354647 240654 -288941
41032b88941p21602O05984K375818J871123r00055k493311r25106J514262J975982
$$ -288941 -1010543 -404559 1971259 3842382 2942327 449016 -476090 1038172 3014154
41023C014154Q94092N0783o60916j897867k369488p63503J209852Q48526j271278
$$ 3014154 3908246 3959029 3298113 1400246 -969242 -1732745 -522893 325633 -945645
41014i45645k107411q22353L61041j8272q48443q42482j37411J055449K888993
$$ -945645 -3053056 -3875409 -3514368 -3532640 -4381083 -5223565 -5360976 -4305527 -1416534
41005a416534M229825L086589j86313k430197j799778j63542J99548K1705Q70893
$$ -1416534 2813291 5899880 5713567 3283370 1483592 1320050 1519598 1541303 2412196
40996B412196J550677j15857k868676k967484J40343K487964J302807q62354j77443
$$ 2412196 3962873 3847016 978340 -1989144 -1848801 639163 1941970 1079616 902173
40987I02173K303774J994456k074703n071725k819596K237855M166505J292783
$$ 902173 3205947 5200403 3125700 -1946025 -4765621 -2527766 1638739 2931522
40979B931522k252031k631390p64781N19323R74626K062491L277141K505490k23048
$$ 2931522 679491 -1951899 -2716680 -2197357 -1222731 839760 4116901 6622391 6399343
40970F399343k235469k028562j135277j186176j357988l38004J019418J127986
$$ 6399343 4163874 2135312 1000035 -186141 -1544129 -1882133 -862715 265271
40962B65271N63034J116805K451468K190177l43513k730366k761155j358650q18104
$$ 265271 828305 1945110 4396578 6586755 6243242 3512876 751721 -606929 -1425033
40953a425033j387047j279669M50244K627420L524830K541475L03199j819342
$$ -1425033 -2812080 -4091749 -3641505 -1014085 2510745 5052220 5355419 3536077
40945C536077k262838n63750J620750J971433L89498q59443m43884J86627n97902
$$ 3536077 1273239 709489 2330239 4301672 4691170 3831727 3387843 3574470 2976568
40936B976568j801377j528340k90939j03734r35214r04581P3474J1841j182087
$$ 2976568 1175191 -353149 -644088 -747822 -1683036 -2587617 -2514143 -2502302 -3684389
40927c684389q78455J622183K979148Q47138j948352j579007Q20525J317752l46221
$$ -3684389 -4562844 -2940661 38487 885625 -1062727 -2641734 -1821209 -503457 -849678
40918h49678r44738L33305R33501P8338R1953J514138J495940j029660k827279
$$ -849678 -1794416 -1461111 -527610 -449272 -357319 1156819 2652759 1623099 -1204180
40909a204180j550914L99024K76176l08670J128006K729104J095413k547831l613157
$$ -1204180 -2755094 -2356070 -2079894 -2388564 -1260558 1468546 2563959 16128 -3597029
40900c597029q23622K490302L474247K447217O65858j089221j641256m21823O10765
$$ -3597029 -4420651 -1930349 1543898 3991115 4656973 3567752 1926496 1504673 2115438
40891B115438p29195k798096k004513J228575K554146M40281j563438p79825O83134
$$ 2115438 1386243 -1411853 -3416366 -2187791 366355 806636 -756802 -1536627 -853493
40882h53493K72157o97783r0546R67179M75992n33679m8017R85346L85283j075262
$$ -853493 -581336 -1279119 -1369665 -402486 73506 -460173 -508190 477156 862439 -212823
40872b12823q66678Q58987J609041Q81133O96576J720750K039718M37432j709869
$$ -212823 -1079501 -220514 1388527 2269660 2966236 4686986 6726704 7164136 5454267
40863E454267k615256k109370q27191Q01758K051609J929598M54649j115448j707144
$$ 5454267 2839011 729641 -97550 704208 2755817 4685415 5140064 4024616 2317472
40854B317472j290781m44549K0476n60621j566586j035933J684636L984489K807108
$$ 2317472 1026691 582142 602618 41997 -1524589 -2560522 -875886 3108603 5915711
40845E915711r03358k943312j261038J629838K276571L35353j911497k490681
$$ 5915711 5012353 2069041 808003 2437841 4714412 5049765 3138268 647587
40837F47587j213578O37803J352330L77454q39263n60004P52555J045170k48462
$$ 647587 -565991 71812 1424142 1801596 962333 402329 1154884 2200054 1951592
40828A951592j500912j540032j086582q94241l73336Q24906J480687M93730j163895
$$ 1951592 450680 -1089352 -2175934 -3070175 -3443511 -2618605 -1137918 -644188 -1808083
40819a808083j517625j2299K044755K921334J787408o39503k278220j413762J188086
$$ -1808083 -3325708 -3338007 -1293252 1628082 3415490 2775987 497767 -915995 272091
40810B72091K796574J905051n8110q27793p7504P68649O68386r7473p06728p39086
$$ 272091 3068665 4973716 4915606 4087813 4010309 4778958 5447344 5349871 4643143 3904057
40800C904057m48536l90679o29024m85237M02404J134114O27254n90803q88878
$$ 3904057 3455521 3064842 2435818 1950581 2352985 3487099 4114353 3523550 2634672
40791B634672J58356J196852R65048l95214j955359k761734k039953J8817J695983
$$ 2634672 2793028 3989880 4954928 4559714 2604355 -157379 -2197332 -2178515 -482532
40782d82532J381203k71369j268222j093886q11506o59609J44768J174838R41140
$$ -482532 898671 627302 -640920 -1734806 -2546312 -3205921 -3061153 -1886315 -945175
40773i45175k83465l94159J025861J698275K23946j755213k161984j020297O82249
$$ -945175 -1228640 -1622799 -596938 1101337 1325283 -429930 -2591914 -3612211 -2929962
40764b929962K329979K834499J040060j790882k580594q39795M53469j95316m28809
$$ -2929962 -599983 2234516 3274576 1483694 -1096900 -1936695 -1483226 -1678542 -2107351
40755b107351J315447K532773J061431o69547L84117K428457J575885j912972
$$ -2107351 -791904 1740869 2802300 2132753 2516870 4945327 6521212 4608240
40747D608240m243362l521695q80554K334928M826981M406567P48323k383059
$$ 4608240 364878 -3156817 -4037371 -1702443 3124538 7531105 8279428 5896369
40739E896369j677999N63254J99822j688013r31489J863384J967625j076479k403778
$$ 5896369 4218370 4781624 4981446 3293433 2361944 4225328 6192953 5116474 2712696
40730B712696k94405R21067j213762k668857R2679L707009L031711j056299l631809
$$ 2712696 2418291 3339358 2125596 -543261 -450582 3256427 6288138 5231839 1600030
40721A600030k950391j297632k17086J003830K633920L508835K788817P62267
$$ 1600030 -1350361 -2647993 -2865079 -1861249 772671 4281506 7070323 7832590
40713G832590j754237l495978l181174j200650K53815L1238l56040O73554K077416
$$ 7832590 6078353 2582375 -598799 -1799449 -1545634 -1514396 -1870436 -1196882 880534
40704H80534J864646K78891n98798J72329J327332J066251j011007l271980l208094
$$ 880534 2745180 3024071 2425273 2597602 3924934 4991185 3980178 708198 -2499896
40695b499896j79766L025471K885449m85169l402826l220586q73685J373469K383551
$$ -2499896 -2679662 345809 3231258 2746089 -656737 -3877323 -4751008 -3377539 -993988
40686i93988J901099L03973p83634k2151J133139K25185j726170j198090J733998
$$ -993988 907111 1211084 427450 405299 1538438 1763623 37453 -1160637 573361
40677E73361K675557p2663k407455r94954J493142J247037o46600j303757j548962
$$ 573361 3248918 3176255 768800 -226154 1266988 2514025 1867425 563668 -985294
40668i85294l263024m125160q13348M196792M990327R72335k268555j294231J089581
$$ -985294 -4248318 -8373478 -9186826 -4990034 293 972628 -1295927 -2590158 -1500577
40659a500577J292265k2420l69344M84963J112305Q98646K07294m45109l95058
$$ -1500577 -208312 -230732 -600076 -115113 997192 1895838 2103132 1658023 1262965
40650A262965O11384J412235N27549j462069k328559j274224J24457M08345L288
$$ 1262965 1874349 3286584 3814133 2352064 23505 -1250719 -1126262 -717917 -714629
40641g14629r837N27699J088878J301020J173126J039482J172550J089689m4775
$$ -714629 -724466 -196767 892111 2193131 3366257 4405739 5578289 6667978 6623203
40632F623203j828911k591034j690741m35330J53416O51066J207464N46794j316013
$$ 6623203 4794292 2203258 512517 77187 230603 881669 2089133 2635927 1319914
40623A319914j884865J9038J804228J151344j74575J35920L88566j811232m082369
$$ 1319914 -564951 -545913 1258315 2409659 2235084 2371004 2759570 948338 -3134031
40614c134031k323839K128942L886151J536453j070104j528283j388039j410254
$$ -3134031 -5457870 -3328928 557223 2093676 1023572 -504711 -1892750 -3303004
40606c303004J03753K808824L350540R56392o66176O58618K015078N62278j695561
$$ -3303004 -3199251 -390427 2960113 3916505 3250329 3908947 5924025 6486303 4790742
40597D790742j536591K31295N71238q88759j873681j106723L95553R24345k59240
$$ 4790742 3254151 3485446 4056684 3167925 1294244 187521 583074 1507419 1248179
40588A248179k025049j959078O50126K928011K007834k79197K0575K248033J856030
$$ 1248179 -776870 -2735948 -2085822 842189 2850023 2570826 2591401 4839434 6695464
40579F695464j688132l329108n76733K290821J165067j703018k166345n91020
$$ 6695464 5007332 1678224 1101491 3392312 4557379 2854361 688016 96996
40571I6996K79677L07789O32178L64982j279732k145565l34560K109523K359228
$$ 96996 376673 684462 1316640 1681622 401890 -1743675 -2078235 31288 2390516
40562B390516J199049O90960J54692j592407k654961j043674J121816Q30264o06082
$$ 2390516 3589565 4280525 4435217 2842810 187849 -855825 265991 1096255 490173
40553D90173j33157J386061J020326n77040n50918O18664K85702r02008k66286
$$ 490173 357016 1743077 2763403 2186363 1635445 2254109 2539811 1637803 1371517
40544A371517J130001j22848l047253l108532m4626J389448m60141j472667Q68881
$$ 1371517 2501518 2378670 -668583 -3777115 -3821741 -2432293 -2892434 -4365101 -3496220
40535c496220L207880K215942j54178n24473P41232J344270Q43231o8432j262314
$$ -3496220 -288340 1927602 1773424 1248951 1990183 3334453 4177684 4109252 2846938
40526B846938j922238m76692K178259K498729m72290k892310j645112J061832
$$ 2846938 924700 448008 2626267 5124996 4652706 1760396 115284 1177116
40518A177116J541754K01060j06912R31214J311437N47309K7965K24605J27625
$$ 1177116 2718870 2919930 2813018 3744232 5055669 5602978 5630943 5855548 5983173
40509E983173q55382k145165k640507j259982J868569M127216K545590j716655
$$ 5983173 5127791 2982626 342119 -917863 950706 5077922 7623512 5906857
40501E906857l793349j668343Q15273n5739k137822j298275J676650K584480P15187
$$ 5906857 2113508 445165 1260438 1204699 -933123 -2231398 -554748 2029732 2744919
40492B744919n21097M55849J338853M63603n60909j31835N70161j34926j531631
$$ 2744919 2223822 2679671 4018524 4482127 3921218 3789383 4359544 4224618 2692987
40483B692987j644704K796K033099K848494J953858K68393o86835m81756l12318
$$ 2692987 1048283 1051079 3084178 5932672 7886530 8154923 7468088 6986332 6674014
40474F674014j070471j747571j158055k90731q44235k007658j254578J580418
$$ 6674014 5603543 3855972 2697917 2407186 1562951 -444707 -1699285 -118867
40466a18867L582901K769284N53390p55232r34453j102300j547778j636294r16875
$$ -118867 3464034 6233318 6786708 6031476 5097023 3994723 2446945 810651 -106224
40457a06224N45971K081869K306153M52341j803070j653875Q83134K306975L17367
$$ -106224 439747 2521616 4827769 5280110 3477040 1823165 2706299 5013274 5330641
40448E330641k693693k838241n4182K169045J745427K27718n1460R93217J745801
$$ 5330641 2636948 -201293 -255475 1913570 3658997 3886715 3835255 4828472 6574273
40439F574273J133645m25386j645559j579401n87925L5798j57621m3070J111608
$$ 6574273 7707918 7282532 5636973 4057572 3469647 3505445 3347824 3304754 4416362
40430D416362J823193K44667k571007l375253j008178J995350K811616J554604
$$ 4416362 6239555 6484222 3913215 537962 -470216 1525134 4336750 5891354
40422E891354J13041n40207m98545K29523J372642J798184Q12813n78555j052593
$$ 5891354 6004395 5464188 4965643 5195166 6567808 8365992 9178805 8600250 7547657
40413G547657q91202j125201j517337j070225k1780M40250K07037K79296Q46573
$$ 7547657 6656455 5531254 4013917 2943692 2921912 3362162 3569199 3848495 4695068
40404D695068R53649J43680r68536j728049j777333p10906J157443K221136J509294
$$ 4695068 5648717 5792397 4823861 3095812 1318479 607573 1765016 3986152 5495446
40395E495446N30530J102397K128872J250470r17608j536244l25296K15928l66949
$$ 5495446 6025976 7128373 9257245 10507715 9590107 8053863 7728567 7944495 7577546
40386G577546K55054K191871K316024O637j036831O42729J061894k050015m098226
$$ 7577546 7832600 10024471 12340495 12347132 11310301 11953030 13014924 10964909 6866683
40377F866683r26191L303442K226038k155859k736781Q66167K151064r15619k934057
$$ 6866683 5940492 9243934 11469972 9314113 6577332 7443499 9594563 8678944 5744887
40368E744887q98216J126204P0304p16174J775993M258419K806501n17708j707297
$$ 5744887 4846671 5972875 6043179 5327005 7102998 11361417 14167918 13650210 11942913
40359A1942913j304378j790990k118324j90182K071213J566998k68414O3347J699189
$$ 11942913 10638535 8847545 6729221 6539039 8610252 10177250 9908836 9972183 11671372
40350A1671372R20981k050602l275412j698685k20656J4721J228837L974613N227125
$$ 11671372 12592353 10541751 7266339 5567654 5346998 5361719 6590556 10565169 15792294
40341A5792294L191967K78464m90139Q27108K295156K580164J480210K42629J283022
$$ 15792294 18984261 19262725 18772586 19599694 21894850 24475014 25955224 26197853 27480875
40332B7480875M973448P769823P527135R051157J7496396K6056824J9561395m844211
$$ 27480875 32454323 40224146 47751281 56802438 74298834 100355658 119917053 115072842
40324A15072842k8617779l1569671j5877408j430383r2657m976832n562322k374792
$$ 115072842 86455063 54885392 39007984 37577601 37484944 32508112 26945790 24570998
40316B4570998j580223l248875k709982N42989K656875K577819L169946N359277
$$ 24570998 22990775 19741900 17031918 17574907 20231782 22809601 25979547 31338824
40308C1338824O493980N349068M345530N361575O852658O785853N584345M411823
$$ 31338824 37832804 43181872 47527402 52888977 59741635 66527488 72111833 76523656
40300G6523656K858045J16797l293760o449827r061060j0439494r286320n892685
$$ 76523656 79381701 79498498 76204738 69754911 60693851 50254357 40968037 35075352
40292C5075352k830898k009470k556238k773813k398451j766515q11404j03960
$$ 35075352 32244454 30234984 27678746 24904933 22506482 20739967 19928563 19824603
40284A9824603n31052q08048J572950N483946O344322L457376K186121N183291
$$ 19824603 19293551 18485503 20058453 25542399 31886721 35344097 37530218 42713509
40276D2713509P253485M621060L102305Q585346J5169372J4688992J3841185K5449975
$$ 42713509 49966994 54588054 57690359 66275705 81445077 96134069 109975254 135425229
40268A35425229M1963563L6846317J211950l7293349m6491477k9136107j3941223
$$ 135425229 177388792 214235109 215447059 178153710 131662233 102526126 88584903
40261H8584903j5046784j9860350j5400892o678874l425183m322249l425214j544715
$$ 88584903 73538119 53677769 38276877 31598003 28172820 23850571 20425357 18880642
40253A8880642k059134k830296p43094J196961r90025m359570l538538L05585
$$ 18880642 16821508 13991212 13248118 14445079 13455054 9095484 5556946 5862531
40245E862531J900257N79953j52358K48165o17460k080638r28809K218085L073166
$$ 5862531 7762788 8342741 8190383 8438548 7821088 5740450 4811641 7029726 10102892
40236A0102892P82244o40646Q81329K292325Q50701j583383k133491j348768j323881
$$ 10102892 10885136 10244490 11125819 13418144 14268845 12685462 10551971 9203203 7879322
40227G879322j811896j020345J027728K326247J668994J311j000216q26087m42924
$$ 7879322 6067426 5047081 6074809 8401056 10070050 10071361 9071145 8245058 7802134
40218G802134q79079j675925j324591N73374K641041L811728M613627N194138
$$ 7802134 6923055 5247130 3922539 4495913 7136954 10948682 15562309 20756447
40210B0756447L812274n46960n334193o868125n005777k805978j921153j093419
$$ 20756447 24568721 24021761 18687568 11819443 6813666 4007688 2086535 993116
40202I93116O76394K216527K201354J146801Q07111K738344O863145R906285O937061
$$ 993116 1669510 3886037 6087391 7234192 8041303 10779647 17642792 27549077 34486138
40193C4486138k412312j0747692j0345074l133153J901139J212964J46810K396635
$$ 34486138 32073826 21326134 10981060 7847907 9749046 10962010 11108820 13505455
40185A3505455L536538n08869n148778l965417P22663J712886j501631k979020
$$ 13505455 17041993 16533124 11384346 7418929 8141592 9854478 8352847 5373827
40177E373827q72269M60001p63074q38895J655207K590074q8995k067277p8322
$$ 5373827 4501558 4961559 4198485 3359590 5014797 7604871 7515876 5448599 5370277
40168E370277K163868L46464k997403k979292m45470L91371m50708K18103J900980
$$ 5370277 7534145 7880609 4883206 1903914 1458444 1849815 1399107 1617210 3518190
40159C518190J059191j983586k945951p18335J155948J013825J433654L347578
$$ 3518190 4577381 2593795 -352156 -1070491 85457 1099282 2532936 5880514
40151E880514L290831n11614l937273k683303J184318K519682O49165o23272N23475
$$ 5880514 9171345 8659731 4722458 2039155 3223473 5743155 6392320 5769048 6292523
40142F292523J575947J39776k397424k918676o16974K240330L015449J391162
$$ 6292523 7868470 8008246 5610822 2692146 2075172 4315502 7330951 8722113
40134H722113p43017j740661j777418j614503r40267O65687J991656J459768k16798
$$ 8722113 7979096 6238435 4461017 2846514 1906247 2571934 4563590 6023358 5806560
40125E806560q20212O3932Q32099Q29192Q35502N75198j051571k828992j963674
$$ 5806560 4986348 5050280 5882379 6711571 7547073 8122271 7070700 4241708 2278034
40116B278034J038157K152621J22700j210904P00687K702459J469100n39093O12208
$$ 2278034 3316191 5468812 5591512 4380608 5081295 7783754 9252854 8713761 9325969
40107I325969L125333K119315k210135m678098k870911K63454J701458J549698
$$ 9325969 12451302 14570617 12360482 7682384 4811473 5074927 6776385 8326083
40099H326083M69182j663955l516945k716500J68509J539963K536j571475o71736
$$ 8326083 8795265 7131310 3614365 897865 1066374 2606337 2608873 1037398 365662
40090C65662J254117J673589Q54155Q20942K184616L700277L853090K001947q81716
$$ 365662 1619779 3293368 4147523 4968465 7153081 10853358 14706448 16708395 15826679
40081A5826679k358534r71458J435981J747982k40916j980043k275932k376252
$$ 15826679 13468145 12496687 13932668 15680650 15439734 13459691 11183759 8807507
40073H807507k828668k457429j104963l01598l95047m9787O17768k74926k529512
$$ 8807507 5978839 3521410 2416447 2114849 1719802 1670015 2287783 2012857 -516655
40064e16655l218787j309230N52520N26395K81321J251556J872040R94161M59284
$$ -516655 -3735442 -5044672 -4492152 -3965757 -3684436 -2432880 -560840 433321 892605
40055H92605J402455J509717o97001k234259k85803K526774K010377q28637j722458
$$ 892605 2295060 3804777 3107776 873517 587714 3114488 5124865 4296228 2573770
40046B573770j29518Q00823K41161M05650J378458M25861k597418l833483j209317
$$ 2573770 2444252 3245075 3486236 3891886 5270344 5696205 3098787 -734696 -1944013
40037a944013K098016K144377o33765k884917k838103j272848N26069J830683
$$ -1944013 154003 2298380 1664615 -1220302 -4058405 -5331253 -4805184 -2974501
40029b974501K173387J446863K42046m96085j48788J099302K169621J939752O44382
$$ -2974501 -801114 645749 887795 391710 242922 1342224 3511845 5451597 6095979
40020F095979k77023k07390o5496l23250l1290R29583O76091j540171k992737
$$ 6095979 5818956 5611566 5546070 5222820 5191530 6121113 6797204 5257033 2264296
40011B264296j105338K114823K619500L38582j025319M9254R76756l01384k222608
$$ 2264296 1158958 3273781 5893281 6231863 5206544 5255798 6232554 5931170 3708562
40002C708562k438523j083044J55696K60862p76831k109624k002281M29235L103560
$$ 3708562 1270039 186995 342691 603553 -173278 -2282902 -4285183 -3855948 -752388
39993g52388K829179k35533k377412j336369R10402J444843K07198q87866p79765
$$ -752388 2076791 1841258 -536154 -1872523 -962121 482722 689920 -197946 -977711
39984i77711J82167J111773J021136l16220j426250o86928R22214Q48323q38062
$$ -977711 -795544 316229 1337365 1021145 -405105 -1092033 -169819 678504 -159558
39975a59558j134033R21241K147172K20448k125285j044801K234184K904611l52598
$$ -159558 -1293591 -372350 1774822 1995270 -130015 -1174816 1059368 3963979 3611381
39966C611381l396390k428636J020914K529125O37636j677097j221589J346684
$$ 3611381 214991 -2213645 -1192731 1336394 1974030 296933 -924656 422028
39958D22028K698299J360479o52102j143837p96784j376104k356488j723013N20762
$$ 422028 3120327 4480806 3828704 2684867 1888083 511979 -1844509 -3567522 -3046760
39949c046760K179222K104823J244894M34412m22144q58626j45914O75933j49272
$$ -3046760 -867538 1237285 2482179 2916591 2494447 1635821 1489907 2165840 2016568
39940B016568j708868j302460P13140P50818j971386l272434l52407L374813L161577
$$ 2016568 307700 -994760 -281620 469198 -1502188 -4774622 -5127029 -1752216 1409361
39931A409361j91687k116213j021011N51702N23972l50863m78516N99648K001283
$$ 1409361 1217674 -898539 -1919550 -1367848 -843876 -1194739 -1673255 -1073607 927676
39922I27676J982921k67722k465790j251031K330968K881536j376519m781367
$$ 927676 2910597 2642875 177085 -1073946 1257022 4138558 2762039 -2019328
39914b019328k385196K076493J993363j539361j999511J433784K960679N17898
$$ -2019328 -4404524 -2328031 -334668 -1874029 -3873540 -2439756 520923 1038821
39906A038821r76114J261253K948577M63389k829522k455917J9305N68600n90306
$$ 1038821 62707 1323960 4272537 4735926 1906404 -549513 -530208 38392 -551914
39897e51914q26043m56279j272884k073021n22487K185682K993656J926538J239643
$$ -551914 -1377957 -1834236 -3107120 -5180141 -5702628 -3516946 -523290 1403248 2642891
39888B642891J029422q0373j206302o34756J52141j343269l332497j935634J673665
$$ 2642891 3672313 3591940 2385638 1750882 1903023 559754 -2772743 -4708377 -3034712
39879c034712K215816r60367k294338R16426L938022K371193r33954j174346O19671
$$ -3034712 -818896 -1779263 -4073601 -3157175 780847 3152040 2218086 1043740 1663411
39870A663411L75329j607231j716308L22001J407568Q33989Q16988J444685K90393
$$ 1663411 2038740 431509 -1284799 -962798 444770 1278759 2095747 3540432 3830825
39861C830825k361767k931447n36170J118528j48025j388331J74273K168923J058798
$$ 3830825 1469058 -1462389 -1998559 -880031 -1028056 -2416387 -2242114 -73191 985607
39852I85607j869670k598081n48921J367528J673816J337706N51410j442145l250732
$$ 985607 -884063 -3482144 -4031065 -2663537 -989721 347985 899395 -542750 -3793482
39843c793482k039583J781344M093773K671658J54972k91513N52444J43162j440942
$$ -3793482 -5833065 -4051721 42052 2713710 2868682 2577169 3129613 3272775 1831833
39834A831833k081140j266420m63805m32530m89486k35235k3359K47926J041917
$$ 1831833 -249307 -1515727 -1979532 -2412062 -2901548 -3136783 -3160142 -2912216 -1870299
39825a870299J815380J395511m9005r11951l72733O11088Q94885M48724l30240
$$ -1870299 -54919 1340592 1291587 379636 6903 617991 1512876 1961600 1631360
39816A631360j258939j742920r01966Q01502J403241J39322r07585M39141K920238
$$ 1631360 372421 -1370499 -2272465 -1470963 -67722 71600 -835985 -396844 2523394
39807B523394L231857P46061j524477j246093K37811N07673l71454q62629r50806
$$ 2523394 5755251 6501312 4976835 3730742 3968553 4476226 4104772 3242143 2291337
39798B291337j564401j947606n91602J403912J119893j419484k547854m53953
$$ 2291337 726936 -1220670 -1812272 -408360 711533 -707951 -3255805 -3709758
39790c709758J810428J138056p07357k43936J826777J888205n08673k037884j007746
$$ -3709758 -1899330 -761274 -1468631 -1712567 114210 2002415 1493742 -544142 -1551888
39781a551888N75972R23724P50652O48630l27299k024493k399471j028400k68833
$$ -1551888 -975916 -52192 698460 1347090 1019791 -1004702 -3404173 -4432573 -4701406
39772d701406j038654p61211J966648L963541K141779j146285j514317O78255
$$ -4701406 -5740060 -6501271 -4534623 -571082 1570697 424412 -1089905 -411650
39764d11650J418973k53318j387111p64082o21708j835333j809714Q58097L195187
$$ -411650 1007323 754005 -633106 -1397188 -2018896 -3854229 -5663943 -4805846 -1610659
39755a610659J965995j480575l163896j732789O78766J940819K021449J818445
$$ -1610659 355336 -1125239 -4289135 -6021924 -5343158 -3402339 -1380890 437555
39747D37555J667119J358331P52497O4742k73552j52554j13640o58237j342238
$$ 437555 2104674 3463005 4215502 4280244 4006692 3854138 3740498 3082261 1740023
39738A740023j291842n25025J51998M86810R01434J249284P83228l20799p50445
$$ 1740023 448181 -76844 75154 561964 1463398 2712682 3495910 3175111 2424666
39729B424666K8523Q16781M08089p03759j230231r67985p74951r91942q55027
$$ 2424666 2453189 3269970 3678059 2974300 1744069 776084 1133 -990809 -1845836
39720a845836K58470J548131J486879J4601q44939L02574J586332J46041k922896
$$ -1845836 -1587366 -39235 1447644 1462245 617306 919880 2506212 2652253 -270643
39711b70643l037110J050198M309681K274446k193312l198197n64801J059439
$$ -270643 -3307753 -2257555 2052126 4326572 2133260 -1064937 -1629738 -570299
39703e70299N38770J256168L506810K850898j692035m421703j794765J378410
$$ -570299 -31529 1224639 4731449 7582347 5890312 1468609 -326156 1052254
39695A052254k49013l498411j926437L292101N101305J690071j456046q52792
$$ 1052254 803241 -2695170 -4621607 -1329506 3771799 5461870 4005824 3153032
39687C153032M42585p24970k455121j845022K04356J230085J077272Q85288P12002
$$ 3153032 3595617 2870647 415526 -1429496 -1225140 4945 1082217 1967505 2679507
39678B679507L67450L96348M67609q41009l012509l092902k46845K066266J097340
$$ 2679507 3046957 3443305 3910914 3069905 57396 -3035506 -3282351 -1216085 -118745
39669a18745p56065J24807K482263K130727j189760l241955j580939J476784K916682
$$ -118745 -874810 -750003 1732260 3862987 2673227 -568728 -2149667 -672883 2243799
39660B243799K656324J846340M93370j388991k434961j718259m47828j87797o31678
$$ 2243799 4900123 6746463 7239833 5850842 3415881 1697622 1249794 1061997 430319
39651D30319p33897p52822j242619j123128Q19789L022962K464723p70039k893935
$$ 430319 -303578 -1056400 -2299019 -3422147 -2602358 420604 2885327 2115288 -778647
39642g78647j505386J081752J390679l12522j194268o23513n65701j408291q09433
$$ -778647 -2284033 -1202281 188398 -124124 -1318392 -1941905 -2507606 -3915897 -4725330
39633d725330K154847M579972L502604Q7988k212197k246025j483735q22744J47184
$$ -4725330 -2570483 2009489 5512093 5600081 3387884 1141859 -341876 -1164620 -1017436
39624a017436J057303P61666k89811k65900Q55047Q76830q20270j717374j27075
$$ -1017436 39867 801533 511722 245822 1100869 1977699 1157429 -559945 -687020
39615f87020J684639Q96624j136110p92497J927752K965249J74170l438673l983907
$$ -687020 997619 1894243 758133 -34364 1893388 4858637 5032807 1594134 -2389773
39606b389773j750559J42983M39052M46096Q29388N27966p76466j525461o82193
$$ -2389773 -4140332 -3997349 -3558297 -3112201 -2282813 -1754847 -2531313 -4056774 -4738967
39597d738967N40287O47433Q2932l5917r1866r33888j624067n70395J477752K096744
$$ -4738967 -4198680 -3551247 -3468315 -3504232 -3596098 -4529986 -6154053 -6724448 -5246696 -3149952
39587c149952R69870L40226J058448J034601r41495k567805j471991R06897J619452
$$ -3149952 -2180082 -1839856 -781408 253193 -688302 -3256107 -4728098 -3821201 -2201749
39578b201749P53895O23463J500716J501020L26766k23508K79385Q2867j397858
$$ -2201749 -1447854 -824391 676325 2177345 2504111 2280603 2559988 2642855 1244997
39569A244997k333952j621034n98080l71556N8042J429534K292329J369936l3205
$$ 1244997 -1088955 -2709989 -3308069 -3679625 -3621583 -2192049 100280 1470216 1437011
39560A437011p2656O46455K49017j264217k106431j395949n5421P05816N92896
$$ 1437011 1364355 2010810 2259827 995610 -1110821 -2506770 -2562191 -1856375 -1263479
39551a263479J81011L83775J397621J860784L03812k162858k514220j16762J825492
$$ -1263479 -1082468 -698693 698928 2559712 2863524 700666 -1813554 -1930316 -104824
39542a04824P62111j438367j524501J95345Q55743k23898r64578k67401O42946
$$ -104824 657287 -781080 -2305581 -2110236 -1254493 -1478391 -2442969 -2710370 -2067424
39533b067424P35988M76729K65362k14444o78309k29634Q90180J246517L13122
$$ -2067424 -1331436 -854707 -589345 -803789 -1482098 -1711732 -821552 424965 738087
39524G38087q41100j237952j053466q75860j023508j443797j349582K82696K702277
$$ 738087 -103013 -1340965 -2394431 -3270291 -4293799 -5737596 -7087178 -6804482 -4102205
39515d102205L269569J165358n28962Q28523K792517J341976k225588k776678
$$ -4102205 -832636 332722 -196240 632283 3424800 4766776 2541188 -235490
39507b35490M19373K312164J43431k400272j555876P82598J116495J09981K17980
$$ -235490 183883 2496047 2639478 239206 -1316670 -534072 582423 692404 910384
39498I10384O71664o63046k509129j794901J033312K408401R27326j209364j815650
$$ 910384 1582048 919002 -1590127 -3385028 -2351716 56685 984011 -225353 -2041003
39489b041003q52075P77557J985957J523685m14603j426452q5899J425765O30007
$$ -2041003 -2893078 -2115521 -129564 1394121 979518 -446934 -532833 892932 1522939
39480A522939j001926p02354L39371r92401l414212k382069K185738M868987K797969
$$ 1522939 521013 -181341 158030 -834371 -4248583 -6630652 -4444914 424073 3222042
39471C222042m80559j292145r86285j867838k546695j121359O87251O40201J89962
$$ 3222042 2741483 1449338 463053 -1404785 -3951480 -5072839 -4385588 -3745387 -3555425
39462c555425J425052K454676L86006l072502l702138j214195R69556J520555
$$ -3555425 -2130373 324303 710309 -2362193 -6064331 -7278526 -6308970 -4788415
39454d788415K173994L260355K908042J015234k42618m04322j171251k338607
$$ -4788415 -2614421 645934 3553976 4569210 4326592 3922270 2751019 412412
39446D12412j583311P76762J318092p01522j618168M65576K255985Q64821j342899
$$ 412412 -1170899 -394137 923955 222433 -1395735 -930159 1325826 2190647 847748
39437H47748j017305P26995J064950M25705M55791K4629j972053k563456R77880
$$ 847748 -169557 557438 1622388 2048093 2503884 2528513 556460 -2006996 -1029116
39428a029116M874311L236727k354256m461066j045911J960783O94849j176465
$$ -1029116 3845195 7081922 4727666 266600 -779311 1181472 1876321 699856
39420F99856P7046J925794J049136m09170O96307K102053l6472l905033m444798
$$ 699856 776902 2702696 3751832 3342662 4038969 6141022 6104550 2199517 -2245281
39411b245281j189082J685421J918081P80445q37176k902998l442163m02212L728277
$$ -2245281 -3434363 -1748942 169139 949584 112408 -2790590 -6232753 -6634965 -2906688
39402b906688M138645Q50853j210500J46768J735663J084911K2984K28217L7758
$$ -2906688 1231957 2082810 872310 1019078 2754741 3839652 3862636 4090853 4128611
39393D128611j637052k426784n67622J706660J854528R01988O65875K77667j278396
$$ 4128611 2491559 64775 -502847 1203813 3058341 3960329 4626204 4903871 3625475
39384C625475k151685p47834P41498k91691k227023j849305L03738J253962O37773
$$ 3625475 1473790 725956 1467454 1175763 -1051260 -2900565 -2596827 -1342865 -705092
39375g05092L46474M50830k86172q73014N48032K504458J869737o27753j262532
$$ -705092 -358618 92212 -193960 -1066974 -518942 1985516 3855253 3227500 1964968
39366A964968L00234M99235j502227j938618R38191L241363J404309k176324k961711
$$ 1964968 2265202 2764437 1262210 -676408 261783 3503146 4907455 2731131 -230580
39357b30580q68070N95830p0786j070862p16304O55304J791872J680020J20079
$$ -230580 -1098650 -502820 -573606 -1644468 -2360772 -1705468 86404 1766424 1886503
39348A886503j545779j303008O80844J507519n61692l204827l046736k69838K048006
$$ 1886503 340724 -962284 -281440 1226079 664387 -2540440 -5587176 -5857014 -3809008
39339c809008K207706J077805k83967j537753j764403K563K407888K384422p36246
$$ -3809008 -1601302 -523497 -807464 -2345217 -4109620 -4107057 -1699169 685253 -50993
39330e0993l660964l176129l03775J424136R59921O81080K125247L178920J249647
$$ -50993 -3711957 -6888086 -7191861 -5767725 -4807804 -4126724 -2001477 1177443 2427090
39321B427090k192711k938023N0171K826469J927117p81339j183302Q71868J809916
$$ 2427090 234379 -2703644 -2653473 172996 2100113 1318774 135472 1007340 2817256
39312B817256K11326j297809p22891K72254k57846j111887l41442J130022J083908
$$ 2817256 3028582 1730773 1007882 1280136 1022290 -89597 -431039 698983 1782891
39303A782891k62680r43036p23033j018011j772435j360162K31078R37448R5110
$$ 1782891 1520211 577175 -145858 -1163869 -2936304 -4296466 -4065388 -3127940 -3032830
39294c032830k01653J454912L174912K468214k9165j693645j787941j769097k049635
$$ -3032830 -3234483 -1779571 1395341 3863555 3834390 2140745 352804 -1416293 -3465928
39285c465928j159864J127395K355316Q54632j161159m42722K333979L323489
$$ -3465928 -4625792 -3498397 -1143081 -288449 -1449608 -1892330 441649 3765138
39277C765138J125585j399409j717523j005156j253057j722616q35233N25756
$$ 3765138 4890723 3491314 1773791 768635 -484422 -2207038 -3042271 -2516515
39269b516515O36781L15288J339763K565776J344457j614329k736570j172701
$$ -2516515 -1879734 -1564446 -224683 2341093 3685550 2071221 -665349 -1838050
39261a838050J14586l29269k16226J681913K547985J60697k732043k184093R55557
$$ -1838050 -1723464 -2052733 -2268959 -587046 1960939 2121636 -610407 -2794500 -1838943
39252a838943K398099N70222j885297k312539r44781M84763R71152P91149R70267
$$ -1838943 559156 1129378 -755919 -3068458 -4013239 -3528476 -2557324 -1766175 -795908
39243g95908K027923K708154J096365k155899l460282p60355L199996M122849
$$ -795908 1232015 3940169 5036534 2880635 -579647 -1340002 1859994 5982843
39235E982843J481479j518319k348089j342793j04921K06815p04087j935195j854084
$$ 5982843 7464322 5946003 3597914 2255121 2150200 2357015 1652928 -282267 -2136351
39226b136351j92690J094834L99369j136611j310896P9085J487767J914957J368046
$$ -2136351 -2329041 -1234207 -834838 -1971449 -3282345 -3203260 -1715493 199464 1567510
39217A567510J16891j020818r25101o3497l64638j746336j310774J781652L608104
$$ 1567510 1684401 663583 -261518 -325015 -689653 -2435989 -3746763 -1965111 1642993
39208A642993J011432k889596l010696J8953J431601J14299o21226N29597J289045
$$ 1642993 2654425 -235171 -3245867 -3226914 -1795313 -1681014 -2302240 -1772643 -483598
39199d83598Q97749J262410K165908Q06281k458875l329565n78586J415668j76875
$$ -483598 414151 1676561 3842469 4648750 2189875 -1139690 -1718276 -302608 -479483
39190d79483k040226o92395J621308J214128p62343r57238K88312M03927l70622
$$ -479483 -2519709 -3212104 -1590796 -376668 -1139011 -2096249 -1807937 -1404010 -1774632
39181a774632n2022P56130J42619q81572L4511J768842J128694j390973j926112
$$ -1774632 -1826654 -1070524 -927905 -1809477 -1774966 -6124 1122570 -268403 -2194515
39172b194515M25227K067675O84130j439897j371265N10974K178508K770537K075594
$$ -2194515 -1769288 298387 982517 -457380 -1828645 -1317671 860837 3631374 5706968
39163E706968k33159k951257l170510M3558L425038L172783k28905k895770k502987
$$ 5706968 5473809 2522552 -647958 -604400 2820638 5993421 5764516 2868746 365759
39154C65759l44831J238654J499523R83154J30345r21104j783150j832724q24238
$$ 365759 20928 1259582 2759105 3742259 3872604 2951500 1168350 -664374 -1488612
39145a488612O44264J339465M07720j485396k383067j080599J169024J850149
$$ -1488612 -844348 495117 902837 -582559 -2965626 -4046225 -2877201 -1027052
39137a027052K91424j387414j067935N86153J325615N85911j82980k93279p84479
$$ -1027052 -735628 -2123042 -3190977 -2604824 -1279209 -693298 -876278 -1169557 -1954036
39128a954036j975508k220363n55616J211739R97337l89888p89404k34128l22543
$$ -1954036 -3929544 -6149907 -6705523 -5493784 -4496447 -4886335 -5675739 -5909867 -6232410
39119f232410q29013q18J875024K393569J056484K43425J059273J284359o73746
$$ -6232410 -7061423 -7062241 -5187217 -2793648 -1737164 -1493739 -434466 849893 176147
39110A76147k492741j252029J761424K553327O0017k444913j884072P20975J859149
$$ 176147 -2316594 -3568623 -1807199 746128 806145 -1638768 -3522840 -2801865 -942716
39101i42716O0216k339322k188418L85973K058517Q18736j163077o99977J691583
$$ -942716 -882500 -3221822 -5410240 -5024267 -2965750 -2147014 -3310091 -4010068 -2318485
39092b318485K693274J196320n09302p14774m53745q44303j079085m13396K15441
$$ -2318485 374789 1571109 1061807 347033 -106712 -951015 -2030100 -2443496 -2228055
39083b228055K0962k00474K16895N81442M44291L94107L01460q46924k347430
$$ -2228055 -2207093 -2407567 -2190672 -1609230 -1164939 -770832 -469372 -1316296 -3663726
39074c663726j836273O83616J984720O27587m66123J093111L003704K192624p0885
$$ -3663726 -5499999 -4816383 -2831663 -2204076 -2670199 -1577088 1426616 3619240 3548355
39065C548355p27385j47771p08239k009962j764060j81234O32565P04915J576927
$$ 3548355 2820970 2673199 1964960 -45002 -1809062 -1990296 -1357731 -652816 924111
39056I24111K435703J070994j638388k376296o55524N37182j99696p77654M10798
$$ 924111 3359814 4430808 2792420 416124 -239400 297782 98086 -679568 -268770
39047b68770K052523K496692J835710M70806j655005l486697l139953p75878J059224
$$ -268770 1783753 4280445 6116155 6586961 4931956 1445259 -1694694 -2470572 -1411348
39038a411348Q38539k17369m50723J65239Q36687J064445N63392m60361j051062
$$ -1411348 -572809 -790178 -1240901 -1075662 -238975 825470 1388862 928501 -122561
39029a22561q82077j046612j792436j092395J915517L963889J880448j771415
$$ -122561 -1004638 -2051250 -3843686 -4936081 -3020564 943325 2823773 1052358
39021A052358j892107J248645K558367M10454j319454l33222P41335j12934q43204
$$ 1052358 -839749 408896 2967263 3377717 2058263 1725041 2466376 2353442 1510238
39012A510238J20109Q12296M3701O9102J849598K232231n45563k883388j467529
$$ 1510238 1630347 2442643 2486344 2555446 4405044 6637275 6091712 3208324 1740795
39003A740795J055150O07152j611201j910847o70695p73793j716255p92967J286067
$$ 1740795 2795945 3403097 1791896 -118951 -789646 -1563439 -3279694 -4072661 -2786594
38994b786594J427795p955K34481K137469K109508n89588k146719l12035K131130
$$ -2786594 -1358799 -1366754 -1132273 1005196 3114704 2525116 378397 66362 2197492
38985B197492J972583J29670o83890k42853l92546j822844l139274k610578o8806
$$ 2197492 4170075 4299745 3615855 3373002 2980456 1157612 -1981662 -4592240 -4661046
38976d661046K517438K606271J31849j747926m66982K272689K734150K94709k198874
$$ -4661046 -2143608 462663 594512 -1153414 -1620396 652293 3386443 3681152 1482278
38967A482278k775520k159382j262665R9419J451093J459391L42823o2822N95529
$$ 1482278 -1293242 -3452624 -4715289 -4615870 -3164777 -1705386 -1362563 -1425385 -829856
38958h29856O90410L0980O55184K736854K984575l85327l878182l212290L60955
$$ -829856 -139446 -108466 546718 3283572 6268147 5882820 2004638 -1207652 -846697
38949h46697J933990J03390j680376r18395O60205P32893p6883k35582j97231
$$ -846697 1087293 1190683 -489693 -1408088 -747883 -14990 -91873 -327455 -524686
38940e24686q11382r16921N50145J562120l82210l374212k900318J056265L075383
$$ -524686 -1336068 -2252989 -1702844 -140724 -522934 -3897146 -6797464 -5741199 -2665816
38931b665816K71198k998460j693094K128181K713286l90720k183242m36885J453354
$$ -2665816 -2394618 -5393078 -7086172 -4957991 -2244705 -2635425 -4818667 -5255552 -3802198
38922c802198O90699r27085j092307o44177o75200J50844K451267L600494J631168
$$ -3802198 -3111499 -4038584 -5130891 -5775068 -6450268 -6299424 -3848157 -247663 1383505
38913A383505j033201j101248O14859J165010L69646J04980K78980o24153j944745
$$ 1383505 350304 -750944 -136085 1028925 1398571 1503551 1782531 1158378 -786367
38904g86367j535393L66105J319576N83159j82041l0528K11518J0019j94266k74221
$$ -786367 -2321760 -1955655 -636079 -52920 -234961 -265489 -53971 -43952 -238218 -512439
38894e12439k96955L57945J671981J804639k57781k109007j024222J534180K059451
$$ -512439 -809394 -451449 1220532 3025171 2767390 658383 -365839 1168341 3227792
38885C227792O13818J64287R48091K61701j931878k234030J16960J252367j056205
$$ 3227792 3841610 4005897 4953988 5215689 3283811 1049781 1166741 2419108 1362903
38876A362903l402626j952690J734311L361432J982828K38332k4569M22338P8478
$$ 1362903 -2039723 -3992413 -2258102 1103330 3086158 3324490 3299921 3722259 3800737
38867C800737j414188k876036k373955N30565L160460K358722r12694k274635
$$ 3800737 2386549 -489487 -2863442 -2332877 827583 3186305 2273611 -1024
38859a024p2209K228943J348908j121729j649007J22350J812131K022433J069401
$$ -1024 -73233 2155710 3504618 2382889 733882 856232 2668363 4690796 5760197
38850E760197n88366k370044l170180k755845k261558j854382M5558L302077M293976
$$ 5760197 5171831 2801787 -368393 -3124238 -5385796 -7240178 -7194620 -3892543 401433
38841D01433O03676m377682n052666q86606L291147L812662J725060k44891j113574
$$ 401433 1005109 -3372573 -8425239 -9311845 -6020698 -2208036 -482976 -727867 -1841441
38832a841441j189349o70066Q7315L83832J29209R290L90331R77701J516430J761050
$$ -1841441 -3030790 -3700856 -3613541 -3229709 -3100500 -3091210 -2700879 -1723178 -206748 1554302
38822A554302J000141r88040k618664j796720J109765L102467K110929m30127
$$ 1554302 2554443 1566403 -1052261 -2848981 -1739216 1363251 3474180 3044053
38814C044053j545153n01481O27460R4426j150234j066813L34981J028769J13523
$$ 3044053 1498900 997419 1624879 1719305 569071 -497742 -162761 866008 979531
38805I79531r37872q85674n61098o72749L7846K087288K818437J35071k955993
$$ 979531 41659 -844015 -1405113 -2077862 -2040016 47272 2865709 3000780 44787
38796D4787j966956J724525K356857j147437l334686j001362K002122J659926
$$ 44787 -1922169 -197644 2159213 1011776 -2322910 -3324272 -1322150 337776
38788C37776K6335M82558J490210N6759k293627k325926r39977q62066j046012
$$ 337776 364111 846669 2336879 2393638 100011 -2225915 -3165892 -4027958 -5073970
38779e073970R63120L194728J903742j335729j537898J346226K438757L31647
$$ -5073970 -4110850 -916122 987620 -348109 -1886007 -539781 1898976 2230623
38771B230623j095827j09325K18769j394816j541243J320696L140926Q48439k199524
$$ 2230623 1134796 1025471 1244240 -150576 -1691819 -371123 2769803 3618242 1418718
38762A418718j635548R25657J003509j356099k091425K87982K806070K517444
$$ 1418718 -216830 708827 1712336 356237 -1735188 -1447206 1358864 3876308
38754C876308q3261k325114k241734k14082J417140R51950l27255L7726J568729
$$ 3876308 3793047 1467933 -773801 -987883 429257 1381207 1053952 1091678 2660407
38745B660407J243673j385970k831924j074401J009200J92690j992213j941141
$$ 2660407 3904080 2518110 -313814 -1388215 -379015 -186325 -2178538 -4119679
38737d119679L00177J513876L99296j066679j004651K46907J385515J612705Q34345
$$ -4119679 -3819502 -2305626 -1906330 -2973009 -3977660 -3730753 -2345238 -732533 101812
38728A01812l31825r29033p31884l04828K64399J296977J952129Q56743j114979
$$ 101812 -230013 -1159046 -1890930 -2195758 -1931359 -634382 1317747 2174490 1059511
38719A059511j320077M07784J052699n21731j287086P48807K561001P86386k545352
$$ 1059511 -260566 147218 1199917 678186 -608900 139907 2700908 3487294 941942
38710I41942l055020o37200J231014J233427R10966O73702m75888j699264j015041
$$ 941942 -2113078 -2750278 -1519264 -285837 625129 1298831 822943 -876321 -1891362
38701a891362P97591Q87093r26678j801965n64645Q29850R95241Q55343J050534
$$ -1891362 -1093771 -206678 -1133356 -2935321 -3499966 -2670116 -1674875 -819532 231002
38692B31002P83439n2373m70039n74378j313286j908414p22900J180167R58425
$$ 231002 1014441 962068 492029 -82349 -1395635 -3304049 -4026949 -2846782 -1888357
38683a888357j136004j697131K64475J797444J252022P63306J677308J780223
$$ -1888357 -3024361 -4721492 -4457017 -2659573 -1407551 -644245 1033063 2813286
38675B813286l16525j930831o39248J428510J075357q95916j635173r91464p00919
$$ 2813286 2496761 565930 -73318 1355192 2430549 1534633 -100540 -1092004 -1792923
38666a792923o72619K71589J319284Q52340l17049k47430M56186l51843k234753
$$ -1792923 -2465542 -2193953 -874669 -22329 -339378 -586808 -130622 -482465 -2717218
38657b717218k456486l13582J920999K541009K046305J022959p48472k483199
$$ -2717218 -5173704 -5487286 -3566287 -1025278 1021027 2043986 1295514 -1187685
38649a187685k364184l07102J398456J189215J28809j83955J63412L26553L15128
$$ -1187685 -3551869 -3858971 -2460515 -1271300 -1142491 -1326446 -1163034 -836481 -521353
38640e21353M43782L15974m19084j061052p19323K65816O84193M1866r14419j234858
$$ -521353 -77571 238403 -180681 -1241733 -1961056 -1695240 -1011047 -969181 -1883600 -3118458
38630c118458q15084k42783J08549M42382R11495J096119O33182M9215J57901
$$ -3118458 -3933542 -4176325 -4067776 -3625394 -2713899 -1617780 -984598 -935383 -777482
38621g77482P36990P42263j26105j059391j392765j140614l13984R31623J478671
$$ -777482 -40492 701771 575666 -483725 -1876490 -3017104 -3331088 -2399465 -920794
38612i20794L18801j362372j204751P59088J827589O75718q20515r01786l59339
$$ -920794 -601993 -1964365 -3169116 -2410028 -582439 93279 -727236 -1629022 -1988361
38603a988361j51803M90231J545565Q64737j910191l106866k11940L399243L099004
$$ -1988361 -2140164 -1649933 -104368 760369 -1149822 -4256688 -4468628 -1069385 2029619
38594B029619J24294p47794R71444J342872r44111k820871k404769j184310J7181
$$ 2029619 2153913 1406119 2377563 3720435 2776324 -44547 -2449316 -3633626 -3616445
38585c616445K174142M077647K451925k068270m044715q87116L065771L060263
$$ -3616445 -1442303 2635344 5087269 3018999 -1025716 -1912832 1152939 4213202
38577D213202M34302p46564O3769P54695P51643N84281l96350k327306k943941
$$ 4213202 4647504 3900940 3964709 4719404 5471047 6055328 5658978 3331672 387731
38568C87731p87631J641430J284300q19677j662130j117217r63337q27359P58880
$$ 387731 -399900 1241530 2525830 1706153 44023 -1073194 -2036531 -2863890 -2105010
38559b105010K485751J744390o37367j270222M00508J534369Q03299l0405P9693
$$ -2105010 380741 2125131 1487764 217542 618050 2152419 2955718 2925313 3005006
38550C005006j96805j440900j938700n52276J371593K040876J171104o14350k306181
$$ 3005006 2808201 1367301 -571399 -1123675 247918 2288794 3459898 2845548 539367
38541E39367k309791p3752K043887J215229j427132j843524R41741L183587J821493
$$ 539367 -1770424 -1844176 199711 1414940 -12192 -1855716 -913975 2269612 4091105
38532D091105j519642l471297l204896k007099p64359L04081R92590J587149K627845
$$ 4091105 2571463 -899834 -4104730 -6111829 -6876188 -6572107 -5579517 -3992368 -1364523
38523a364523L393412K360850j38357j787482j594298j083213j307823j192219
$$ -1364523 2028889 4389739 4251382 2463900 869602 -213611 -1521434 -2713653
38515b713653o2286P33896K77768k39731J08123L23159j31714J53184J645721
$$ -2713653 -2775939 -2042043 -1764275 -2004006 -1895883 -1572724 -1704438 -1551254 94467
38506I4467K103834J18011j997701j603975J36111N01662l42962l90456K95224
$$ 94467 2198301 2316312 318611 -1285364 -1149253 -647591 -990553 -1381009 -1085785
38497a085785J37345n63775j74984J003760J142061P7529o98707o81374l08454
$$ -1085785 -948440 -1512215 -1687199 -683439 458622 536151 -162556 -843930 -1152384
38488a152384Q28126K793604L382910Q44357k309072k099748P93740J950422J38955
$$ -1152384 -324258 2469346 5852256 6696613 4387541 2287793 3081533 5031955 5170910
38479E170910j343716q22766o69664j973543j834269J209084L479241J604090
$$ 5170910 3827194 3004428 2334764 361221 -1473048 -263964 3215277 4819367
38471D819367j863596k467622p96443p61227k592473k523069P16713L592389L031377
$$ 4819367 2955771 488149 -308294 -1069521 -3661994 -6185063 -5468350 -1875961 1155416
38462A155416N90780l25436P95798J443184k51648l002636l586364n09056L644516
$$ 1155416 1746196 1420760 2216558 3659742 3408094 405458 -3180906 -3689962 -45446
38453d5446M540625J298810k184532k371414o49119m23464j389380m07038K460655
$$ -45446 4495179 5793989 3609457 1238043 588924 165460 -1223920 -1630958 829697
38444H29697L211319L41848k124394o33024K187149J480152k243273l807041j142535
$$ 829697 4041016 4382864 2258470 1625446 3812595 5292747 3049474 -757567 -1900102
38435a900102J957413J786991l13826r79897P7010P48951M68195M06254O18188
$$ -1900102 57311 1844302 1530476 550579 627589 1376540 1844735 2250989 2869177
38426B869177q171j103173r35299M73698R94894j66869j264420j205105j208024
$$ 2869177 2861006 1757833 822534 1296232 2291126 2124257 859837 -345268 -1553292
38417a553292j777801r50287K035651L988795J999252j586459k306203l54515
$$ -1553292 -3331093 -4281380 -2245729 1743066 3742318 2155859 -150344 -504859
38409e04859J92360j625258k343275m05350J172287L52561l00808J464104K966265
$$ -504859 -312499 -1937757 -4281032 -4686382 -3514095 -3161534 -3462342 -1998238 968027
38400I68027Q40906k855818l203277L78108L624854L514945J142949j253786k585743
$$ 968027 1808933 -1046885 -4250162 -3872054 -247200 3267745 4410694 3156908 571165
38391E71165k005073Q57520L871046L563692l94240m140669m314163j827881L05953
$$ 571165 -1433908 -576388 3294658 6858350 6464110 2323441 -1990722 -3818603 -3512650
38382c512650R86857J100255R86620L9565j439619j837693l34465J552453J531195
$$ -3512650 -2525793 -1425538 -438918 -399353 -1838972 -3676665 -4011130 -2458677 -927482
38373i27482m50527j800229o02925J572559J785669J67688k24743J513793K196088
$$ -927482 -1378009 -3178238 -3781163 -2208604 -422935 -255247 -479990 1033803 3229891
38364C229891m73117l674090l201072M36107L040858K724845J319519M20841k51722
$$ 3229891 2756774 -917316 -4118388 -3682281 -641423 2083422 3402941 3823782 3572060
38355C572060n85100J68477R89522k4992j896155j602277O14728R65674j465179
$$ 3572060 2986960 3155437 4144959 4119967 2223812 621535 1236263 2201937 736758
38346G36758k488523M94339L749590K740159r56586k488706j154501m62422j926291
$$ 736758 -1751765 -1257426 2492164 5232323 4275737 1787031 632530 170108 -1756183
38337a756183l108013j818500J101835L479075L799086J598773j872486l695760
$$ -1756183 -4864196 -6682696 -5580861 -2101786 1697300 3296073 1423587 -2272173
38329b272173k228708L88391Q91001n39363r12952P80920K285051J754299R9119
$$ -2272173 -4500881 -4112490 -3221489 -3760852 -4673804 -3892884 -1607833 146466 245585
38320B45585r43551r75849n45778j97506k88581n15790J85200J964248L002626
$$ 245585 -697966 -1673815 -2219593 -2417099 -2705680 -3221470 -3036270 -1072022 1930604
38311A930604J893045J69514J92144J336602J018049j039413k568258k549615
$$ 1930604 3823649 3993163 4185307 5521909 6539958 5500545 2932287 382672
38303C82672k080423j457834K12861K114798J921447k56845j472426n17129M26559
$$ 382672 -1697751 -3155585 -2942724 -827926 1093521 836676 -635750 -1152879 -726320
38294g26320j11652o30729n0593J90791n95577n11206J122667J636886m14561
$$ -726320 -837972 -1468701 -1519294 -1328503 -1924080 -2435286 -1312619 324267 -90294
38285i0294k005965m95183J525753N55838j443349k44990K908417K731186j275725
$$ -90294 -2096259 -2591442 -1065689 -509851 -1953200 -2198190 710227 3441413 2165688
38276B165688l451743p11507K745854K055472j279968k443137m79209J383507
$$ 2165688 -1286055 -1997562 748292 2803764 1523796 -919341 -1398550 -15043
38268a5043J125922O9428j65602J11285J44316L53056J279785K087466J457627
$$ -15043 1110879 1180307 1014705 1125990 1270306 1623362 2903147 4990613 6448240
38259F448240l51013j563890j261595o13060r71855j681700j176587K85193Q98758
$$ 6448240 6097227 4533337 3271742 2658682 1686827 5127 -1171460 -886267 12491
38250A2491L30129K08845R48104N40463j928107l820799k373159J000705K519126
$$ 12491 342620 551465 1499569 2040032 111925 -3708874 -6082033 -5081328 -2562202
38241b562202J231872l23347k48204O43084J003452P51355J62404q09276j630944
$$ -2562202 -1330330 -1653677 -1901881 -1258797 -255345 496010 658414 -150862 -1781806
38232a781806j232669M09326J962919K372765J708399L70160j235670k201407
$$ -1781806 -3014475 -2605149 -642230 1730535 3438934 3809094 2573424 372017
38224C72017j700017k35876Q65656J202455J381653J609782J501264J003632K20695
$$ 372017 -1328000 -1563876 -698220 504235 1885888 3495670 4996934 6000566 6221261
38215F221261j139116k685126k628832j67972K311036J979288j55918p29170O17746
$$ 6221261 5082145 2397019 -231813 -399785 1911251 3890539 3734621 3005451 3623197
38206C623197R24303p76939j770290m90468P32418j88950j481429o35205J420321
$$ 3623197 4547500 3770561 2000271 1509803 2242221 2053271 571842 -63363 1356958
38197A356958K035309P93057q80958k386754l594346l271758o74185K214918K664302
$$ 1356958 3392267 4185324 3304366 917612 -2676734 -5948492 -6622677 -4407759 -1743457
38188a743457Q83178n37576l47075M16024P97296J000361J069557M21658j005950
$$ -1743457 -860279 -1397855 -1744930 -1328906 -531610 468751 1538308 1959966 954016
38179I54016k420760l019553k285532n8653K518578L028323M85637k581964k713294
$$ 954016 -1466744 -4486297 -6771829 -6830482 -4311904 -1283581 -797944 -3379908 -6093202
38170f093202M8152K245474J659423m9356j3087K013873L576825K646722o6799
$$ -6093202 -6045050 -3799576 -2140153 -2189509 -2202596 -188723 3388102 6034824 5968025
38161E968025k034599j845492p19563n92107j227563o61845J408564K582129J085048
$$ 5968025 3933426 2087934 1368371 776264 -451299 -1113144 295420 2877549 3962597
38152C962597j491737k292177q76211P82473J161223N10940j81237k54610L01339
$$ 3962597 2470860 178683 -697528 84945 1246168 1757108 1575871 1321261 1622600
38143A622600P91863N70432J58567N11211R92121J3873j774973j597673Q70408
$$ 1622600 2414463 2984895 3143462 3654673 4646794 4660667 2885694 1288021 2158429
38134B158429K084420L5959k036050o28888K118650J807084r73159j822830L1257
$$ 2158429 4242849 4278808 2242758 1613870 3732520 5539604 4566445 2743615 2774872
38125B774872R10128n52142j260281L68857J298496q48648l524355l258340q11200
$$ 2774872 3685000 3132858 1872577 2241434 3539930 2691282 -833073 -4091413 -4902613
38116d902613P53007P90643Q11171J133689P61770k30652n99465Q1122R37441
$$ -4902613 -4149606 -3358963 -2547792 -1414103 -652333 -882985 -1482450 -1401328 -463887
38107d63887J034590J50667j139883j592268l81886J552240K399682J884979J239360
$$ -463887 570703 721370 -418513 -2010781 -2392667 -840427 1559255 3444234 4683594
38098D683594P18888o63148k515277k748066q71559Q50010P94849J59522L85007
$$ 4683594 5402482 4739334 2224057 -524009 -1395568 -545558 249291 408813 793820
38089G93820Q58998P42664O12490N84960n75588k563433k618900J03196K228009
$$ 793820 1652818 2395482 3007972 3592932 3017344 453911 -2164989 -2061793 166216
38080A66216J179991m89468M99585K240446P97683k757391l778879j527871K24913
$$ 166216 1346207 856739 1356324 3596770 4394453 1637062 -2141817 -3669688 -3444775
38071c444775l7209K77718K127460K610267L63085j560365p35238P70449M14783
$$ -3444775 -3481984 -3204266 -1076806 1533461 1896546 336181 -399057 371392 786175
38062G86175n52975r0009N14497p47733k259235j111388J675556K314729P1230
$$ 786175 233200 143191 657688 -90045 -2349280 -3460668 -1785112 529617 600847
38053F00847j799137j041633R25421J908056J728484J203451N59099q7117l43451
$$ 600847 -1198290 -2239923 -1314502 593554 2322038 3525489 4084588 3997471 3654020
38044C654020n03893j415426k685796k590664o55804J199450J288060N79197R65820
$$ 3654020 3150127 1734701 -951095 -3541759 -4197563 -2998113 -1710053 -1130856 -165036
38035a65036K105728J911138p0849j699568j219887K71807M40775j008241k002451
$$ -165036 1940692 3851830 3780981 2081413 861526 1133333 1574108 565867 -1436584
38026a436584j031559P56794J050580o11277k200089j645461P26756K630618K431239
$$ -1436584 -2468143 -1711349 -660769 -1272046 -3472135 -5117596 -4390840 -1760222 671017
38017F71017Q14250k97492j48802P2171r01611k301512k032959L28761K409138
$$ 671017 1485267 1187775 1038973 1111144 209533 -2091979 -4124938 -3796177 -1387039
38008a387039J921960j16907o97245Q47537J840186L14965j911771j891874J35360
$$ -1387039 534921 418014 -279231 568306 2408492 2723457 811686 -1080188 -944828
37999i44828J316853M54721p25942o75749j6004K76110N30164J070570J109072
$$ -944828 372025 826746 100804 -574945 -590949 -314839 215325 1285895 2394967
37990B394967L86868K40774J331074J911836M88143j254608q56379O61376K04024
$$ 2394967 2781835 3022609 4353683 6265519 6753662 5499054 4642675 5304051 5508075
37981E508075k138146k915212r00050R16833L18937p74786k13135M65261p54280
$$ 5508075 3369929 454717 -445333 471500 790437 15651 -197484 267777 -486503
37972d86503j928534n2942L172763K974717j339269n031921m432782j186416J163010
$$ -486503 -2415037 -2467979 704784 3679501 2340232 -2691689 -7124471 -8310887 -7147877
37963g147877J666548J404301R98091O22170P29668J147506Q59015j30169k79303
$$ -7147877 -5481329 -4077028 -3078937 -2456767 -1727099 -579593 279422 149253 -130050
37954a30050J033174K289682K255539J684383J199325k90952k967563m029393
$$ -130050 903124 3192806 5448345 7132728 8332053 8041101 5073538 1044145
37946A044145j204573L003385L872632Q15987k016042j692905K8035K09580r58076
$$ 1044145 -160428 2842957 6715589 7531576 5515534 3822629 3850664 4060244 3102168
37937C102168j217712K871R63603K94170j199708j630121k82477J460130J503831
$$ 3102168 1884456 1887327 2850930 3145100 1945392 315271 32794 1492924 2996755
37928B996755m34348k008617p68260K519735M223843K111577j740517l401761
$$ 2996755 2562407 553790 -214470 2305265 6529108 8640685 6900168 3498407
37920C498407j880348L0983j75582j496940j444955l4849M22353o65613r31278
$$ 3498407 1618059 1649042 1473460 -23480 -1468435 -1503284 -1080931 -1746544 -2677822
37911b677822J078302L081705K260419l36819j345950j67055O30790j55763p64978
$$ -2677822 -1599520 1482185 3742604 3405785 2059835 1892780 2523570 2367807 1602829
37902A602829j03297K80075o76698j325593k02183J268066J177321K06290l5985
$$ 1602829 1499532 1779607 1102909 -222684 -424867 843199 2020520 2226810 2190825
37893B190825J03071m01514p36222K58162J425544R63821l62310o15428l03658
$$ 2190825 2293896 1892382 1156160 1414322 2839866 3803687 3441377 2825949 2522291
37884B522291j349639l053290k617507K15487K411144K082063O72051l1146k33897
$$ 2522291 1172652 -1880638 -4498145 -4282658 -1871514 210549 882600 851454 617557
37875F17557n18868m61430n457n2043o91018q39677l38682k28118l57439O89846
$$ 617557 98689 -362741 -368198 -420241 -1111259 -1950936 -2289618 -2517736 -2875175 -2185329
37865b185329K466439K395598J0225j525585j15323J828092J164449j150186k021540
$$ -2185329 281110 2676708 2686933 1161348 1046025 2874117 4038566 2888380 866840
37856H66840j183830r19090j866795k318510j298576M34344K252827L952910M318971
$$ 866840 -316990 -1236080 -3102875 -5421385 -6719961 -6285617 -4032790 -79880 4239091
37847D239091K057489j549823l368049k344956o03826p4561k25223K7800L14781
$$ 4239091 6296580 4746757 1378708 -966248 -1570074 -1644635 -1869858 -1842058 -1527277
37838a527277K3258k48638N1420J20124o88207j227865k13838J354700J392827
$$ -1527277 -1504019 -1752657 -1701237 -1581113 -2269320 -3497185 -3711023 -2356323 -963496
37829i63496m7942q01867N2213Q70179K00594q77197m57013J282993K339463J544304
$$ -963496 -1011438 -1813305 -1761092 -890913 -690319 -1567516 -2024529 -741536 1597927 3142231
37819C142231k83292j601188j536247k40374J172234J268603j62592j506622j271062
$$ 3142231 2858939 1257751 -278496 -518870 653364 1921967 1759375 252753 -1018309
37810a018309j38290K81990J25381O81483J468957N92787j572029k076719o3964
$$ -1018309 -1156599 -874609 -749228 -67745 1401212 1993999 421970 -1654749 -1718713
37801a718713J312547j71914j806898j13153L152960L272688j02393k267432n07449
$$ -1718713 -406166 -578080 -2384978 -2498131 654829 3927517 3825124 1557692 1050243
37792A050243K166325J806303j053358k839723j788629O96027K409809K373269
$$ 1050243 3216568 5022871 3969513 1129790 -658839 37188 2446997 4820266
37784D820266R14844j122635l043912m211611l518917k41310L763410M530487
$$ 4820266 5735110 4612475 1568563 -2643048 -6161965 -6403275 -2639865 1890622
37776A890622P81236l270311k840874Q03782K321077L07271j171910L29803J827135
$$ 1890622 2671858 -598453 -3439327 -2635545 -314468 -7197 -1179107 -849304 977831
37767I77831K75662k385690k579879l88989J615530K410210K370395J214220q35900
$$ 977831 1253493 -1132197 -3712076 -4101065 -2485535 -75325 2295070 3509290 2673390
37758B673390j654106m1966J641830P57372j271880j283857K63802J31340k084072
$$ 2673390 1019284 977318 2619148 3376520 2104640 820783 1084585 1215925 -868147
37749h68147l165647j450754Q28663J373966R43873J211200J842031J407962k12880
$$ -868147 -4033794 -5484548 -4655885 -3281919 -2338046 -1126846 715185 2123147 1910267
37740A910267j750117k085060j088844M54714J379103J175144N48154L35756K35953
$$ 1910267 160150 -1924910 -3013754 -2559040 -1179937 -4793 543361 879117 1115070
37731A115070m39310j205912r34889K50976R83206O04557j03862k88387k8556
$$ 1115070 675760 -530152 -1465041 -1214065 -230859 373698 269836 -18551 -47107
37722d7107K20808K88861J63627j65945o27780j144817j568082j347587L9244
$$ -47107 173701 462562 626189 460244 -167536 -1312353 -2880435 -4228022 -4188778
37713d188778J951681K790644J912835L81214p10252j366374j508853m29261J378998
$$ -4188778 -2237097 553547 2466382 2847596 2137344 770970 -737883 -1167144 211854
37704B11854J691286l80162k414504j878718J05214N83915p32160j452244m21860
$$ 211854 1903140 1522978 -891526 -2770244 -2665030 -2081115 -2813275 -4265519 -4687379
37695d687379R25786J083746K39554n04480j37348J607308L177657J848931k586418
$$ -4687379 -3761593 -2677847 -2438293 -2942773 -3080121 -1472813 1704844 3553775 967357
37686I67357n970653m242407J039990M449829L499213P84669m80833o650Q98073
$$ 967357 -5003296 -9245703 -8205713 -3755884 -256671 527998 47165 40515 938588
37677I38588J415003J174427J72503p10291o85287m40664q57645j024177K08347
$$ 938588 2353591 3528018 3700521 2990230 2304943 1864279 1006634 -17543 190804
37668A90804J508985P81091j037597j213294O8732m7771j952516k642136p81451
$$ 190804 1699789 2480880 1443283 229989 298721 250950 -1701566 -4343702 -5125153
37659e125153J131109J028810K13075L53445O90764R8766p24603q46148n45924
$$ -5125153 -3994044 -2965234 -2752159 -2398714 -1707950 -1609184 -2333787 -3179935 -3725859
37650c725859R3035J540969K734668J554678j419972k788458j333882K25071O0599
$$ -3725859 -3632824 -2091855 642813 2197491 777519 -2010939 -3344821 -3119750 -3059151
37641c059151K4779J420092J916033k43500k452227j735513M21642J010880O48596
$$ -3059151 -3034372 -1614280 301753 58253 -2393974 -4129487 -3707845 -2696965 -2048369
37632b048369J680116L216389K434261l91238k216484j898584r87454m35138K16097
$$ -2048369 -368253 2848136 5282397 4891159 2674675 776091 -211363 -646501 -430404
37623d30404Q10084O66534K43457K43321l7622j042932j089363R39240K652414
$$ -430404 379680 1046214 1289671 1532992 1495370 452438 -636925 302315 2954729
37614B954729J386807j073294r67252J377247K294071Q94544k20477j83413q76036
$$ 2954729 4341536 3268242 2300990 3678237 5972308 6866852 6646375 6462962 5586926
$$ [...]
##END NTUPLES=NMR SPECTRUM
##END=
