##TITLE=31Pdec_SR49_mat_rep
 CDCl3, 24 sc
 26.04.2021
##JCAMPDX= 6.0         $$ Bruker NMR JCAMP-DX V2.0
##DATA TYPE= NMR SPECTRUM
##DATA CLASS= NTUPLES
##ORIGIN= UXNMR, Bruker Analytische Messtechnik GmbH
##OWNER= root
$$ XWIN-NMR		Version 3.5
$$ Mon Apr 26 14:44:45 2021 Russian Standard Time (UT+4h)  she@DPX200
##.OBSERVE FREQUENCY= 81.013821
##.OBSERVE NUCLEUS= ^31P
##.ACQUISITION MODE= SIMULTANEOUS
##.ACQUISITION SCHEME= undefined
##.AVERAGES= 24
##.DIGITISER RES= 16
##SPECTROMETER/DATA SYSTEM= spect
##.PULSE SEQUENCE= zgpg30
##.SOLVENT NAME= D2O
##.SHIFT REFERENCE= (INTERNAL, D2O, 0, 248.564)
##AUDIT TRAIL= $$ (NUMBER, WHEN, WHO, WHERE, WHAT)
$$ ##TITLE= Audit trail, XWIN-NMR		Version 3.5
$$ ##JCAMPDX= 5.01
$$ ##ORIGIN= Bruker BioSpin GmbH
$$ ##OWNER= she
$$ F:/spectra/data/she/nmr/P31/1/pdata/1/auditp.txt
$$ ##AUDIT TRAIL=  $$ (NUMBER, WHEN, WHO, WHERE, WHAT)
(   1,<2021-04-26 14:36:20.95 +0400>,<she>,<DPX200>,
      <created by zg, POWCHK disabled, PULCHK disabled
       configuration hash MD5:
       00 E9 B6 7A A2 85 ED C7 34 08 36 98 17 FE 4E 26
       data hash MD5: 32K
       9B AC 05 C4 0D DA 9F 89 D5 BC 9B C4 D6 A6 92 EB>)
(   2,<2021-04-26 14:37:29.17 +0400>,<she>,<DPX200>,
      <Start of raw data processing
       efp BC_mod = 2 LB = 1 FT_mod = 6 PKNL = 1 PHC0 = -5507.458 PHC1 = 88.6015 SI = 64K 
       data hash MD5: 64K
       AC 5F 22 D3 33 74 2B 8A C6 F8 39 69 E6 29 96 25>)
(   3,<2021-04-26 14:38:00.65 +0400>,<she>,<DPX200>,
      <pk PHC0 = 91.80214 PHC1 = -203.4001 
       data hash MD5: 64K
       01 3B 15 AA 40 B0 14 3E 66 03 A9 5C 5E DC BE 55>)
(   4,<2021-04-26 14:38:03.79 +0400>,<she>,<DPX200>,
      <abs ABSG = 5 
       data hash MD5: 64K
       58 A7 49 E0 A7 2B A4 40 CD 24 3E 85 87 A7 94 B9>)
$$ ##END=
$$ 
$$ hash MD5
$$ 2A 7E 7F 28 C4 A7 75 F8 8E E2 2E 8D 46 7A 8F F5
##$RELAX= 
##$RELAX= 
##$RELAX= 
##$RELAX= 
##$RELAX= 
##$RELAX= 
##$RELAX= 
##$RELAX= 
$$ Bruker specific parameters
$$ --------------------------
##$DU= <F:/spectra>
##$EXPNO= 1
##$NAME= <P31>
##$PROCNO= 1
##$TYPE= <nmr>
##$USER= <she>
##$AMP= (0..31)
100 100 100 100 100 100 100 100 100 100 100 100 100 100 100 100 100 100 
100 100 100 100 100 100 100 100 100 100 100 100 100 100 
##$AQSEQ= 0
##$AQ_mod= 1
##$AUNM= <au_zg>
##$AUTOPOS= <>
##$BF1= 81.014009
##$BF2= 200.13
##$BF3= 200.13
##$BF4= 200.13
##$BF5= 200.13
##$BF6= 200.13
##$BF7= 200.13
##$BF8= 200.13
##$BYTORDA= 1
##$CFDGTYP= 0
##$CFRGTYP= 5
##$CHEMSTR= <none>
##$CNST= (0..31)
1 1 145 1 1 1 1 1 1 1 1 1 1 1 1 1 1 1 1 1 1 1 1 1 1 1 1 1 1 1 1 1 
##$CPDPRG= <waltz16>
##$CPDPRG1= <>
##$CPDPRG2= <waltz16>
##$CPDPRG3= <>
##$CPDPRG4= <mlev>
##$CPDPRG5= <mlev>
##$CPDPRG6= <mlev>
##$CPDPRG7= <mlev>
##$CPDPRG8= <mlev>
##$CPDPRGB= <>
##$CPDPRGT= <>
##$D= (0..31)
0 1 0 0 0 0 0 0 0 0 0 0.03 2e-05 3e-06 0 0 0 0 0 0 0 0 0 0 0 0 0 0 0 0 
0 0 
##$DATE= 1619433380
##$DBL= (0..7)
120 120 120 11 120 120 24 19 
##$DBP= (0..7)
150 150 150 150 150 150 150 150 
##$DBP07= 0
##$DBPNAM0= <>
##$DBPNAM1= <>
##$DBPNAM2= <>
$$ [...]
##$SUBNAM3= <"">
##$SUBNAM4= <"">
##$SUBNAM5= <"">
##$SUBNAM6= <"">
##$SUBNAM7= <"">
##$SUBNAM8= <"">
##$SUBNAM9= <"">
##$SW= 501.771253377433
##$SWIBOX= (0..15)
0 1 3 0 0 0 0 0 0 0 0 0 0 0 0 0 
##$SW_h= 40650.406504065
##$TD= 32768
##$TD0= 1
##$TE= 0
##$TE2= 300
##$TE3= 300
##$TEG= 300
##$TL= (0..7)
0 120 53 12 22 120 120 120 
##$TP= (0..7)
150 150 150 150 150 150 150 150 
##$TP07= 0
##$TPNAME0= <>
##$TPNAME1= <>
##$TPNAME2= <>
##$TPNAME3= <>
##$TPNAME4= <>
##$TPNAME5= <>
##$TPNAME6= <>
##$TPNAME7= <>
##$TPOAL= (0..7)
0.5 0.5 0.5 0.5 0.5 0.5 0.5 0.5 
##$TPOFFS= (0..7)
0 0 0 0 0 0 0 0 
##$TUNHIN= 0
##$TUNHOUT= 0
##$TUNXOUT= 0
##$USERA1= <user>
##$USERA2= <user>
##$USERA3= <user>
##$USERA4= <user>
##$USERA5= <user>
##$V9= 5
##$VALIST= <valist>
##$VCLIST= <CCCCCCCCCCCCCCC>
##$VD= 0
##$VDLIST= <DDDDDDDDDDDDDDD>
##$VPLIST= <PPPPPPPPPPPPPPP>
##$VTLIST= <TTTTTTTTTTTTTTT>
##$WBST= 1024
##$WBSW= 4
##$XGAIN= (0..3)
0 0 0 0 
##$XL= 0
##$YL= 0
##$YMAX_a= 6152
##$YMIN_a= -6798
##$ZGOPTNS= <>
##$ZL1= 120
##$ZL2= 120
##$ZL3= 120
##$ZL4= 120
##$ABSF1= 248.5645
##$ABSF2= -253.2056
##$ABSG= 5
##$ABSL= 3
##$ALPHA= 0
##$AQORDER= 0
##$ASSFAC= 0
##$ASSFACI= 0
##$ASSFACX= 0
##$ASSWID= 0
##$AUNMP= <proc_1d>
##$AZFE= 0.1
##$AZFW= 0.5
##$BCFW= 0
##$BC_mod= 2
##$BYTORDP= 0
##$COROFFS= 0
##$CY= -3
##$DATMOD= 1
##$DC= 0
##$DFILT= <>
##$DTYPP= 0
##$F1P= 0
##$F2P= 0
##$FCOR= 1
##$FTSIZE= 65536
##$FT_mod= 6
##$GAMMA= 0
##$GB= 0
##$INTBC= 1
##$INTSCL= 5.30512e-09
##$ISEN= 30
##$LB= 1
##$LEV0= 0
##$LPBIN= 0
##$MAXI= 10000
##$MC2= 0
##$MEAN= 0
##$ME_mod= 0
##$MI= 50
##$NCOEF= 0
##$NC_proc= -6
##$NLEV= 6
##$NOISF1= 182.463
##$NOISF2= 159.3651
##$NSP= 0
##$NTH_PI= 0
##$NZP= 0
##$OFFSET= 248.5645
##$PC= 4
##$PHC0= -5415.656
##$PHC1= -114.7986
##$PH_mod= 1
##$PKNL= yes
##$PPARMOD= 0
##$PSCAL= 0
##$PSIGN= 0
##$REVERSE= no
##$SF= 81.014009
##$SI= 65536
##$SIGF1= 159.3651
##$SIGF2= -187.1042
##$SINO= 113.3802
##$SIOLD= 16384
##$SREGLST= <1H.CDCl3>
##$SSB= 0
##$STSI= 65536
##$STSR= 0
##$SW_p= 40650.406504065
##$SYMM= 0
##$S_DEV= 0
##$TDeff= 32768
##$TDoff= 0
##$TI= <>
##$TILT= no
##$TM1= 0
##$TM2= 0
##$TOPLEV= 0
##$USERP1= <user>
##$USERP2= <user>
##$USERP3= <user>
##$USERP4= <user>
##$USERP5= <user>
##$WDW= 1
##$XDIM= 65536
##$YMAX_p= 338233145
##$YMIN_p= -15403494
$$ End of Bruker specific parameters
$$ ---------------------------------
##NTUPLES= NMR SPECTRUM
##VAR_NAME=  FREQUENCY,     SPECTRUM/REAL,   SPECTRUM/IMAG
##SYMBOL=    X,             R,               I
##VAR_TYPE=  INDEPENDENT,   DEPENDENT,       DEPENDENT
##VAR_FORM=  AFFN,          ASDF,            ASDF
##VAR_DIM=   65536,         65536,           65536
##UNITS=     HZ,            ARBITRARY UNITS, ARBITRARY UNITS
##FACTOR=    0.620285442955139, 1,           1
##FIRST=     20137.2065510759, 0,            0
##LAST=      -20513.1999529892, 0,           0
##MIN=       -20513.1999529892, -15403494,   0
##MAX=       20137.2065510759, 338233145,    0
$$ Real data points
##PAGE= N=1
##DATA TABLE= (X++(R..R)), XYDATA
$$ [...]
##PAGE= N=2
##DATA TABLE= (X++(I..I)), XYDATA
13123A616077n99865j580561L32236K125623L71790l115233l792159j014891J591678
$$ 1616077 1016212 -564349 -232113 1893510 2265300 -849933 -4642092 -5656983 -4065305
13114d065305J760203Q38394K50266o85590k276445k743895p46745K240603L620190
$$ -4065305 -2305102 -1466708 -1216442 -1902032 -4178477 -6922372 -7669117 -5428514 -1808324
13105a808324K556188J66927j966344k558400j065159J502467K935543J971642
$$ -1808324 747864 914791 -1051553 -3609953 -4675112 -3172645 -237102 1734540
13097A734540k64109j541662r38960M42537R70578L51380j86892K97645R38543
$$ 1734540 1470431 -71231 -1010191 -567654 402924 754304 567412 865057 1803600
13088A803600K93236j133747j274773J86887R43466l32433j630375p66613R91024
$$ 1803600 2096836 963089 -311684 -124797 818669 486236 -1144139 -1910752 -919728
13079i19728J034289k46703k22997J578923K831939K056931K93317r83225j348688
$$ -919728 114561 -132142 -355139 1223784 4055723 6112654 6405971 5422746 4074058
13070D074058q20146J49451K30121j170369k280683j221400P35539Q52810o70243
$$ 4074058 3253912 3403363 3633484 2463115 182432 -1038968 -303429 549381 -120862
13061a20862j083746L40826J413807Q30327l88515j489339k662980k841238n07173
$$ -120862 -1204608 -863782 550025 1380352 991837 -497502 -3160482 -6001720 -6508893
13052f508893K667617K890874L853j792619l70372J302000N63717o80590L8790
$$ -6508893 -3841276 -950402 -946549 -2739168 -3109540 -1807540 -1243823 -1924413 -1885623
13043a885623J196745K34184j756024j958950l98984Q37553J303958J901744K209216
$$ -1885623 -688878 -454694 -2210718 -4169668 -4568652 -3731099 -2427141 -525397 1683819
13034A683819J182094l92510q66080m24575m60890j002925r59189k59501K36857
$$ 1683819 2865913 2473403 1607323 1182748 721858 -281067 -1240256 -1499757 -1262900
13025a262900L67146M78954K58257p20620j852271k107719j202772M82017K165538
$$ -1262900 -895754 -416800 -158543 -879163 -2731434 -4839153 -6041925 -5559908 -3394370
13016c394370K589546J260868r4724N13714J885996J085294j420726j956382J27816
$$ -3394370 -804824 456044 361320 875034 2761030 3846324 2425598 469216 597032
13007E97032J009151r26319j901184O84005L313818K122549p22430j245189m15222
$$ 597032 1606183 679864 -1221320 -537315 2776503 4899052 4176622 2931433 2516211
12998B516211j177612k072357n1209K805678K026139j343526k266612l14887J02547
$$ 2516211 1338599 -733758 -784967 2020711 4046850 2703324 436712 121825 224372
12989B24372j940784k312163L83099K067273L40971j495950l21240J832682J704107
$$ 224372 -1716412 -4028575 -3645476 -1578203 -1237232 -2733182 -3054422 -1221740 482367
12980D82367k25639j534198j479741n00294J077402K044706R02220j153027j013982
$$ 482367 256728 -1277470 -2757211 -3257505 -2180103 -135397 766823 -386204 -1400186
12971a400186J277560J917608n97509k745897j565760Q62293J335069M74009N13382
$$ -1400186 -122626 1794982 1197473 -1548424 -3114184 -2251891 -916822 -442813 70569
12962G0569J068000N94877k16964K3204L06286r66327k485245j722431P32440
$$ 70569 1138569 1733446 1516482 1539686 1845972 879645 -1605600 -3328031 -2595591
12953b595591J729653K24240j407103j029302M52207P42039o53925j848288j099182
$$ -2595591 -865938 -641698 -2048801 -3078103 -2625896 -1883857 -2537782 -4386070 -5485252
12944e485252O76810R65477m49587n44537K230611M396879K033079k525012l295913
$$ -5485252 -4808442 -3842965 -4292552 -4837089 -2606478 1790401 3823480 1298468 -1997445
12935a997445L08808K551741N52766j495053K3662K001075M67945k164981j324553
$$ -1997445 -1688637 863104 1415870 -79183 -55521 1945554 2413499 248518 -1076035
12926a076035J573470J369453k143552l854898j423425J687244K031095N60105
$$ -1076035 497435 1866888 -276664 -4131562 -5554987 -3867743 -1836648 -1276543
12918a276543j62854K98465Q04174O04823k82207j097307o16190J058754J672035
$$ -1276543 -1439397 -1140932 -336758 268065 -14142 -1111449 -1727639 -668885 1003150
12909A003150j34892k005925r78663J522544J472650j274805k487659k40025K112891
$$ 1003150 868258 -1137667 -2116330 -593786 878864 -395941 -2883600 -3123625 -1010734
12900a010734J415074n66481n48340J008165J233706k96979j256874m29979Q54033
$$ -1010734 404340 -162141 -710481 297684 1531390 1234411 -22463 -452442 401591
12891D01591J138537N39507l06283j304046k282784k472106j394991K40978J159330
$$ 401591 1540128 2079635 1773352 469306 -1813478 -4285584 -5680575 -5439597 -4280267
12882d280267Q65290J9002m62836l01791K70197J099621K023304K387016J503147
$$ -4280267 -3414977 -3395975 -3858811 -4160602 -3890405 -2790784 -767480 1619536 3122683
12873C122683j74956j148441o22262N35816J092144R15521M72827k76068j448216
$$ 3122683 2947727 1799286 1177024 1712840 2804984 3720505 4193332 3917264 2469048
12864B469048k337124k124081j160937m63041j50108N54330J848839K822736K471275
$$ 2469048 131924 -1992157 -3153094 -3616135 -3766243 -3211913 -1363074 1459662 3930937
12855C930937O65612j694595l014565k091919L07809J633409M65199j335409r21502
$$ 3930937 4596549 2901954 -112611 -2204530 -1896721 -263312 201887 -1133522 -2055024
12846b055024J403577K298058P9650k608388k197265R82437L196767K363853N46293
$$ -2055024 -651447 1646611 1726261 -882127 -3079392 -2096955 1099812 3463665 4009958
12837D009958N27804J655387J147052j222025k539363j453663n32548j963068
$$ 4009958 4537762 6193149 7340201 6118176 3578813 2125150 1592602 -370466
12829c70466l449290j629211K075956L110799P72301q94384K23646J287263p5470
$$ -370466 -3819756 -5448967 -3373011 -262212 510089 -384295 -160649 1126614 1051144
12820A051144j610254n53680J578743J743946K64596n43945n32033r59796j300574
$$ 1051144 -559110 -1112790 465953 2209899 2474495 1930550 1398517 438721 -861853
12811h61853l78174O37600j16897j621282j437775K08510J158522J145877J406954
$$ -861853 -1240027 -602427 -719324 -2340606 -3778381 -3569871 -2411349 -1265472 141482
12802A41482J401668k89284k408076k261346k57314N92000m02148r08694J94689
$$ 141482 1543150 1253866 -1154210 -3415556 -3672870 -3080870 -3483018 -4391712 -4197023
12793d197023J525357K081298J905656L36754k512170l396038R8278L995065K327074
$$ -4197023 -2671666 -590368 1315288 1652042 -860128 -4256166 -4157888 -162823 2164251
12784B164251k959292l568811K318372O435350K861175l281886m495183j838628
$$ 2164251 -795041 -4363852 -2045480 4389870 7251045 3969159 -526024 -2364652
12776b364652q68362j658318k17637L093328L815118R56637j807241k216061j665498
$$ -2364652 -3233014 -4891332 -5108969 -2015641 1799477 2756114 948873 -1267188 -2932686
12767b932686j470170j192273p11555m55023J30954J389029J737155J41113j211048
$$ -2932686 -4402856 -5595129 -6306684 -6761707 -6630753 -5241724 -3504569 -3363456 -4574504
12758d574504k7895K054230K219878J252794J366614J374579r47667l424644k144941
$$ -4574504 -4602399 -2548169 -328291 924503 2291117 3665696 2718029 -706615 -2851556
12749b851556J435870K075851q54032k624184j095275O87588P37538R21004J996140
$$ -2851556 -1415686 660165 -193867 -2818051 -3913326 -3225738 -2488200 -1567196 428944
12740D28944J632663o00458j612422l04760M04264p81815j105417O25939J345899
$$ 428944 2061607 1461149 -151273 -456033 -51769 -833584 -1939001 -1313062 32837
12731C2837m63680j578512L8323J339833p944j082473P33147K590406J407581
$$ 32837 -430843 -2009355 -1971032 -631199 -639143 -1721616 -988469 1601937 3009518
12722C009518m19370J60535Q21186j369650l302772p73992L303455L048972m87828
$$ 3009518 2590148 2750683 3571869 2202219 -1100553 -1874545 1428910 4477882 3990054
12713C990054j362418Q93172J089730j798053k845732k10283J743564L70476j133511
$$ 3990054 2627636 3520808 4610538 2812485 -33247 -243530 1500034 1870510 736999
12704G36999k05491O99155o47069k034992j222539J44987K57773M31612J526619
$$ 736999 531508 1230663 583594 -1451398 -2673937 -2528950 -2271177 -1839565 -312946
12695c12946J409966o31854j274981J177653K687922l46594m426311l783723P11402
$$ -312946 1097020 465166 -809815 367838 3055760 2709166 -1717145 -5500868 -4789466
12686d789466L103544J330594q76406o24330P68969J488930J808313J892717P63796
$$ -4789466 -1685922 -355328 -1231734 -1856064 -1087095 401835 2210148 4102865 4866661
12677D866661j193242j747160k82627P83420m70671k565645k734636m68197K284602
$$ 4866661 3673419 1926259 1643632 2427052 1956381 -609264 -3343900 -3812097 -1527495
12668a527495L350091J950131p67644k185768n18778K596214L219764j07872l997829
$$ -1527495 1822596 3772727 3005083 819315 300537 2896751 6116515 6008643 2010814
12659B010814m125344o44900K133131J306548j280948j984378j23145J719238
$$ 2010814 -2114530 -2759430 -626299 680249 -600699 -2585077 -2708222 -988984
12651i88984J521013J13821o97587o66745o10635m74747N05081K044770K727268
$$ -988984 532029 645850 -51737 -718482 -1329117 -1803864 -1298783 745987 3473255
12642C473255J836093J55649j202253j756082j364908j30539J111447J223483
$$ 3473255 5309348 5464997 4262744 2506662 1141754 1011215 2122662 3346145
12634C346145J12761j078625j351182p69172k2403K09556l71553j172246r83547
$$ 3346145 3458906 2380281 1029099 259927 237524 447080 75527 -1096719 -2080266
12625b080266L15486J084237K49598p25654j46821P35465l40008k239959j578503
$$ -2080266 -1764780 -680543 -430945 -1156599 -1303420 -567955 -907963 -3147922 -4726425
12616d726425J579388L139344J230973r24479l92150R94775L82555j153570r81188
$$ -4726425 -3147037 -7693 1223280 298801 -93349 901426 1283981 130411 -850777
12607h50777K90445L49390k41938Q06254K743189K380703n93905k772324k068076
$$ -850777 -560332 -210942 -452880 353374 3096563 5477266 4883361 2111037 42961
12598D2961k39455N38142N82460Q48491P39525m55994j717284j641458n63710
$$ 42961 -196494 341648 924108 1772599 2512124 2056130 338846 -1302612 -1866322
12589a866322R9156j19687n45143o45011l94768L67657J859581L406143L430992
$$ -1866322 -1767166 -1886853 -2431996 -3077007 -3471775 -3104118 -1244537 2161606 5592598
12580E592598J171738j842908l022806j755314j87861k10879q73873k88628J061107
$$ 5592598 6764336 4921428 1898622 143308 -44553 -255432 -1129305 -1417933 -356826
12571c56826J233525L37148K10943P65437M4039j593287j215319J360969K037434
$$ -356826 876699 1213847 1424790 2190227 2234266 640979 -574340 786629 2824063
12562B824063j294518m691516l767379k04456J398186O70461Q00469K273902K245186
$$ 2824063 1529545 -3161971 -6929350 -7133806 -5735620 -5065159 -4264690 -1990788 254398
12553B54398j19972k125674j872477m91970N48054J254413J614154J051098q160
$$ 254398 134426 -1991248 -3863725 -4355695 -3807641 -2553228 -939074 112024 103864
12544A03864l56319j28757n33254j413111j343258j65250Q02795J029861J111888
$$ 103864 -252455 -381212 -914466 -2327577 -3670835 -3836085 -3033290 -2003429 -891541
12535h91541J105853O73555M36837R82152J211622N0421j181256p86145J13116
$$ -891541 214312 887867 1324704 2306856 3518478 3568899 2387643 1601498 1714614
12526A714614m90546j677129j376626n88533j444279k238049L19353M367406M382933
$$ 1714614 1224068 -453061 -1829687 -2418220 -3862499 -6100548 -5781195 -1413789 2969144
12517B969144L860k748138p15066J872555P31414k085405k548820p46385J084645
$$ 2969144 2973004 224866 -490200 1382355 2113769 28364 -2520456 -3266841 -2182196
12508b182196K618312L795880K748704p41558k931573j263058J066603j50324
$$ -2182196 436116 4231996 6980700 6239142 3307569 2044511 3111114 2960790
12500B960790l333119l563042j24282K836379K387160k10350k205504k058977
$$ 2960790 -372329 -3935371 -4059653 -1223274 1163886 953536 -1251968 -3310945
12492c310945J24885K506346K610173M41085r02343L06699J448861k53242k783439
$$ -3310945 -3186060 -679714 1930459 2371544 1469201 1775900 3224761 2971519 188080
12483A88080k204346J016549K591078Q14340j415229j276772M53450J388479P60328
$$ 188080 -2016266 -999717 1591361 2405701 990472 -286300 167150 1555629 2315957
12474B315957k73236l25418O61177J129345k83020k411012k571483m76522J087125
$$ 2315957 2042721 1717303 2378480 3507825 3224805 813793 -1757690 -2234212 -1147087
12465a147087N81256k3409Q92455J513546Q7614j367036l80760J317973N42270
$$ -1147087 -565831 -589240 303215 1816761 1904375 537339 156579 1474552 2016822
12456B016822j725071j862899K44754J104465n50329k038061j285214N32984J616169
$$ 2016822 291751 -1571148 -1326394 -221929 -772258 -2810319 -4095533 -3562549 -1946380
12447a946380J742954J150682j63660j406768j435691n52414M583J11800L79930
$$ -1946380 -203426 947256 783596 -623172 -2058863 -2611277 -2606694 -2494894 -2114964
12438b114964M62373M632K38282J896795K743892N60247k438876k158353R85262
$$ -2114964 -1652591 -1647959 -1409677 487118 3231010 3791257 1352381 -805972 179290
12429A79290K600430J176343l08396k23281p52873k912179l822909j576860J081606
$$ 179290 2779720 3956063 3647667 3424386 2671513 -240666 -4063575 -5640435 -4558829
12420d558829R67657p27737r18519N32867J502778J277557P29431K64903J7187
$$ -4558829 -3591172 -4318909 -5237428 -4704561 -3201783 -1924226 -1194795 -929892 -912705
12411i12705P11237K130615K214219p686k088410j390133O78724O67392j468443
$$ -912705 -201468 1929147 4143366 4135680 2047270 657137 1335861 2003253 534810
12402E34810k259561j78680K021001J526816n62595j293590j99721N74824j59106
$$ 534810 -1724751 -1903431 117570 1644386 1081791 -211799 -411520 163304 4198
12393D198j070846o61769M79184Q26252L13597J54710O26641O09130l95500j251421
$$ 4198 -1066648 -1728417 -1249233 -422981 -109384 45326 671967 1281097 885597 -365824
12383c65824r17255N6010O87345J088892J652665J722161N50181j050037j491757
$$ -365824 -1283079 -1227069 -539724 549168 2201833 3923994 4474175 3424138 1932381
12374A932381n46093N26472O70070j60114j388045j980550q94150J452349K877582
$$ 1932381 1386288 1912760 2582830 2422716 1034671 -945879 -1840029 -387680 2489902
12365B489902J943594J7823o49545j32697l42520j877234l257029l126997j587622
$$ 2489902 4433496 4451319 3801774 3669077 3326557 1449323 -1807706 -4934703 -6522325
12356f522325N11329K140922K245795P85202o89409q19886k48375k69085n48035
$$ -6522325 -6010996 -3870074 -1624279 -839077 -1528486 -2348372 -2596747 -2865832 -3413867
12347c413867L0689J025241R74267k23970j351301j747717j391481K6397K099464
$$ -3413867 -3383178 -2357937 -1383670 -1607640 -2958941 -4706658 -6098139 -6071742 -3972278
12338c972278K823863J100897r05799n91343R71762Q73161o23097o77920Q90699
$$ -3972278 -1148415 -47518 -953317 -1544660 -572898 300263 -322834 -1000754 -110055
12329a10055J131088q06441j967763l31371K191239K925661J724460j58828j799635
$$ -110055 1021033 214592 -1753171 -2084542 106697 3032358 4756818 4597990 2798355
12320B798355k158944o17420J113838M43341j910669k376826j82507J112336o00094
$$ 2798355 639411 21991 1135829 1579170 -331499 -2708325 -2890832 -1778496 -2378590
12311b378590k408322j110756J789397K899897K119890J640666J660172N51550
$$ -2378590 -4786912 -5897668 -4108271 -1208374 911516 2552182 4212354 4763904
12303D763904j655147k991820k483109j152192k40435M5322K44392J034305K359107
$$ 4763904 3108757 116937 -2366172 -3518364 -3758799 -3713477 -3469085 -2434780 -75673
12294g5673K773900R53972j740933k196509O3226J674235J48894k354216k114496
$$ -75673 2698227 3652199 1911266 -285243 -222017 1452218 1601112 -753104 -2867600
12285b867600Q53491K960515J803905j185010k739767j251258J734911L204959
$$ -2867600 -2014109 946406 2750311 1565301 -1174466 -2425724 -690813 2514146
12277B514146K108540N50222N91518J076123j63148k120662k035846l99983l32501
$$ 2514146 4622686 5172908 5764426 6840549 6677401 4556739 2520893 2120910 1788409
12268A788409j801833j323324J482486K320320n43130k783072j114194J207517
$$ 1788409 -13424 -1336748 145738 2466058 1922928 -860144 -1974338 -766821
12260g66821M07592r99070R21604L692614K222665j972356k631099R66124K843894
$$ -766821 -359229 -1358299 -436695 3255919 5478584 3506228 875129 1841253 4685147
12251D685147K29885k229651m41940K759293K656170k79322k258772k183328j827278
$$ 4685147 4915032 2685381 2243441 5002734 7658904 7379582 5120810 2937482 1110204
12242A110204j725444o95032R47938R73177j213973k884069j312708K313572M052428
$$ 1110204 -615240 -1310272 -362334 610843 -603130 -3487199 -4799907 -2486335 1566093
12233A566093K234212m16848o95019O51023N70352j155492j625872O2631R64127
$$ 1566093 3800305 3383457 2688438 3339461 3909813 2754321 1128449 1191080 2155207
12224B155207q81598k980932k216859M62662K051648K025562J752383J197333
$$ 2155207 1273609 -1707323 -3924182 -3461520 -1409872 615690 2368073 3565406
12216C565406l37736j551486q16192M39866l43227k254699k078024K68395J544092
$$ 3565406 3227670 1676184 859992 1299858 956631 -1298068 -3376092 -3107697 -1563605
12207a563605O93779L03723J521919J727996o43607k594464r21683K395646K646631
$$ -1563605 -869826 -566103 955816 2683812 2040205 -554259 -1475942 919704 3566335
12198C566335q69250l814743k663922R95221L003829J806323m44957j289944p04938
$$ 3566335 2697085 -1117658 -3781580 -2786359 217470 2023793 1578836 288892 -416046
12189d16046k3076L21035O12387M61414n27628j252702m48630Q13559N66302l08011
$$ -416046 -439122 -118087 494300 955714 428086 -824616 -1273246 -459687 106615 -201396
12179b01396Q08864L025268K123345k352728m798392j464971L486959M029835
$$ -201396 607468 3632736 5756081 3403353 -1395039 -2860010 626949 4656784
12171D656784Q39198j139205q26367r72043j836897j082573O92987L31757j805681
$$ 4656784 5495982 4356777 3530410 2558367 721470 -361103 331884 663641 -1142040
12162a142040j859689P24095J940634R916j868328j240555R0375K86813M72178
$$ -1142040 -3001729 -2277634 -337000 -327084 -2195412 -3435967 -3345592 -3058779 -2586601
12153b586601J229432O81651j348592j717299N71163J664329q75508l298117j412022
$$ -2586601 -1357169 -675518 -2024110 -3741409 -3170246 -1505917 -2381425 -5679542 -7091564
12144g091564K459400L141432O29099o63348Q55936K384741J834865J99723j183741
$$ -7091564 -4632164 -1490732 -861633 -1524981 -669045 1715696 3550561 3750284 2566543
12135B566543k123057k135129n87109J497205K288112J757965J173707M80188
$$ 2566543 443486 -1691643 -2278752 -781547 1506565 3264530 4438237 4918425
12127D918425j224595l065387l109643j584434n56106l94806N13476K266088K729808
$$ 4918425 3693830 628443 -2481200 -4065634 -4621740 -5016546 -4503070 -2236982 492826
12118D92826J123770n29541o55079k10933k05873K68183J692855K150766J21883
$$ 492826 1616596 1087055 431976 221043 15170 283353 1976208 4126974 4248857
12109D248857k425385k439201k90623Q99633N5694o22095L39748J222828R2620
$$ 4248857 1823472 -615729 -906352 -6719 48975 -573120 -233372 989456 1082076
12100A082076j850441j988595k17073J076412O28437k37130q2849O07968P56087
$$ 1082076 -768365 -2756960 -2974033 -1897621 -1269184 -1506314 -1589163 -981195 -225108
12091b25108N59936P90376J157762P16874n21264j465042j256435k3083J362131
$$ -225108 334828 1125204 2282966 2999840 2478576 1013534 -242901 -265984 1096147
12082A096147J759906N94630j216431j916108j100739k44673l05586k73724O37592
$$ 1096147 2856053 3450683 2234252 318144 -782595 -1027268 -1332854 -1606578 -968986
12073i68986J086294m2918r32739O58930L182000K982741l5062k062988j180646
$$ -968986 117308 74390 -858349 -199419 2982581 5965322 5930260 3867272 2686626
12064B686626K13485l4704n64128J17411M12822j202624k549460r26244J917657
$$ 2686626 2900111 2865407 2301279 2418690 2831512 1628888 -920572 -1846816 70841
12055G0841J972577p41429k104675k14614K028256J669819j99957q11298K34102
$$ 70841 2043418 1301989 -802686 -1017300 1010956 2680775 2480818 1669520 1903622
12046A903622J246546J162346J45981j341378k436950j879577K30501J610645
$$ 1903622 3150168 4312514 4458495 3117117 680167 -1199410 -968909 641736
12038F41736N30506j460949j633271k21667K00643o32317J2829K844155M227289
$$ 641736 1172242 -288707 -1921978 -2143645 -1943002 -2575319 -2562490 281665 4508954
12029D508954J381644k789037l492759r27140O22962l05077q48621M81543J267761
$$ 4508954 5890598 3101561 -391198 -1318338 -695376 -1000453 -1849074 -1367531 -99770
12020i9770n3472j143787k443J397732Q12553j22899R15007K307031J232788j051195
$$ -99770 -153242 -1297029 -1299472 98260 910813 787914 1702921 4009952 5242740 4191545
12010D191545j259077P0607k90195k067978j746821Q53265J707776n26986k021575
$$ 4191545 2932468 3003075 2712880 644902 -1101919 -248654 1459122 932136 -1089439
12001a089439l35615J371249j59287k643173k060414Q24694K016589O47486l60854
$$ -1089439 -1425054 -53805 -213092 -2856265 -4916679 -4091985 -2075396 -1427910 -1788764
11992a788764O09063J780794J343081J09181j22497P88624J300858K55848j533580
$$ -1788764 -1179701 601093 1944174 2053355 1930858 2719482 4020340 4276188 2742608
11983B742608k030471o35511N84213l41020j944719j136743J683735K481875l78551
$$ 2742608 712137 76626 660839 319819 -1624900 -2761643 -1077908 1403967 1025416
11974A025416l177477k041241J593074L437801K237949K28716q45269j122467
$$ 1025416 -2152061 -4193302 -2600228 837573 3075522 3304238 2458969 1336502
11966A336502q33556P9454Q55285O51839O1998Q8826L43128J09502J11144R53167
$$ 1336502 502946 582400 1437685 2089524 2151522 2240348 2583476 2692978 2804122 3757289
11956C757289R96559j348647m054499l527604l4957K346881J603630J86222N02343
$$ 3757289 4753848 3405201 -649298 -4176902 -4211859 -1864978 -261348 -75126 427217
11947D27217J294464M12734j409040j945829r75711n9058J77965M66709J125160
$$ 427217 1721681 2134415 725375 -1220454 -2196165 -2255223 -2077258 -1610549 -485389
11938d85389J594326J523065J026090J40002q61566j030167J24837J378911J037973
$$ -485389 1108937 2632002 3658092 3798094 2936528 1906361 2031198 3410109 4448082
11929D448082o58953j804498j580642j158660j349850j081448N67165K226187
$$ 4448082 3789129 1984631 403989 -754671 -2104521 -3185969 -2618804 -392617
11921c92617J951929K51811p03255n33449q79235j916826j457275J139861K818239
$$ -392617 1559312 1811123 1107868 574419 -304816 -2221642 -3678917 -2539056 279183
11912B79183J015898j964382j928811R21058K235002N9967k422436j835690P32877
$$ 279183 1295081 -669301 -2598112 -1677054 557948 617915 -1804521 -3640211 -2907334
11903b907334J954603J017204j06983L457P37501R92218O13846P5998m71758j413064
$$ -2907334 -952731 64473 -42510 -39053 698448 1690666 2304512 2380510 1908752 495688
11893D95688k785860l301337j281094K546173M469777K003374k165130l067782
$$ 495688 -2290172 -5591509 -6872603 -4326430 143347 2146721 -18409 -3086191
11885c086191m5699K605391J955789N3878o3061J198688J632424Q27584j84962
$$ -3086191 -3131890 -526499 1429290 1483168 1420107 2618795 4251219 5078803 4893841
11876D893841j041478j711072j613563q15922m72134o20264L02951K126868J897473
$$ 4893841 3852363 2141291 527728 -288194 -760328 -1380592 -1077641 1049227 2946700
11867B946700j391331l857263j933444J814238K173906r28703k594355l82012
$$ 2946700 1555369 -2301894 -4235338 -2421100 -247194 -1175897 -3770252 -4152264
11859d152264K743124L264409J200450j417900l017212k601805j40128K365347
$$ -4152264 -1409140 1855269 3055719 1637819 -1379393 -3981198 -4121326 -1755979
11851a755979K559162R87202L00116R67130O43111j540523l082408j860934P57085
$$ -1755979 803183 1790385 2090501 3057631 3700742 2160219 -922189 -2783123 -2026038
11842b026038K143862J707356M33272j063025k383611k596028j187223R88871
$$ -2026038 117824 1825180 2258452 1195427 -1188184 -3784212 -4971435 -3982564
11834c982564K601725K906559J633064q48798k907674k816036j052930K21573
$$ -3982564 -1380839 1525720 3158784 2309986 -597688 -3413724 -4466654 -4245081
11826d245081M05359J046545K470695K401633l72132l212888k894853j56604J525085
$$ -4245081 -3839722 -2793177 -322482 2079151 1707019 -1505869 -4400722 -4557326 -3032241
11817c032241Q03194m50895n58173K7301M96784J092810J791637J424584m27914
$$ -3032241 -2229047 -2679942 -3238115 -3210814 -2714030 -1621220 170417 1595001 1167087
11808A167087j872161q32784J681325K355873J9123k472613k030565L92195J343198
$$ 1167087 -705074 -1537858 143467 2499340 2518463 45850 -1984715 -1592520 -249322
11799b49322k9808j047730L6489J432399J039830j70757j79421N54369K47938
$$ -249322 -279130 -1326860 -1290371 142028 1181858 1011101 831680 1386049 1633987
11790A633987p46943n40469Q17541J301987K55063q75319j227979j368004j193702
$$ 1633987 887044 346575 1164116 2466103 2721166 1845847 617868 -750136 -1943838
11781a943838K83285K423658K846633Q74226j175598j269744k09746J97834m25595
$$ -1943838 -1660553 763105 3609738 4483964 3308366 2038622 1828876 2026710 1601115
11772A601115j547222k755695l086871j229421K207957M339694L324026N68221
$$ 1601115 53893 -2701802 -5788673 -7018094 -4810137 -470443 2853583 3421804
11764C421804j506528k198674j885246o65899P85503Q90944n57880j483645n47997
$$ 3421804 1915276 -283398 -2168644 -2834543 -2049040 -1158096 -1715976 -3199621 -3747618
11755c747618P47684P55621L56477P47651Q08213n06238j256690M90912K487427
$$ -3747618 -2999934 -2244313 -1887836 -1140185 -331972 -838210 -2094900 -1603988 883439
11746H83439J236959j941012k384412N50165K432252R02948r21904j44126J225286
$$ 883439 2120398 179386 -2205026 -1654861 777391 1680339 758435 614309 1839595
11737A839595L44491j189020p0281K830078L404835M44233k669760k661411k04288
$$ 1839595 2184086 995066 924785 3754863 7159698 7603931 4934171 2272760 2068472
11728B068472J515361M68128k341495l721849j332847L196960N105680J903309
$$ 2068472 3583833 4051961 1710466 -2011383 -3344230 -147270 4958410 6861719
11720F861719l064290m472097j672368J032613N82043j245581j244045O97120
$$ 6861719 3797429 -674668 -2347036 -1314423 -732380 -1977961 -3222006 -2524886
11712b524886K107908J485367l08261j521065j226421J44941J392519J857390
$$ -2524886 -416978 1068389 760128 -760937 -1987358 -1842417 -449898 1407492
11704A407492K054434K409839J937421l70162l126692l555877j248660J095462
$$ 1407492 3461926 5871765 7809186 7439024 4312332 756455 -492205 603257
11696F03257J339072L26426k14287j09619O3611K04437j46523j748602l410736
$$ 603257 1942329 2268755 2054468 1944849 2008460 2212897 2066374 317772 -3092964
11687c092964k310477J564308M016212K239425r06195j481756n90914j547127
$$ -3092964 -5403441 -3839133 177079 2416504 1510309 28553 -562361 -2109488
11679b109488l137530j296997L256461M954898J677587k218607k651587p90704
$$ -2109488 -5247018 -6544015 -3287554 1667344 3344931 1126324 -1525263 -2315967
11671b315967N78472J124147J130484j70174j876952j065571K123218L164039
$$ -2315967 -1737495 -613348 517136 346962 -1529990 -2595561 -472343 2691696
11663B691696P3291k623474q40730K279704J551256j780459k654227q09672l15612
$$ 2691696 2764987 141513 -699217 1580487 3131743 1351284 -1302943 -2112615 -2428227
11654b428227j753279j537023R40041J906158Q0339r29281R67859K771065J746680
$$ -2428227 -4181506 -5718529 -4778488 -2872330 -2791991 -3721272 -2753413 17652 1764332
11645A764332k11384n04980j35723q22236j224371L42845K136265J693189K25454
$$ 1764332 1552948 1047968 912245 90009 -1134362 -791517 1344748 3037937 3263391
11636C263391M26608J422154R2790l175392m308084j657725J437701J638845P7928
$$ 3263391 3689999 5112153 5204943 2029551 -2278533 -3936258 -2498557 -859712 -781784
11627g81784k91212M94969J30702j509205j838564J15830J670003M07135j831212
$$ -781784 -1072996 -578027 -447325 -1956530 -3795094 -3679264 -2009261 -1602126 -3433338
11618c433338j374786J736820L532254J714140j281048k069545p97816J27325
$$ -3433338 -4808124 -3071304 460950 2175090 894042 -1175503 -1973319 -1845994
11610a845994k325L0030O19080Q62573N25427L05452J90336m84517j266323q06238
$$ -1845994 -1848319 -1818289 -1199209 -336636 188791 494243 684579 200062 -1066261 -1872499
11600a872499P87190J574898M60026j107698r51849J066154K813076K237126k85180
$$ -1872499 -1085309 489589 949615 -158083 -1109932 -43778 2769298 5006424 4721244
11591D721244k165280j584805J31455L86931p23153o13204J187227J701172n54627
$$ 4721244 2555964 971159 1102614 1489545 766392 153188 1340415 3041587 2486960
11582B486960k485012j136529J323154J155975o83376m89369J411176J134245
$$ 2486960 1948 -1134581 188573 1344548 661172 171803 1582979 2717224
11574B717224j692192k769963j51100K502643J709107q79178j788659p45496K09793
$$ 2717224 1025032 -1744931 -1896031 606612 2315719 1436541 -352118 -1097614 -887821
11565h87821K00846k29513n71082l56711O75145J426911M21911j412663j499903
$$ -887821 -686975 -916488 -1487570 -1844281 -1169136 257775 679686 -732977 -2232880
11556b232880J72752P64447m39580m84409J921079L370483J017440k416059k553344
$$ -2232880 -2060128 -1295681 -1735261 -2219670 -298591 3071892 4089332 1673273 -880071
11547h80071J33163J656962P66989j42829K64683M11133r56091k521468k355307
$$ -880071 -746908 910054 1677043 1534214 1798897 2210030 1253939 -1267529 -3622836
11538c622836m46016J521058K136778J601606J176089J245959N99928j344408
$$ -3622836 -4068852 -2547794 -411016 1190590 2366679 3612638 4212566 2868158
11530B868158k595010j094918J496029J660797m45597j126616O46434J538928
$$ 2868158 273148 -821770 674259 2335056 1889459 762843 1409277 2948205
11522B948205j59692j511814l84830O70904n87264j589093K54192K175977O15476
$$ 2948205 2788513 1276699 891869 1562773 975509 -613584 -359392 1816585 2432061
11513B432061k110876j530553J027976N99800k650529l507398m55459K127050
$$ 2432061 321185 -1209368 -181392 418408 -2232121 -5739519 -6194978 -4067928
11505d067928J563421O91105K047955L396414J877498j220254k702478j769312
$$ -4067928 -2504507 -1813402 234553 3630967 5508465 4288211 1585733 -183579
11497a83579J94547J910757K513429J541475R919k72999P24792J267969P55825
$$ -183579 10968 1921725 4435154 5976629 5986548 5713549 6438341 7706310 8462135
11488H462135K34842j87400j524384l109771k903355j295411j029862k298949
$$ 8462135 8696977 8509577 6985193 3875422 972067 -323344 -1353206 -3652155
11480c652155j893103J048836K657119M39768k108824p06204K976543M030824
$$ -3652155 -5545258 -4496422 -1839303 -1399535 -3508359 -4214563 -1238020 2792804
11472B792804J673190n69159q82175r08278j613470j571083k17197N85081l16613
$$ 2792804 4465994 3896835 3014660 2106382 492912 -1078171 -1295368 -710287 -1026900
11463a026900j178751j3402K239375K926509J269352p42593r90710K27255Q13777
$$ -1026900 -2205651 -2219053 20322 2946831 4216183 3473590 2482880 2710135 3523912
11454C523912k49861j507610j153708J91088L40482r79855j536315r4549J574573
$$ 3523912 3274051 1766441 612733 803821 1144303 164448 -1371867 -1466416 108157
11445A08157J520950N37892M03535Q31641M97513j36111K61095Q73377l12697
$$ 108157 1629107 2166999 2570534 3402175 3899688 3763577 4024672 4898049 4585352
11436D585352k580157k691828J11098K278155Q50788k130750k485863K58952K515095
$$ 4585352 2005195 -686633 -575535 1702620 2553408 422658 -2063205 -1804253 710842
11427G10842J745366n30292j442605o37201j04840r62875j875410j011588J254585
$$ 710842 2456208 1925916 483311 -153890 -258730 -1221605 -3097015 -4108603 -2854018
11418b854018K516872J305118r23539j529904o3227J241656N54656j141902j582941
$$ -2854018 -337146 967972 44433 -1485471 -1548698 -307042 247614 -894288 -2477229
11409b477229l15200R80680R48779K5691p01609q94820o81967M3564J205147K021441
$$ -2477229 -2792429 -1811749 -862970 -837279 -1538888 -2433708 -3115675 -3072111 -1866964 154477
11399A54477J781009Q57105K18202J43503J35131p2440k16286k05187l23723n77877
$$ 154477 1935486 2792591 3010793 3154296 3289427 3216987 3000701 2795514 2471791 1893914
11389A893914n36504r4855J79276k19829j069510j708893j625399o65337Q37353
$$ 1893914 1357410 1262555 1441831 1222002 152492 -1556401 -3181800 -3847137 -3009784
11380c009784K010521K080518J264134N06710K12876p5656n65854p12621l40742
$$ -3009784 -999263 1081255 2345389 2852099 3064975 2989319 2423465 1710844 1370102
11371A370102l21192j227803k028527j300315N42098J477794N17104r39717r05639
$$ 1370102 1048910 -178893 -2207420 -3507735 -2965637 -1487843 -970739 -1910456 -2816095
11362b816095P26445K203341K076037O46893p54952j276265r27623K1436J216626
$$ -2816095 -2089650 113691 2189728 2836621 2081669 805404 -122219 -100783 1115843
11353A115843J834428R99796r16943k202257j741681m24342K67662L84061R40271
$$ 1115843 2950271 3950067 3033124 830867 -910814 -1335156 -1067494 -683433 256838
11344B56838J720933J357623l14742j637850j331949P9138J473402K281704J966132
$$ 256838 1977771 3335394 3020652 1382802 50853 129991 1603393 3885097 5851229
11335E851229J24213k046655k280724m89356M71337j012462k426010r81351J476911
$$ 5851229 5975442 3928787 1648063 1158707 1630044 617582 -1808428 -2789779 -1312868
11326a312868J069625j508852j461592K368143M844935K080088k294589k372704
$$ -1312868 -243243 -1752095 -3213687 -845544 3999391 6079479 3784890 1412186
11318A412186J081794J993714j447462m024431j723655K133475K251478o55392
$$ 1412186 2493980 4487694 3040232 -984199 -2707854 -574379 1677099 1021707
11310A021707j650713M97232K047624Q02490p72543k37015R68091N94545n51046
$$ 1021707 -629006 -131774 1915850 2718340 1945797 1708782 2676873 3271418 2720372
11301B720372n24699K61930L26858J47739R10293J527753J07637k303778k650751
$$ 2720372 2195673 2457603 2784461 2932200 3842493 5370246 5477883 3174105 523354
11292E23354m75639J318248O66938j183761j944569r85910O86001J537903N22757
$$ 523354 47715 1365963 2032901 849140 -1095429 -2081339 -1395338 142565 665322
11283F65322j546322k119726j09439K015908J577955j86029m35528J72629j106805
$$ 665322 -881000 -3000726 -3110165 -1094257 483698 297669 -137859 34770 -1072035
11274a072035l314302k493014J368053L419428J496742n83635L81690K037397
$$ -1072035 -4386337 -6879351 -5511298 -2091870 -595128 -1178763 -797073 1240324
11266A240324J284269m41560n28207K807p92522j516604k16072J339397N77259
$$ 1240324 2524593 2083033 1554826 1557633 765111 -751493 -967565 371832 949091
11257I49091j090405q54104L48586m3564r56332L62064K602387J968129j269921
$$ 949091 -141314 -995418 -646832 -690396 -1646728 -1284664 1317723 3285852 2015931
11248B015931l025323j917672m76759J17554J296629K689225J747611j078324
$$ 2015931 -1009392 -2927064 -3403823 -3286269 -1989640 699585 2447196 1368872
11240A368872j832452O04862K369907R03654j064516m78154J090692O79269j044612
$$ 1368872 -463580 141282 2511189 3414843 2350327 1872173 2962865 3642134 2597522
11231B597522j462954m48785J57976m6711q5253L9500l83895q71368l29755Q49473
$$ 2597522 1134568 685783 843759 797048 711795 751295 367400 -503968 -833723 15750
11221A5750J049442l49718k146562k596609j046422J268684K075044O28712r19511
$$ 15750 1065192 715474 -1431088 -4027697 -5074119 -3805435 -1730391 -1101679 -2021190
11212b021190l04516J214448N36811k024908k583443J97646K436487P78592k300257
$$ -2021190 -2325706 -1111258 -574447 -2599355 -5182798 -4985152 -2548665 -1770073 -4070330
11203d070330k153353J247031L782218L212491J106288p55860k277954l001914
$$ -4070330 -6223683 -4976652 -1194434 2018057 3124345 2368485 90531 -2911383
11195b911383j575397J455946L020600J445054r73160j241378M3117K8755j666089
$$ -2911383 -4486780 -3030834 -10234 1434820 461660 -779718 -736601 -707846 -2373935
11186b373935k308684l37989K246663K883286J779795O00974m75255k061172k990243
$$ -2373935 -4682619 -5020608 -2773945 109341 1889136 2490110 2014855 -46317 -3036560
11177c036560j360269J859839L096471Q59062k181051k842660j071593J154693
$$ -3036560 -4396829 -2536990 559481 1418543 -762508 -3605168 -4676761 -3522068
11169c522068K387123J873933n27684k919519k166472J714966M194010J885880
$$ -3522068 -1134945 738988 211304 -2708215 -4874687 -3159721 1034289 2920169
11161B920169k409246l426311n95437K032048J998798P93815J64175l00335j196714
$$ 2920169 510923 -2915388 -3510825 -1478777 520021 1313836 1478011 1177676 -19038
11152a9038j727766j074814L92499J673447J691488j28064k389333k150948J071173
$$ -19038 -1746804 -2821618 -2429119 -755672 935816 807752 -1581581 -3732529 -2661356
11143b661356L381238J485967k076443k434370K78595J677770N23152R8293J764259
$$ -2661356 719882 2205849 129406 -2304964 -2026369 -348599 174553 272846 2037105
11134B037105K513014N95440j253844o13410P09404K60386j038283j221352o54101
$$ 2037105 4550119 5145559 3891715 3278305 3987709 4248095 3209812 1988460 1334359
11125A334359l83203J55551J141441P69977j483885k551322j8665L371645L101721
$$ 1334359 951156 1106707 2248148 3018125 1534240 -1017082 -1035747 2335898 5437619
11116E437619n42801k952488j800646K85389J55052j538144j762467O18591L412335
$$ 5437619 4894818 1942330 141684 427073 582125 -956019 -2718486 -2099895 1312440
11107A312440L778364J569810o41710r12242k20843m94234j502038j576133o84646
$$ 1312440 5090804 6660614 6018904 5106662 4885819 4391585 2889547 1313414 628768
11098F28768m13597j067099j242590m46983K59397M62236Q21889J102680L47556
$$ 628768 215171 -851928 -2094518 -2541501 -2282104 -1819868 -997979 104701 452257
11089D52257p80401o36127K38517k09814j377668l08540K895855M053256J091613
$$ 452257 -328144 -964271 -725754 -935568 -2313236 -2621776 274079 4327335 5418948
11080E418948k541520k993897j128577Q8435K45330O05348J068991Q87030M65732
$$ 5418948 2877428 -116469 -1245046 -1156611 -911281 -305933 763058 1650088 2115820
11071B115820J38677q47016k166787j726993P52316K221395Q07489j006984m93793
$$ 2115820 2254497 1407481 -759306 -2486299 -1733983 487412 1294901 287917 -205876
11062b05876R11637N67081o85452m82966O27837N95243r8792L03127J020578J13241
$$ -205876 705761 1272842 587390 104424 732261 1327504 1228712 1531839 2552417 2665658
11052B665658j466290j114027Q93296J860542J142918N29949N02482k88412j761669
$$ 2665658 1199368 85341 978637 2839179 3982097 4512046 5014528 4726116 2964447
11043B964447k016136o18782O21496O46908L89129N60715M65664m31133j474228
$$ 2964447 948311 329529 951025 1597933 1987062 2547777 3013441 2582308 1108080
11034A108080j735902q46898P92870J691555K59370k572104l339462n32409K704423
$$ 1108080 -627822 -1474720 -681850 1009705 1269075 -1303029 -4642491 -5174900 -2470477
11025b470477K783346P57171J17471J115182J060001n62902j315042k06964Q07534
$$ -2470477 312869 1070040 1187511 2302693 3362694 2799792 1484750 1277786 2085320
11016B085320L57746m86172p06138r22528j486258j291249L71380K369880K984067
$$ 2085320 2443066 1956894 1250756 328228 -1158030 -2449279 -2077899 291981 3276048
11007C276048J627216p84277k333873j594015L64539P04541j065950j714225O93349
$$ 3276048 4903264 4118987 1785114 191099 555638 1260179 194229 -1519996 -826647
10998h26647K795391P12272l064695k596581K208910M780702J485713l168081
$$ -826647 1968744 2681016 -383679 -2980260 -771350 4009352 5495065 2326984
10990B326984l451650k43110J553835L98186j040289q91973j89741j27741j45749
$$ 2326984 -1124666 -1367776 186059 584245 -456044 -1348017 -1537758 -1665499 -1811248
10981a811248N60352J426454J319650J16891j161278j496689p71696M19348J480010
$$ -1811248 -1250896 175558 1495208 1612099 450821 -1045868 -1817564 -1398216 81794
10972H1794K012071J643353M73806l87633P5708R50240K31671j888193k532687
$$ 81794 2093865 3737218 4211024 3823391 3899099 4849339 5081010 3192817 660130
10963F60130k73927K217886J741135q32334k101380j161673j75333m07789o76582
$$ 660130 386203 2604089 4345224 3512890 1411510 249837 74504 -333285 -1009867
10954a009867K2439R48526J273009J193504P99439l19845j742380k162417j289194
$$ -1009867 -987428 -38902 1234107 2427611 3227050 2907205 1164825 -997592 -2286786
10945b286786l44521j13645J34810J141553K206683K006624K97344j603531j886153
$$ -2286786 -2631307 -2744952 -2610142 -1468589 738094 2744718 3042062 1438531 -447622
10936d47622j02962J815196J311946j398878k994165j307695J487254J875207
$$ -447622 -550584 1264612 2576558 1177680 -1816485 -3124180 -1636926 238281
10928B38281L6215o65980J139630K895223J975075p07989k219099j452613p6011
$$ 238281 274496 -391484 748146 3643369 5618444 4910455 2691356 1238743 1162732
10919A162732P3327n94949l12925J041106J238778r58690l126820k130583J024038
$$ 1162732 1236059 641110 328185 1369291 2608069 1649379 -1477441 -3608024 -2583986
10910b583986K415416J176191L61497J086269M14255k674387l950564m52954L662028
$$ -2583986 -168570 1007621 1369118 2455387 2869642 195255 -3755309 -4208263 -546235
10901e46235K849346j146268k115709Q10082K385447N0031k521945j858894M84725
$$ -546235 2303111 1156843 -958866 -148784 2236663 2286694 -235251 -2094145 -1609420
10892a609420J570288J410300J273928Q24018n71277j855659j788525r75479p61816
$$ -1609420 -39132 1371168 2645096 3469114 2897837 1042178 -746347 -1721826 -2483642
10883b483642j189276j255173m07196R62868J931933J756652P34301N8785K05260
$$ -2483642 -3672918 -4928091 -5335287 -4372419 -2440486 -683834 50467 109252 314512
10874C14512K64907l02774n52552J15776O12899K47336L27870J628411K231854
$$ 314512 579419 276645 -275907 -160131 452768 700104 1027974 2656385 4888239
10865D888239N04173j690020j758692n35825k86316m16713Q20882J964087L68339
$$ 4888239 5392412 3702392 1943700 1407875 1121559 704846 1525728 3489815 3858154
10856C858154k390097k210525O79115J750279m68915k192944p69568J504361J798549
$$ 3858154 1468057 -742468 -63353 1686926 1218011 -974933 -1744501 -240140 1558409
10847A558409P95597J98793j96800p61278m84414P40384J060329k18311j099768
$$ 1558409 2354006 2552799 2355999 1594721 1110307 1850691 2911020 2692709 1592941
10838A592941k75053O08116m2820r94435n48405M81005L65596o20418r59926l57252
$$ 1592941 1317888 1926004 1883184 888749 340344 821349 1186945 566527 -393399 -750651
10828g50651L35449P68123J217577J646680J675659J194352N61633L63429O95265
$$ -750651 -415202 352921 1570498 3217178 4892837 6087189 6648822 7012251 7707516
10819G707516M42112j607627m227928m194773q22501K109899J425100o62276j89909
$$ 7707516 8149628 6542001 2314073 -1880700 -2703201 -593302 831798 169522 -20387
10810b0387K051072J933396j206631l763613l504329j636659O09755L014763L931916
$$ -20387 2030685 3964081 2757450 -1006163 -4510492 -6147151 -5537396 -2522633 1409283
10801A409283J515892k107902k535934L21577K003736O70191n67896J65071L91424
$$ 1409283 2925175 817273 -1718661 -1397084 606652 1276843 708947 874018 1265442
10792A265442j331781k071752K06430K489999J576488o26971o64715O04237j6107
$$ 1265442 -66339 -2138091 -1931661 558338 2134826 1507855 843140 1447377 1431270
10783A431270k210429k514461K21065L144074L204055M26663k634810l380899
$$ 1431270 -779159 -3293620 -3072555 71519 3275574 3702237 1067427 -2313472
10775b313472j346378J323402K068239Q05236l36515q2733P13572Q81901K78837
$$ -2313472 -3659850 -2336448 -268209 537027 200512 117779 831351 1713252 1992089
10766A992089p69866j667554j305537N45289J953858J046020r40234j166827O83611
$$ 1992089 1222223 -445331 -1750868 -1205579 748279 1794299 854065 -312762 370849
10757C70849K280970K163603Q72147p70293j942881j368427P08427J501550l21239
$$ 370849 2651819 4815422 5687569 4917276 2974395 1605968 2314395 3815945 3494706
10748C494706j653901K26730K329205M79800l102051k957404N06828K024589O67422
$$ 3494706 1840805 2067535 4396740 4876540 1774489 -1182915 -676087 1348502 2015924
10739B015924M55160J885457R64151k360273l041785j06781J163454j181400k155642
$$ 2015924 2471084 4356541 5320692 2960419 -81366 -188147 975307 -206093 -2361735
10730b361735P31437K522159k00755k925886j192775J769453J269040q42353n02459
$$ -2361735 -1630298 891861 691106 -2234780 -3427555 -1658102 -389062 -1231415 -1733874
10721a733874J213552J093394j33434l19823n22845j867380j842501J065067L159035
$$ -1733874 -520322 573072 439638 119815 -403030 -2270410 -4112911 -3047844 111191
10712A11191J310941j189658j99955J982034J057586j348872r71681R97569K34060
$$ 111191 1422132 232474 32519 2014553 3072139 1723267 751586 1749155 1983215
10703A983215k462817k416179N76637J992814M17485o71109N75561J652643O30516
$$ 1983215 -479602 -2895781 -2319144 -326330 91155 -579954 -4393 1648250 2278766
10694B278766p80113n94799M12992M98084m89651j341925r91132N41719K016756
$$ 2278766 1498653 903854 1316846 1814930 1325279 -16646 -1007778 -466059 1550697
10685A550697K197347J411997P25282k62220k571032m862035m312225q76579K431018
$$ 1550697 3748044 5160041 5885323 5623103 3052071 -1809964 -6122189 -6998768 -4567750
10676d567750L752400L486023J537159k013720l843342p22644L885821L216852
$$ -4567750 -815350 2670673 4207832 2194112 -1649230 -2371874 1513947 4730799
10668D730799k007757l768544N51269M077471K116937q74094n04391Q2876k119550
$$ 4730799 2723042 -1045502 -494233 3583238 5700175 4826081 4321690 4404566 2285016
10659B285016l022013P32717M192006K087470j898318j833216K47889p86110l112383
$$ 2285016 -736997 -4280 4187726 6275196 4376878 2543662 2791551 2005441 -1106942
10650a106942j561993K585348L858954J676868l65291j336053k168109j322743
$$ -1106942 -2668935 -83587 3775367 5452235 5086944 3750891 1582782 260039
10642B60039J953013L581842N52113l050623k527231m19384p65067r33142K399379
$$ 260039 2213052 5794894 6347007 3296384 769153 349769 -415298 -1348440 1050939
10633A050939M591285K55565n503438l931184K775475M965183J175458j228634
$$ 1050939 5642224 5897789 394351 -3536833 -761358 4203825 5379283 4150649
10625D150649L15087Q77978j101731j359859Q36174J017201j424066j816892P32918
$$ 4150649 4465736 5343714 4241983 2882124 3718298 4735499 3311433 1494541 2227459
10616B227459J672952k34255r50693O73690J023728o38438p94887O56057m51528
$$ 2227459 3900411 3666156 2715463 3389153 4412881 3774443 2979556 3635613 3184085
10607C184085l976243m178659O22759M679621L804197Q72738l52332n45281j193786
$$ 3184085 -792158 -4970817 -4348058 331563 4135760 5008498 4656166 4110885 2917099
10598B917099j341136o36055p69461j724974j037448J579456L089382J923295
$$ 2917099 1575963 939908 170447 -1554527 -2591975 -1012519 2076863 4000158
10590D000158N8660n71471k54745L02695Q37704P55667N7577q0454K43778p77231
$$ 4000158 4058818 3487347 3232602 3535297 4373001 5128668 5186245 5105791 5349569 4572338
10580D572338k468981j304338K338360K757264j544784l719736K75665L896746
$$ 4572338 2103357 799019 3137379 5894643 4349859 630123 905788 4802534
10572D802534R74461l228156j449892K356891N70408l640312k128065K851463
$$ 4802534 5776995 2548839 1098947 3455838 4026246 385934 -1742131 1109332
10564A109332K593364k131961k840081J115438K324701m63583j078428J491158
$$ 1109332 3702696 1570735 -1269346 -153908 2170793 1707210 628782 2119940
10556B119940J813277o47031p39029J808912K186210L72753M51842J397389n77243
$$ 2119940 3933217 3286186 2547157 4356069 6542279 6915032 7366874 8764263 8187020
10547H187020k740648l83635K476143n73686n002352k249994L809527K795343
$$ 8187020 5446372 5062737 7538880 6965194 1962842 -287152 3522375 6317718
10539F317718l109668k872019L032156L853062j120654j911403K650847L269633
$$ 6317718 3208050 336031 3368187 7221249 6100595 4189192 6840039 10109672
10531A0109672j335124k511344Q70109J072301j814136j22940M357235K625060
$$ 10109672 8774548 6263204 7133313 8205614 6391478 6268538 10625773 13250833
10523A3250833k658491p13837N691849L885656m152447m402215K469324K387845
$$ 13250833 10592342 9878505 15570354 19456010 15303563 10901348 13370672 15758517
10515A5758517m073357k423091O006325M684238n498630n794580M650649O146074
$$ 15758517 11685160 9262069 15268394 19952632 14454002 8659422 13310071 19456145
10507A9456145l578545m590600N652886O351074m746705m753830Q728590R986173
$$ 19456145 15877600 11287000 16939886 23290960 18544255 13790425 22519015 32505188
10499C2505188m197015n176303J0805435J1247691p256030m803103K3122367K4984085
$$ 32505188 28308173 23131870 33937305 45184996 37928966 33125863 56248230 81232315
10491H1232315p744888l715393N9927301P7300323l6264557j78992362j76257662
$$ 81232315 73487427 69772034 129699335 206999658 170735101 -8257261 -184514923
10484a84514923k9557106Q4049079O2836651m932506r569320K5432259K4709021
$$ -184514923 -214072029 -130022950 -67186299 -72118805 -81688125 -56255866 -31546845
10477c1546845m791523q910788J0007088J0636996n598488n514645Q532075P311535
$$ -31546845 -36338368 -45249156 -35242068 -24605072 -30203560 -35718205 -27186130 -19874595
10469a9874595o689896o130319Q042617J0399093j007115m975744J522650K369064
$$ -19874595 -26564491 -32694810 -24652193 -14253100 -15260215 -20235959 -18713309 -16344245
10461a6344245l140113j230230N767931L318739n286569m026478N021929N630236
$$ -16344245 -19484358 -20714588 -14946657 -11627918 -16914487 -20940965 -15919036 -10288800
10453a0288800j860517k508775L920683L622710l491467l677363L900595N777309
$$ -10288800 -12149317 -14658092 -10737409 -7114699 -10606166 -14283529 -10382934 -4605625
10445d605625l88901k803088J450846K669627j291423j998088J429181Q49871
$$ -4605625 -4994526 -7797614 -6346768 -3677141 -4968564 -6966652 -5537471 -4687600
10437d687600l393253k321258L600801M378046q06044k366220J447709K183745
$$ -4687600 -8080853 -10402111 -6801310 -2423264 -3229308 -5595528 -4147819 -1964074
10429a964074j977308l474633n84487K41059j825078q45298K694374K229447j238395
$$ -1964074 -3941382 -7416015 -8000502 -7759443 -9584521 -10429819 -7735445 -5505998 -6744393
10420f744393m53380L431124K441752k347055j991933L303335M165637m40154
$$ -6744393 -7197773 -3766649 -1324897 -3671952 -5663885 -2360550 1805087 1364933
10412A364933j726779J724359J540564l550640m583419O34783K990153j250085
$$ 1364933 -361846 1362513 2903077 -647563 -5230982 -4596199 -1606046 -2856131
10404b856131l988448m41595L009312J411826r20202m11744m05502k390238k024591
$$ -2856131 -6844579 -7286174 -4276862 -2865036 -3785238 -4196982 -4602484 -6992722 -9017313
10395i017313J543272K859054N58402J04465K718996K508651j806549l524603
$$ -9017313 -7474041 -4614987 -4056585 -3952120 -1233124 1275527 -531022 -4055625
10387d055625k79151J505300j188662k522641O20767K667332L74405q61496K294483
$$ -4055625 -4334776 -2829476 -4018138 -6540779 -5920012 -3252680 -2878275 -3739771 -1445288
10378a445288M219155O29995l431437k519708N89353J424493J181502J684642
$$ -1445288 2773867 3403862 -27575 -2547283 -1957930 -533437 648065 2332707
10370B332707N65267k752984l508731L46850L470694J763208j150239j080421
$$ 2332707 2897974 144990 -3363741 -3016891 453803 2217011 1066772 -13649
10362a3649M451n80102r55740J53122k37250k945113l365051M44688L296857J490870
$$ -13649 -9198 -589300 -1545040 -1391918 -1629168 -4574281 -7939332 -7494644 -4197787 -2706917
10352b706917j055173m15010O83437p05860j662899L55288J883273J02065j334838
$$ -2706917 -3762090 -4177100 -3493663 -4199523 -5862422 -5507134 -3623861 -3521796 -4856634
10343d856634P74197K833548J283667o41545M46612J161095j800328m138151j184036
$$ -4856634 -4082437 -1248889 34778 -606767 -160155 1000940 -799388 -4937539 -6121575
10334f121575L012148K200516j421427j744490M04804K2889j945665o52055K768531
$$ -6121575 -3109427 -908911 -2330338 -4074828 -3670024 -3647135 -5592800 -6244855 -3476324
10325c476324K661645q95713k153960J62518J091132j412333l153178j242972
$$ -3476324 -814679 -1710392 -3864352 -3701834 -2610702 -4023035 -7176213 -8419185
10317h419185J462525J681741L55636k22410N4515L62224P03646R63677N23254
$$ -8419185 -6956660 -5274919 -4919283 -5141693 -5087178 -4724954 -4021308 -3057631 -2534377
10308b534377l32028m91864J90425P71239P02753J20106o92150j005981m7124
$$ -2534377 -2866405 -3358269 -3167844 -2396605 -1693852 -1573746 -2265896 -3271877 -3319001
10299c319001J295051R96458p60745j223294N60127J927926J006740k99847o6274
$$ -3319001 -2023950 -1027492 -1788237 -3011531 -2451404 -523478 483262 183415 117141
10290A17141K39682j048354k359060j788812m91878m1092N43127J900619J802508
$$ 117141 356823 -691531 -3050591 -4839403 -5331281 -5372373 -4829246 -2928627 -1126119
10281a126119q29282k744533j280444Q78158L24166j054753J73662K333533J620690
$$ -1126119 -1955401 -4699934 -5980378 -5102220 -4778054 -5832807 -5659145 -3325612 -1704922
10272a704922p12584m90438J720090J616971r97053j936962j81402O87703o31425
$$ -1704922 -2417506 -2907944 -1187854 429117 -567936 -2504898 -2686300 -1998597 -2630022
10263b630022q85320J522873L382417J915086j119036k640901k060000k48964
$$ -2630022 -3515342 -1992469 1389948 3305034 2185998 -454903 -2514903 -2763867
10255b763867J967336K954685J213801j569932j762545P43356J891115k17635
$$ -2763867 -796531 2158154 3371955 1802023 39478 782834 2673949 2456314
10247B456314k195076q13934J930926K195834M1693j461264j123921m52761n04019
$$ 2456314 261238 -552696 1378230 3574064 3615757 2154493 1030572 577811 73792
10238G3792p29414o77814o29406n10055J48091J063066J315410P02523n8614n34379
$$ 73792 -655622 -1333436 -1962842 -2472897 -2324806 -1261740 53670 756193 697579 163200
10228A63200r70899j289229p21963Q66935K022089J190121r33094j867667o89715
$$ 163200 -807699 -2096928 -2818891 -1951956 70133 1260254 327160 -1540507 -2230222
10219b230222M86194l88719k011027j616623O96753K262439K197934K210958K593248
$$ -2230222 -1744028 -2132747 -4143774 -5760397 -5063644 -2801205 -603271 1607687 4200935
10210D200935J160336k222889l814780j415371J649405J436740m97483j19415
$$ 4200935 5361271 3138382 -676398 -2091769 -442364 994376 496893 377478
10202C77478K051179J917502j105665l131206k150071m99743k2747O34220K172367
$$ 377478 2428657 4346159 3240494 109288 -2040783 -2540526 -2563273 -1929053 243314
10193B43314K358155P4875j934177j260285K68362L7712p19130M96630K334301
$$ 243314 2601469 2676344 742167 -518118 -249756 -212044 -931174 -434544 1899757
10184A899757J468677j433888k278393k03414R13905j083409k945073j317410
$$ 1899757 3368434 1934546 -343847 -547261 366644 -716765 -3661838 -4979248
10176d979248J763178K209830L34326j90583J317067J665879m85373k215328j141901
$$ -4979248 -3216070 -1006240 -671914 -862497 454570 2120449 1635076 -580252 -1722153
10167a722153Q57114J000965k3155K04018J615243K099158J059438k01588j020458
$$ -1722153 -865039 135926 112771 316789 1932032 4031190 5090628 4889040 3868582
10158C868582j811409k377085k063538j309829r86452o41417M98085J435778P66496
$$ 3868582 2057173 -319912 -2383450 -3693279 -4679731 -5321148 -4823063 -3387285 -2620789
10149b620789m80578j57965J250760J310992p2836n01347M67318M06930j452880
$$ -2620789 -3101367 -3259332 -2008572 -697580 -770416 -1271763 -804445 -397515 -1850395
10140a850395k414621o42675J878238K556804J547029J09964j523309k696781
$$ -1850395 -4265016 -4907691 -3029453 -472649 1074380 1184344 -338965 -3035746
10132c035746j629544J485870L317779J815840o72420j234117p14969j218655
$$ -3035746 -4665290 -3179420 138359 1954199 1281779 47662 -667307 -1885962
10124a885962j829969n11528J637845J931871O08291m4856l7168j095443k348822
$$ -1885962 -3715931 -4227459 -2589614 -657743 -49452 -94308 -131476 -1226919 -3575741
10115c575741j010386K312505L298212K09895l163443k807894J95138J978472
$$ -3575741 -4586127 -2273622 1024590 1234485 -1928958 -4736852 -4541714 -2563242
10107b563242J374272M46791O39421R63960J18171j402220k038163j175598L05719
$$ -2563242 -1188970 -742179 -102758 861202 979373 -422847 -2461010 -3636608 -3330889
10098c330889J222054J158174K84215j098877k244392j969780j07847J604888
$$ -3330889 -2108835 -950661 -666446 -1765323 -4009715 -5979495 -6087342 -4482454
10090d482454J544316O45023R48812K060438J619545n10397j599033n51799K10853
$$ -4482454 -2938138 -2293115 -1344303 716135 2335680 1825283 226250 -325549 -114696
10081a14696q63125j494160K84802J961719J96852l375086m075057r23813K469347
$$ -114696 -977821 -2471981 -2187179 -225460 -28608 -3403694 -7478751 -8402564 -5933217
10072e933217L425209K850309K142891J014952o13180j439899q39479k8041m6581
$$ -5933217 -2508008 342301 2485192 3500144 2886964 1447065 607586 579545 532964
10063E32964k35991L02994J096854J079258J03789r39674j046817p9910Q40854
$$ 532964 296973 599967 1696821 2776079 2879868 1940194 893377 813467 1654321
10054A654321M86066n47124l11251J261383J490708r94798l356482k353914O13132
$$ 1654321 2140387 1593263 1282012 2543395 4034103 3039305 -317177 -2671091 -2057959
10045b057959J655358M84464L51469K099929K588299O7169k745027k840559j082546
$$ -2057959 -402601 81863 433332 2533261 5121560 5188729 2443702 -396857 -1479403
10036a479403L0766K82934R04079J561490Q52527r51713j894927r82965O87188
$$ -1479403 -1448637 -1165703 -261624 1299866 2152393 1200680 -694247 -1677212 -990024
10027i90024J527461J133265J74274o86466j312428j586909r06703R66197K560438
$$ -990024 537437 1670702 1844976 1158510 -153918 -1740827 -2647530 -1681333 879105
10018H79105J694181j338583l196188j693711R36303J224168m26778p98797P58030
$$ 879105 2573286 1234703 -1961485 -3655196 -2718893 -1494725 -1921503 -2720300 -1962270
10009a962270J605396O16278n4568R08911J556830J95303j595604j713056q88751
$$ -1962270 -356874 259404 204836 1113747 2670577 2865880 1270276 -442780 -1331531
10000a331531q03626q37832M88717K222447K114732M13286l60696N34703Q44184
$$ -1331531 -2135157 -2972989 -2484272 -261825 1852907 2266193 1905497 2440200 3284384
9991C284384j107527l655620l902293j483199J073803J478709J88534n43712L47925
$$ 3284384 2176857 -1478763 -5381056 -6864255 -5790452 -4311743 -4123209 -4666921 -4318996
9982d318996J471102R82349q21751j845248q97747J022915K270498K314505J638021
$$ -4318996 -2847894 -1865545 -2687296 -4532544 -5430291 -4407376 -2136878 177627 1815648
9973A815648Q73005N42236Q44981J215253Q04162k81520j075966j338067j840801
$$ 1815648 2688653 3230889 4075870 5291123 6095285 5813765 4737799 3399732 1558931
9964A558931k546563j949128N61300K851757K309772n22268k384921j531051J55163
$$ 1558931 -987632 -2936760 -2375460 476297 2786069 2263801 -121120 -1652171 -1497008
9955a497008M8249j535172j977955j83328J898572K019170N66545l87217j42675
$$ -1497008 -1448759 -2983931 -4961886 -5145214 -3246642 -1227472 -660927 -1048144 -1190819
9946a190819J43683j28533L0433J163039J948595J112617m15591p95160K2727
$$ -1190819 -1047136 -1175669 -1145236 17803 1966398 3079015 2663424 1868264 1890991
9937A890991N22011J67687L4009Q10490J643687J376550l2354j605340k154951
$$ 1890991 2413002 2580689 2614698 3425188 5068875 6445425 6413071 4807731 2652780
9928B652780j058911R38574J874281N58090j655431k232921o73120Q71127N28959
$$ 2652780 1593869 2532443 4406724 4964814 3309383 1076462 403342 1274469 1803428
9919A803428q91905j176311L81772K226055K526369J204114l41218j151799j567583
$$ 1803428 911523 -264788 116984 2343039 4869408 6073522 5732304 4580505 3012922
9910C012922j899398j324256O46992K357421J675825n96883j346370K80026J451462
$$ 3012922 1113524 -210732 436260 2793681 4469506 3872623 2526253 2806279 4257741
9901D257741L0133k117639k069910l3831J555506J439222K4515j862391k802273
$$ 4257741 4287874 2170235 100325 66494 1622000 3061222 3085737 1223346 -1578927
9892a578927j281574J655442K539799M20577j210704r7511Q53342q36839j855192
$$ -1578927 -2860501 -1205059 1334740 1755317 544613 447102 1300444 463605 -1391587
9883a391587J057827L815613J115922l043584n04911O347261O044241l787167
$$ -1391587 -333760 3481853 4597775 1554191 1049280 7396541 13440782 9653615
9875I653615j0945417o522909J920716K874455j765789j931469L456961N797618
$$ 9653615 -1291802 -7814711 -5893995 -3019540 -4785329 -6716798 -3259837 2537781
9867B537781J470120l249826k921059l1020J056533N58999N64839P50292k2755
$$ 2537781 4007901 758075 -2162984 -2194004 -1137471 -578472 -13633 736659 713904
9858G13904j061872j280108r85400o03225L58987J867568K645433J787537j99343
$$ 713904 -347968 -1628076 -2613476 -3216701 -2857714 -990146 1655287 3442824 3243481
9849C243481k133917k748125j228999J214255J553215j085377l192780j549992
$$ 3243481 1109564 -1638561 -2867560 -1653305 -100090 -1185467 -4378247 -5928239
9841e928239J540240J555155j053570j734119O11146K242479J294875N00356J630136
$$ -5928239 -4387999 -2832844 -3886414 -5620533 -5009387 -2766908 -1472033 -971677 658459
9832F58459K298367P46838p17778o7433O44667p67521k308667j231708R83299
$$ 658459 2956826 3703664 2985886 2918453 3563120 2795599 486932 -744776 238523
9823B38523J100129m52655o66353Q57018J643151N98507q65030j599141j694114
$$ 238523 1338652 885997 219644 1076662 2719813 3318320 2453290 854149 -839965
9814h39965j051399L40445J165948M42447k19955J089164K719090J449010j801247
$$ -839965 -1891364 -1550919 -384971 57476 -162479 926685 3645775 5094785 3293538
9805C293538k381823R54820L415702R56946l640034m738078j671466J150892J005525
$$ 3293538 911715 1866535 5282237 6239183 2599149 -2138929 -3810395 -2659503 -1653978
9796a653978j81268o1064M88069k40302j239415l46919J763933K025176m22827
$$ -1653978 -1835246 -1896310 -1408241 -1648543 -2887958 -3234877 -1470944 554232 131405
9787A31405k624074j935875K68339Q95145k48236n98957Q36032J965684J013314
$$ 131405 -2492669 -4428544 -4160205 -3265060 -3513296 -4112253 -3276221 -1310537 -297223
9778b97223q68611j598874j002128j91139M29067Q94169O06152o36426j417699
$$ -297223 -1165834 -2764708 -3766836 -3957975 -3528908 -2634739 -2028587 -2665013 -4082712
9769d082712m44830J159187J349122M13907L93892J463786J607586K98443l61391
$$ -4082712 -4527542 -3368355 -2019233 -1605326 -1211434 252352 1859938 2158381 1796990
9760A796990O69548J269314l63444k446513k345847q27237o15299j741936j589576
$$ 1796990 2466538 3735852 3372408 925895 -1419952 -2247189 -2862488 -4604424 -6194000
9751f194000N71082K246864J572719j71791q82939k28248J074023K415572K691870
$$ -6194000 -5622918 -3376054 -1803335 -1975126 -2858065 -3086313 -2012290 403282 3095152
9742C095152Q20251j858072k170302K29515J543455m69615k442609n83186K765007
$$ 3095152 3915403 2057331 -112971 116544 1659999 1190384 -1252225 -1835411 929596
9733I29596K621111k82442o50029K067703K208412k433807o013666l522752J289256
$$ 929596 3550707 3268265 2618236 4685939 6894351 4460544 -1553122 -5075874 -3786618
9724c786618K129320n2487J15839K669599K609776r06815k904938j034654R04196
$$ -3786618 -1657298 -1709785 -1593946 1075653 3685429 2778614 -126324 -1160978 -256782
9715b56782J3642j052900L28394J704545K45975j652953l29041K547625K485680
$$ -256782 -243140 -1296040 -967646 736899 982874 -670079 -999120 1548505 4034185
9706D034185n21308k355914j584078q17007j234164p31288J359012K196307J02463
$$ 4034185 3512877 1156963 -427115 -1244122 -2478286 -3209574 -1850562 345745 448208
9697D48208k322203k153523l11202P40847R42913J457422J573062j4910k095195
$$ 448208 -1873995 -4027518 -4338720 -3597873 -2654960 -1197538 375524 360614 -1734581
9688a734581k276228p50107K27091J07687K15343M19620p94477k522367j592985
$$ -1734581 -4010809 -4760916 -4533825 -4426138 -4210795 -3791175 -4585652 -7108019 -8701004
9679h701004K018002L743801R50655k499815j810025J383520J863530o18926j255065
$$ -8701004 -6683002 -2939201 -1988546 -4488361 -6298386 -4914866 -3051336 -3670262 -4925327
9670d925327J356448K597824l07262l170609j273434L142088M471749K147318
$$ -4925327 -3568879 -971055 -1278317 -4448926 -5722360 -2580272 1891477 4038795
9662D038795L42715P38230Q71810m84140j428642j244421j827521l216869k266297
$$ 4038795 4381510 5119740 5991550 5507410 4078768 2834347 1006826 -2210043 -4476340
9653d476340J698797M067942J332928l013938l206409M49153K591181R84247j096667
$$ -4476340 -2777543 1290399 2623327 -390611 -3597020 -3147867 -556686 427561 -669106
9644f69106o99631J010448J815966J597699R04059n66842k307480k382030l19519
$$ -669106 -1368737 -358289 1457677 3055376 3959435 3392593 1085113 -1296917 -1616436
9635a616436J518842J244131O1279k61209l68171j388826j993425l81318K076802
$$ -1616436 -97594 1146537 1207816 946607 578436 -810390 -2803815 -3185133 -1108331
9626a108331K409307O06977n83103j56060K03743j30911L90707J921631K041694
$$ -1108331 1300976 1907953 1324850 1168790 1372533 1241622 1632329 3553960 5595654
9617E595654j40896j974432j632674j355424l182827m278100q80350M703439O117705
$$ 5595654 5454758 3480326 1847652 492228 -2690599 -6968699 -7849049 -3145610 2972095
9608B972095J947697k181206j715232J033071J485473n12283j805497j227308
$$ 2972095 4919792 2738586 1023354 2056425 3541898 3029615 1224118 -3190
9600c190l36684k02076m37336o71877o12088M45563J982547J528740j706630l968083
$$ -3190 -339874 -541950 -979286 -1651163 -2263251 -1817688 164859 1693599 -13031 -3981114
9590c981114j399693L540851M564183N94473k526468q46997K050515J278794j597112
$$ -3981114 -5380807 -1839956 2724227 3318700 792232 -54765 1995750 3274544 1677432
9581A677432j543562J697736L414507J270398j800737k569569j469876l74723
$$ 1677432 133870 1831606 5246113 6516511 4715774 2146205 676329 301606
9573C01606L40763Q47004N51350m07676m53469P37825P96524j771591m239697
$$ 301606 642369 1489373 2040723 1633047 1179578 1917403 2713927 942336 -3297361
9564c297361k862359J428895L852777K407996K72995M39425J263877j28522k527208
$$ -3297361 -6159720 -4730825 -878048 1529948 1802943 2242368 3506245 3377723 850515
9555H50515k340958M65285K071003P24733p63043J70622J862835J567902j01917
$$ 850515 -1490443 -1025158 1045845 1770578 1007535 1178157 3040992 4608894 4506977
9546D506977q42694p73521j460696k158604q72836J357336J331776q74099j554091
$$ 4506977 3664283 2890762 1430066 -728538 -1601374 -244038 1087738 213639 -1340452
9537a340452M30114J398483r65588l220236j453519K137601K360272r93736k897202
$$ -1340452 -910338 488145 -477443 -3697679 -5151198 -3013597 -653325 -1647061 -4544263
9528d544263n17944L248800M384468K555588J49139r74564n07009O96397J020046
$$ -4544263 -5062207 -1813407 2571061 5126649 5275788 4301224 3794215 4490612 5510658
9519E510658m67016k408890k518499q80401l1425j135647k122527q28729J731114
$$ 5510658 5043642 2634752 116253 -764148 -795573 -1931220 -4053747 -4882476 -3151362
9510c151362K854673J843478N39491N29503J168444O91457j277959k835403j816857
$$ -3151362 -296689 1546789 2086280 2615783 3784227 4475684 3197725 362322 -1454535
9501a454535J283411L339897K232001n33182j998149j525252o91824l39206k7764
$$ -1454535 -171124 3168773 5400774 4867592 2869443 1344191 652367 313161 285397
9492B85397J9211r57154k095628j507287N19263J451955L33549q60645n47537
$$ 285397 304608 -652546 -2748174 -4255461 -3736198 -2284243 -1950694 -2811339 -3358876
9483c358876L36637O14095P02148Q82622L16708p26059k99665J815194K827189
$$ -3358876 -3022239 -2408144 -1705996 -823374 -506666 -1232725 -1532390 282804 3109993
9474C109993J079702j220753j674572j206252j247258n51815J661211K439478
$$ 3109993 4189695 2968942 1294370 88118 -1159140 -1710955 -49744 2389734
9466B389734n18845l675545k127689K359499L586796M53095j923628r19441J75218
$$ 2389734 1870889 -1804656 -3932345 -1572846 2013950 2467045 543417 -376024 -200806
9457b00806r49386j510433O55761K673251J684064j69432N858M88858j470445
$$ -200806 -1150192 -2660625 -2004864 668387 2352451 2183019 2188877 2677735 1207290
9448A207290l794949k520418J353148L116972J464769m85169q47304r75100j604905
$$ 1207290 -2587659 -5108077 -3754929 -637957 826812 341643 -505661 -1480761 -3085666
9439c085666j386788j19466L38616n44579r80514k07540L81901L72892J151169
$$ -3085666 -4472454 -4591920 -4253304 -4797883 -5778397 -5985937 -5604036 -5231144 -4079975
9430d079975K420656J623973j336060k561906L0503K865571K044971n29707n27391
$$ -4079975 -1659319 -35346 -1371406 -3933312 -3902809 -1037238 1007733 478026 -49365
9421d9365J657727J971183l17064j790654r35787m5820l06210K30725K115890
$$ -49365 1608362 3579545 3262481 1471827 536040 490220 184010 414735 2530625
9412B530625K452411j00314k230264j084023Q99588P4117k217285j954763P93188
$$ 2530625 4983036 4882722 2652458 1568435 2468023 2542140 324855 -1629908 -836720
9403h36720K117321O06938j068784j028641m53894l58213P5843R23536P65853
$$ -836720 1280601 1887539 818755 -209886 -663780 -1021993 -946150 -22614 743239
9394G43239l77143o97142k46457j276273l514399l183417R33226M402889L313804
$$ 743239 366096 -331046 -577503 -1853776 -5368175 -8551592 -7618366 -3215477 98327
9385I8327L0363j015483j77026o64705k101580j247702J824058L347319J755408
$$ 98327 128690 -886793 -1063819 -1728524 -3830104 -5077806 -3253748 93571 1848979
9376A848979l73952p42160K7392O63961Q08702n3877k028580l101623j358078
$$ 1848979 1475027 732867 760259 1424220 2232922 2179045 150465 -2951158 -4309236
9367d309236J267308J308511m10195k447K219470J463557l008098n157328j222346
$$ -4309236 -3041928 -1733417 -2143612 -2146059 73411 1536968 -1471130 -6628458 -7850804
9358g850804L986329M279054J007643m45939N30163M49466j154661j512055n02551
$$ -7850804 -3864475 414579 1422222 976283 1506446 1955912 801251 -710804 -1213355
9349a213355p92386k139767j245902J903350K939104R6623k539024j352592J359283
$$ -1213355 -2005741 -4145508 -5391410 -3488060 -548956 -452333 -2991357 -4343949 -2984666
9340b984666J574068r4425k45253J142686Q82444j517604k463409N520K652506
$$ -2984666 -1410598 -1505023 -1750276 -607590 274854 -1242750 -3706159 -3700639 -1048133
9331a048133J718316j226547j605532R60037J997100m26219k091635N85647L920146
$$ -1048133 670183 -556364 -2161896 -1201859 795241 369022 -1722613 -1136966 2783180
9322B783180K121569l066896m239322K86377L812994J927588r90038P5045K239206
$$ 2783180 4904749 1837853 -2401469 -2115092 1697902 3625490 2635452 2710497 4949703
9313D949703L23839l617875l649734j38682J124662r41670j205773K239751M380053
$$ 4949703 5273542 1655667 -1994067 -2132749 -1008087 -1949757 -3155530 -915779 3464274
9304C464274J443425l225532m651899k845457o13695J238742K953079L183813
$$ 3464274 4907699 1682167 -2969732 -5815189 -6428884 -5190142 -2237063 946750
9296I46750R65160j715670k273956q86003O68659J666339J951869Q81123j080744
$$ 946750 1911910 196240 -2077716 -2963719 -2295060 -628721 1323148 2204271 1123527
9287A123527j667039R9897J951052J573723r4254q43153n22238j84695J96356
$$ 1123527 -543512 -443615 1507437 3081160 2986906 2143753 1621515 1436820 1633176
9278A633176Q38013P83291k57562n70468O69616J235561o69231k863295k377638
$$ 1633176 2471189 3254480 2996918 2426450 3096066 4331627 3662396 799101 -1578537
9269a578537l11918K04827o45374k63796J111103O55673j589295k110600L64068
$$ -1578537 -1890455 -1685628 -2331002 -2594798 -1483695 -828022 -2417317 -4527917 -4163849
9260d163849K682653K264864O57629K40511N40440Q4460o05572l13326M09282
$$ -4163849 -1481196 783668 1441297 1681808 2222248 2306708 1701136 1387810 1797092
9251A797092L61299j21871j68637l09779j287039j918036m99577K048648K747457
$$ 1797092 2158391 2036520 1867883 1558104 271065 -1646971 -2146548 -97900 2649557
9242B649557N74624j979299k173369m44244O02904j57187j213377r87601j07962
$$ 2649557 3224181 1244882 -928487 -1372731 -769827 -927014 -2140391 -3127992 -3235954
9233c235954n5498m52528M72851K651551L460926J363935j462021j988195o34003
$$ -3235954 -3291452 -3743980 -3271129 -619578 2841348 4205283 2743262 755067 121064
9224A21064l29067j780165k386986l72148K450731L278147J894355J84545o07664
$$ 121064 -208003 -1988168 -4375154 -4747302 -2296571 981576 2875931 3060476 2452812
9215B452812n49253J27277J099890J272200l03706k660692l484417k001363k21192
$$ 2452812 1903559 2030836 3130726 4402926 4099220 1438528 -2045889 -4047252 -4268444
9206d268444m20255k071469k472432l62235K355834L131903J974276R02236P86859
$$ -4268444 -4688699 -6760168 -9232600 -9594835 -7239001 -4107098 -2132822 -1230586 -443727
9197d43727N15135m77884p94561N70714J917698Q31394k024259l151380p15453
$$ -443727 71408 -406476 -1201037 -630323 1287375 2118769 94510 -3056870 -3772323
9188c772323K754119L269015L03429k476795j748557J125898J640579j788367
$$ -3772323 -1018204 2250811 2554240 77445 -1671112 -545214 1095365 -693002
9180f93002n081129l536378J604408M514278K607562m44120o88786P42702Q65496
$$ -693002 -5774131 -9310509 -7706101 -3191823 -584261 -1028381 -1717167 -974465 -108969
9171a08969K47888J233349K809992J910604r43343k047682p23340l14300j922042
$$ -108969 138919 1372268 4182260 6092864 5149521 3101839 2378499 2064199 142157
9162A42157k073226R86379L232261Q76611l020591k713505J405129L296284L34140
$$ 142157 -1931069 -944690 2287571 3164182 143591 -2569914 -1164785 2131499 2465639
9153B465639l035851k095416J625300L239821J470602m27698O0163J428057Q97753
$$ 2465639 -570212 -2665628 -1040328 2199493 3670095 3242397 3302560 4730617 5628370
9144E628370j427847k751548j408123R96159J714667J45313j862214k448593j504368
$$ 5628370 4200523 1448975 40852 1037011 2751678 2896991 1034777 -1413816 -2918184
9135b918184j48116O17132O15510N07454J066373J962928J741444j44165j934799
$$ -2918184 -3066300 -2449168 -1833658 -1326204 -259831 1703097 3444541 3300376 1365577
9126A365577j623953M9212N02023q89930j987880j239952L27822J227119J485111
$$ 1365577 -258376 -209164 292859 -597071 -2584951 -3824903 -3497081 -2269962 -784851
9117g84851J425276N72389p75905q79104P32805J690136Q5138k229585k177339
$$ -784851 640425 1212814 436909 -442195 290610 1980746 2065884 -163701 -2341040
9108b341040j21560Q51149k64733j250641m35584J116503J864622J927194J912778
$$ -2341040 -2462600 -1611451 -1876184 -3126825 -3562409 -2445906 -581284 1345910 3258688
9099C258688J403444j25948j959293k764521k025856l90172Q74216P21194n61109
$$ 3258688 4662132 4536184 2576891 -187630 -2213486 -2603658 -1729442 -1008248 -1569357
9090a569357j157398K99398K611989L173128J379250n35366n42010O52035R02156
$$ -1569357 -2726755 -2427357 184632 3357760 4737010 4201644 3659634 4311669 5213825
9081E213825n55891k462817l111762j926505J07859J234227O05090o65484p29909
$$ 5213825 4657934 2195117 -916645 -2843150 -2735291 -1501064 -895974 -1561458 -2291367
9072b291367O57577J878189J717085R02633Q14821J417134J298853l74841k479398
$$ -2291367 -1633790 244399 1961484 2864117 3678938 5096072 6394925 6020084 3540686
9063C540686k794579m92732K367039K692032J19959k179158j464127R74628J819628
$$ 3540686 746107 253375 2620414 5312446 5432405 3253247 1789120 2763748 4583376
9054D583376L85644j006912r33801m95376o84816p63554k93567m36951j726809
$$ 4583376 4969020 3962108 3028307 2532931 1848115 1084561 790994 354043 -1372766
9045a372766k508066j387710L37875O58865J9042L52904J702574K050298M92041
$$ -1372766 -3880832 -5268542 -4930667 -4271802 -4252760 -3899856 -2197282 -146984 345057
9036C45057j339821j506265j05852J229619J410570Q31068M39552L36816k36920
$$ 345057 -994764 -2501029 -2606881 -1377262 33308 864376 1303928 1640744 1403824
9027A403824j363408j696268k59908J600141J703040K77797l41100M32987L03755
$$ 1403824 40416 -1655852 -1915760 -315619 1387421 1665218 1324118 1757105 2060860
9018B060860k085606m475819l962302j008662J434222J690574N68016k29543M77005
$$ 2060860 -24746 -4500565 -8462867 -9471529 -8037307 -6346733 -5778717 -6008260 -5531255
9009e531255K471722L666535J998477j247926k246207j02059J400200k53497j945841
$$ -5531255 -3059533 607002 2605479 1357553 -888654 -990713 409487 155990 -1789851
9000a789851n2763L123379K814605m75085k134785j097017m87298j070982k72589
$$ -1789851 -1842614 1280765 4095370 3620285 1485500 388483 -98815 -1169797 -1442386
8991a442386J747363J462532j070871j126568K296094L487520p11207m750323
$$ -1442386 304977 1767509 696638 -429930 1866164 5353684 4642477 -107846
8983a07846k708043K283333L163827k59865k359851j100161M23076O75186J280825
$$ -107846 -2815889 -532556 2631271 2371406 11555 -1088606 -665530 9656 1290481
8974A290481K010027L79359k884730l539847m51343K314786J759277m1417k12112
$$ 1290481 3300508 3679867 795137 -2744710 -3196053 -881267 878010 836593 624481
8965F24481N52665L13539o01487q99059p25923o49756k59315N05964N78354k40398
$$ 624481 1177146 1490685 889198 -9861 -735784 -1385540 -1644855 -1138891 -560537 -800935
8955h00935n04217L50324Q20856j0607q47032n65718J1843J57452O64008J657179
$$ -800935 -1305152 -954828 -133972 -144579 -991611 -1557329 -1545486 -1388034 -724026 933153
8945I33153J503925j84603j010195M40110J731460K78954k236079k375897k82973
$$ 933153 2437078 2252475 1242280 1682390 3413850 3692804 1456725 -919172 -1202145
8936a202145R30361J67579o82374l79918K37010N20063Q73626J044956Q4244j494666
$$ -1202145 -271784 -104205 -786579 -1166497 -929487 -409424 464202 1509158 1593402 98736
8926I8736j741223q3045J722380J992638Q98975n13822j541465j722534r56876
$$ 98736 -1642487 -1725532 -3152 1989486 2888461 2374639 833174 -889360 -1846236
8917a846236K893L91512O38717J333280J452631k91662k531686k261003P06060
$$ -1846236 -1843343 -1451831 -813114 520166 1972797 1681135 -850551 -3111554 -2405494
8908b405494K875133J797455o64600j361271j72594O35550o3275j416545k354583
$$ -2405494 469639 2267094 1602494 241223 68629 704179 640904 -775641 -3130224
8899c130224k301560q25121J562683K779136J335749j038084r87127J932780M245455
$$ -3130224 -5431784 -6256905 -4694222 -1915086 -579337 -1617421 -2604548 -671768 3573687
8890C573687K929212p77867l179280k626799p60191K24913J5414k89057M2641
$$ 3573687 6502899 5725032 2545752 -81047 -841238 -616325 -600911 -889968 -847327
8881h47327O38868O23026l75101j605803j690817j87145J507893J588708J56325
$$ -847327 -208459 414567 39466 -1566337 -3257154 -3444299 -1936406 -347698 -191373
8872a91373r32693p43960m19155q82536r25792P46441K642489K024605q65567
$$ -191373 -1124066 -1868026 -2287181 -3169717 -4095509 -3349068 -706579 1318026 452459
8863D52459k634454j419225O23350Q36383k6638M88863K303525K858190J079275
$$ 452459 -2181995 -3601220 -2977870 -2141487 -2168125 -1679262 624263 3482453 4561728
8854D561728j074100j465543l59664N97076N73526j82126j238589k092126k000114
$$ 4561728 3487628 2022085 1662421 2259497 2833023 2650897 1412308 -679818 -2679932
8845b679932p49336O35356Q50303R181m01094M70256J553215J212607m66641j634293
$$ -2679932 -3429268 -2793912 -1943609 -1934428 -2335522 -1865266 -312051 900556 433915 -1200378
8835a200378j054218L48016R04754M55842J74302M91945M77737m59758j377973
$$ -1200378 -2254596 -1906580 -1001826 -545984 -371682 120263 598000 138242 -1239731
8826a239731j033568L36490J265258Q79994j53149o09274k68317j19679q56825
$$ -1239731 -2273299 -1936809 -671551 208443 55294 -553980 -822297 -941976 -1798801
8817a798801j594380r12515Q30842J496953J13485j501750j255637L14818J281487
$$ -1798801 -3393181 -4305696 -3474854 -1977901 -1864416 -3366166 -4621803 -4306985 -3025498
8808c025498J319064J318349R47283o81475k326929j662982P90174J853965M33032
$$ -3025498 -1706434 -388085 559198 -122277 -2449206 -4112188 -3322014 -1468049 -1035017
8799a035017j012771o72321J44068J19000K92728J429041K042999J221325N07639
$$ -1035017 -2047788 -2720109 -2576041 -2457041 -2164313 -735272 1307727 2529052 3036691
8790C036691O87947j72452k737859l786496j142345J917580J479406n98435j50607
$$ 3036691 3724638 3552186 814327 -2972169 -4114514 -2196934 -717528 -1315963 -1466570
8781a466570J761658P94540k493656l040860M143J635394m37610j882386P48074
$$ -1466570 295088 1089628 -1404028 -4444888 -4440745 -2805351 -3242961 -5125347 -4377273
8772d377273M035038L126121q64440l044144j641219J044246K666341K510434
$$ -4377273 -342235 2783886 1919446 -1124698 -2765917 -1721671 944670 3455104
8764C455104O14982j885953k684175r71117R19657N87246j046627j467820k78771
$$ 3455104 4070086 2184133 -500042 -1471159 -551502 35744 -1010883 -2478703 -2757474
8755b757474J023772J704297J939942J374353k17299j626470j624321q85067o02537
$$ -2757474 -1733702 -29405 1910537 3284890 3067591 1441121 -183200 -1068267 -1670804
8746a670804k11322J306723K759136J984693n77587k086238j209246M03716R67673
$$ -1670804 -1882126 -575403 2183733 4168426 3590839 1504601 295355 699071 1666744
8737A666744P95932Q41254P25834l91623j834878j778248J93551J854113O89510
$$ 1666744 2462676 3303930 4029764 3638141 1803263 25015 218566 2072679 2762189
8728B762189k518331l809670q48190L498782M359001J092332k215821k571548
$$ 2762189 243858 -3565812 -4414002 -915220 3443781 4536113 2320292 -251256
8720b51256j338060p09310j77988J278562K189541P99251j427542j644810O168
$$ -251256 -1589316 -2298626 -2476614 -1198052 991489 1790740 363198 -1281612 -1275444
8711a275444Q30645j59715j242137j082098k47405M94171J089662J191643L17612
$$ -1275444 -444799 -604514 -1846651 -2928749 -3176154 -2681983 -1592321 -400678 -83066
8702h3066p27017n12913O85817J074726O2879j043998j290220j086138o73640
$$ -83066 -810083 -1322996 -637179 437547 500426 -543572 -1833792 -2919930 -3593570
8693c593570L86808J639226J642013K49644q50191p25788m73043r08016r73053
$$ -3593570 -3206762 -1567536 74477 324121 -526070 -1251858 -1724901 -2632917 -3605970
8684c605970J07707R39655J71342q69109o9413J872798K308581P76262l75801
$$ -3605970 -3498263 -2558608 -2387266 -3256375 -3325788 -1452990 855591 1631853 1256052
8675A256052J01359M20935j031568k704721k047854O26520K561081K242343P04113
$$ 1256052 1357411 1778346 746778 -1957943 -4005797 -3379277 -818196 1424147 2128260
8666B128260o02508j275266j217611l94995K64183l71189j421418o26748J942473
$$ 2128260 1525752 250486 -967125 -1362120 -1097937 -1469126 -2890544 -3517292 -1574819
8657a574819L161619J346399q96584n47696J213122J197433n71449j255685k715
$$ -1574819 1586800 2933199 2036615 1488919 2702041 3899474 3328025 2072340 2069625
8648B069625J134928Q68163J0475q31351j755927j811293r9543J397106q6245
$$ 2069625 3204553 4072716 4083191 3251840 1495913 -315380 -414923 982183 895938
8639H95938k960526k660728J001845K787103J90235k359706n32478L175911L724645
$$ 895938 -2064588 -4725316 -3723471 -936368 -746133 -3105839 -3638317 -462406 3262239
8630C262239R27278j735398k824020l072622k155877K24463J817729O56616j126629
$$ 3262239 4189517 2454119 -369901 -3442523 -5598400 -5373937 -3556208 -2899592 -4026221
8621d026221m15754J545319J255196j001141j793382k16207J627701K890101M002862
$$ -4026221 -4441975 -2896656 -1641460 -2642601 -4435983 -4652190 -3024489 -134388 3868474
8612C868474L334585q62298n458242n049158r2398L073618J413019j108871p30816
$$ 3868474 7203059 6340761 882519 -4166639 -4259037 -1185419 227600 -881271 -1612087
8603a612087O69212J10981j225033p17738J162579K223416J838690M52406j623651
$$ -1612087 -942875 -831894 -2056927 -2774665 -1612086 611330 2450020 2902426 1278775
8594A278775k990354j668287J290480J910044r63803l464456k506384q6712Q91554
$$ 1278775 -1711579 -3379866 -2089386 -179342 -1143145 -4607601 -7113985 -7200697 -6309143
8585f309143J160999K044661J750494r81767k855418n71292L163947L385539O34636
$$ -6309143 -5148144 -3103483 -1352989 -2334756 -5190174 -5761466 -2597519 788020 1422656
8576A422656n46123N05850K25443j940380k163220P42369K597140N09505k395781
$$ 1422656 876533 1382383 1607826 -332554 -2495774 -1753405 843735 1353240 -1042541
8567a042541j955419Q15893J859605J63655j527206r99529R99617K243689J316268
$$ -1042541 -2997960 -2182067 -322462 -158807 -1686013 -2685542 -1685925 557764 1874032
8558A874032j248933l184235k471880K43579K145880J694061L13589q8634K38151
$$ 1874032 625099 -2559136 -5031016 -4787437 -2641557 -947496 -633907 -722541 -484390
8549d84390L3670n09181k38874O40883O48879m95581j089096J54127J973235J970273
$$ -484390 -450720 -959901 -1198775 -557892 90987 -404594 -1493690 -1339563 633672 2603945
8539B603945p8710j500230j166L022391L773945P80199l104956m255298k525620
$$ 2603945 2525235 1025005 1023839 4046230 7820175 8600374 5495418 1240120 -1285500
8530a285500m90429N18027J380916K405019K112549j83522k535024k677231j047088
$$ -1285500 -1775929 -1257902 123014 2528033 4640582 4457060 1922036 -755195 -1802283
8521a802283J12394l6492k54862M46050J369582J356150L38841p82950j113431
$$ -1802283 -1689889 -1726381 -1981243 -1535193 -165611 1190539 1529380 746430 -367001
8512c67001l20575J100119J921150J333869K64793N50058K260516L015660J077222
$$ -367001 -687576 412543 2333693 3667562 3932355 4482413 6742929 9758589 10835811
8503A0835811j860143k658331j050363Q2443r94909k418288j687918N80373J578812
$$ 10835811 8975668 6317337 5266974 5349417 4354508 1936220 248302 828675 2407487
8494B407487J50198j944033k377914o64514J732714K849014J905913Q5075p51764
$$ 2407487 2557685 613652 -1764262 -2428776 -696062 2152952 4058865 4143940 3392176
8485C392176l81445k90860j000806r45862P56566K126501R57050j587968k417802
$$ 3392176 3010731 2719871 1719065 773203 1529769 3656270 4613320 3025352 607550
8476F07550q56223Q91930J210455N73410k30664r57775j016485k3958Q23480K24642
$$ 607550 -248673 643257 1853712 2427122 2196458 1238683 222198 198240 1021720 1246362
8466A246362p52161l33090M17227p92730k635221j335598K671365M102426O75000
$$ 1246362 494201 161111 578338 -214392 -2849613 -4185211 -1513846 2588580 3263580
8457C263580l083990k663312R8236J074548M23417P21613J521757O45511j023253
$$ 3263580 179590 -2483722 -2385486 -1310938 -887521 -165908 1355849 2001360 978107
8448I78107q65987N08188K19883j610116j972133j99728J082757N43333j22973
$$ 978107 112120 620308 840191 -769925 -2742058 -2941786 -1859029 -1315696 -1438669
8439a438669L54343R85666Q77660N62996L48894j76157o65518l58958J71077m7734
$$ -1438669 -1084326 -98660 779000 1341996 1690890 1514733 849215 490257 661334 613600
8429F13600k70588M78510Q13390p20721j918182J11542L041749J842814k684808
$$ 613600 343012 821522 1634912 914191 -1003991 -892449 2149300 3992114 1307306
8420A307306m053191j77313L087150J351150j560960o14338K102649J662857j151816
$$ 1307306 -2745885 -2923198 163952 1515102 -45858 -660196 1442453 3105310 1953494
8411A953494j844576j23982M74168n62989l82680J180512J023174j324511k502991
$$ 1953494 108918 -15064 459104 -103885 -486565 693947 1717121 392610 -2110381
8402b110381j077446K52514l58412j020195o8545R35752L83164m54453k0678P13919
$$ -2110381 -3187827 -2935313 -3293725 -4313920 -4382465 -3446713 -3063549 -3518002 -3538680 -2824761
8392b824761L68038k62211k1578K69661m19803j080983m65838N13356M69878O9348
$$ -2824761 -2456723 -2718934 -2740512 -2470851 -2890654 -3971637 -4437475 -3924119 -3454241 -3384893
8382c384893M85409Q21939k41596j469962p35782J120483J283765m09089j084959
$$ -3384893 -2899484 -2077545 -2319141 -3789103 -4524885 -3404402 -2120637 -2529726 -3614685
8373c614685N12457K103121J667884M14314L31991R58010N53990q96324j785421
$$ -3614685 -3102228 -999107 668777 1083091 1415082 2373092 2927082 2030758 245337
8364B45337j234149J39569J285946J456246M59351q51807j029922Q1089P02434
$$ 245337 -988812 -849243 436703 1892949 2352300 1500493 470571 551660 1254094
8355A254094n12533k240370k047773K28391K165567J864836J17450q91071j85753
$$ 1254094 741561 -1498809 -3546582 -3318191 -1152624 712212 829662 -61409 -247162
8346b47162J182201J602051Q22795J45320N11621R82365J37930j398234j581144
$$ -247162 935039 2537090 3359885 3505205 4016826 4999191 5137121 3738887 2157743
8337B157743k31608M82884l69413q83400J89000R11443m92601k127336j432814
$$ 2157743 1926135 2409019 2039606 1156206 1345206 2256649 1764048 -363288 -1796102
8328a796102K20151j95412j831474j185298J637898K701829P63070p75967K43303
$$ -1796102 -1575951 -1771363 -3602837 -4788135 -3150237 -448408 314662 -461305 -218002
8319b18002J490929Q24485q3012N62080J213422K83879n57001K46515O44041j378487
$$ -218002 1272927 2097412 2014400 2576480 3789902 4073781 3516780 3763295 4407336 3028849
8309C028849l460187k336571N81150J458966J81370k15539Q94129J174942j87974
$$ 3028849 -431338 -2767909 -2186759 -727793 -546423 -761962 132167 1307109 1119135
8300A119135j520544j920499j890072j159797O17703J729586O99381k05891J947513
$$ 1119135 -401409 -2321908 -4211980 -5371777 -4754074 -3024488 -2325107 -2530998 -583485
8291e83485N018626M150305l70335l088250j775357j99981j108966k076155p39335
$$ -583485 4435141 8585446 8215111 5126861 3351504 3151523 2042557 -33598 -772933
8282g72933R50559P74606J53309P70977J161501m9945j030177j88314N56825o63301
$$ -772933 177626 952232 1105541 1876518 3038019 2988074 1957897 1769583 2326408 1663107
8272A663107j975804j113067N19221O56723J50614M89649L38386j465507k432884
$$ 1663107 -312697 -1425764 -906543 -249820 -99206 390443 728829 -736678 -3169562
8263c169562m21531J680532K82885k373545j633109J541522K165938j65591q42339
$$ -3169562 -3591093 -1910561 -1627676 -4001221 -5634330 -4092808 -1926870 -2092461 -2934800
8254b934800J496088K743459O17539j754808j532336k05850L97350J349424L064701
$$ -2934800 -1438712 1304747 1922286 167478 -1364858 -1570708 -1173358 176066 3240767
8245C240767K849883o06099l773914k918503L52577J593626k58440k272529j919893
$$ 3240767 6090650 5484551 1710637 -1207866 -855289 738337 479897 -1792632 -3712525
8236c712525M82875K894656L254876R45638k131524l066377j445603K32198L76235
$$ -3712525 -3229650 -334994 2919882 3865520 1733996 -1332381 -2777984 -2545786 -2169551
8227b169551K56258J011199J383494K72171r25857p10640j6089j04551j14373
$$ -2169551 -1913293 -902094 481400 753571 -172286 -882926 -899015 -1003566 -1117939
8218a117939Q29248J247591j22939j452608o98654N07281m88722k338096j548021
$$ -1117939 -288691 958900 835961 -616647 -1315301 -808020 -1296742 -3634838 -5182859
8209e182859J367937K125720o00005k943687j615458J662568L242211K258274
$$ -5182859 -3814922 -1689202 -2289207 -5232894 -6848352 -5185784 -1943573 314701
8201C14701L55350j072663j408938k06886K043176L489985K702967L06144j924109
$$ 314701 670051 -402612 -1811550 -2018436 24740 3514725 6217692 6523836 4599727
8192D599727k812442k170550n23479R59111J239224N49716j60613q63627k039547
$$ 4599727 1787285 -383265 -906744 52367 1291591 1841307 1680694 817067 -1222480
8183a222480k695303j041348K187312L467760R94043k514837l293176j223885
$$ -1222480 -3917783 -4959131 -2771819 695941 1689984 -824853 -4118029 -5341914
8175e341914R33491J720231K042875K640037K754808J566789n15625k251858k484204
$$ -5341914 -4408423 -2688192 -645317 1994720 4749528 6316317 5800692 3548834 1064630
8166A064630r74853R11303J085261o80667j952761p90864J259745J226162q69232
$$ 1064630 89777 1001080 2086341 1405674 -547087 -1337951 -78206 1147956 278724
8157B78724j916281j06247K692773L486393J448495j850043m092815l694503j045694
$$ 278724 -1637557 -1743804 948969 4435362 5883857 4033814 -59001 -3753504 -4799198
8148d799198J279919R04374j411303k569601j086594J406845K847790K882294
$$ -4799198 -3519279 -2614905 -4026208 -6595809 -7682403 -6275558 -3427768 -545474
8140e45474J778285m27873k539132k279863N35469K913025K567949R08171J40354
$$ -545474 1232811 804938 -1734194 -4014057 -3478588 -565563 2002386 2910557 3050911
8131C050911k97335j637780k327571l96957K214161J958766m67929j187544J30182
$$ 3050911 2753576 1115796 -1211775 -1608732 605429 2564195 2096266 908722 1038904
8122A038904k07696k800097l193142N53982L716753K189964o94657K70021L336315
$$ 1038904 831208 -1968889 -5162031 -4608049 -891296 1298668 604011 874032 4210347
8113D210347K678296j860929m450584k428254M72845J010028P03562J185093O11919
$$ 4210347 6888643 5027714 577130 -1851124 -1378279 -368251 335311 1520404 2132323
8104B132323k088135l732944j527993J992592K671366R92238N37814J855172K118154
$$ 2132323 44188 -3688756 -5216749 -3224157 -552791 439447 977261 2832433 4950587
8095D950587K11844j793804k279511j850170j255913n10937l13620j443311k446879
$$ 4950587 5162431 3368627 1089116 -761054 -2016967 -2527904 -2841524 -4284835 -6731714
8086f731714r57620K123965K968493L89169k123698j565680M39946R09520J52486
$$ -6731714 -7689334 -5565369 -2596876 -2207707 -4331405 -5897085 -5457139 -4547619 -4395133
8077d395133K30140Q99122N18765l04237M12952K035759J791326n31961j818561
$$ -4395133 -4164993 -3265871 -2747106 -3051343 -2638391 -602632 1188694 656733 -1161828
8068a161828m98994R77771J52798j679374j904315o93214q3296l05494J85716
$$ -1161828 -1660822 -683051 -530253 -2209627 -4113942 -4807156 -4890452 -5195946 -5010230
8059e010230J541628K029157Q97222m82827q75249p14247o47518j97835J063785
$$ -5010230 -3468602 -1439445 -542223 -1025050 -1900299 -2614546 -3262064 -3459899 -2396114
8050b396114K240921K201895J202048L89677J90086M7877n50711j469898k106696
$$ -2396114 -155193 2046702 3248750 3638427 3828513 3876390 3325679 1855781 -250915
8041b50915j822663n99559N38079M65139m20920m93771P36775J749075J276110
$$ -250915 -2073578 -2673137 -2135058 -1669919 -2090839 -2584610 -1847835 -98760 1177350
8032A177350J59436k28581j63834n92170j044751n14213K80873k66072j767057
$$ 1177350 1336786 1108205 944371 352201 -692550 -1206763 -925890 -1191962 -2959019
8023b959019k024400k78833J767650K493384J978515P80630p96594j704802o68964
$$ -2959019 -4983419 -5262252 -3494602 -1001218 977297 1757927 961333 -743469 -1412433
8014a412433J462496K081290N35579p75358k22907O06098j6392r30119m56047
$$ -1412433 50063 2131353 2666932 1891574 1668667 2274765 2258373 1328254 872207
8005H72207L84999j96438j366237j252283n11126r75834j768617m74750K159646
$$ 872207 1257206 1060768 -305469 -1557752 -2068878 -3044712 -4813329 -5288079 -3128433
7996c128433K568562j10005k403678j469667J356338L246846L384815K340547
$$ -3128433 -559871 -669876 -3073554 -4543221 -3186883 59963 3444778 5785325
7988E785325M51322j473888j897834o99775J40289n52308j348762q12425J5723
$$ 5785325 6236647 4762759 2864925 2165150 2305439 1753131 404369 -408056 -392333
7979c92333m17706j394500j201514O2595J004442J249077J262663P67441n95160
$$ -392333 -810039 -2204539 -3406053 -3343458 -2339016 -1089939 172724 940165 345005
7970C45005j649383q21191J354822K684710K163488P82329l66511j156102j524433
$$ 345005 -1304378 -2125569 -770747 1913963 4077451 4859780 4493269 3337167 1812734
7961A812734j075950k8419N70497R7013q30661j125640m78512K96802J10962j013547
$$ 1812734 736784 708365 1278862 1375875 545214 -580426 -1058938 -762136 -651174 -1664721
7951a664721j607884n24858J186783J450006J77532o35253j47944K09085k90272
$$ -1664721 -3272605 -3797463 -2610680 -1160674 -983142 -1618395 -1766339 -1557254 -1847526
7942a847526j40862J310017J864279M8544j642657l34254K197712J960419q41673
$$ -1847526 -1988388 -678371 1185908 1234452 -408205 -742459 1455253 3415672 2573999
7933B573999k120129m87531R08338l382j016091Q5675J681681J294215l45093
$$ 2573999 453870 -33661 874677 871295 -144796 -59121 1622560 2916775 2571682
7924B571682r91612o20296o34803p94449J89575J742179J789853q3603k016353
$$ 2571682 1580070 959774 324971 -469478 -279903 1462276 3252129 3168526 1152173
7915A152173k497699j798774o06865J012206K693649L182915J627500j095703
$$ 1152173 -1345526 -3144300 -3751165 -2738959 -45310 3137605 4765105 3669402
7907C669402l001071k795749q69283J259456K263725J888561P69476l15419q53271
$$ 3669402 668331 -2127418 -2996701 -1737245 526480 2415041 3184517 2869098 2015827
7898B015827o12062K08378R15986R29344M22546n3516l87525p70902j055561j066658
$$ 2015827 1403765 1612143 2528129 3457473 3880019 3826503 3438978 2668076 1612515 545857
7888E45857j251324j929190k118169n59319J924557K708835P38408j720159j769962
$$ 545857 -705467 -2634657 -4752826 -5312145 -3387588 -678753 59655 -1660504 -3430466
7879c430466N52279K492998J889775o14901k443729j648300J158936L225266K461908
$$ -3430466 -2878187 -385189 1504586 889685 -1554044 -3202344 -2043408 1181858 3643766
7870C643766j27007j617511q67145J91439m26370j753841j300448J114389K626728
$$ 3643766 3516759 1899248 1032103 1223542 797172 -956669 -2257117 -1142728 1484000
7861A484000Q99996k602544l977997j522978J941982K313632o01419k694660r30367
$$ 1484000 2383996 -218548 -4196545 -5719523 -3777541 -1463909 -2065328 -4759988 -5690355
7852e690355K561741L373622O51686k172688k141243K950J650863J451092j0640
$$ -5690355 -3128614 245008 896694 -1275994 -3417237 -3414287 -1763424 -312332 -322972
7843c22972j170550o74607J125696J866921m1386k551656k150859J036697L072136
$$ -322972 -1493522 -2168129 -1042433 824488 783102 -1768554 -3919413 -2882716 189420
7834A89420J760933n92099j239012p44635p09610n97404M72644J088128j81158
$$ 189420 1950353 1358254 119242 -625393 -1335003 -1932407 -1459763 -371635 -552793
7825e52793j588832o00099J696045J962733k16333j907295j450737k87341J71378
$$ -552793 -2141625 -2741724 -1045679 917054 700721 -1206574 -2657311 -2944652 -2773274
7816b773274M54330J026582J053564K52969k38075N8813j3686j055960j786517
$$ -2773274 -2318944 -1292362 -238798 14171 -223904 -165091 -178777 -1234737 -3021254
7807c021254j099249K16919J009446J380599J483771M46605j730479k728025o86477
$$ -3021254 -4120503 -3903584 -2894138 -1513539 -29768 416837 -1313642 -4041667 -4728144
$$ [...]
##END NTUPLES=NMR SPECTRUM
##END=
