##TITLE=31Pdec_SR49_k+TFA
 CDCl3, 24 sc
 8.04.2021
##JCAMPDX= 6.0         $$ Bruker NMR JCAMP-DX V2.0
##DATA TYPE= NMR SPECTRUM
##DATA CLASS= NTUPLES
##ORIGIN= UXNMR, Bruker Analytische Messtechnik GmbH
##OWNER= root
$$ XWIN-NMR		Version 3.5
$$ Thu Apr  8 14:07:03 2021 Russian Standard Time (UT+4h)  she@DPX200
##.OBSERVE FREQUENCY= 81.013821
##.OBSERVE NUCLEUS= ^31P
##.ACQUISITION MODE= SIMULTANEOUS
##.ACQUISITION SCHEME= undefined
##.AVERAGES= 24
##.DIGITISER RES= 16
##SPECTROMETER/DATA SYSTEM= spect
##.PULSE SEQUENCE= zgpg30
##.SOLVENT NAME= CDCl3
##.SHIFT REFERENCE= (INTERNAL, CDCl3, 0, 248.564)
##AUDIT TRAIL= $$ (NUMBER, WHEN, WHO, WHERE, WHAT)
$$ ##TITLE= Audit trail, XWIN-NMR		Version 3.5
$$ ##JCAMPDX= 5.01
$$ ##ORIGIN= Bruker BioSpin GmbH
$$ ##OWNER= she
$$ F:/spectra/data/she/nmr/P31/1/pdata/1/auditp.txt
$$ ##AUDIT TRAIL=  $$ (NUMBER, WHEN, WHO, WHERE, WHAT)
(   1,<2021-04-08 14:05:48.98 +0400>,<she>,<DPX200>,
      <created by zg, POWCHK disabled, PULCHK disabled
       configuration hash MD5:
       00 E9 B6 7A A2 85 ED C7 34 08 36 98 17 FE 4E 26
       data hash MD5: 32K
       7B 5B E7 E0 EB EA D1 D9 B8 FB 1E CA B3 7E 22 FC>)
(   2,<2021-04-08 14:05:52.25 +0400>,<she>,<DPX200>,
      <Start of raw data processing
       efp BC_mod = 2 LB = 1 FT_mod = 6 PKNL = 1 PHC0 = -4771.97 PHC1 = 95.20264 SI = 64K 
       data hash MD5: 64K
       26 F4 F7 24 39 F7 1A 30 0A 3B A2 CA 46 11 D6 FF>)
(   3,<2021-04-08 14:06:27.89 +0400>,<she>,<DPX200>,
      <pk PHC0 = 92.44588 PHC1 = -271.4002 
       data hash MD5: 64K
       C3 09 38 E7 4B 1F 0F D3 D0 CF 75 81 A3 B0 2C 87>)
$$ ##END=
$$ 
$$ hash MD5
$$ C6 17 27 92 2A 5F 5C 3C 6C 05 70 BA 68 CA 5C 70
##$RELAX= 
##$RELAX= 
##$RELAX= 
##$RELAX= 
##$RELAX= 
##$RELAX= 
##$RELAX= 
##$RELAX= 
$$ Bruker specific parameters
$$ --------------------------
##$DU= <F:/spectra>
##$EXPNO= 1
##$NAME= <P31>
##$PROCNO= 1
##$TYPE= <nmr>
##$USER= <she>
##$AMP= (0..31)
100 100 100 100 100 100 100 100 100 100 100 100 100 100 100 100 100 100 
100 100 100 100 100 100 100 100 100 100 100 100 100 100 
##$AQSEQ= 0
##$AQ_mod= 1
##$AUNM= <au_zg>
##$AUTOPOS= <>
##$BF1= 81.014009
##$BF2= 200.13
##$BF3= 200.13
##$BF4= 200.13
##$BF5= 200.13
##$BF6= 200.13
##$BF7= 200.13
##$BF8= 200.13
##$BYTORDA= 1
##$CFDGTYP= 0
##$CFRGTYP= 5
##$CHEMSTR= <none>
##$CNST= (0..31)
1 1 145 1 1 1 1 1 1 1 1 1 1 1 1 1 1 1 1 1 1 1 1 1 1 1 1 1 1 1 1 1 
##$CPDPRG= <waltz16>
##$CPDPRG1= <>
##$CPDPRG2= <waltz16>
##$CPDPRG3= <>
##$CPDPRG4= <mlev>
##$CPDPRG5= <mlev>
##$CPDPRG6= <mlev>
##$CPDPRG7= <mlev>
##$CPDPRG8= <mlev>
##$CPDPRGB= <>
##$CPDPRGT= <>
##$D= (0..31)
0 1 0 0 0 0 0 0 0 0 0 0.03 2e-05 3e-06 0 0 0 0 0 0 0 0 0 0 0 0 0 0 0 0 
0 0 
##$DATE= 1617876348
##$DBL= (0..7)
120 120 120 11 120 120 24 19 
##$DBP= (0..7)
150 150 150 150 150 150 150 150 
##$DBP07= 0
##$DBPNAM0= <>
##$DBPNAM1= <>
##$DBPNAM2= <>
##$DBPNAM3= <>
##$DBPNAM4= <>
##$DBPNAM5= <>
##$DBPNAM6= <>
##$DBPNAM7= <>
##$DBPOAL= (0..7)
0.5 0.5 0.5 0.5 0.5 0.5 0.5 0.5 
##$DBPOFFS= (0..7)
$$ [...]
##$SUBNAM2= <"">
##$SUBNAM3= <"">
##$SUBNAM4= <"">
##$SUBNAM5= <"">
##$SUBNAM6= <"">
##$SUBNAM7= <"">
##$SUBNAM8= <"">
##$SUBNAM9= <"">
##$SW= 501.771253377433
##$SWIBOX= (0..15)
0 1 3 0 0 0 0 0 0 0 0 0 0 0 0 0 
##$SW_h= 40650.406504065
##$TD= 32768
##$TD0= 1
##$TE= 0
##$TE2= 300
##$TE3= 300
##$TEG= 300
##$TL= (0..7)
0 120 53 12 22 120 120 120 
##$TP= (0..7)
150 150 150 150 150 150 150 150 
##$TP07= 0
##$TPNAME0= <>
##$TPNAME1= <>
##$TPNAME2= <>
##$TPNAME3= <>
##$TPNAME4= <>
##$TPNAME5= <>
##$TPNAME6= <>
##$TPNAME7= <>
##$TPOAL= (0..7)
0.5 0.5 0.5 0.5 0.5 0.5 0.5 0.5 
##$TPOFFS= (0..7)
0 0 0 0 0 0 0 0 
##$TUNHIN= 0
##$TUNHOUT= 0
##$TUNXOUT= 0
##$USERA1= <user>
##$USERA2= <user>
##$USERA3= <user>
##$USERA4= <user>
##$USERA5= <user>
##$V9= 5
##$VALIST= <valist>
##$VCLIST= <CCCCCCCCCCCCCCC>
##$VD= 0
##$VDLIST= <DDDDDDDDDDDDDDD>
##$VPLIST= <PPPPPPPPPPPPPPP>
##$VTLIST= <TTTTTTTTTTTTTTT>
##$WBST= 1024
##$WBSW= 4
##$XGAIN= (0..3)
0 0 0 0 
##$XL= 0
##$YL= 0
##$YMAX_a= 7968
##$YMIN_a= -2809
##$ZGOPTNS= <>
##$ZL1= 120
##$ZL2= 120
##$ZL3= 120
##$ZL4= 120
##$ABSF1= 0
##$ABSF2= 0
##$ABSG= 0
##$ABSL= 0
##$ALPHA= 0
##$AQORDER= 0
##$ASSFAC= 0
##$ASSFACI= 0
##$ASSFACX= 0
##$ASSWID= 0
##$AUNMP= <proc_1d>
##$AZFE= 0.1
##$AZFW= 0.5
##$BCFW= 0
##$BC_mod= 2
##$BYTORDP= 0
##$COROFFS= 0
##$CY= -3
##$DATMOD= 1
##$DC= 0
##$DFILT= <>
##$DTYPP= 0
##$F1P= 0
##$F2P= 0
##$FCOR= 1
##$FTSIZE= 65536
##$FT_mod= 6
##$GAMMA= 0
##$GB= 0
##$INTBC= 1
##$INTSCL= 5.30512e-09
##$ISEN= 30
##$LB= 1
##$LEV0= 0
##$LPBIN= 0
##$MAXI= 10000
##$MC2= 0
##$MEAN= 0
##$ME_mod= 0
##$MI= 50
##$NCOEF= 0
##$NC_proc= -7
##$NLEV= 6
##$NOISF1= 182.463
##$NOISF2= 159.3651
##$NSP= 0
##$NTH_PI= 0
##$NZP= 0
##$OFFSET= 248.5645
##$PC= 4
##$PHC0= -4679.524
##$PHC1= -176.1976
##$PH_mod= 1
##$PKNL= yes
##$PPARMOD= 0
##$PSCAL= 0
##$PSIGN= 0
##$REVERSE= no
##$SF= 81.014009
##$SI= 65536
##$SIGF1= 159.3651
##$SIGF2= -187.1042
##$SINO= 113.3802
##$SIOLD= 16384
##$SREGLST= <1H.CDCl3>
##$SSB= 0
##$STSI= 65536
##$STSR= 0
##$SW_p= 40650.406504065
##$SYMM= 0
##$S_DEV= 0
##$TDeff= 32768
##$TDoff= 0
##$TI= <>
##$TILT= no
##$TM1= 0
##$TM2= 0
##$TOPLEV= 0
##$USERP1= <user>
##$USERP2= <user>
##$USERP3= <user>
##$USERP4= <user>
##$USERP5= <user>
##$WDW= 1
##$XDIM= 65536
##$YMAX_p= 575662121
##$YMIN_p= -37411650
$$ End of Bruker specific parameters
$$ ---------------------------------
##NTUPLES= NMR SPECTRUM
##VAR_NAME=  FREQUENCY,     SPECTRUM/REAL,   SPECTRUM/IMAG
##SYMBOL=    X,             R,               I
##VAR_TYPE=  INDEPENDENT,   DEPENDENT,       DEPENDENT
##VAR_FORM=  AFFN,          ASDF,            ASDF
##VAR_DIM=   65536,         65536,           65536
##UNITS=     HZ,            ARBITRARY UNITS, ARBITRARY UNITS
##FACTOR=    0.620285442955139, 1,           1
##FIRST=     20137.2065510759, 0,            0
##LAST=      -20513.1999529892, 0,           0
##MIN=       -20513.1999529892, -37411650,   0
##MAX=       20137.2065510759, 575662121,    0
$$ Real data points
##PAGE= N=1
##DATA TABLE= (X++(R..R)), XYDATA
$$ [...]
13017F63286k383611q62419R61261K077805L275849L779575K174671l3691k05022
13008I447704P12807l09601k675570k738534j60396J062000j257664m505413n501072
12999e925739m081149j408629J863053M451559M430230J804859r37943j650912
12991a454671k30568K301969M230799L223825j110927n055069m389895j95504
12983b680041K268167O90784j781402j783974P8013J508178J859995J677966J387429
12974C225115J700146L078073L927995J877993k212574m354019k886439r56869
12966C399421j599299l024633j628582K031150L536205O86774l434271m467125
12958d500360k204231k69664o91927j067088J224353L844778K288345k337238
$$ plain form
13017 663286 -1720325 -2582744 -1621483 456322 3732171 7511746 9686417 9652726 9447704
13008 9447704 10160511 9850910 7175340 4436806 4276410 5338410 4080746 -424667 -5925739
12999 -5925739 -10006888 -11415517 -9552464 -5100905 -670675 1134184 196241 -1454671
12991 -1454671 -1685239 616730 4847529 8071354 6960427 1905358 -2484537 -2680041
12983 -2680041 -411874 278910 -1502492 -3286466 -3208453 -1700275 159720 1837686 3225115
12974 3225115 4925261 8003334 11931329 13809322 11596748 7242729 4356290 3399421
12966 3399421 1800122 -1224511 -2853093 -821943 2714262 3401036 -33235 -4500360
12958 -4500360 -6704591 -6974255 -7666182 -8733270 -7508917 -3664139 -1375794 -3713032
12950c713032l310115J777730O202785L613235k071125k659195J442632K405769
12942C688684j811664m206484m10185M587274N023077K527877R29685q01682m429124
12933E097458o416876l035934K033306K490600m75577l80999L378695M500638
12925G191311N93688k707592j034647J958276J088229k275589l310266j281984
12917B21426P88203J550169J797035J142604j246230l470319k791496l66111J69793
12908b204926j135743m48224K902339M334228J252729k129891r51781K748528
12900D367259L217350m11447l539145l150832p57830J477239K997009K851746
12892G051349p9902l837126m450194j527277J152961J727949K343910L542668
$$ plain form
12950 -3713032 -7023147 -5245417 957368 4570603 2499478 -159717 1282915 3688684
12942 3688684 1877020 -2329464 -2739649 1847625 6870702 9398579 10328264 9526582 5097458
12933 5097458 -1319418 -4355352 -2322046 168554 -307023 -688022 2690673 7191311
12925 7191311 7784999 5077407 4042760 6001036 7089265 4813676 1503410 221426
12917 221426 1009629 2559798 4356833 5499437 4253207 782888 -2008608 -2374719 -2204926
12908 -2204926 -3340669 -3788893 -886554 3447674 4700403 2570512 1618731 4367259
12900 4367259 7584609 7173162 3634017 483185 -274645 1202594 4199603 7051349
12892 7051349 6971447 3134321 -1315873 -2843150 -1690189 37760 2381670 5924338
12884E924338J951599l242167o611532l749078J901543M248851K878627J069808
12876D371989p26463l187615l125792K309414Q198962O580894j597881o901965
12868E921543m567944Q2811J014984p41263j314972k9659J654803K435643N61063
12859E017009m127775o715469k153242N328434N753952j508554n567897j005258
12851d978800L304898n77478n716697k072617N806176N892315j283260l783399
12843c408862J894559N990219K252712l045925k986930j75711M95050L89388K061950
12834C466450K725956m34856l750105k467252J297048K153889j40479j661232
12826A189419j155302k27867J301518M420447O471416L551468k639334n805532
$$ plain form
12884 5924338 7875937 4633770 -1977762 -5726840 -3825297 423554 3302181 4371989
12876 4371989 3645526 457911 -2667881 -358467 7840495 14421389 12823508 5921543
12868 5921543 1353599 1436410 2451394 1710131 395159 365500 2020303 4455946 5017009
12859 5017009 889234 -5826235 -7979477 -2651043 3102909 1594355 -3973542 -4978800
12851 -4978800 -1673902 -2251380 -7968077 -10040694 -4234518 1657797 374537 -3408862
12843 -3408862 -1514303 4475916 6728628 3682703 695773 520062 1015112 1404500 3466450
12834 3466450 6192406 5757550 2007445 -459807 837241 2991130 2850651 1189419
12826 1189419 34117 -193750 1107768 5528215 11999631 15551099 12911765 7106233
12818G106233l837554j541784k684894m023927r26550M282088M706360q68369
12810B211603n137353j892994N142451P099080J863729l744103l973918j019739
12802E48756L91205J86064M26305k36349l640984o255647l059250L629333O136876
12793a873691K548318j094256q99169j26912j440601j500711K084833M708985
12785B406796J743780l063267k880223J533022L305414J48024l111536k781978
12777b699968j062855r63032j248348P62411M128214M980556J697860k539412
12769C055426l210620j35557J741817j354826o145922n638323J652115R252647
12761g83243J0579418O017829O22533k167995k491562k266708l353535n605483
$$ plain form
12818 7106233 3268679 1726895 -957999 -4981926 -5908476 -1626388 3079972 2211603
12810 2211603 -2925750 -4818744 323707 7422787 9286516 5542413 1568495 548756
12802 548756 939961 1126025 1552330 1315981 -2325003 -8580650 -11639900 -8010567 -1873691
12793 -1873691 674627 -419629 -1318798 -1445710 -2886311 -4387022 -2302189 2406796
12785 2406796 4150576 1087309 -1792914 -259892 3045522 3193546 82010 -2699968
12777 -2699968 -3762823 -4725855 -5974203 -5211792 -1083578 3896978 5594838 3055426
12769 3055426 -155194 -290751 1451066 96240 -6049682 -11688005 -10035890 -783243
12761 -783243 9796175 15814004 16436537 14268542 11776980 9510272 6156737 551254
12753E51254o009323k341837K389505L224562R70281J021514L741131L229620
12745F776707j876759m457362l60564M010972J913038k994296l596949o71802
12737a257015J062656K331110N324588N714596o18746p211596n171259J489227
12729A663561J505674m561414n099818K318414O364750J056100m669183k484775
12721c906691K572712K562863m40258m37548J590370J363183l90677r86897j762613
12712A64444m055899m330774p8254M135507L127860o89097j874681n63956j33788
12703d298638j83185J485349L000512J117144k364547k713995O68414L964588
12695F75642M254484J614625k090161l814179j468122K485471L201070O09334
$$ plain form
12753 551254 -5458069 -7799906 -5410401 -2185839 -1215558 -194044 3547087 6776707
12745 6776707 4899948 442586 82022 4092994 6006032 3011736 -585213 -1257015
12737 -1257015 -194359 2136751 7461339 13175935 12557189 5345593 174334 1663561
12729 1663561 3169235 -1392179 -6491997 -4173583 2191167 3247267 -1421916 -3906691
12721 -3906691 -1333979 1228884 788626 351078 1941448 3304631 2913954 1927057 164444
12712 164444 -3891455 -8222229 -8300483 -4164976 -1037116 -1726213 -3600894 -4164850 -4298638
12703 -4298638 -4481823 -2996474 4038 1121182 -1243365 -3957360 -3288946 675642
12695 675642 4930126 6544751 4454590 640411 -827711 1657760 4858830 5468164
12687E468164p16836j8411j419162m419505k453478M878594P995852J968265m845459
12678F438024m463244j574320k731760l410312K091335O866083J860069o772518
12670a696643o226216J914066N151588J372752J04159L720519M107275q96064
12662G551436l510633q44696Q70870n38652M66K196988o43902o736503n439848
12653g094474L527122O602636j238306o864774q46347O634898L469992m444111
12645b53364m659642J362457L608835J027601k60802J32939j199124j978821J123056
12636a096865L438745k56369m389713r93194N407260M557939j767720k876372
12628B023711K357041M597584J006389j353188j47917j655817o996380p779469
$$ plain form
12687 5468164 4751328 4732917 3313755 -1105750 -3559228 1319366 9315218 11283483 6438024
12678 6438024 1974780 400460 -2331300 -5741612 -3650277 3215806 5075875 -1696643
12670 -1696643 -7922859 -6008793 -857205 515547 619706 4340225 8447500 7551436
12662 7551436 4040803 3196107 4066977 3528325 3528791 5725779 5081877 -1654626 -7094474
12653 -7094474 -3567352 3035284 1796978 -5067796 -5914143 720755 4190747 -253364
12645 -253364 -4913006 -3550549 58286 1085887 825085 958024 -241100 -2219921 -1096865
12636 -1096865 2341880 2085511 -2304202 -3297396 2109864 6667803 4900083 2023711
12628 2023711 4380752 8978336 9984725 8631537 8483620 6827803 -168577 -7948046
12620g948046n01934O176100M565781j115353l070466j141443M66332J028015
12612a541014J909803K415190J778481R33226p32420m971181q581924m918713
12604a3708552M750953R350241L164142m711497l661626K476413K528393l561607
12596c373140n070521J515902O415554J673768o824913q199539j437523N083003
12588a0217409N748838K964951J013163M28337p8191l38313L9342k03840j852922
12579b496044k975195j647959M48795M87173m51082J082584M438883M829039R32542
12570D648736k501746k019829l66936n64369k59545K911580M958731J281071m519101
12561C568592n214370j292558O43368j41685K226567P707392P423346k056071
$$ plain form
12620 -7948046 -8449980 -2273880 2291901 1176548 -1893918 -3035361 -2569029 -1541014
12612 -1541014 368789 2783979 4562460 5495686 4763266 -207915 -8789839 -13708552
12604 -13708552 -8957599 392642 3556784 -1154713 -4816339 -2339926 188467 -3373140
12596 -3373140 -8443661 -6927759 -512205 1161563 -5663350 -13862889 -15300412 -10217409
12588 -10217409 -4468571 -1503620 -490457 -62120 -140311 -478624 -439282 -643122 -2496044
12579 -2496044 -5471239 -7119198 -6670403 -6183230 -6634312 -5551728 -1112845 3716194 4648736
12570 4648736 2146990 127161 -239775 -804144 -1063689 1847891 6806622 8087693 3568592
12561 3568592 -1645778 -2938336 -2294968 -2436653 -210086 7497306 14920652 12864581
12553A2864581j0537972p718064J586015M502934j340066n839128k392389L311298
12545e562791L342248o87940j271408L217281O462887L771305j407639k972269
12537D891674q81217j69758k290246k603855J675812N654612L017901m655076
12529D639847r653574p835849j883082M080605P796754P177139J425925n007781
12521G39984n445610N4837M217775L178743J411077K675944K777720k840300r655572
12512b885402r600766k885948K998003M198474L267698K111043k97848k801183
12504e895929j925426J474042J981993j565710l208972P99486N354592L807850
12496H21926k276579n787311l739565O62224L832789M850374L566366K50349k702649
$$ plain form
12553 12864581 2326609 -5391455 -3805440 697494 -642572 -6481700 -8874089 -5562791
12545 -5562791 -2220543 -2908483 -4179891 -962610 5500277 9271582 7863943 4891674
12537 4891674 4010457 3840699 1550453 -1053402 622410 6277022 9294923 4639847
12529 4639847 -5013727 -12849576 -14732658 -10652053 -2855299 4321840 5747765 739984
12521 739984 -4705626 -4650789 -433014 2745729 4156806 6832750 9610470 6770170 -2885402
12512 -2885402 -12486168 -15372116 -12374113 -8175639 -4907941 -2796898 -3094746 -5895929
12504 -5895929 -7821355 -6347313 -4365320 -5931030 -9140002 -8340516 -2985924 821926
12496 821926 -1454653 -7241964 -10981529 -10319305 -6486516 -1636142 1930224 2180573 -522076
12487e22076k404052O56196L143445L323807K182193L50591k563235n098884m103982
12478e035997O56036M980768N149389K025737j298193l410610m184285l048944
12470d166099l44399J521013J015610n4870K55472L78319j631900l164115k12538
12461f403507N130129O083600J261767k356182N18044N470613M998800n11424
12453A4191840m133287k963502j229177k490997m324838l025026M50748K345477
12445a178762J524802O4196k98201K46712Q66812Q86158k63367k099665k602226
12436b853541n65385K054088K463887J434465K264003M758433M140332j555622
12428A2140660o603794m551492K129567M978869J556479j876887q94045Q51346
$$ plain form
12487 -522076 -2926128 -2269932 873513 4197320 6379513 6730104 4166869 -932015 -5035997
12478 -5035997 -4379961 600807 5750196 7775933 6477740 3067130 -1117155 -4166099
12470 -4166099 -4510498 -2989485 -1973875 -2028745 -1773273 -1394954 -3026854 -6190969 -6403507
12461 -6403507 -1273378 4810222 6071989 3715807 4233851 9704464 14703264 14191840
12453 14191840 10058553 7095051 5865874 3374877 -949961 -3974987 -3524239 -1178762
12445 -1178762 346040 410236 112035 358747 1225559 2111717 1848350 -251315 -2853541
12436 -2853541 -3418926 -1364838 1099049 2533514 4797517 9555950 13696282 12140660
12428 12140660 5536866 985374 3114941 8093810 9650289 7773402 6879357 7730703
12420G730703n03106j608871J476304M525356J158924n475097o259426n28927
12412E15860K628998j155993n215339l461023M86311J226681R60338L753656O357548
12403F097037L185579l094110m484396K05883L877634J859542k566593m420278
12395F60298l336157j878029j362214j013572P06365M155618O756788N006631
12387I695728o7049k811253j151039l36364l908661o309121j782432M249388K753357
12378C32554l115480k030843O092330Q395373N3777o744920j992389O022599M282268
12369A1295269m378723o920903r97774L098133m2658l868099k214758J440529
12361b588984J140099k361765m119635k144119J645699M481788M239582O59151
$$ plain form
12420 7730703 7227597 5618726 7095030 11620386 12779310 7304213 1044787 515860
12412 515860 3144858 1988865 -3226474 -6687497 -6201186 -4974505 -4014167 -260511 6097037
12403 6097037 9282616 6188506 1704110 1909993 5787627 7647169 5080576 660298
12395 660298 -2675859 -4553888 -5916102 -6929674 -6223309 -2067691 4689097 9695728
12387 9695728 9628679 6817426 5666387 5330023 1421362 -4887759 -6670191 -2420803 332554
12378 332554 -2782926 -4813769 1278561 9673934 9727711 2982791 990402 7013001 11295269
12369 11295269 6916546 -4357 -1002131 2096002 2053344 -1814755 -4029513 -2588984
12361 -2588984 -1448885 -3810650 -7930285 -10074404 -8428705 -3946917 292665 951816
12353I51816l062561k705057J334161L785236J636131j606003j202080K027500
12345A159143L404930J243498j359215j193572J323898L399485K934280j9307
12337A0893140l332488m008938r02761L162600L617002l98608m334034l706993
12329I88920J31696K292262J354476K77513K60997j370911n051315n800375n43556
12320g460293N391600M952905j04030k093255O77066K505136Q01665l66412Q98086
12311E202468M32930l267880m524381k11300L240797k67996n730400m663955J087298
12302h702419K805442n59867j574650K371324M973140K008685k355781l261468
12294d295594j727546j84004J796570L539893J452749m247089o690382j603542
$$ plain form
12353 951816 -2110745 -4815802 -3481641 303595 1939726 333723 -868357 1159143
12345 1159143 4564073 5807571 4448356 3254784 4578682 7978167 10912447 10893140
12337 10893140 7560652 3551714 2648953 5811553 9428555 9029947 4695913 988920
12329 988920 1120616 3412878 4767354 5044867 5305864 3934953 -1116362 -6916737 -7460293
12320 -7460293 -2068693 2884212 2780182 686927 1363993 3869129 4670794 4304382 5202468
12311 5202468 5635398 2367518 -2156863 -2368163 872634 604638 -5125762 -9789717 -8702419
12302 -8702419 -5896977 -6456844 -8031494 -5660170 -687030 1321655 -1034126 -4295594
12294 -4295594 -6023140 -6207144 -4410574 -870681 582068 -3665021 -10355403 -11958945
12286a1958945N330199O168941J902932m31800R58022J281344j744421m204865
12278b698593k510886J543996M037155L541234R08380k522912m833144l979884
12270f514654p8120M079515N691864M088942K33948m030426o017384l833129R01359
12261e478085L747228K233301j203290k202199M89421L976068M559081J349452
12253G470977k986372m681049k615422L32697O02471j521798k319029J42187L292509
12244b282829L699268J382274j274332l035603l728137k197166K118735N984216
12236F66426M696919j298473n531289l190362K940733O407150M670493L72177
12228I733774k865342l034781N7323L929975M204360k57082m364640l044313Q77864
$$ plain form
12286 -11958945 -6628746 -459805 1443127 1011327 1969349 3250693 1506272 -2698593
12278 -2698593 -5209479 -3665483 371672 3912906 4821286 2298374 -2534770 -6514654
12270 -6514654 -6592774 -2513259 3178605 7267547 7501495 3471069 -2546315 -6379444 -5478085
12261 -5478085 -1730857 502444 -700846 -2903045 -2413624 1562444 6121525 7470977
12253 7470977 4484605 -196444 -2811866 -2479169 -1876698 -3398496 -5717525 -5575338 -2282829
12244 -2282829 1416439 2798713 1524381 -1511222 -5239359 -7436525 -5317790 666426
12236 666426 5363345 4064872 -1466417 -4656779 -1716046 4691104 9361597 9733774
12228 9733774 6868432 3833651 3890974 7820949 12025309 11768227 7403587 4359274 5237138
12219E237138L97486m570647o513208k088707K637770K270932M65103K476454
12211C12321N217373K580266l138978m149433j7828J694303j628714l257774J241401
12202a147063O139383M484994j283788l792395j584223O98250L86665q65911j530705
12193A505207j835785j463483J11206J377006N85960q62637n00981O80648k3836
12184d26695j516255l9619M011690N589832K493390j507514k884143k892407l243434
12175d15155j988675K141728N036964K087309m210598o743724l197744J829371
12167e460524M131838M384208M131081K096742k495241o273647n350275j189025
12159f024843Q56919j191396l308539j124785M081525O851486M031213j856338
$$ plain form
12219 5237138 5634624 1063977 -5449231 -7537938 -4900168 -2629236 -2164133 312321
12211 312321 5529694 8109960 4970982 821549 803721 2498024 869310 -2388464 -1147063
12202 -1147063 4992320 9477314 8193526 4401131 2816908 3515158 3901823 3035912 1505207
12193 1505207 -330578 -1794061 -1682855 -305849 280111 -582526 -1083507 -402859 -426695
12184 -426695 -1942950 -1982569 2029121 7618953 10112343 8604829 5720686 2828279 -415155
12175 -415155 -2403830 -262102 4774862 6862171 2651573 -4092151 -7289895 -5460524
12167 -5460524 -1328686 3055522 7186603 9283345 6788104 514457 -4835818 -6024843
12159 -6024843 -5167924 -6359320 -9667859 -10792644 -6711119 140367 4171580 2315242
12151B315242n608192m514291k79653L288489L781805J693869p26483j589295
12143a638509m71707J841319L877356L772711L81305m677676o889327l004182
12135f808710M113449P060352K168116n350032p160576k036989K904605J755413
12127c354372k840325m194375r02932K040493R21823j719534j335570J977959
12119i406833L799218J656184j701898k212419J73783J942122J059533o75505
12111e365815p22821Q59406K350612K809384J883528r68735m510295m663441P38411
12102g589766O807906N983577j529669o633193l135905L905897N636112J437825
12094D882784j832764m69608K242081K524889Q32240j002160k587168l249258
$$ plain form
12151 2315242 -3292950 -7807241 -8086894 -4798405 -1016600 677269 -49214 -1638509
12143 -1638509 -2110216 -268897 3608459 7381170 7762475 3084799 -3804528 -6808710
12135 -6808710 -2695261 4365091 6533207 1183175 -5977401 -8014390 -5109785 -3354372
12127 -3354372 -6194697 -10389072 -11292004 -9251511 -8329688 -10049222 -11384792 -9406833
12119 -9406833 -5607615 -3951431 -5653329 -7865748 -7691965 -5749843 -4690310 -5365815
12111 -5365815 -6088636 -5229230 -2878618 -69234 1814294 845559 -3664736 -8328177 -7589766
12102 -7589766 -781860 5201717 3672048 -2961145 -6097050 -2191153 3444959 4882784
12094 4882784 3050020 2580412 4822493 7347382 8179622 7177462 4590294 1341036
12086A341036j566584J315932J527492j969087m880001l399325L58319K021766
12078e250452J620001K420904M323141L090300k891005q710517q157800j271461
12070a4826889N556765O832513L643901J322957K411548L738674J111807m655556
12062E135720q311322o384058r12224L398527M165034K766701J920396K669981
12054D448755L500075K332032n64576k595819k312064j153326m27527J016329
12046D243879L400188L025826k575585q204992o067514K516033P423605L824863
12038G586303j167791p2176L544743J912672l697221n163332q97503J820227j246377
12029B619545m831371k727596K981489N489551K555933j957431m090849l687143
$$ plain form
12086 1341036 -225548 1090384 2617876 648789 -4231212 -7630537 -7272218 -5250452
12078 -5250452 -3630451 -1209547 3113594 6203894 3312889 -5397628 -13555428 -14826889
12070 -14826889 -9270124 -2437611 1206290 2529247 4940795 8679469 9791276 5135720
12062 5135720 -3175602 -9559660 -10471884 -7073357 -2908323 -141622 1778774 4448755
12054 4448755 7948830 10280862 9716286 7120467 4808403 3655077 3227550 4243879
12046 4243879 7644067 10669893 8094308 -110684 -6178198 -3662165 3761440 7586303
12038 7586303 6418512 6346336 9891079 11803751 8106530 2943198 2045695 3865922 2619545
12029 2619545 -2211826 -4939422 -1957933 3531618 6087551 4130120 39271 -3647872
12021c647872k623152j829168p95405J068994L222283M114887K640319n18692
12013A632194l180246l331246p22113K652629L860840J850917j081724j946313
12005b65062r50747o99384j597555j160502J267788K749088J651041O36362J825162
11996C456191K556288M6862k809924j512920K182040K349024j752671m357263
11988A57627k014603J702276K183213p3755j834392k145423k185255k425110k385003
11979i020425j789015l61228K205177M968672N838677L935222P25326j657024
11971D845382k100391p20394R96858P23612j867622l403499q71819L074483K811324
11962C487934j769493m059502j67968M699303L190773l577141p204498l316864
$$ plain form
12021 -3647872 -6271024 -8100192 -8895597 -7826603 -4604320 -489433 2150886 1632194
12013 1632194 -1548052 -4879298 -5601411 -2948782 912058 2762975 1681251 -265062
12005 -265062 -1215809 -1915193 -3512748 -4673250 -3405462 -656374 994667 1631029 3456191
11996 3456191 6012479 6059341 3249417 1736497 3918537 6267561 4514890 157627
11988 157627 -1856976 -154700 2028513 1954758 120366 -2025057 -4210312 -6635422 -9020425
11979 -9020425 -10809440 -11170668 -8965491 -3996819 1841858 5777080 6502406 4845382
11971 4845382 2744991 2024597 3021455 3745067 1877445 -1526054 -2397873 676610 3487934
11962 3487934 1718441 -2341061 -2509029 2190274 5381047 1803906 -5400592 -8717456
11954h717456K866017L886241k36621k780102K27576M897498N190100R86133k725810
11945C593576l474104l809282n466922n519531j207009M638167O741243M194968
11937c08894P71733l14444R72792K855740L017953l8199m376228n381992j853531
11928d655070J474450R69673M3975K886953N854969K504104m753247o640849r38824
11919c253866M107383K336621k292614l609420k014997p28018P11321L493618
11911a249972M507106M74846n231390n718827m1772N030740L579933k028899m048899
11902d727134Q98421O753788M896590m034671r390991m255277M712253O649171
11894A502150J754583q06369J927518L367064l01480m231590m024690j965755
$$ plain form
11954 -8717456 -5851439 -1965198 -2201819 -4981921 -4754345 143153 5333253 6319386 3593576
11945 3593576 119472 -3689810 -9156732 -14676263 -15883272 -11245105 -4503862 -308894
11937 -308894 462839 148395 1121187 3976927 6994880 6956681 2580453 -2801539 -4655070
11928 -4655070 -3180620 -2210947 -2166972 719981 6574950 9079054 4325807 -2315042 -3253866
11919 -3253866 853517 3190138 897524 -2711896 -4726893 -5454911 -4743590 -1249972
11911 -1249972 3257134 3731980 -1499410 -7218237 -7260009 -2229269 1350664 -678235 -4727134
11902 -4727134 -3828713 2925075 7821665 3786994 -5603997 -9859274 -5147021 1502150
11894 1502150 3256733 2450364 4377882 7744946 7443466 3211876 -812814 -2778569
11886b778569p44016Q47960K322521Q0581m243447l081998M169555P246431J017543
11877D836561m580760j32835P010402M365671m961621p515184j322944K621457
11869C20747k80608k331421R80382L407483M37187k448697j10633L303709K418858
11860E697007l13877m64511J92590j583304l179512q67881K540634K068878q72995
11851C217029j548102n89897j890830l827408j176360M509253N330032m07260
11843C616457m591876j918136J825992j99232m365924l032353K199976L206016
11835c259080o99387j707403K812481N663456K231145j747164m50307K078647
11827D922388k23844m179170k994036J431103J722368k093002l175283l55813
$$ plain form
11886 -2778569 -3522585 -2674625 -352104 -271523 -4514970 -7596968 -3427413 3819018 4836561
11877 4836561 255801 122966 7133368 11499039 6537418 -977766 -2300710 320747
11869 320747 40139 -2291282 -1310900 2096583 2533770 85073 -25560 3278149 5697007
11860 5697007 5383130 4918619 5111209 3527905 348393 -519488 2021146 4090024 3217029
11851 3217029 1668927 1079030 -811800 -4639208 -5815568 -1306315 4023717 3616457
11843 3616457 -975419 -2893555 -1067563 -1266795 -5632719 -8665072 -6465096 -3259080
11835 -3259080 -3958467 -5665870 -2853389 2810067 5041212 3294048 2843741 4922388
11827 4922388 4698544 519374 -2474662 -1043559 678809 -1414193 -4589476 -4945289
11819d945289M57833j848358q69415N186501Q355585K951218n009778o341369
11811b063072j053311L495494K851946j030000l851986k949198P86504L189178
11803f24445J380515j905736k291367r97222k247411m401884j740769M520049
11795h308270O273123J541836k181282p07682Q07828j051989j263246L205039
11787a684643O154890K679686k008597j951790j19851p55789o48759L179170N375916
11778A0220233J303230l627728l253715j326953k871326l472769J385774M925460
11770C282206O7858o196663l847172K143289P37079m708367k673485M538764M269910
11761b386581l230718m708868K600065O737429K637323p52535J074657P87272
$$ plain form
11819 -4945289 -4487456 -6335814 -7205229 -2018728 6336857 9288075 4278297 -2063072
11811 -2063072 -3116383 379111 3231057 2201057 -1650929 -4600127 -3813623 -624445
11803 -624445 756070 -1149666 -3441033 -4438255 -6685666 -11087550 -12828319 -8308270
11795 -8308270 -2035147 -493311 -2674593 -3382275 -2574447 -3626436 -4889682 -1684643
11787 -1684643 4470247 7149933 5141336 3189546 3069695 2313906 1665147 4844317 10220233
11778 10220233 11523463 7895735 4642020 3315067 443741 -3029028 -1643254 3282206
11770 3282206 3350064 -2846599 -6693771 -4550482 -3813403 -8521770 -11195255 -6656491 -2386581
11761 -2386581 -5617299 -10326167 -7726102 -988673 1648650 896115 1970772 2758044
11753B758044m128256m726297K122447N943788N66285m957874k486669J818383
11745c090149J96003k952601o71502L712378L920621J930527K058117K024770
11737G128164q83236k480768P11473L825405J793560j996672k668823j904264
11729C524839j907382K24287M585001M125851l252011p740355k434843M293612
11721A418999K194654m108509m204881K91041Q12096j703894r9016L760955J952888
11712C14333l824557m129476J489148L579411p68393l750607j166690J254358
11704g002473o81954k393451O92649N322114N926257K079531k778739n442230
11696d278296m105791K10131K975880J262398j324822J11854L435775K955261
$$ plain form
11753 2758044 -1370212 -6096509 -3974062 1969726 2536011 -2421863 -4908532 -3090149
11745 -3090149 -2894146 -5846747 -6518249 -2805871 1114750 3045277 5103394 7128164
11737 7128164 6244928 3764160 4475633 8301038 10094598 8097926 5429103 3524839
11729 3524839 1617457 1841744 6426745 10552596 7300585 -439770 -2874613 1418999
11721 1418999 3613653 -494856 -4699737 -4408696 -3596600 -5300494 -5399510 -1638555 314333
11712 314333 -3510224 -7639700 -6150552 -2571141 -3339534 -7090141 -8256831 -7002473
11704 -7002473 -7684427 -10077878 -9385229 -4063115 1863142 3942673 1163934 -4278296
11696 -4278296 -8384087 -8173956 -5198076 -3935678 -5260500 -5148646 -1712871 1242390
11688A242390n17283j061331J596514J418297l113739o064929l924381n46761
11680a0971223M46665R74544K936754L839596J809521l57267M6477J200541M90843
11671D16451j103241j447902p96167j82553P69900K056949K001746r8055k331034
11662g13906k842562k020497r03109K62426R23275J38277j401112j539948K33752
11653g863404J887959J749900M66948l76448K0576J391660K402992J474058r21934
11644B32307j991946n05275Q46869m77687k453221j521050J672032L455395K773787
11635B031211J563169M45857j656165m002569m234058k169847l2434Q94078Q78991
11626f281767o544j076840j6867L568504N443781K067301l251536m723700k732419
$$ plain form
11688 1242390 725107 -336224 1260290 2678587 -435152 -6500081 -10424462 -10971223
11680 -10971223 -10524558 -9550014 -6613260 -2773664 -964143 -1321410 -1274933 -74392 416451
11671 416451 -686790 -2134692 -2930859 -3113412 -2343512 -286563 1715183 1617128 -713906
11662 -713906 -3556468 -5576965 -6480074 -6217648 -5294373 -5156096 -6557208 -8097156 -7863404
11653 -7863404 -5975445 -4225545 -3758597 -4135045 -4114469 -2722809 -319817 1154241 232307
11644 232307 -1759639 -2264914 -1418045 -1895732 -4348953 -5870003 -4197971 -742576 2031211
11635 2031211 3594380 4040237 2384072 -1618497 -5852555 -8022402 -8054836 -7160758 -6281767
11626 -6281767 -6288311 -7365151 -7382018 -3813514 1630267 3697568 446032 -4277668 -7010087
11617g010087j870066j876361J684448P632179Q529420K091404m472004n054973
11609c46040k682303k454408k802942J77186M298750M050217n24321l957104l470221
11600g711186j519689l42094R46881K772098L029194Q19377q77836Q65035M088425
11591B070205M105218l1164m171173m638911k345667j6645J879301L892464M607663
11582E351291K470324q11451k526239l402006n303121n732564p44700O678229
11574d020237Q328896K549282k985568l106915k085412m312353n886792k123331
11566a3642430L141198L587508O63702k23306O02061m35933j742490N71038M276458
11557c202194M315408K034051K230233L396854N44974m140526l834605P34000
$$ plain form
11617 -7010087 -8880153 -10756514 -9072066 -1439887 7089533 9180937 4708933 -346040
11609 -346040 -3028343 -5482751 -8285693 -8108507 -3809757 240460 -283861 -4240965 -7711186
11600 -7711186 -9230875 -9572969 -8626088 -5853990 -2824796 -2005419 -2883255 -2018220 2070205
11591 2070205 6175423 6144259 1973086 -2665825 -5011492 -5028137 -3148836 743628 5351291
11582 5351291 7821615 7010164 4483925 1081919 -4221202 -9953766 -10698466 -4020237
11574 -4020237 4308659 6857941 3872373 765458 -1319954 -5632307 -11519099 -13642430
11566 -13642430 -10501232 -6913724 -6250022 -6473328 -5871267 -6307200 -8049690 -7478652 -3202194
11557 -3202194 1113214 3147265 5377498 8774352 9319326 5178800 1344195 2078195
11549B078195K262600k90713q71502J415586R36871k308830j492778L436729L620808
11540H786966l032751o719497k092452K708731Q36056j551531K206709O164954
11532G307185K619547l229590k268264K154654N43236n203811m930070J692373
11524a314740M451961p5643l757327j390422J981278J620391M55499J456385J664278
11515E091660j073889k953422j076949R26835n60573k633537j348016J262651
11507b365240J418923M65675J278712J595517j874858n317339k073858N473816
11499a398652O952372r38777q325637n643888L091936O802496K834360j601238
11491A772972j614340j94455o92447j149313O49004K179405N53572k171944k445218
$$ plain form
11549 2078195 4340795 4050082 3178580 4594166 5531037 3222207 1729429 5166158 8786966
11540 8786966 5754215 -965282 -3057734 -349003 487053 -1064478 1142231 7307185
11532 7307185 9926732 6697142 4428878 6583532 7126768 1922957 -3007113 -1314740
11524 -1314740 3137221 3061578 -695749 -2086171 -104893 1515498 1970997 3427382 5091660
11515 5091660 4017771 1064349 -12600 914235 353662 -2279875 -3627891 -2365240
11507 -2365240 -946317 -480642 798070 2393587 518729 -4798610 -6872468 -1398652
11499 -1398652 5553720 4614943 -3710694 -9354582 -6262646 539850 3374210 1772972
11491 1772972 158632 -35823 -728270 -1877583 -1228579 950826 1504398 -667546 -3112764
11482c112764q50515L8064O63211K644665M151530K193192j792983l477331j832379
11473a375310O79875K887986M991200N084849J230689l592418m450911k146071
11465C309889j828152l989688l825556m02233J173180j035615k024712J199479
11457g423408M105170K681052L81216J399516K814386Q8041m073224l534360J388858
11448b172753M633467L378929L72046j714511k916152l470853l080797k221635
11440g192259r18633K206401O313912O475130K10645o417077n142579L078879
11432a385581Q883887O694447M57434l531243m086125l479205k773377j685401
11424i05164o20661m45978j208983k090756k055442p61420M53518l25027k375660
$$ plain form
11482 -3112764 -3963279 -3925215 -3262004 -617339 3534191 5727383 3934400 457069 -1375310
11473 -1375310 -695435 2192551 7183751 12268600 13499289 9906871 5455960 3309889
11465 3309889 1481737 -2507951 -6333507 -6735740 -5562560 -6598175 -8622887 -7423408
11457 -7423408 -3318238 -637186 -255970 1143546 3957932 4045973 -27251 -3561611 -2172753
11448 -2172753 2460714 5839643 6211689 4497178 1581026 -1889827 -4970624 -7192259
11440 -7192259 -8110892 -5904491 409421 6884551 7095196 678119 -4464460 -1385581
11432 -1385581 7498306 14192753 14650187 11118944 7032819 3553614 780237 -905164
11424 -905164 -1525825 -1971803 -3180786 -5271542 -7326984 -8088404 -7634886 -7959913 -10335573
11415a0335573k262441J115994L954318K971774P32254J367036L248053J368093
11407B159508l888324o242312k524835K993697M927544L196761J131921N79038
11399B332998J116857J831897J995468J246729j05086j793104l901602n123845
11391b399688k728796K977104O567895M075304o01806j303484M61124j552883
11383E494770o453857o343430K74359M818265K207232j206015P42763L308282
11375B842369K13632l722515k85565O680441N982754k441571o617566j654712
11367I97267K581220k234077r514857q296096L92642O383252N201691J680955
11359b808003P75998K145874L574304L931883K392171q73160l187286k297625
$$ plain form
11415 -10335573 -12598014 -11482020 -7527702 -4555928 -3823674 -2456638 791415 2159508
11407 2159508 -1728816 -7971128 -10495963 -7502266 -2574722 622039 1753960 2332998
11399 2332998 3449855 5281752 7277220 8523949 8418863 6625759 2724157 -2399688
11391 -2399688 -5128484 -2151380 4416515 8491819 7890013 6586529 7047653 5494770
11383 5494770 -959087 -7302517 -7028158 -2209893 -2661 -1208676 -465913 2842369
11375 2842369 3056001 -666514 -952079 5728362 11711116 9269545 2651979 997267
11367 997267 3578487 1344410 -8170447 -16466543 -16073901 -9690649 -4488958 -2808003
11359 -2808003 -2032005 113869 3688173 7620056 10012227 9139067 5951781 3654156
11351C654156j86642o5977o96690J379920M612423L398667k850791p508334n880911
11342d144179j455449L0167j665691l054211k716621j370313R05029L470276L672118
11333f328874P36513j197375J441570N115961L566273k290935m953677j307594
11325e218138L110842K901509K65138O1610J833287J611090r26144k256397j085342
11316B97455J61863J89618P10497K077080J235903k965007n680805j901818M921816
11307i53398N596923k198431r214283o264894L267326Q077099M142197j452603
11299I99936k326031j114511k458360l989158o28875N669567P643092L334751
11291G130411j473809k096084m29761J01200j44951K82721J11561j970378l568006
$$ plain form
11351 3654156 3467514 3401537 2704847 4084767 8697190 12095857 9245066 1736732 -4144179
11342 -4144179 -5599628 -5569461 -7235152 -10289363 -13005984 -14376297 -13471268 -10000992 -6328874
11333 -6328874 -5592361 -6789736 -5348166 -232205 3334068 1043133 -3910544 -5218138
11325 -5218138 -2107296 794213 1059351 1120961 2954248 4565338 3639194 1382797 297455
11316 297455 459318 648936 1359433 3436513 4672416 1707409 -3973396 -5875214 -953398
11307 -953398 4643525 2445094 -6769189 -13034083 -9766757 -1689658 2452539 999936
11299 999936 -1326095 -2440606 -4898966 -8888124 -9516999 -3847432 3795660 7130411
11291 7130411 5656602 3560518 3130757 3231957 3087006 3369727 3481288 1510910 -2057096
11282b057096j531881K753732M692002K574670p81648k444322k469595k089151
11274a353289j540240r61442j184178j810321l77230L970461P264311M815045
11266H823117j427625m003003l38995K597510j582948p784608n778976L852901
11258e642627Q905049K885525n447146n343984M74301J970021j512400j323448
11250e034709M753574P826243K109209n213109m338188K861366N995912Q67384
11242I827682n804318o420262j834643J497038N49798j236626L35050L927167
11234H40886M132101j023327o643244o828862k044058K331257L623457M037662
11226a574128N049081M203840j75980m594619m263904K66376L747120K980448
$$ plain form
11282 -2057096 -3588977 -835245 3856757 6431427 5649779 3205457 735862 -1353289
11274 -1353289 -2893529 -3854971 -5039149 -6849470 -7226700 -3256239 4008072 8823117
11266 8823117 7395492 3392489 3053494 5651004 4068056 -3716552 -9495528 -5642627
11258 -5642627 3262422 6147947 700801 -4643183 -4168882 -2198861 -3711261 -5034709
11250 -5034709 -281135 7545108 9654317 4441208 103020 2964386 8960298 9827682
11242 9827682 4023364 -2396898 -4231541 -2734503 -2184705 -3421331 -3086281 840886
11234 840886 4972987 3949660 -2693584 -9522446 -11566504 -9235247 -5611790 -1574128
11226 -1574128 3474953 7678793 7502813 2908194 -1355710 -1089334 2657786 5638234
11218E638234k7402j821709j641348p21568K94921J216022Q07414j946051n045627
11209c247114m601464Q735M362028M398893J638964J79466K72896r86790l382630
11200a357016l107068N67220L221535K039019M5943P10738K455853K111872K64418
11191F952514p64100j222294k202932k341815l69322J448973N04502j726633k277896
11182a999003j299149l37787J012367K644654J662216k477059m294240K01301
11174d886700N871288N351485N17668r97764J521315J686760k369406n404866
11166A289780m637742l178494k644414p01782K278455K243103o61042j088884
11158g101020K129264L412157R5588l099476k602854j239125j066532J120649
$$ plain form
11218 5638234 5610832 3789123 2147775 1426207 1721128 2937150 3744564 1798513 -3247114
11209 -3247114 -7848578 -7839843 -3477815 921078 2560042 2739508 3012404 2025614 -1357016
11200 -1357016 -4464084 -3896864 -675329 1363690 1409633 2120371 4576224 6688096 6952514
11191 6952514 6188414 4966120 2763188 421373 52051 1501024 2005526 278893 -1999003
11182 -1999003 -3298152 -3635939 -2623572 21082 1683298 -793761 -5088001 -4886700
11174 -4886700 984588 6336073 6853741 5855977 7377292 9064052 6694646 1289780
11166 1289780 -3347962 -6526456 -9170870 -9872652 -7594197 -5351094 -6012136 -7101020
11158 -7101020 -4971756 -1559599 -1464011 -4563487 -7166341 -8405466 -9471998 -8351349
11150h351349O143744P745514J790311n763523o472147n00286N412217O938488
11142F942969M166161j183718n657107n154872o15007J505661j453517l571370
11134e020800K52898N486191M818124o64132m102188l302634j529640l19233J486201
11125b895213K894570J500309j404890k089530n09377q5481j421162j145076K258223
11116b897627N563392N123758J415969j988155k595608j313226q06446j691865
11108H10192j524279J061820L135017J683979q04198m2832K125610L42318l931910
11099B855717l166618L293401O210191O20734n751381m470764R83376K317774
11091B892430j75076k26575K648395L070078n66741m218611n023696l687240r79497
$$ plain form
11150 -8351349 -2207605 5537909 7328220 1564697 -4907450 -5407736 4481 6942969
11142 6942969 11109130 9925412 4268305 -886567 -1501574 4087 -1449430 -5020800
11134 -5020800 -4767902 718289 5536413 4872281 770093 -2532541 -4062181 -4381414 -2895213
11125 -2895213 -643 1499666 94776 -1994754 -2504131 -2589612 -4010774 -5155850 -2897627
11116 -2897627 2665765 7789523 9205492 7217337 4621729 3308503 2502057 810192
11108 810192 -714087 347733 3482750 5166729 4362531 4319699 6445309 6787627 2855717
11099 2855717 -310901 2982500 9192691 9813425 4062044 -408720 574656 2892430
11091 2892430 2717354 2490779 5139174 8209252 7642511 3423900 -1599796 -5287036 -6266533
11082f266533K710969N287594M909449K721001K46440l066702o125932m406463
11074c990177K881020Q117408M326419m301241p709748l383577K227521L801260
11066A968885K037343m57439k204370k293427j391395k120191m679195m741678
11058a3881467M0907M923744M617569J386303P72493K624142K730095N22441j152398
11049B583829j421021r19720R32219K981976J166861l956216m529788K367492
11041g94368O876987P26437p598221n036747M298311N312237k939919n892751
11033e048034J697105P314500K173078n009369l932721J096904J046795k224491
11025b886233j213379L557393N526177L160989J98648j837020l793746m225992
$$ plain form
11082 -6266533 -3555564 1732030 6641479 9362480 9608920 6542218 416286 -3990177
11074 -3990177 -1109157 7008251 11334670 7033429 -676319 -4059896 -1832375 1968885
11066 1968885 4006228 3548789 1344419 -949008 -2340403 -4460594 -9139789 -13881467
11058 -13881467 -13840560 -8916816 -4299247 -2912944 -2140451 483691 3213786 3736227 2583829
11049 2583829 1162808 243088 1175307 4157283 5324144 1367928 -3161860 -794368
11041 -794368 6082619 6809056 -789165 -5825912 -1527601 3784636 844717 -5048034
11033 -5048034 -3350929 3963571 6136649 1127280 -2805441 -1708537 -661742 -2886233
11025 -2886233 -4099612 -542219 4983958 8144947 8343595 6506575 2712829 -1513163
11017a513163j264517K674811L471863J030617j707086l352482l906363k471028
11009g037348R45997L404837K430420k19694j105935K75405J827602J957686L55680
11000B834650k283820l716510j730972K313555M291614K928596J339932J553184
10992G530229J410780q58516k943385k435721j130241j639617k270401N03250
10984a833622N532508O986249J624514o333646r231037m423517K677661M997772
10976c118K081249o38715l54568n7520j749682k172374P32915K586293k53183
10967A71297l098167j29243M771116L596469j966979k896935J659858K696537
10959D803953l030664o982347k746511L904645M705262O27876k346330k661188
$$ plain form
11017 -1513163 -2777680 -102869 3368994 4399611 2692525 -659957 -4566320 -7037348
11009 -7037348 -6091351 -2686514 -256094 -475788 -1581723 -1306318 521284 2478970 2834650
11000 2834650 550830 -3165680 -4896652 -2583097 1708517 4637113 5977045 7530229
10992 7530229 8941009 8082493 5139108 2703387 1573146 -66471 -2336872 -1833622
10984 -1833622 3698886 10685135 12309649 5976003 -3255034 -7678551 -5000890 -3118
10976 -3118 2078131 1439416 1084848 1027328 -722354 -2894728 -2161813 424480 171297
10967 171297 -2926870 -3056113 1715003 5311472 3344493 447558 2107416 4803953
10959 4803953 1773289 -5209058 -7955569 -4050924 654338 1282214 -1064116 -3725304
10951c725304k139027q13723J323124J822255R9186n0205L135690N102959J975561
10942F730516k785880l927604k288412j738386k287377j900591j472242k092112
10934a1762088p71442M698664R331228O254371k845239q892183o750069j54624
10926a0891382M536070M875897K439200K21845K99429J687051J260359j419939
10918C008530k635135m23076J512120j46383j992492O81061M979712L991610j997858
10909F978089n429221k971925L02624p04j390893m77267J108643J015927J138398
10900B73671L272242M122376L86935m387429m361483p57178J84601k204829j971786
10891e442880K768165N597718J720275m183061m954781j024100K129051K860641
$$ plain form
10951 -3725304 -5864331 -6678054 -5354930 -3532675 -3433489 -3483694 -348004 4754955 6730516
10942 6730516 3944636 17032 -2271380 -4009766 -6297143 -8197734 -9669976 -11762088
10934 -11762088 -12533530 -7834866 1496362 7750733 4905494 -3986689 -10736758 -10891382
10926 -10891382 -6355312 -1479415 959785 1181630 1481059 3168110 4428469 3008530
10918 3008530 373395 -49681 1462439 1316056 -676436 4625 4984337 8975947 6978089
10909 6978089 1548868 -1423057 -1120433 -1121137 -2512030 -2989297 -1880654 -864727 273671
10900 273671 3545913 7668289 8055224 3667795 -693688 -1450866 -1266265 -3471094 -5442880
10891 -5442880 -2674715 2923003 4643278 460217 -4494564 -5518664 -3389613 -528972
10883e28972L404964L478096O66183l566203m648457j977505L61023L77270K85393
10874b148208J209674J230202j76220q14136n1413K45171l27157o05805j506426
10865b944318l994936m201313J843234Q900022P376692j430686n557931m94498
10857e03734M460112K465169n60349J084388J866711l295922p384434l036817
10849d904876L387718K344747k295330j082988L264071J185226n218655m949936
10841h270023K543665O203286J744975k943953k326894l28168n20667n01736J145157
10832c254358J807737R28761R18914J254825l75118j713986O81271L301914N52935
10823D102895m211962l213269K180845M079154K295990K995106M687800J43619
$$ plain form
10883 -528972 2875992 6354088 7020271 3454068 -1194389 -3171894 -2810871 -2433601 -2148208
10874 -2148208 -938534 291668 115448 -698688 -750101 -504930 -832087 -1437892 -2944318
10865 -2944318 -6939254 -11140567 -9297333 -397311 6979381 5548695 -9236 -503734
10857 -503734 3956378 6421547 5861198 6945586 8812297 5516375 -1868059 -4904876
10849 -4904876 -1517158 827589 -1467741 -2550729 713342 1898568 -3320087 -8270023
10841 -8270023 -5726358 476928 2221903 -722050 -3048944 -3377112 -3897779 -4399515 -3254358
10832 -3254358 -1446621 -517860 401054 1655879 1280761 -433225 248046 3549960 4102895
10823 4102895 -109067 -3322336 -1141491 2937663 5233653 8228759 12916559 13060178
10815A3060178p883644q253749k30241M720120K320305R30018M049545L630746
10807A2343278l527230q216182m740893k78738r32289j874685R02193K127339
10799d197207j202762k365365K392774N732739K524828o66087J491335K753777
10791F464032j983727n425244q19350M519675J169564n951623o025185l127K843857
10782e211128N43485j278701o32812j37340J11452J745881L042709J787212n6151
10773h5393k20173l70791j640640j386436J136499K268082J171147J972600M817076
10764G661971L912684j166575k732421J316793K719419k007445m427797N3752
10756E330381K828071j868635n316560m32434L951831j233974p838670m424580
$$ plain form
10815 13060178 5176534 -3077215 -3307456 1412664 3732969 4662987 8712532 12343278
10807 12343278 8816048 599866 -4141027 -4419765 -5352054 -7226739 -6324546 -4197207
10799 -4197207 -5399969 -7765334 -5372560 360179 2885007 2218920 3710255 6464032
10791 6464032 4480305 -944939 -1764289 2755386 3924950 -2026673 -8051858 -8054985 -5211128
10782 -5211128 -4667643 -5946344 -6579156 -6716496 -6605044 -4859163 -1816454 -29242 -85393
10773 -85393 -305566 -676357 -2316997 -3703433 -2566934 -298852 872295 2844895 7661971
10764 7661971 11574655 10408080 7675659 8992452 11711871 9704426 5276629 5330381
10756 5330381 8158452 6289817 973257 540823 4492654 3258680 -4579990 -9004570
10748i004570L247421K768320k856695j698629N183533O422855P70912k185833
10740B647314O38616K985961K023765O24199r60103l699915l475010K179214N796076
10731H760117P46038n538929k770529L978767K784275m001379m390154J509230
10723A077436K688144j950083k544665K180207K638565k794100m186622J713515
10715a177603N873291L316222L0946k64726j710953m548176k188723M898442O176775
10706A0405495j977780q913221o100188M16272J244197k393855l451173k73288
10698a1043541L626990N402245L868210l23311k978255l81108L892563K909716
10690D973509k391399l999667K57863L531114J472060j992041k922481k865336
$$ plain form
10748 -9004570 -5757149 -2988829 -5845524 -7544153 -2360620 4062235 4833147 2647314
10740 2647314 3285930 6271891 8295656 8919855 7959752 4259837 784827 2964041 8760117
10731 8760117 9506155 3967226 1196697 5175464 7959739 3958360 -431794 1077436
10723 1077436 3765580 1815497 -729168 1451039 4089604 1295504 -2891118 -1177603
10715 -1177603 4695688 8011910 8042856 7778130 6067177 1519001 -669722 4228720 10405495
10706 10405495 8427715 -485506 -6585694 -6169422 -4925225 -7319080 -10770253 -11043541
10698 -11043541 -7416551 -2014306 1853904 1530593 -1447662 -1828770 2063793 4973509
10690 4973509 2582110 -1417557 -1159694 2371420 3843480 1851439 -1071042 -3936378
10682c936378l153192j675172J579338K986572J969242K242075M177474L225908
10674G415867j539945m520137k247518J507564K342670J244094J108073K028376
10666G339044K550656K040693N38683r13063l24480J921774K050215j143857l005393
10657A1054272n44901J527596j291747m686445k907077N64999n98596l532567
10649d14466j637494K307456J000601k801835l12250O558518O953723n97467o051375
10640E005411n206078m678544o917513m760738M152365J0573254P601489P36192
10632F505838k198705j846894k158011k741134k096732j541684j184610J633598
10624e628334O140386O913455K363059j977341k016140p74727k083803m336970
$$ plain form
10682 -3936378 -7089570 -8764742 -7185404 -4198832 -2229590 12485 4189959 7415867
10674 7415867 5875922 1355785 -891733 615831 2958501 4202595 5310668 7339044
10666 7339044 9889700 11930393 12469076 11556013 11231533 13153307 15203522 14059665 11054272
10657 11054272 10509371 12036967 10745220 6058775 3151698 3716697 3118101 -414466
10649 -414466 -2051960 255496 1256097 -1545738 -1857988 4700530 11654253 11056786 5005411
10640 5005411 -200667 -4879211 -11796724 -16557462 -12405097 -1831843 5769646 6505838
10632 6505838 4307133 2460239 302228 -2438906 -4535638 -6077322 -7261932 -5628334
10624 -5628334 512052 7425507 9788566 7811225 5795085 5020358 2936555 -1400415
10616a400415m187167j985232l57002m43001j351990j180919J328228M177992
10608e399506L349811p34422j970381K301673O031109L604382j450437l340988
10600B391241l333763m548022m074388O98732M445662K469259J57002L145416
10592A351139N475900J36187n995793k527572N335439M320951m742014r068554
10584e714317n191364j243355O497L404380P531204N303886j233994k476174J897154
10575B283917K751339j545340l091752J26391J600242k72518l72839J185157q31297
10566A833300m828148m138734J02619J219956J34343K447850N473180K831415
10558E075781j809412j021662J159662l074825q160424m124248L458895K733938
$$ plain form
10616 -1400415 -5587582 -7572814 -7929816 -8372817 -9724807 -10905726 -9577498 -5399506
10608 -5399506 -2049695 -2784117 -4754498 -2452825 3578284 7182666 5732229 2391241
10600 2391241 -942522 -5490544 -9564932 -8866200 -4420538 -1951279 -1794277 1351139
10592 1351139 6827039 6963226 967433 -1560139 3775300 8096251 3354237 -5714317
10584 -5714317 -10905681 -12149036 -12142539 -8738159 -1206955 4096931 2862937 386763 2283917
10575 2283917 5035256 3489916 398164 524555 2124797 1852279 1479440 2664597 1833300
10566 1833300 -2994848 -7133582 -7030963 -5811007 -5676664 -3228814 2244366 5075781
10558 5075781 3266369 2244707 3404369 329544 -7830880 -11955128 -8496233 -5762295
10550e762295j616488K712651J0081974N312065p044326q567309R26850M678611
10542G21733K50987P49442N847633J869251q356643o802113N865045Q917878j665853
10533G397360o375229K187227P860264K206638k811498r66554j523886n876351
10525B097971l072881N372556N103570k337303p18341Q097163N571596o835748
10517A3278583q171508K110173L010411o371183n220261N738827L837339q801233
10509e88852o151812R449296Q162398q568325p364209J1553802J1179357j0025073
10501G646582j1933911Q399525Q478269j2868869p317107K2747010J6022564k4621757
10493F552306j7942043L9001828L7985304l6275425k4194797J49914466K80533062
$$ plain form
10550 -5762295 -7378783 -4666132 5415842 10727907 3683581 -4883728 -3956878 721733
10542 721733 972720 1722162 7569795 9439046 1082403 -5719710 145335 9063213 7397360
10533 7397360 1022131 3209358 11069622 13276260 10464762 9498208 7974322 2097971
10525 2097971 -974910 4397646 9501216 7163913 6445572 14542735 20114331 13278583
10517 13278583 5107075 7217248 10227659 3856476 -1363785 4375042 8212381 -588852
10509 -588852 -6740664 2708632 10871030 2302705 -5061504 6492298 17671655 7646582
10501 7646582 -4287329 4112196 12590465 -278404 -7595511 15151499 31174063 6552306
10493 6552306 -11389737 27612091 65597395 29321970 5127173 155041639 435574701
10486D35574701J40087420j57693492k82481415j40822407K9684088L5641833
10480E9990728l6619336l5735390J3534937J2589550k0852017j1572105K2936513
10473D272880J6858267j5052020j2434408J4673140J1771233j4317567j3330289
10466g558764J1421005J3554280p636102j0897299P074482J0214545o041181j0285254
10458a54288K538931N632951m796209m936919O900091P045358o364510r677382
10450c811977J454526O207631j001058l565399K414688K705597m188120m224186
10442d008298L172149M070615k226532l148951J239740J4593m164719Q5359P685565
10433B719521M559661m231301k208901O995332N113849o814471r617148o9099
$$ plain form
10486 435574701 575662121 417968629 135487214 -5335193 24348895 59990728
10480 59990728 23371392 -12363998 1170939 13760489 -7091528 -18663633 4272880
10473 4272880 21131147 6079127 -6355281 8317859 20089092 5771525 -7558764
10466 -7558764 3862241 17416521 9780419 -1116880 5957602 16172147 10130966 -154288
10458 -154288 2384643 8017594 3221385 -1715534 5184557 12229915 5865405 -3811977
10450 -3811977 -2357451 3850180 2849122 -716277 1698411 4404008 215888 -4008298
10442 -4008298 -836149 3234466 1007934 -2141017 -901277 -886684 -5051403 -4966044 2719521
10433 2719521 7279182 3047881 838980 7834312 12948161 6133690 -3483458 -3552557
10425c552557N018131m86047m465997j572364m04634l256249k121368K752681
10417h088404K130480k769150j044591O495594P204436q15850n630415k378018
10409d895918J219672J326599K453630M702049K893316j433623k034728l26958
10401C904039j517720k435314J658417M035098k650422r186455k854984Q685612
10393c61729Q089997k147409m170637M010950O102095l183926r872574n181574
10385f714807K528499M638109L070734M10992m388442p427777k315765O607629
10377c590828P962444J307324k767310n46826J370222K54585J74231J004359j316076
10368C852125m305872k309334J595117N76459k500197q42861J854863j561804
$$ plain form
10425 -3552557 1465574 979527 -3486470 -5058834 -5463468 -8719717 -10841085 -8088404
10417 -8088404 -5957924 -8727074 -9771665 -3276071 3928365 3112515 -2517900 -4895918
10409 -4895918 -3676246 -2349647 103983 4806032 7699348 6265725 4230997 3904039
10401 3904039 2386319 -48995 1609422 5644520 2994098 -6192357 -9047341 -361729
10393 -361729 7728268 5580859 1410222 5421172 11523267 8339341 -1533233 -6714807
10385 -6714807 -4186308 451801 3522535 3933527 -454915 -7882692 -10198457 -3590828
10377 -3590828 4371616 5678940 2911630 2364804 3735026 3989611 4163842 5168201 3852125
10368 3852125 -453747 -2763081 -1167964 -591505 -3091702 -3934563 -2079700 -3641504
10360c641504n863376j959356M652351L048679j619451K781605J0317000N201199
10352A2917147q338183j0371734J111513P268252R42365m197117j122944L051
10344a787650m807082m422410M571293R201978L456238j361157J155598J228335
10336G235143o136811r682066k739347L786730J074555k999722o30646J921815
10328h170349q83647j841822L743807O611625J81538o119606l014223K959627
10320f533050K559234n46866K56989J532693r43025j932002K306757M636949K44419
10311A582098k896214J374504M803889l80385o185501k632746M231610L103413
10303C000668l265992m676016j427906p25959j720624J299194N808591M637732
$$ plain form
10360 -3641504 -9504880 -11464236 -6811885 -3763206 -5382657 -2601052 7715948 12917147
10352 12917147 4578964 -5792770 -4681257 2586995 3529360 -667757 -1790701 -1787650
10344 -1787650 -6594732 -11017142 -6445849 2756129 6212367 4851210 6006808 7235143
10336 7235143 1098332 -8583734 -11323081 -7536351 -6461796 -9461518 -10092164 -8170349
10328 -8170349 -9053996 -10895818 -7152011 -540386 -358848 -6478454 -9492677 -6533050
10320 -6533050 -3973816 -4520682 -4263693 -2731000 -3674025 -5606027 -3299270 1337679 1582098
10311 1582098 -1314116 60388 4864277 4483892 -1701609 -4334355 -102745 3000668
10303 3000668 -265324 -4941340 -6369246 -7095205 -8815829 -7516635 -1708044 2929688
10295B929688j099404m226757k924132j38180L516771P072065N559286j510230
10287I179107n080574J0134M615257j30352o429982k323291O763363N782794m798683
10278G587773r385847k358923M182424Q90211n346048m259506K555385O169296
10270C4765K959785l125038o595154m765913R41254N757854N800506K192964j012478
10261B188545k105192k144708j552801J11910J749085J424519p22215k480743
10253c531600k014051P60273L842445L856116l30032m541919l556608J377825
10245d137551L956401K043202l90815j301409l293995o217245m961901J449422
10237a2853891N964389L618420j001619j603166P00497J718501J804359K980222
$$ plain form
10295 2929688 1830284 -2396473 -5320605 -5458785 -1942014 5130051 10689337 9179107
10287 9179107 4098533 4108667 8723924 8593572 2163590 -159701 6603662 12386456 7587773
10278 7587773 -1798074 -4156997 25427 915638 -4430410 -8689916 -6134531 34765
10270 34765 2994550 -130488 -6725642 -11491555 -10550301 -4792447 1008059 3201023 2188545
10261 2188545 83353 -2061355 -3614156 -3502246 -1753161 -328642 -1050857 -3531600
10253 -3531600 -5545651 -4785378 -942933 2913183 2583151 -1958768 -5515376 -4137551
10245 -4137551 -181150 1862052 1471237 169828 -3124167 -9341412 -14303313 -12853891
10237 -12853891 -6889502 -3271082 -4272701 -5875867 -5175370 -3456869 -1652510 1327712
10229A327712L359285P17973k196625j588033J329996K807622J895632l43492
10221G310070l150458m441134j480176L658933M536776l95927m636013l264342
10213a862271L39208J316229M96437L50601K726j211962j201842n1410r25113
10204b747397k623478O70055Q102254R920600K075259o473613p497975m615223
10196c189518l278358n14819N764209P873375O68847o462786l050530M951726
10188B762146N110344r63914k367907J090546J15269n630192o838830j985679
10180h708217K36914k690983k952474K522222O208840L264146j069782j721777
10172d911111j080241j632943p55133K563651M013116J313483j754917j975866
$$ plain form
10229 1327712 4686997 5404970 3208345 1620312 2950308 5757930 7653562 7310070
10221 7310070 4159612 -281522 -1761698 1897235 6434011 6038084 1402071 -1862271
10213 -1862271 -1523063 -206834 289603 640204 642930 -569032 -1770874 -1822284 -2747397
10204 -2747397 -5370875 -4700820 3401434 13322034 15397293 8923680 1425705 -3189518
10196 -3189518 -6467876 -6982695 -1218486 6654889 7323736 860950 -2189580 2762146
10188 2762146 7872490 6908576 4540669 5631215 5746484 116292 -6722538 -8708217
10180 -8708217 -8471303 -11162286 -14114760 -11592538 -5383698 -2119552 -3189334 -4911111
10172 -4911111 -5991352 -7624295 -8379428 -5815777 -1802661 -489178 -2244095 -4219961
10164d219961o75023J092334L993481N311257Q10985n985361n626021K669005
10156b629304P710260K617493m795289m566483O75171J840706j939638m003227
10148e090311j951319J41926Q7290M90707K879714M844579M253325K104712K4645
10139G785268j868541l486038l721062k265701q06465r39761j751457j029583
10131h083340J148307J836080n17966k834732j197179K817540L562351k03931
10123c472870k868031l78717L427931K886731r13769k659354j156185M78713J251228
10114c404323K971938M976462L883901n57428m028137l377375m31747J055553
10106A088844j23467j848037r78701L062286O265848L855848k666920o113414
$$ plain form
10164 -4219961 -4894984 -3802650 190831 5502088 6313073 327712 -5298309 -2629304
10156 -2629304 5080956 7698449 2903160 -1663323 -988152 852554 -1087084 -5090311
10148 -5090311 -7041630 -6899704 -6812414 -6321707 -3441993 1402586 5655911 7760623 7785268
10139 7785268 5916727 2430689 -1290373 -3556074 -4362539 -5302300 -7053757 -8083340
10131 -8083340 -6935033 -5098953 -5616919 -8451651 -9648830 -6831290 -3268939 -3472870
10123 -3472870 -6340901 -6719618 -3291687 -404956 -1318725 -3978079 -5134264 -4655551 -3404323
10114 -3404323 -432385 4544077 8427978 7870550 3842413 465038 33291 1088844
10106 1088844 965377 -882660 -1861361 1200925 7466773 11322621 8655701 2542287
10098B542287l541778n75093j841008l016927J043401N686199L061340m086624
10090g28203n585933L40983M886164K958517n35909r57059p21147k008108j476897
10081c827592K539497M789992R09687n000751o215796k599338J051931K346197
10073f006173K261579J513962J83902q30575r59996r07601q30151J9823R39680
10064d615550M83877K14396L207282P752762Q036326L029111j257961j160226
10056A5690017o56752l428196o083595m618715j805221j790467k332059M31386
10048d593602L579672J744056k915807l313739J280629M441820K743200o86671
10040B279558k921662m261232l819963M18143N500066M894271j312973m750013
$$ plain form
10098 2542287 -999491 -1574584 -3415592 -6432519 -5389118 297081 3358421 -728203
10090 -728203 -6314136 -5973153 -1086989 1871528 1335619 378560 -342587 -2350695 -3827592
10081 -3827592 -1288095 3501897 4411584 -589167 -6804963 -9404301 -8352370 -6006173
10073 -6006173 -3744594 -2230632 -2046730 -2877305 -3837301 -4744902 -5575053 -5555230 -4615550
10064 -4615550 -4131673 -3917277 -709995 7042767 15079093 18108204 16850243 15690017
10056 15690017 15033265 11605069 5521474 902759 -902462 -2692929 -5024988 -4593602
10048 -4593602 -1013930 730126 -2185681 -5499420 -4218791 223029 2966229 2279558
10040 2279558 -642104 -4903336 -8723299 -8305156 -2805090 2089181 776208 -3973805
10032c973805r42920L843307K957610j47914J145021M475290K336348m411956
10024E280981o528786n71093N653365M801404j03656k039204n17839J15965q45320
10015E245817k94481J877339K028911q55249l286917k917693j454045k73619K262155
10006B332218O161298O583762K0470q485335r791910k558671M278203L056963
9998A596998k587037l295174K473870O022767Q89071p267914p924220m13470N003736
9989e501373J695151m167918l160354L585708O720735K638348k353427k442247
9981b985377N1074L25726j136247p71368J610239L021842K142532L24527j144349
9972A438599j902951j551725k42909N70616k1217o49128M91401K917646M392036
$$ plain form
10032 -3973805 -4916725 -1073418 1884192 1736278 2881299 7356589 9692937 5280981
10024 5280981 -1247805 -1818898 3834467 8635871 8532215 6493011 5975172 6091137 5245817
10015 5245817 4951336 6828675 8857586 8002337 4715420 1797727 343682 70063 2332218
10006 2332218 8493516 15077278 15097748 6612413 -3179497 -5738168 -1459965 1596998
9998 1596998 -990039 -4285213 -1811343 4211424 5100495 -2167419 -10091639 -10505109 -5501373
9989 -5501373 -3806222 -7974140 -11134494 -7548786 -828051 1810297 -543130 -2985377
9981 -2985377 -2934303 -2608577 -3744824 -4516192 -2905953 115889 2258421 2582948 1438599
9972 1438599 -464352 -2016077 -2258986 -1688370 -1709587 -2358715 -1867314 1050332 5442368
9963E442368L286705l88268m784676o393694k818468L369147O100441K822713
9955F636268k422179m597856l464455j623835P2125K027179L237909K488103O86047
9946C039306n67962j128567j082005K05852J809726J180891j196210r82440K866313
9937D144904M614996K57350m790106l025464L226049M858744m50685n567697n031230
9928a763139j413283J039920K374990L697031L407539K26962l644562n374705
9920a449247m920520l564749j554785J002738L103887M180412M610487M126071
9912E534294J929528r27003j829186l86256L57394j983552n374558n342531m27512
9903h449382N280661N891487N41007m845625m793483j694738j542480l371528
$$ plain form
9963 5442368 8729073 8340805 3556129 -2837565 -5656033 -2286886 3813555 6636268
9955 6636268 4214089 -383767 -3848222 -5472057 -5399932 -3372753 -134844 2353259 3039306
9946 3039306 2471344 1342777 260772 466624 2276350 3457241 2261031 1278591 4144904
9937 4144904 8759900 9017250 4227144 1201680 4427729 9286473 8835788 3268091 -1763139
9928 -1763139 -3176422 -2136502 238488 3935519 7343058 7570020 3925458 -1449247
9920 -1449247 -6369767 -9934516 -11489301 -10486563 -7382676 -3202264 1408223 5534294
9912 5534294 7463822 6536819 4707633 4321377 4678771 2695219 -2679339 -8021870 -8449382
9903 -8449382 -3168721 2722766 3263773 -1581852 -6375335 -8070073 -9612553 -12984081
9895a2984081m21973O822435Q293193J41076o774405k798041M837800L882792
9887I98796k666599k956849J889767J21521p223034m865042J0029194J8627922
9879A3955676P756286r437657j3099848m349283J623059O73822J031976M542596
9871B696627L752513k455276n238796o20959M045417K465786j468930j715026
9863A461356N39489R14902l28844L1J711209J362818k347710o227365n750534
9854h664648l4470O208244O895883J822440k592024j896002K70422j468717n038396
9845d497268m144270J087717L886443J540663p44298J274009M437832M003067
9837F843895Q73323j064433j220339j638670k332874j404929J048835K452687
$$ plain form
9895 -12984081 -13406054 -6583619 1709574 1850650 -4923755 -7721796 -2883996 998796
9887 998796 -1667803 -4624652 -2734885 -2613364 -9836398 -14701440 -4672246 13955676
9879 13955676 21711962 12274305 -825543 -5174826 -3551767 -2877945 -1845969 2696627
9871 2696627 6449140 3993864 -1244932 -1865891 2179526 4645312 3176382 1461356
9863 1461356 2000845 2915747 2586903 2586934 4298143 5660961 3313251 -2914114 -8664648
9854 -8664648 -8699118 -2490874 4405009 6227449 3635425 1739423 2009845 541128 -4497268
9845 -4497268 -8641538 -7553821 -3667378 -2126715 -2871013 -1597004 2840828 6843895
9837 6843895 7717218 6652785 5432446 3793776 1460902 55973 1104808 3557495
9829C557495J280939r50638j568833K19289K246292J478823k161719m780640k986436
9820c665428J247541K780486K94959k078454r53927J765574K354916M88838j464242
9811G70263k304796k436646j807234j72427J295172J234825O43328J728258M082122
9802C032865M455266J238344k826067l889697j720082M47370J48910j853385l220013
9793d186489k547011j3558K850524L508867M46134l933630m504162K85205N131452
9784b962668M113549j056845l293098m05270K150049L89542j788888P80086N663453
9775C589910N919251M4979o262576p607339l874765J802422N933779N713041J241690
9766F500392l011123k568192J170373L008042J529198L1749j29889j496453m348747
$$ plain form
9829 3557495 4838434 3887796 2318963 2538252 4784544 6263367 4101648 -678992 -3665428
9820 -3665428 -2417887 362599 657558 -1420896 -2374823 -609249 1745667 2234505 770263
9811 770263 -1534533 -3971179 -5778413 -5950840 -4655668 -3420843 -2777515 -1049257 3032865
9802 3032865 7488131 8726475 5900408 2010711 290629 737999 886909 -966476 -4186489
9793 -4186489 -6733500 -6747058 -3896534 -387667 58467 -3875163 -8379325 -8094120 -2962668
9784 -2962668 1150881 94036 -3199062 -3604332 -1454283 -1064741 -2853629 -2073543 3589910
9775 3589910 9509161 9554140 3291564 -4315775 -8190540 -6388118 -454339 5258702 6500392
9766 6500392 3489269 921077 2091450 5099492 6628690 6660439 6530550 5034097 685350
9757F85350m456242j27780L541055J738945k612808l229256M74537L547558L006287
9748B567646N53066j285549j628286l94354J398577J109243k223437m807484k313648
9739g024226L198457M984924P97278l978550l867321j57189K150176J358841J16297
9730b421313Q03162K478233K524297J81060k104280j355383J799582L292768J127443
9721F325569j522931j313044l58009k455220n405586l287779L380382O564998
9713A928380K193398l595527l646841K68924J967904Q39079Q54577K355048J737486
9704D902428j465334l456357k503086j116320j123646j187455j79840J144962
9696d984648K738376N368670P141230M340115k446435p130330n530053o70291
$$ plain form
9757 685350 -3770892 -3898672 -357617 1381328 -1231480 -4460736 -3986199 -438641 2567646
9748 2567646 3120712 1835163 206877 -187477 1211100 2320343 96906 -4710578 -7024226
9739 -7024226 -3825769 1159155 1956433 -2022117 -5889438 -6046627 -3896451 -2537610 -2421313
9730 -2421313 -1618151 860082 3384379 3565439 1461159 105776 1905358 5198126 6325569
9721 6325569 4802638 3489594 3131585 676365 -4729221 -8017000 -4636618 1928380
9713 1928380 4121778 526251 -3120590 -2851666 -883762 -44683 809894 3164942 4902428
9704 4902428 3437094 -19263 -2522349 -3638669 -4762315 -5949770 -6129610 -4984648
9696 -4984648 -2246272 3122398 10263628 14603743 12157308 5026978 -503075 -1173366
9688a173366J828960O70850j594783l322775m583674m618648j880785L194122
9680a1480099P406026P381319K686233l307856n952261l846375m67669K07000
9672g373682j199345j246329M33894R40705k70757l14028J366166J162976k147765
9663h648165l741485L80422O486488P762612L428355j476423l665834m039435
9655c513465l395180q59835K732033M196209K339672p2641k98272P64384O62118
9646B555023o32612r59898L00659P73603j588050m730364m258704L32869L735453
9637d472021J653087k630298k801309N91395Q29205l625326n503075l6831O596540
9628i398633O205593J131655J61547M499050O377686J808158l430834l152293
$$ plain form
9688 -1173366 655594 1326444 -268339 -3591114 -8174788 -12793436 -14674221 -11480099
9680 -11480099 -4074073 3307246 5993479 2685623 -3266638 -7113013 -7580682 -7373682
9672 -7373682 -8573027 -9819356 -9385462 -8444757 -8715514 -9029542 -7663376 -6500400 -8648165
9663 -8648165 -12389650 -12009228 -5522740 2239872 5668227 4191804 525970 -3513465
9655 -3513465 -6908645 -7768480 -5036447 -840238 1499434 1426793 1128521 1892905 2555023
9646 2555023 1922411 962513 1263172 2036775 448725 -4281639 -8540343 -8207474 -4472021
9637 -4472021 -2818934 -5449232 -8250541 -7659146 -6829941 -10455267 -15958342 -15995173 -9398633
9628 -9398633 -3193040 -2061385 -1899838 2599212 8976898 10785056 7354222 4201929
9620D201929M40439J445151q15909k343756j360674N5458M32250Q53088J824080
9611D732056J533958q80334k577996m48408L496429L758067p33870m177405k074053
9602B628444J776524J126325k613088k624737J953687M523497J934905q93792
9594G811765r6857R41958j184807l466431k610404j231387j932013j474983K262848
9585i80311L828422r76756n627966k153885M899175N089778o90628k178590K448309
9576C657548M100093o95146l963788o77444K973773J152990k063653j163541J313653
9567D634485N85012j958314k573381j646190p51151J193680L651784K185432m021042
9558A300315p967750m064378L427551O826239N062451J820939j193117l239879
$$ plain form
9620 4201929 4642368 6087519 5271610 2927854 1567180 1622638 2054888 2907976 4732056
9611 4732056 6266014 5385680 2807684 2359276 5855705 9613772 8879902 4702497 2628444
9602 2628444 4404968 5531293 2918205 293468 2247155 6770652 8705557 7811765
9594 7811765 7714908 8656866 7472059 4005628 1395224 163837 -1768176 -3243159 -980311
9585 -980311 2848111 1871355 -3756611 -5910496 -1011321 4078457 3387829 1209239 3657548
9576 3657548 7757641 7062495 3098707 2421263 5395036 6548026 4484373 3320832 4634485
9567 4634485 5219497 3261183 687802 -958388 -1709539 -515859 3135925 5321357 1300315
9558 1300315 -6667435 -10731813 -7304262 -478023 4584428 6405367 5212250 1972371
9550A972371j916221K158767L016840j751737n071153q20065N226374L968350
9542F783526k100810l208793J313820K686422j681341m028144m8246L851410J667895
9533E235739k559136k181154J361133J772890j985314m823332l214250O64083
9525e729341K214405n67370n103598o388062k132178M100269O689956M727140
9517b188779K325121K150231K188794R1767k697917l268414j223195J701684M011269
9508C090561M587683K456297j339546l218454j027272K297719J729693l155905
9500E420776p061148n569291p51136J895417Q52865j25209J638892L669105K821210
9491B791481P81923J136634K819752J655600j892404k413469J451918L596470
$$ plain form
9550 1972371 56150 2214917 5231757 3480020 -1591133 -2411198 2815176 6783526
9542 6783526 4682716 1473923 2787743 5474165 3792824 -235320 -283566 3567844 5235739
9533 5235739 2676603 495449 1856582 3629472 1644158 -3179174 -6393424 -5729341
9525 -5729341 -3514936 -4082306 -9185904 -15573966 -17706144 -13605875 -6915919 -2188779
9517 -2188779 136342 2286573 4475367 4567134 1869217 -1399197 -2622392 -920708 3090561
9508 3090561 7678244 10134541 8794995 5576541 4549269 6846988 8576681 5420776
9500 5420776 -1640372 -7209663 -7960799 -6065382 -5212517 -5337726 -3698834 -29729 2791481
9491 2791481 3573404 4710038 7529790 9185390 7292986 4879517 6331435 9927905
9483I927905m97963o336941o911753k773810J53916K49491J131043L753128M269134
9474B964150J048901j871410r68293J467397J450859m43678p61326P12144P02517
9465D301261j712571k943056l70397K910580K099517j962035l702473j416068
9457b795242k7030k733710m815790q58180N545813O315170J300657j840050k18543
9448a26905N94471k394103l894563l19764K735385k45413m625327k921786K688792
9439h509213M035310Q8804k566947j011365J034255J481011K672905M542140K859204
9430D626104k777949n883187k067423L830287M041023j831646o978052o233801
9422a3274644j225003L012320L918482K994929K577873K610637J635388k67l71323
$$ plain form
9483 9927905 9429942 3093001 -3818752 -6592562 -6438646 -6189155 -5058112 -1304984 2964150
9474 2964150 4013051 2141641 1173348 2640745 4091604 3647926 2886600 3598744 4301261
9465 4301261 2588690 -354366 -724763 2185817 4285334 2323299 -1379174 -2795242
9457 -2795242 -2822272 -5555982 -10371772 -11229952 -5684139 631031 1931688 91638 -126905
9448 -126905 467566 -1926537 -5821100 -6140864 -3405479 -3650892 -8276219 -11198005 -8509213
9439 -8509213 -4473903 -4385099 -6952046 -7963411 -6929156 -5448145 -2775240 1766900 4626104
9430 4626104 1848155 -4035032 -6102455 -2272168 1768855 -62791 -7040843 -13274644
9422 -13274644 -14499647 -11487327 -7568845 -4573916 -1996043 614594 2249982 2249715 1878392
9413A878392M88497K78061j463489k294094j318354q46640j593972o75262K656584
9404b890277M123034J339466j319812N8610J793204q15319m371110k765322K004908
9395b842618L369433J866481L280824O437666L905708m233772q393105m302929
9387i12312L52870j282665m982675l921636L28379K263910J960528K787740L811962
9378D06101J744080j882308j996603K273626O076989N023756k64708n457875o362910
9369d39852k404653K417110L503290J154289m13970J66490k86968l072999m214757
9360c592020n72202M517350N495173J872239k162844l434470k091790J27837J360274
9351A519547N49661j314111k079090j279787k17869Q79235K762862M115532K624064
$$ plain form
9413 1878392 2366889 2644950 1181461 -1112633 -2430987 -3277627 -4871599 -5546861 -2890277
9404 -2890277 1232757 2572223 1252411 1311021 3104225 2288906 -2082204 -4847526 -2842618
9395 -2842618 526815 2393296 5674120 12111786 16017494 11783722 3390617 -912312
9387 -912312 -559442 -1842107 -6824782 -10746418 -10418039 -8154129 -6193601 -3405861 406101
9378 406101 2150181 267873 -1728730 544896 6621885 11645641 11380933 5923058 -439852
9369 -439852 -2844505 -427395 3075895 4230184 3816214 3982704 3695736 622737 -3592020
9360 -3592020 -4164222 353128 5848301 7720540 5557696 2123226 31436 159273 1519547
9351 1519547 2069208 755097 -1323993 -2603780 -2821649 -1942414 820448 4935980 7560044
9342G560044l27333p52785J107169N65550l055568m090657n5385K962017l06876
9333C606176n152717l911103J902889M120984N09419k809610j431048J628695
9325a536315J830085m43081j616166J19261L431261N461291L859786j123992n968976
9316D013154o630015k463132L205183O266923N188474J836668n91419r56254j130871
9307H738711k644956l853707k913371j836292l335272m818405j441179M742834
9299g361637N815115J99925l678537l483N332581M202427j272597l192245m02659
9290c61110J677798J110459R94791J977226J085246j584257k027754O00202K151623
9281E624224L03176k152610k647436k508052k973513j999395J796910N208506
$$ plain form
9342 7560044 7232711 6479926 7587095 8152645 5097077 1006420 951035 3913052 3606176
9333 3606176 -1546541 -5457644 -3554755 566229 1075648 -1733962 -3165010 -1536315
9325 -1536315 293770 -149311 -1765477 -1646216 1785045 7246336 11106122 9982130 4013154
9316 4013154 -2616861 -5079993 -1874810 4392113 9580587 11417255 10825836 9869582 8738711
9307 8738711 6093755 2240048 -673323 -2509615 -5844887 -10663292 -12104471 -7361637
9299 -7361637 -1546522 -1346597 -5025134 -5028617 303964 4506391 3233794 41549 -361110
9290 -361110 1316688 2427147 3421938 5399164 6484410 4900153 2872399 3472601 5624224
9281 5624224 5927400 3774790 1127354 -1380698 -4354211 -6353606 -4556696 651810
9273F51810M025278r28096m340869k860110J033560K387791J18760j679876L61500
9264a230252L515572K489759k401521n005494k244578J562345J836527N13998
9256i63644J652814M091888L502630n88084m510835n558392l492826J021429N594282
9247G49262O092750J727291k254873j429249J103875J32694k658420j888039J501246
9238C076537J334663l132530n563501k624272J497864K654296K364078L184007
9230B791142L901745K452984m18241k891874m182995l564377q52024J339688R546
9221a414406k819625j892900K951970N458622J816584m163471o965498n608450
9213a2637174j646909L809937P884974N964894j556643o715181l266216M330405
$$ plain form
9273 651810 4677088 3748992 -591877 -3451987 -2418427 -30636 88124 -1591752 -1230252
9264 -1230252 2285320 4775079 2373558 -2631936 -4876514 -3314169 -1477642 -963644
9256 -963644 689170 4781058 8283688 7695604 3184769 -2373623 -5866449 -4845020 749262
9247 749262 6842012 8569303 6314430 4885181 5989056 6121750 3463330 1575291 3076537
9238 3076537 4411200 1278670 -4284831 -6909103 -5411239 -2756943 -392865 2791142
9230 2791142 6692887 9145871 8727630 5835756 1652761 -1911616 -2763640 -1423952 -1414406
9221 -1414406 -4234031 -6126931 -3174961 2283661 4100245 -63226 -7028724 -12637174
9213 -12637174 -14284083 -10474146 -2589172 3375722 1819079 -4896102 -8162318 -3831913
9205c831913O409452Q83442m604141l085308L590063Q213909O910657K330645
9197A6816806r45476k087812l585839n889503n784614j887961J613273N50247
9189a200879k461014j916317J660899K807790M02868r98771M04596J082921l81364
9180e99271n70861J470538J585428j328967j986115J800922L855000n258l645351
9171E76065n68777M244926K177374m187816n243392p05085L87699l987933m988820
9162a2295759J451863O771562L716060j557875K08870O015405N631065j754195
9154H186996o438057l469636P15398l87579l439358j802275L380469N050778R22114
9145B718850l638748l407895O18299L906510L749397Q06882k097133j889041J600790
$$ plain form
9205 -3831913 2577539 3460981 -1143160 -4228468 -638405 7575504 14486161 16816806
9197 16816806 15871330 13783518 10197679 4308176 -1476438 -3364399 -1751126 -1200879
9189 -1200879 -3661893 -5578210 -3917311 -1109521 -706653 -1705424 -1300828 -217907 -599271
9180 -599271 -1170132 300406 1885834 556867 -1429248 371674 4226674 4221416 576065
9171 576065 7288 4252214 6429588 2241772 -3001620 -3706705 -3319006 -7306939 -12295759
9162 -12295759 -10843896 -4072334 -356274 -1914149 -1705279 4310126 9941191 8186996
9154 8186996 1748939 -1720697 -1005299 -1392878 -4832236 -6634511 -3254042 1796736 2718850
9145 2718850 -919898 -4327793 -3709494 197016 3946413 4753295 2656162 767121 2367911
9136B367911M059948J367793l830391m508573M77030L694223k02948o243430o472878
9127i291315j317487K543107K729108K688401M131754M845152L837675K476044
9119A2642439N11531l091314n635204l441417R76308J504943j578414j986396
9111i7524J401167K486574q38037k696376m2498J799071n90795k002434J382801
9102H01949L874539J47980m483655k941378J007241o00162n633475n410740M73476
9093a2764225M014480K304648O66671K128715L357151K187302P90821P456j965304
9084G27715m147185l225641l04468l1314k202247j745972J831102K910354m23220
9075f610876k877897r88104J800900K357069K980604N208956N122103n8465n811398
$$ plain form
9136 2367911 6427859 7795652 3965261 -543312 -66282 3627941 3424993 -2818437 -9291315
9127 -9291315 -10608802 -8065695 -5336587 -2648186 1483568 6328720 10166395 12642439
9119 12642439 13153970 10062656 4427452 986035 1962343 3467286 1888872 -97524
9111 -97524 1303643 3790217 2952180 255804 213306 2012377 1421582 -580852 801949
9102 801949 4676488 4824468 340813 -2600565 -1593324 -2193486 -7826961 -13237701 -12764225
9093 -12764225 -8749745 -6445097 -5778426 -3649711 -292560 1894742 2685563 2693019 727715
9084 727715 -3419470 -6645111 -6949579 -6980893 -9183140 -10929112 -9098010 -6187656 -6610876
9075 -6610876 -9488773 -10476877 -8675977 -6318908 -3338304 1870652 6992755 6934290 1122892
9066A122892n985809j121289L181866L445626O02498k340616k486320O68078L763971
9057H50897L223330N76306O7593J216619l43364m169623m463045k05838J920380
9048a326745j591402m713277j466757M572343O196785K783888j195892l383848
9040a24905l659099j213621K945794M293209Q23359k830211k201634J79822m5144
9031a832430j477783n01703J599325J444480P8410M49447J539697R97462K41341
9022B538246J019662Q49629j814743k597637J277274L739647q67067o461260m120405
9013f436654K077240J180403n276728m947315M010273Q845450K988143l922567
9005a481755k975485N46885r67868l769075r89966M518257O031634M520240M244524
$$ plain form
9066 1122892 -4862917 -5984206 -2802340 643286 1245784 -1094832 -3581152 -2913074 850897
9057 850897 4074227 4650533 4718126 5934745 5591381 1421758 -3041287 -3247125 -1326745
9048 -1326745 -2918147 -7631424 -9098181 -4525838 1670947 4454835 3258943 -124905
9040 -124905 -3784004 -4997625 -2051831 2241378 3064737 234526 -1967108 -1787286 -1832430
9031 -1832430 -3310213 -3811916 -2212591 -768111 -689701 -240254 1299443 2296905 2538246
9022 2538246 3557908 4407537 2592794 -4843 1272431 5012078 4145011 -2316249 -6436654
9013 -6436654 -4359414 -3179011 -8455739 -13403054 -9392781 -547331 2440812 -1481755
9005 -1481755 -4457240 -3910355 -4878223 -8647298 -9637264 -5119007 912627 5432867 9677391
8996I677391K928190l163898r129662p212990K90166L993307J339666j801769
8988c079599j918620j004924J52124K700695L953204j11212o090098n803006J078723
8979a0122713N836483M080068J359502K251544K847202p27451m228801k529638
8971a233804J120638O27114k388905j546093L008745M248626p08844o117693n959454
8962h949670j559889J802324K188606J674550J760110J493266J55867o80943P74408
8953a341371L372302L835242J111472j980651k851529k904497m412186n205077
8945a0376295j073324O264113Q924275L262274l979164m143714J909672N929486
8937F717323L885342k93802k246640k486445k656280j759386P94623K246274K77977
$$ plain form
8996 9677391 12605581 9441683 312021 -6900969 -6610803 -2617496 -1277830 -3079599
8988 -3079599 -4998219 -6003143 -5851019 -3150324 802880 691668 -5398430 -11201436 -10122713
8979 -10122713 -4286230 -206162 1153340 3404884 6252086 5524635 1295834 -1233804
8971 -1233804 -113166 513948 -1874957 -3421050 -412305 3836321 3127477 -2990216 -8949670
8962 -8949670 -10509559 -8707235 -6518629 -4844079 -3083969 -1590703 -1434836 -2115779 -1341371
8953 -1341371 2030931 5866173 6977645 4996994 2145465 -759032 -5171218 -10376295
8945 -10376295 -11449619 -5185506 3738769 7001043 3021879 -1121835 787837 6717323
8937 6717323 10602665 10308863 8062223 5575778 2919498 1160112 1954735 4201009 4478986
8928D478986k816269l402768k032898j813590k558162j035655K927947N051466
8920a200943K728597j081430k202423n24455J523061L066769M119116L028084
8912I456376j176158m990512l819581O54016J583187k984414o423377l267017
8904a0967480K259678K839927m86841q05583K309119J713852m366610p227630
8896a4731568o99550P979388Q073442J269783j751276J592130K892699j831068
8888B793980m803550J56822O162914L603673m170814n688284Q68347N373701J838784
8879F135573l240487k222723K274182L109270n1703j932216q73667j23038j058046
8870B017145j120506J037416L046626K661003O73224j238135k822027m037203
$$ plain form
8928 4478986 1662717 -1740051 -3772949 -5586539 -8144701 -9180356 -6252409 -1200943
8920 -1200943 1527654 446224 -1756199 -2280654 -757593 2309176 6428292 9456376
8912 9456376 8280218 3289706 -529875 124141 1707328 -1277086 -7700463 -10967480
8904 -10967480 -8707802 -5867875 -6354716 -7160299 -4851180 -3137328 -7503938 -14731568
8896 -14731568 -15431118 -7451730 621712 1891495 140219 1732349 4625048 2793980
8888 2793980 -2009570 -1852748 4310166 7913839 3743025 -1945259 -1076912 4296789 6135573
8879 6135573 2895086 672363 2946545 6055815 6004112 4071896 3198229 3075191 2017145
8870 2017145 896639 1934055 4980681 7641684 8314908 7076773 4254746 217543
8862B17543l674964r43676K535560L735346J384467k250095l337462r03329J448807
8853a787803J9656l352365l283816J184822M741931L629814P91947J20493J63660
8844B228339j837431l765105k318401M33730P28139L97395K958148N010254P65386
8835D600454o116709n890980J327200M423997r31908n183400j106912M377003
8827d501255K953892p86101J304840N375403K226799n514101o468327R96262O167851
8818A755263K620207l824426n788849l186757J194063O091342Q710156N256679
8810A2827678k135206o070260m394534k910724m728553m863756J47150M874694
8802g253511L322101j315611j796489K473817O037925N603358K267818j913507
$$ plain form
8862 217543 -3457421 -4401097 -1865537 1869809 3254276 1004181 -2333281 -3236610 -1787803
8853 -1787803 -1768147 -5120512 -8404328 -7219506 -2477575 1152239 1944186 2064679 2228339
8844 2228339 390908 -3374197 -5692598 -5258868 -4530729 -4133334 -1175186 3835068 4600454
8835 4600454 -1516255 -7407235 -6080035 -1656038 -2587946 -7771346 -8878258 -4501255
8827 -4501255 -1547363 -2333464 -1028624 4346779 6573578 1059477 -5408850 -4412588 1755263
8818 1755263 4375470 551044 -5237805 -8424562 -7230499 -1139157 7570999 12827678
8810 12827678 10692472 4622212 227678 -2683046 -7411599 -12275355 -12128205 -7253511
8802 -7253511 -3931410 -5247021 -7043510 -4569693 1468232 7071590 9339408 7425901
8794G425901m776189l741103R67919M769682M026693P00338j372599j822572j927878
8785D250192r66333J313077J786161j619785n223897m309670l31110J670988R24169
8776b506208Q01418K144767K277939M23988q91767k50526R04090J316611J398380
8767E618692J524335J616024K050266K565678J434748j654049l716231k668662
8759F770801j226958k623303m599922k616678K402280M885753K633178j039010
8751D586141k989702l294624k600655j029230J51445r8196P4917K469253M283717
8742A553066J691516l044528m093441j154119O98710J82448J132368L712014K830936
8733C508970j925895l345552J837889O217946K727890m137776n381683q72678
$$ plain form
8794 7425901 2649712 -1091391 -123472 4646210 8672903 9373241 8000642 6178070 4250192
8785 4250192 3283859 4596936 6383097 4763312 -460585 -4770255 -5101365 -3430377 -2506208
8776 -2506208 -1704790 439977 2717916 3141904 2250137 1999611 2903701 4220312 5618692
8767 5618692 7143027 8759051 10809317 13374995 14809743 13155694 9439463 6770801
8759 6770801 5543843 2920540 -1679382 -4296060 -1893780 2991973 5625151 4586141
8751 4586141 1596439 -1698185 -4298840 -5328070 -5176625 -5274821 -5199904 -2730651 1553066
8742 1553066 3244582 200054 -3893387 -5047506 -4348796 -4166348 -3033980 678034 3508970
8733 3508970 1583075 -1762477 75412 6293358 9021248 4883472 -498211 -1370889
8725a370889K199233J074233l35576K88625M64656j538770l598324l346099j032989
8716g195900J829239L746138L296305O54630j481396j119999j51222j431487l838360
8707e692052l565145K71052M412739N512068K936423j648043n053365m135186
8699f961509O90745M694903M244580J348445r5701k74280j561678k738927n45816
8690a199238L728312M921422J812628j065482p42429R2901j493413l590542k836096
8681c71937K40288K353109J890548l00803k857299m325620k980345J488729O493754
8672A630424Q219145M930757j408863o302062o111542j663315K149285J964818
8664C408647J5311J86664J599828K19767l769009n343919k311923J525964K800880
$$ plain form
8725 -1370889 828344 1902577 1567001 1855626 2320282 781512 -2816812 -6162911 -7195900
8716 -7195900 -5366661 -1620523 1675782 2330412 849016 -270983 -422205 -1853692 -5692052
8707 -5692052 -9257197 -8986145 -4573406 938662 3875085 2227042 -2826323 -6961509
8699 -6961509 -6270764 -1575861 2668719 4017164 3921463 3647183 2085505 -653422 -1199238
8690 -1199238 2529074 7450496 9263124 8197642 7455213 7548114 6054701 2464159 -371937
8681 -371937 -131649 2221460 4112008 3811205 953906 -3371714 -6352059 -4863330 1630424
8672 1630424 9849569 14780326 13371463 7069401 957859 -705456 1443829 3408647
8664 3408647 3423958 3610622 5210450 5430217 1661208 -3682711 -5994634 -4468670 -1667790
8655a667790L070119L974670L053326j154763m234436j904430K175896J169631
8647D482223m013186n640408j102234L184056J853249j780251j882840J070714
8639c828677K421551J057843r9384K12242K35738p18663r45732L18950J510530
8630A64398J498156J020015N80753m61875j761329j564893K43859J187011q9053
8621H17042j602515j576349j619799l467900m787308k192545K703800M654746
8613g070828K279598o6891R68150L061249K421451l76767j546585O28710M047914
8604D346001N458995L378310q11541l818514l591180j826122j636845k816189
8596a317085k310379K40245J381394k45403j203913P91478K477574N44151k169626
$$ plain form
8655 -1667790 1402329 5376999 8430325 7275562 3041126 1136696 3312592 4482223
8647 4482223 469037 -5171371 -6273605 -3089549 -1236300 -3016551 -4899391 -3828677
8639 -3828677 -1407126 -349283 -448667 -236425 -687 -719350 -1665082 -1346132 164398
8630 164398 1662554 2682569 3263322 2801447 1040118 -524775 -280916 906095 817042
8621 817042 -785473 -2361822 -3981621 -7449521 -12236829 -14429374 -11725574 -7070828
8613 -7070828 -4791230 -4858121 -3889971 -828722 1592729 1215962 -330623 298087 4346001
8604 4346001 9804996 13183306 12371765 8553251 4962071 3135949 1499104 -1317085
8596 -1317085 -3627464 -3387219 -2005825 -2251228 -3455141 -2663663 -186089 358062 -1811564
8587a811564r52610L017334M570026K368297n24434k421516l733006l115212P80781
8578a821904M109510J229849n891001q540242l454705K488754K756364M140J25081
8569h994154K760852L181767K40830k742227l136448j001735K426230M983719
8561b281166M119309J55064k883586k296134j92620O52694J301834L458124M862123
8552F895642K490837j771806l440062k003206n97942k22593R44381K942182L414406
8543H651839J741950k77962j933553l783456m423580j608562K814531L789056
8535D970263L64004k239646j78912L214122K363654k487459n732881l781475J109848
8526b398482M303732L759861R19271j877893l550880m013448l012484m16356K620472
$$ plain form
8587 -1811564 -2764174 253160 4823186 7191483 6667049 4245533 512527 -2602685 -1821904
8578 -1821904 2287606 3517455 -2373546 -10913788 -14368493 -11879739 -9123375 -9119235 -8994154
8569 -8994154 -6233302 -3051535 -2810705 -5552932 -8689380 -9691115 -7264885 -2281166
8561 -2281166 1838143 1993207 -890379 -3186513 -3379133 -2726439 -1424605 2033519 6895642
8552 6895642 9386479 7614673 4174611 2171405 1573463 1350870 2295251 5237433 8651839
8543 8651839 10393789 10115827 8182274 4398818 -24762 -1633324 1181207 4970263
8535 4970263 5334267 3094621 2915709 6129831 8493485 6006026 273145 -3508330 -2398482
8526 -2398482 1905250 5665111 6584382 4706489 1155609 -2857839 -5870323 -6286679 -3666207
8517c666207M203884L679650J863236n62431k992920l539043q10491K610466K504063
8508C290207q9927N40867M870906N197645k260900q668008m337833N183789N570306
8499I297052m898022j1997177o123479M491603O774220O57036l646096j040529
8491f485392L615509M129183K80655l370044k508518K691696O796133M519139
8483I668361k021232m970680j313254K871393J688511k084673k461947J86586
8475A563065J073718l88598m31268J827400L031439J482479o59166j503767j588333
8466D406969j443779n90497N83819Q64850K12844p00789k189079m059836l784879
8457f700377K05568M423892L734249j363347m940614l430272N41050K696263K066846
$$ plain form
8517 -3666207 537677 4217327 6080563 5518132 2525212 -1013831 -1824322 786144 3290207
8508 3290207 3200280 3741147 8612053 13809698 11548798 2880790 -1457043 3726746 9297052
8499 9297052 4399030 -7598147 -13721626 -9230023 -2455803 -1798767 -5444863 -6485392
8491 -6485392 -2869883 1259300 1539955 -1830089 -4338607 -1646911 5149222 9668361
8483 9668361 7647129 2676449 1363195 4234588 5923099 3838426 1376479 1563065
8475 1563065 2636783 2248185 1816917 3644317 6675756 8158235 7499069 5995302 4406969
8466 4406969 2963190 2372693 2956512 3821362 4034206 3333417 1144338 -2915498 -6700377
8457 -6700377 -6494809 -2070917 1663332 299985 -4640629 -8070901 -7529851 -4833588 -2766742
8448b766742M90036j52407O31606J492653L95622k203615k843831j05433K182663
8439b879448N50666j803449K89399M752465M581174q03145l959191r05627K929079
8430B751923J640593k374244l218226n82571J013741n99964l162316l588504p66924
8421h886492L725420N922271K899681k509076l741164P15291M469809K069267
8413D665007l323612n044779k198556R64421K313277L216926L985243K920517
8405G498444j61693l154587m331891l209345J95354M226007N305502K059345j769499
8396F657637j887736P40045K237356J864694J270275j97691l769011o199418l095102
8387b378951K709087L149656l140766p776437m491682K161436M276899J562656
$$ plain form
8448 -2766742 -2276706 -2429113 -1797507 -304854 90768 -2112847 -4956678 -5062111 -2879448
8439 -2879448 -2328782 -4132231 -3842832 909633 5490807 4687662 728471 -177156 2751923
8430 2751923 4392516 2018272 -1199954 -1782525 -768784 -1368748 -4531064 -8119568 -8886492
8421 -8886492 -5161072 761199 3660880 1151804 -2589360 -1874069 2595740 4665007
8413 4665007 1341395 -3703384 -5901940 -4937519 -2624242 592684 4577927 7498444
8405 7498444 7336751 4182164 -149727 -3359072 -3163718 1062289 6367791 8427136 6657637
8396 6657637 4769901 5509946 7747302 9611996 10882271 10684580 6915569 716151 -2378951
8387 -2378951 330136 3479792 339026 -7437411 -11929093 -9767657 -5490758 -3928102
8379c928102m44033O13507K383070L085235K954943J600489j170741k566970L30402
8370B857800M925360N052674n31391n875371n647080j508323J402426J080201
8362A756296r09713k881037l671182j789030K437413N002376K465114k269413
8354A40824k766202J554210L601932j193308p236489o016360J670418O704625
8346c540350M459395M32636J044849M146009K937459l631266r182672q134062
8338a1468002k019435L097331L447304Q14155m43814R89186J814302p27771l760911
8329h257655k220839L236007O610862N593645M387424N193136L627527k613218
8321A5556889p170976m309306Q58954M97334k307176N75469N828878K259504q589714
$$ plain form
8379 -3928102 -4372135 -3758628 -1375558 1709677 4664620 6265109 5094368 2527398 2857800
8370 2857800 7783160 12835834 12304443 6429072 781992 -726331 676095 1756296
8362 1756296 846583 -2034454 -5705636 -7494666 -5057253 -54877 2410237 140824
8354 140824 -2625378 -1071168 2530764 1337456 -5899033 -11915393 -10244975 -3540350
8346 -3540350 919045 1351681 2396530 6542539 9479998 5848732 -3333940 -11468002
8338 -11468002 -13487437 -10390106 -6942802 -6128647 -6572461 -5583275 -3768973 -4496744 -8257655
8329 -8257655 -10478494 -7242487 -631625 4962020 9349444 14542580 18170107 15556889
8321 15556889 8385913 4076607 4935561 5432895 3125719 3701188 9530066 11789570 3199856
8312C199856j1023470M40322J0354452N403793n030199m536745M272388N663704
8304H744101k872022p698441j965975M880483L983879l95784j032119P54262O53642
8295E052026j95225O84760J253714m70943j767684p90444r68671m064176m864559
8286f131202M61633O263807N335061L21908j066513J440016J895160n93626j187386
8277F738858R35659J243232j302692k515015j236914j230437l040027j958576
8269b365912L079534O029969K861966k335037m255847l427457k349802m46366
8261c208952K543842L523975J355057K73453K878051M632500J120088l943346
8253I174668m558937k129659j902002l197046j489487K050632K006060j123150
$$ plain form
8312 3199856 -7823614 -7383292 2971160 8374953 3344754 -1191991 3080397 8744101
8304 8744101 5872079 -1826362 -3792337 1088146 5072025 4676241 3644122 4398384 5052026
8295 5052026 4856801 5541561 6795275 6324332 4556648 3766204 2797533 -1266643 -6131202
8286 -6131202 -5669569 594238 5929299 6251207 5184694 6624710 8519870 7926244 6738858
8277 6738858 7674517 8917749 7615057 5100042 3863128 2632691 -407336 -2365912
8269 -2365912 713622 6743591 9605557 7270520 3014673 -412784 -2762586 -3208952
8261 -3208952 -665110 2858865 4213922 4487375 7365426 11997926 13118014 9174668
8253 9174668 4615731 2486072 584070 -2612976 -4102463 -2051831 -45771 -1168921
8245a168921j247845K216502K550114k779126p161329n000000L52165L223531
8237i014909M046113N975694P846736O074431P76540m512862p237458o738951
8229b784666l224603J294203L588885L236234L121037L877059K083773l018421
8221H173501n980102k846177K125224K908499O85404m1279l69190l969179p784325
8212g097624n140664K353234N617513K085305p02999J604553L071308r55184m293077
8203c457635j36908O181057M775605k638511n231302l72036K860813q06777m617660
8194c443354j864078K996963K615261p46978o2223L320858J667781n002550p199631
8185g717951p13878O209274N342131M29770k64452K455781J479783l253698m085316
$$ plain form
8245 -1168921 -2416766 -200264 2349850 -429276 -7590605 -12590605 -12238440 -9014909
8237 -9014909 -4968796 1006898 8853634 14928065 15704605 11191743 3954285 -2784666
8229 -2784666 -6009269 -4715066 -1126181 2110053 5231090 9108149 11191922 8173501
8221 8173501 2193399 -652778 1472446 4380945 5066349 5025070 4655880 686701 -7097624
8212 -7097624 -12238288 -9885054 -4267541 -2182236 -2885235 -1280682 1790626 835442 -3457635
8203 -3457635 -3594543 2586514 7362119 4723608 -507694 -879730 1981083 1174306 -3443354
8194 -3443354 -5307432 -2310469 304792 -442186 -504409 2816449 4484230 -518320 -7717951
8185 -7717951 -8431829 -2222555 3119576 3549346 3284894 5740675 7220458 3966760 -118556
8176a18556J159291M628440O81114m936907l885939K082267M275470L44013k951942
8167A277251o09245L453268K984788j262253l211504p04347J695663L6159k902135
8158G57645k057062J645758K324056j507947m038285j088515L154807K949349
8150B139806K87883Q65942L637707K563537k035533k987621J299141L122029j875857
8141G017034o851903m485888J577580L260482M72258r25458M64732J291628Q67108
8132B687573J061721P33486k210168m729653k224522K853823L615544n38336l423232
8123b173764k199476k35088N33936K120149M180550L024244j184229l489455k293372
8114a716505j254437j373516Q80741N266507O096673K132562n16469N68582n95045
$$ plain form
8176 -118556 1040735 5669175 6350289 1413382 -2472557 -390290 3885180 4229193 1277251
8167 1277251 668006 4121274 7106062 5843809 2632305 1927958 3623621 3659780 757645
8158 757645 -1299417 346341 2670397 1162450 -2875835 -3964350 -809543 2139806
8150 2139806 2427689 3293631 6931338 9494875 7459342 4471721 5770862 8892891 7017034
8141 7017034 165131 -4320757 -2743177 517305 989563 64105 528837 1820465 2687573
8132 2687573 3749294 4482780 2272612 -2457041 -4681563 -1827740 1787804 1249468 -2173764
8123 -2173764 -4373240 -4608328 -4074392 -1954243 2226307 5250551 4066322 576867 -1716505
8114 -1716505 -2970942 -4344458 -3463717 1802790 7899463 10032025 9515556 10084138 9489093
8105I489093o504208r051592k245971O198551N691030j162064l840607o63262
8097b089030R63320j438229k533738l11357L66685k599899m157394p05324L690554
8088h814412L579323j21568k326287p97914J975291K555179N48330j003411N01618
8079c903851L108242K473185j237099k686385L31326K886130Q71930k238028j754852
8070b149402J55904p47903k497932r03707K165707K664987K692962N661738O821853
8061A3864207k23917r829463r664026M70653P941478O503135K975317K237069
8053A4274453k58611n935313p053130q03639L236789j213775n746993j907312
8045e407531L880574K276984k032131L06430M980605J204151p768452q246119
$$ plain form
8105 9489093 2984885 -6066707 -8312678 -2114127 3576903 2414839 -1425768 -2089030
8097 -2089030 -1125710 -2563939 -5097677 -5409034 -5042349 -7642248 -11799642 -12504966 -8814412
8088 -8814412 -5235089 -5356657 -7682944 -8480858 -6505567 -3950388 -3402058 -4405469 -3903851
8079 -3903851 -795609 1677576 440477 -2245908 -1914582 971548 1843478 -394550 -2149402
8070 -2149402 -1993498 -2741401 -5239333 -6143040 -3977333 -1312346 1380616 7042354 13864207
8061 13864207 13640290 3810827 -5853199 -5382546 2558932 9062067 12037384 14274453
8053 14274453 14015842 8080529 1027399 223760 3460549 2246774 -3500219 -5407531
8045 -5407531 -1526957 750027 -1282104 -975674 4004931 5209082 -2559370 -10805489
8037a0805489J513565Q760025O636309J803955l43222l091312p051569n708653
8029h286391J599015N098950L21867l370536J357938O454674J869892o722897
8021a677488o541357J712334N482196L20070m832825l165431Q49105J282879K22422
8012f348095J968111M469336K927707j662594l553937p20478K497328J850327
8004A427705j116815j747373J019846L283299J856610j164769j588494P33453
7996B703462K129978R29637p19605j300203k086046l395132k849005J87230K301414
7987b098270J233444k63539O95991K030964Q12312r38635J74919K346423J475873
7978E469482j417677k038642n68951p00367j802269K74503M355131M179898q10817
$$ plain form
8037 -10805489 -9291924 -531899 6104410 7908365 7565143 4473831 -2577738 -8286391
8029 -8286391 -6687376 -1588426 -1266559 -4637095 -3279157 3175517 5045409 -1677488
8021 -1677488 -8218845 -6506511 -1024315 -704245 -5537070 -8702501 -7853396 -6570517 -6348095
8012 -6348095 -4379984 89352 3017059 1354465 -2199472 -2919950 -422622 1427705
8004 1427705 310890 -1436483 -416637 2866662 4723272 3558503 1970009 2703462
7996 2703462 4833440 5763077 5043472 3743269 1657223 -1737909 -4586914 -4399684 -2098270
7987 -2098270 -864826 -1128365 -432374 1598590 2410902 1472267 1647186 3993609 5469482
7978 5469482 4051805 2013163 1444212 743845 -1058424 -783921 3571210 7751108 6940291
7969F940291l342791j79158K184362j383345n622181l676258J565270K953753
7961e60057R62960J134852K959621J062502l674549m093651R68052L559618j044840
7952A274508o643498n364824J246236N575430M300203M02935k449156k988881
7944d647047j477178N41282Q02873o21506n69288K206558L638929j67982n801769
7935f095128n803033R27345O693432M672998k488921o385773l138394K945166
7927h672308N573036L719149J455469J843529L160381J983788j497558l406077
7919D159409j415098K039320K882275L37427k671547l278410j439914Q13481J764958
7910C191901J400948Q36471O30015J01200j278537k545529k430710j306826m01465
$$ plain form
7969 6940291 3597500 3418342 5602704 4219359 -1402822 -5079080 -3513810 -560057
7961 -560057 402903 1537755 4497376 5559878 1885329 -2208322 -1240270 2319348 1274508
7952 1274508 -5368990 -10733814 -9487578 -3912148 388055 790990 -1658166 -4647047
7944 -4647047 -6124225 -5582943 -4780070 -5401576 -5970864 -3764306 -125377 -293359 -6095128
7935 -6095128 -11898161 -10970816 -4277384 395614 -2093307 -8479080 -11617474 -8672308
7927 -8672308 -3099272 619877 2075346 3918875 7079256 9063044 7565486 4159409
7919 4159409 2744311 4783631 7665906 8003333 5331786 2053376 613462 1426943 3191901
7910 3191901 4592849 5429320 6059335 6160535 4881998 2336469 -94241 -1401067 -1802532
7901a802532L67222J654946K260355L94435k409813k194109J385805L518158R71467
7892D145934k869521k746192J236519M484682M128320J024374k819561n383036
$$ plain form
7901 -1802532 -1435310 219636 2479991 2874426 464613 -1729496 -343691 3174467 4145934
7892 4145934 1276413 -1469779 -233260 4251422 8379742 9404116 6584555 1201519
$$ [...]
##END NTUPLES=NMR SPECTRUM
##END=
