##TITLE=31Pdec_SR48_Km
 CDCl3, 124 sc
 9.04.2021
##JCAMPDX= 6.0         $$ Bruker NMR JCAMP-DX V2.0
##DATA TYPE= NMR SPECTRUM
##DATA CLASS= NTUPLES
##ORIGIN= UXNMR, Bruker Analytische Messtechnik GmbH
##OWNER= root
$$ XWIN-NMR		Version 3.5
$$ Fri Apr  9 13:31:39 2021 Russian Standard Time (UT+4h)  she@DPX200
##.OBSERVE FREQUENCY= 81.013821
##.OBSERVE NUCLEUS= ^31P
##.ACQUISITION MODE= SIMULTANEOUS
##.ACQUISITION SCHEME= undefined
##.AVERAGES= 124
##.DIGITISER RES= 16
##SPECTROMETER/DATA SYSTEM= spect
##.PULSE SEQUENCE= zgpg30
##.SOLVENT NAME= CDCl3
##.SHIFT REFERENCE= (INTERNAL, CDCl3, 0, 248.564)
##AUDIT TRAIL= $$ (NUMBER, WHEN, WHO, WHERE, WHAT)
$$ ##TITLE= Audit trail, XWIN-NMR		Version 3.5
$$ ##JCAMPDX= 5.01
$$ ##ORIGIN= Bruker BioSpin GmbH
$$ ##OWNER= she
$$ F:/spectra/data/she/nmr/P31/1/pdata/1/auditp.txt
$$ ##AUDIT TRAIL=  $$ (NUMBER, WHEN, WHO, WHERE, WHAT)
(   1,<2021-04-09 13:30:00.35 +0400>,<she>,<DPX200>,
      <continue with go, POWCHK disabled, PULCHK disabled
       configuration hash MD5:
       00 E9 B6 7A A2 85 ED C7 34 08 36 98 17 FE 4E 26
       data hash MD5: 32K
       84 08 34 32 8B 06 AF E4 86 EE 43 5F D6 A4 40 60>)
(   2,<2021-04-09 13:30:35.46 +0400>,<she>,<DPX200>,
      <Start of raw data processing
       efp BC_mod = 2 LB = 1 FT_mod = 6 PKNL = 1 PHC0 = -5226.663 PHC1 = 648.0021 SI = 64K 
       data hash MD5: 64K
       88 83 18 2A D7 D8 23 0E 13 1E 85 7B 3A E1 6A 48>)
(   3,<2021-04-09 13:31:06.60 +0400>,<she>,<DPX200>,
      <pk PHC0 = -249.4442 PHC1 = 191.9997 
       data hash MD5: 64K
       AA CB 47 67 AD 6F B3 96 10 E4 92 0E F0 C8 82 D0>)
(   4,<2021-04-09 13:31:09.75 +0400>,<she>,<DPX200>,
      <abs ABSG = 5 
       data hash MD5: 64K
       3E 84 56 48 99 10 25 CC 98 92 A5 E2 EF 2E 31 89>)
$$ ##END=
$$ 
$$ hash MD5
$$ D5 AA A0 01 F6 FF 86 08 DC A5 1D 19 73 38 27 39
##$RELAX= 
##$RELAX= 
##$RELAX= 
##$RELAX= 
##$RELAX= 
##$RELAX= 
##$RELAX= 
##$RELAX= 
$$ Bruker specific parameters
$$ --------------------------
##$DU= <F:/spectra>
##$EXPNO= 1
##$NAME= <P31>
##$PROCNO= 1
##$TYPE= <nmr>
##$USER= <she>
##$AMP= (0..31)
100 100 100 100 100 100 100 100 100 100 100 100 100 100 100 100 100 100 
100 100 100 100 100 100 100 100 100 100 100 100 100 100 
##$AQSEQ= 0
##$AQ_mod= 1
##$AUNM= <au_zg>
##$AUTOPOS= <>
##$BF1= 81.014009
##$BF2= 200.13
##$BF3= 200.13
##$BF4= 200.13
##$BF5= 200.13
##$BF6= 200.13
##$BF7= 200.13
##$BF8= 200.13
##$BYTORDA= 1
##$CFDGTYP= 0
##$CFRGTYP= 5
##$CHEMSTR= <none>
##$CNST= (0..31)
1 1 145 1 1 1 1 1 1 1 1 1 1 1 1 1 1 1 1 1 1 1 1 1 1 1 1 1 1 1 1 1 
##$CPDPRG= <waltz16>
##$CPDPRG1= <>
##$CPDPRG2= <waltz16>
##$CPDPRG3= <>
##$CPDPRG4= <mlev>
##$CPDPRG5= <mlev>
##$CPDPRG6= <mlev>
##$CPDPRG7= <mlev>
##$CPDPRG8= <mlev>
##$CPDPRGB= <>
##$CPDPRGT= <>
##$D= (0..31)
0 1 0 0 0 0 0 0 0 0 0 0.03 2e-05 3e-06 0 0 0 0 0 0 0 0 0 0 0 0 0 0 0 0 
0 0 
##$DATE= 1617960412
##$DBL= (0..7)
120 120 120 11 120 120 24 19 
##$DBP= (0..7)
150 150 150 150 150 150 150 150 
##$DBP07= 0
##$DBPNAM0= <>
##$DBPNAM1= <>
$$ [...]
##$SUBNAM3= <"">
##$SUBNAM4= <"">
##$SUBNAM5= <"">
##$SUBNAM6= <"">
##$SUBNAM7= <"">
##$SUBNAM8= <"">
##$SUBNAM9= <"">
##$SW= 501.771253377433
##$SWIBOX= (0..15)
0 1 3 0 0 0 0 0 0 0 0 0 0 0 0 0 
##$SW_h= 40650.406504065
##$TD= 32768
##$TD0= 1
##$TE= 0
##$TE2= 300
##$TE3= 300
##$TEG= 300
##$TL= (0..7)
0 120 53 12 22 120 120 120 
##$TP= (0..7)
150 150 150 150 150 150 150 150 
##$TP07= 0
##$TPNAME0= <>
##$TPNAME1= <>
##$TPNAME2= <>
##$TPNAME3= <>
##$TPNAME4= <>
##$TPNAME5= <>
##$TPNAME6= <>
##$TPNAME7= <>
##$TPOAL= (0..7)
0.5 0.5 0.5 0.5 0.5 0.5 0.5 0.5 
##$TPOFFS= (0..7)
0 0 0 0 0 0 0 0 
##$TUNHIN= 0
##$TUNHOUT= 0
##$TUNXOUT= 0
##$USERA1= <user>
##$USERA2= <user>
##$USERA3= <user>
##$USERA4= <user>
##$USERA5= <user>
##$V9= 5
##$VALIST= <valist>
##$VCLIST= <CCCCCCCCCCCCCCC>
##$VD= 0
##$VDLIST= <DDDDDDDDDDDDDDD>
##$VPLIST= <PPPPPPPPPPPPPPP>
##$VTLIST= <TTTTTTTTTTTTTTT>
##$WBST= 1024
##$WBSW= 4
##$XGAIN= (0..3)
0 0 0 0 
##$XL= 0
##$YL= 0
##$YMAX_a= 7901
##$YMIN_a= -11971
##$ZGOPTNS= <>
##$ZL1= 120
##$ZL2= 120
##$ZL3= 120
##$ZL4= 120
##$ABSF1= 248.5645
##$ABSF2= -253.2056
##$ABSG= 5
##$ABSL= 3
##$ALPHA= 0
##$AQORDER= 0
##$ASSFAC= 0
##$ASSFACI= 0
##$ASSFACX= 0
##$ASSWID= 0
##$AUNMP= <proc_1d>
##$AZFE= 0.1
##$AZFW= 0.5
##$BCFW= 0
##$BC_mod= 2
##$BYTORDP= 0
##$COROFFS= 0
##$CY= -3
##$DATMOD= 1
##$DC= 0
##$DFILT= <>
##$DTYPP= 0
##$F1P= 0
##$F2P= 0
##$FCOR= 1
##$FTSIZE= 65536
##$FT_mod= 6
##$GAMMA= 0
##$GB= 0
##$INTBC= 1
##$INTSCL= 5.30512e-09
##$ISEN= 30
##$LB= 1
##$LEV0= 0
##$LPBIN= 0
##$MAXI= 10000
##$MC2= 0
##$MEAN= 0
##$ME_mod= 0
##$MI= 50
##$NCOEF= 0
##$NC_proc= -7
##$NLEV= 6
##$NOISF1= 182.463
##$NOISF2= 159.3651
##$NSP= 0
##$NTH_PI= 0
##$NZP= 0
##$OFFSET= 248.5645
##$PC= 4
##$PHC0= -5476.107
##$PHC1= 840.0018
##$PH_mod= 1
##$PKNL= yes
##$PPARMOD= 0
##$PSCAL= 0
##$PSIGN= 0
##$REVERSE= no
##$SF= 81.014009
##$SI= 65536
##$SIGF1= 159.3651
##$SIGF2= -187.1042
##$SINO= 113.3802
##$SIOLD= 16384
##$SREGLST= <1H.CDCl3>
##$SSB= 0
##$STSI= 65536
##$STSR= 0
##$SW_p= 40650.406504065
##$SYMM= 0
##$S_DEV= 0
##$TDeff= 32768
##$TDoff= 0
##$TI= <>
##$TILT= no
##$TM1= 0
##$TM2= 0
##$TOPLEV= 0
##$USERP1= <user>
##$USERP2= <user>
##$USERP3= <user>
##$USERP4= <user>
##$USERP5= <user>
##$WDW= 1
##$XDIM= 65536
##$YMAX_p= 342680721
##$YMIN_p= -141922971
$$ End of Bruker specific parameters
$$ ---------------------------------
##NTUPLES= NMR SPECTRUM
##VAR_NAME=  FREQUENCY,     SPECTRUM/REAL,   SPECTRUM/IMAG
##SYMBOL=    X,             R,               I
##VAR_TYPE=  INDEPENDENT,   DEPENDENT,       DEPENDENT
##VAR_FORM=  AFFN,          ASDF,            ASDF
##VAR_DIM=   65536,         65536,           65536
##UNITS=     HZ,            ARBITRARY UNITS, ARBITRARY UNITS
##FACTOR=    0.620285442955139, 1,           1
##FIRST=     20137.2065510759, 0,            0
##LAST=      -20513.1999529892, 0,           0
##MIN=       -20513.1999529892, -141922971,  0
##MAX=       20137.2065510759, 342680721,    0
$$ Real data points
##PAGE= N=1
##DATA TABLE= (X++(R..R)), XYDATA
$$ [...]
##PAGE= N=2
##DATA TABLE= (X++(I..I)), XYDATA
14879 -8323493 -11366967 -13388967 -16544144 -10983412 3466367 9548733 -1782828 -14561759
14871 -14561759 -9735374 8195026 18767048 11469636 -5596029 -16460376 -10195109
14864 -10195109 10044314 26386565 22424031 2987284 -11386313 -10880436 -4357830 972385
14856 972385 10216360 23931903 28841599 18320225 7308579 11463583 23179579 24681211
14848 24681211 15323188 8063688 5714680 -155278 -9560000 -11993691 -5011659 1163444
14840 1163444 534628 -902965 1945695 4704590 2589098 -1842627 -4555522 -5403288
14832 -5403288 -4158317 514407 4741188 901526 -10051945 -16077597 -9542368 2001381
14824 2001381 6732749 3751163 407531 143120 1124792 3084521 6866420 9079124
14816 9079124 5537664 -415471 -939421 4367786 7511921 5106848 4155793 10264409
14808 10264409 17270893 15863841 7815467 2917774 3771793 3300747 -1292951 -1810545
14800 -1810545 8151634 20627094 21560110 8916614 -4913692 -8432673 -2330109 5520350
14792 5520350 10496904 13547712 16535019 18770160 17547601 10943251 847915 -6868965
14784 -6868965 -7137401 -1056769 5239046 7384905 6631408 6575974 8147363 9029311 7048448
14775 7048448 2984110 -455756 -2605779 -6265692 -12479406 -15126749 -6677784 8935273
14767 8935273 16627389 8980990 -1937432 -460558 10077370 12872087 4291706 528587
14759 528587 13181856 30780245 33676679 19522313 4086769 623641 7187588 13187178
14751 13187178 11407988 2782251 -6375615 -10615526 -10067268 -8347561 -6173992 -639954
14743 -639954 8400960 15881534 17426311 13372572 5365640 -5427668 -14462125 -15076654
14735 -15076654 -7895722 -2642979 -5481097 -10598362 -10021067 -5355506 -2694656 -1969585
14727 -1969585 -12298 876765 -2677941 -5709713 -489207 10041380 14727667 10097628
14719 10097628 4340704 4578164 8950139 12943638 15541048 16734955 15478269 12160171
14711 12160171 8117452 2598449 -4390212 -7831208 -3632075 2883026 3364359 -152908
14703 -152908 821885 4425751 -825512 -15735742 -25192092 -19714164 -9293994 -7022806
14695 -7022806 -10639093 -11199902 -9689288 -11349080 -10874048 1094516 19245404 25947356
14687 25947356 13734286 -5693986 -16997688 -16417426 -9163767 -238565 7843825 13571141
14679 13571141 16578541 17104792 14591153 9064232 2696440 -3014054 -9145796 -14538799
14671 -14538799 -13109318 -2561211 7714843 6432768 -3084823 -5742525 4972148 18469808
14663 18469808 21540322 13495478 3264111 -2057192 -1606857 1475245 3059135 1826333
14655 1826333 1292913 4624822 8466940 7857175 5913154 9767514 16641426 15074281
14647 15074281 3398062 -4613926 558037 8920505 4847688 -11092899 -24432184 -26190688
14639 -26190688 -20181177 -13835405 -10688514 -10689327 -11048325 -8155423 -3522246 -3951152 -10300452
14630 -10300452 -12016456 -1022971 14638889 21182153 18113233 15087692 14054396 9096331
14622 9096331 2301225 3215516 10236170 9027448 -4682570 -15972994 -12997930 -4619565
14614 -4619565 -4306397 -7875054 -1792578 13275020 22347595 17419444 6092277 -1144385
14606 -1144385 -1636352 2407771 8089437 10578782 5443950 -4313306 -8959096 -3193220
14598 -3193220 6671819 9295149 389989 -13061624 -19953690 -16462406 -10178571 -10861655
14590 -10861655 -17435905 -18846752 -9087737 4813914 13026309 14215009 11433676 4282906
14582 4282906 -6472590 -12713634 -8066275 703242 2567226 -353203 3178719 13285832
14574 13285832 17139030 9658369 1945026 3588854 9255611 10558838 10106844 13952173
14566 13952173 18824159 17722700 12050252 7581468 3193151 -5401373 -13870230 -12632790
14558 -12632790 -1462255 9243610 12264635 9738051 4882580 -3157513 -13585759 -21065355
14550 -21065355 -22280171 -19482055 -14787679 -6994468 3072924 10408302 12745019 13528485
14542 13528485 13716320 7355514 -8056260 -22524027 -23880365 -14420698 -7957630 -10865937
14534 -10865937 -15585515 -14761947 -12157770 -14167622 -18261440 -17939195 -14636346 -15465042
14526 -15465042 -20224170 -19859210 -10260523 5451 871659 -5082461 -6023264 3112242
14518 3112242 14049779 16177102 9993471 6091639 11695247 21614549 24613521 17305844
14510 17305844 8046099 5660954 8061715 6336152 -1920876 -9613593 -11222788 -10431338
14502 -10431338 -13090366 -17481343 -16799854 -8821249 1665944 8649112 9209051 3766130
14494 3766130 -3527123 -5671872 1145076 12043258 17484250 13130286 3071081 -6074026
14486 -6074026 -10928743 -11542024 -9301969 -5571833 -950553 3756789 5628730 2046552
14478 2046552 -3330078 -2369804 5348932 8127416 -2257787 -15211590 -12511905 6242625
14470 6242625 20840915 15377445 -4010534 -19979561 -23548917 -17922991 -10573245 -7613570
14462 -7613570 -10677040 -14342816 -11117909 -2207189 2554272 -1314040 -6717800 -7767563
14454 -7767563 -10318723 -21485884 -35149996 -38211770 -28397120 -16482268 -11624775 -12360899
14446 -12360899 -12443063 -9151648 -4599520 -2812068 -5818709 -10218975 -9296924 -1141284
14438 -1141284 8153858 12357140 12323049 11548976 9258298 3721316 -1298268 -377113 4900737
14429 4900737 6948952 1226464 -9439091 -17948303 -17879728 -8765535 1361318 3858818
14421 3858818 1866177 6585688 17878951 20500754 7603066 -4957951 -879369 11514815
14413 11514815 13688934 7301417 8917665 19011053 20006607 6478985 -5751379 -6261791
14405 -6261791 -4498829 -9068425 -12195580 -6461888 -158475 -2426909 -6829016 -3664829
14397 -3664829 2595479 1858368 -4995668 -10794117 -14711441 -18137543 -16626131 -8347390
14389 -8347390 -2165028 -4784079 -8406040 -4050705 2346469 1879236 838232 9127903
14381 9127903 18906999 15447255 4001103 3772800 17045600 26417672 23360922 17535608
14373 17535608 15170671 10833424 6073287 13231439 31271588 39110015 25411318 6392285
14365 6392285 624340 3871337 4104750 4199775 10958749 16196894 10085072 2202929 6730854
14356 6730854 14990359 7190292 -12828088 -20359256 -8135871 3444180 374280 -4328118
14348 -4328118 4326103 17006990 14907315 -1409019 -14260960 -13845831 -7424984 -6029446
14340 -6029446 -12352805 -21375100 -26037039 -22351239 -12844682 -4170323 -80333 133128
14332 133128 -3682929 -12851461 -23396863 -27397379 -24184946 -21781935 -22760939 -18324103
14324 -18324103 -3568800 10751777 11673572 1829914 -7260211 -13377866 -21854219 -29523581
14316 -29523581 -25653308 -10069507 2872823 2486512 -6035065 -11548404 -10294592 -4956553
14308 -4956553 1556747 5820711 3536545 -4593382 -10392732 -6519312 4755409 13811228
14300 13811228 12833707 1868536 -11251053 -16879246 -13385583 -10467408 -17148979 -27093288
14292 -27093288 -23921747 -3124548 19524211 25719749 14392489 -556862 -6334207
14285 -6334207 -430832 10806660 17599923 14636420 7148840 4790095 7445838 4414738
14277 4414738 -8712702 -21413442 -23073983 -17838383 -15600074 -15640666 -10533600 -1293176
14269 -1293176 3642824 2262065 289146 -440744 -3884215 -9704314 -11681305 -7915101
14261 -7915101 -3882760 -3733941 -6183461 -9675073 -13849967 -15968322 -14313356 -14415689
14253 -14415689 -21841257 -29416337 -24056134 -7544865 3459801 1999053 695594 10029374
14245 10029374 21057494 20566915 11619110 6078507 5499980 2970517 -2393577 -6065553
14237 -6065553 -8278384 -10563796 -6693199 8467811 23876463 22026937 4349144 -8566902
14229 -8566902 -5530701 937009 -5082086 -20986349 -32500826 -32661966 -24663429 -12933535
14221 -12933535 -1005230 6100353 6056193 3471880 3431477 3618001 -639249 -6470044 -6543389
14212 -6543389 -1149588 568826 -7134870 -19131347 -26226911 -24633031 -16273251 -4089922
14204 -4089922 8911756 18172311 19714863 14726916 9679029 10230636 15607264 20102710
14196 20102710 19561830 14513408 6867668 -3237967 -14782018 -22687041 -22014511 -15158755
14188 -15158755 -10386175 -12079466 -16196021 -16740881 -12939144 -8257922 -6170064 -8875821
14180 -8875821 -15940836 -21691199 -19049823 -9888619 -6134220 -14600458 -25470508 -23720745
14172 -23720745 -8690823 6747118 14296470 16636305 15966291 9390977 208453 831527
14164 831527 14845718 25758866 16164008 -7239345 -20990070 -15304060 -3818448 -1491968
14156 -1491968 -5967323 -6850085 -2968583 -1024508 -2682098 -2423024 3053611 10081741
14148 10081741 12887858 9098734 853354 -6421094 -7451284 -2326372 3090538 4480081
14140 4480081 4219604 5874338 7188055 4426632 1102057 4401893 12859003 15887701
14132 15887701 8216865 -2800005 -8683154 -11559594 -17489392 -23414745 -20251906 -7548614
14124 -7548614 4396762 8685820 9595951 12317623 12721378 4655121 -7316999 -11645040
14116 -11645040 -5755067 -77064 -3928689 -13886945 -19752353 -16957586 -8808662 -686237
14108 -686237 2862680 -1329898 -11214534 -17992044 -14632789 -5227437 109253 -1119789
14100 -1119789 -2468115 -933323 -1380658 -5260488 -4447884 6278572 17765115 17318604
14092 17318604 7122134 1181564 4946795 9302638 7481111 6929365 16681372 30044770
14084 30044770 30499275 13853101 -4724819 -8869176 319764 9103937 10455951 10612754
14076 10612754 15813118 20743712 16170253 3632218 -5378700 -4253915 2127790 6850532
14068 6850532 9557358 12083597 12268447 8072933 3483416 3837609 7659679 9054658
14060 9054658 6753090 5158955 6946794 9696371 10299412 8913502 7873549 8763205
14052 8763205 10316390 8698703 2613371 -1322837 5885544 21652775 30482430 22740006
14044 22740006 8210310 2681193 6917482 9348053 4808713 -2034392 -8995931 -17469961
14036 -17469961 -21214510 -9739925 13103363 28403652 26700388 20600029 24978297 36295207
14028 36295207 41598848 38210251 32719183 27519134 20554270 14181775 12866709 14232023
14020 14232023 12244715 7922017 8108373 14525553 21933049 26458782 28455490 27699754
14012 27699754 22934831 16411665 12786915 13120518 14698971 16105141 17776125 18891574
14004 18891574 18720083 19486405 22628195 23852886 17555467 5035842 -6515902 -11337768
13996 -11337768 -7081977 6113433 21551319 25637939 11983385 -6131290 -8627163
13989 -8627163 5682280 17468489 12950693 63516 -5930655 -2118804 4043777 7739242
13981 7739242 8788496 6138220 -670816 -7254507 -9005403 -8136838 -9799530 -13032063
13973 -13032063 -12227885 -6751359 -2422731 -2875323 -5323622 -6269966 -6036176 -5325498 -2035069
13964 -2035069 4916473 11693350 13299981 9694535 5245531 3683165 6462049 13790398
13956 13790398 22373631 23316422 9256921 -14056884 -29503000 -26693439 -14046319 -7263814
13948 -7263814 -9454881 -10082989 -1985304 9061495 13133227 7316873 -4593358 -17560513
13940 -17560513 -26981484 -29381815 -24979817 -17300830 -9554559 -4600484 -6746404 -16393308
13932 -16393308 -23309886 -15109874 4930429 18634497 16046447 7402791 5618068 8042232
13924 8042232 5822177 1758506 5417249 16189637 24556800 26911319 26861204 24704379
13916 24704379 18251566 12015503 12306582 14162263 7123971 -5554713 -8461330 2131925
13908 2131925 10761677 5193382 -6660898 -10265202 -4100368 3329125 7633409 10059762
13900 10059762 10721427 9220038 8470274 11118524 15338132 19100353 23876675 28587369
13892 28587369 25371697 9164821 -11715666 -22374037 -17936738 -7530234 -2304200
13885 -2304200 -4594247 -8885205 -8895023 -2388859 8283655 18450317 23809655 21694060
13877 21694060 12091082 -594326 -9240705 -11229468 -11999059 -16930180 -22313447 -20891455
13869 -20891455 -14144876 -10429436 -11600926 -11298843 -7276345 -4617559 -4255353 -64754
13861 -64754 7671041 7674198 -5726771 -21587622 -27154290 -25064345 -25663518 -29538885 -29011328
13852 -29011328 -21875300 -12551827 -3145029 6322889 11793478 9354639 3182489 81884
13844 81884 -921183 -4033294 -5879593 -1281925 3277511 -3293805 -16048377 -16122592 2234807
13835 2234807 21250443 23696095 15031990 11669220 16934839 20782512 17497130 11014055
13827 11014055 4480534 -3807328 -12474342 -14619789 -7483801 1733810 4533100 1724019
13819 1724019 530570 3397985 5363068 2971898 183528 1582767 3327860 -2709227
13811 -2709227 -15612747 -22881509 -15081214 1411066 11653484 9734269 3389527 1962389
13803 1962389 5928449 9616294 8997204 4038693 -2992149 -8605117 -9782883 -6847413
13795 -6847413 -2798178 1328369 7340507 14480748 17491491 14071891 10520889 13812156
13787 13812156 20036108 18540679 8371598 2023011 8351928 19281072 21207537 14288849
13779 14288849 10040147 12058890 11634295 4800834 1035606 7600140 15448119 11580709
13771 11580709 -1096091 -8547831 -7012228 -6640229 -13326273 -19261753 -15652787 -5319642
13763 -5319642 2566816 3214371 -3053698 -14324186 -25891250 -30340603 -24254816 -12180986
13755 -12180986 -849982 7161379 11809419 12542359 10416630 9135867 10498892 12299306
13747 12299306 13159416 14805387 16492394 12326047 -1105381 -17520979 -25254071 -17357064
13739 -17357064 2743744 21414088 21547128 -2153892 -32057953 -41024867 -22148549
13732 -22148549 3123061 12148521 6758000 3309835 6809213 8332868 3322507 -1902466
13724 -1902466 -1934261 1033372 3979672 7135446 9341734 7657452 4009006 4716080 10300267
13715 10300267 12420962 5052493 -6432463 -12109062 -10230504 -8111412 -11140210 -15631071
13707 -15631071 -14847000 -9290402 -6126888 -7904082 -8151938 -2849135 -9934 -8382741
13699 -8382741 -20278126 -18878529 -3591718 6233311 -1636389 -15001022 -15906330 -5073107
13691 -5073107 3795211 5142499 4230943 4738329 6132880 9586562 15505152 18308559
13683 18308559 13308739 5268474 1466454 1236068 1191097 3698209 8998105 6863522
13675 6863522 -9189625 -25514282 -22902577 -4067729 10308988 10793931 6928179 6692103
13667 6692103 7112942 7178674 11307392 15503456 7857103 -10684820 -22227241 -16085304
13659 -16085304 -2393592 6001500 10731217 17930496 24438241 24599553 20427312 15450659
13651 15450659 7759006 -2474372 -8066904 -5625790 -1840294 -1214704 2108015 11454445
13643 11454445 17236334 10318655 -3023134 -10460342 -10250218 -7879662 -3696656 4248658
13635 4248658 10844449 9395479 2961135 135260 2674054 6098692 8938174 12635145
13627 12635145 15462054 14598740 11366229 7661433 1186429 -8998424 -16728197 -15707013
13619 -15707013 -8051393 396663 8032876 14350846 15255900 9353173 3165390 2446247
13611 2446247 4322870 5238807 8602782 15445721 16614780 6657957 -2338934 4398103
13603 4398103 20897325 27640322 19524720 10581887 10750572 13739346 11513333 7359140
13595 7359140 8479560 14893625 21339705 24113265 22261424 16575546 9583768 3312324
13587 3312324 -2873034 -9372799 -13829892 -15093896 -15539946 -15131558 -9411468 421188
13579 421188 3243279 -6872009 -18505441 -17268335 -6166966 1002494 1057231 2015339
13571 2015339 6407901 9045882 8865788 8208530 2807213 -11828556 -26173429 -25749573
13563 -25749573 -13332398 -4754220 -3923129 -1649815 1539590 -4744258 -15099803 -8938116
13555 -8938116 14255844 25986317 9273089 -15057146 -20214271 -10647227 -6306553 -7873209
13547 -7873209 -2984309 5395278 3760041 -5173953 -6035960 1084323 -31827 -13004878
13539 -13004878 -21355315 -14376362 -1946677 2923103 1125363 61433 1417053 3004255
13531 3004255 3454940 323202 -7992157 -15404545 -12530841 -901379 6997629 5393260
13523 5393260 2926356 8137998 17014427 21020034 19145453 15254505 10333536 4246006
13515 4246006 -155204 -1060359 -1731189 -5281715 -9438051 -11067927 -11452067 -12067544 -9631782
13506 -9631782 -1409999 7835890 10714622 7533311 5910550 10136688 15653856 15293169
13498 15293169 8104430 360890 -1590170 1358378 2076295 -3733946 -11793895 -15528900
13490 -15528900 -15546788 -17274343 -20381679 -18234362 -9446271 -2218374 -3193633 -8518021
13482 -8518021 -11003496 -10444076 -10693633 -11091949 -7884387 -1613004 3273690 4491579 2239878
13473 2239878 -4232937 -14281659 -21899249 -20852759 -13326549 -7433526 -6664952 -8122932
13465 -8122932 -10619597 -16498069 -23697349 -24020950 -13796806 -712291 4849038 1600627
13457 1600627 -3647491 -5440228 -3643468 -226156 3425434 6570765 9261604 11623679
13449 11623679 11488887 5268179 -6129492 -14837658 -13425265 -3563865 6081013 9543248
13441 9543248 7857682 5092153 4430732 7755017 14291530 18746737 15379093 6089276
13433 6089276 509185 4832492 13602530 16719222 12616995 9161460 11339397 14057954
13425 14057954 10758837 4799602 5754219 15017029 22072535 18259198 8944560 6510254
13417 6510254 14145908 22957435 24179898 17567178 7167327 -3813499 -11041630 -9067988
13409 -9067988 1134464 9463717 7497567 -1310724 -7502831 -7565433 -3450536 5126835
13401 5126835 17706962 24415520 12963696 -12415574 -30038461 -25196214 -7259303
13394 -7259303 4806622 6553818 8036545 14621675 19690914 16872238 9701897 5531009
13386 5531009 5950929 6901743 4730800 -61269 -2514021 3487684 17484839 28105597
13378 28105597 22660849 3187469 -13234416 -13827276 -4016590 2675859 2254985 17169
13370 17169 -2247891 -7599335 -13275736 -10593225 974319 9962747 9072320 5867627
13362 5867627 9024440 12316225 4501000 -9826023 -13996728 -3787448 6572978 6938830
13354 6938830 5727625 13490689 23901250 23708323 14346010 9289840 12225327 11905736
13346 11905736 1154525 -10729287 -10657366 306105 8388212 3523181 -10624084 -22268318
13338 -22268318 -23941441 -18284789 -12106182 -7110558 -403330 6386579 6037245 -2202489
13330 -2202489 -7322301 -1352169 7076088 5125970 -2937560 -1256715 11746491 19443749
13322 19443749 13184858 6346070 12599525 23152613 19470719 1311415 -12557656 -9893104
13314 -9893104 988855 4484218 -3622397 -14081512 -16154742 -8825962 -899208 160541
13306 160541 -1570682 3982191 16430104 21634047 9943837 -9000727 -17561522 -11868178
13298 -11868178 -3588740 -2250716 -5047560 -4869969 -421501 4765622 8394314 11137248
13290 11137248 14427446 18360153 21169998 20735338 16884022 11202164 4946129 -286402
13282 -286402 -607733 6489634 16086290 19590515 16090356 13081658 13761107 12281777 5879186
13273 5879186 2066382 6561177 12734014 11964423 6913748 4751295 4395742 1531403
13265 1531403 -373662 3382702 6873692 1997563 -5879601 -5657999 79073 397943
13257 397943 -1664151 7843724 26550441 32716629 16860703 -2395511 -5066673 3536857
13249 3536857 6118217 167850 -4164289 -3952697 -4900768 -7185785 -4744910 2081723
13241 2081723 5327630 1980619 -1437429 1177459 7332005 9395139 2677140 -9680949
13233 -9680949 -17475913 -11626414 5318456 20129448 23563322 19682075 16814818 15528907
13225 15528907 12436174 10524787 15989030 26479721 31555564 25716353 14399496 6227059
13217 6227059 4884055 9176906 15445507 18424500 14416792 5759571 -728075 -999210
13209 -999210 2545305 4719346 2609936 -2840095 -7902514 -8674649 -4428673 1846587
13201 1846587 7178714 11304210 14312092 14347245 10705342 7311146 9481090 17622236
13193 17622236 26384030 29341509 23400644 11158952 1138311 2418200 14982412 27317661
13185 27317661 27622067 16153437 3135660 -3420344 -3407740 -392862 1966987 -579346
13177 -579346 -10186699 -21167661 -22205730 -8552667 10621855 20847323 17058359 6716653
13169 6716653 -514285 -2242721 -1924476 -2008543 -1938491 -1609520 -2916073 -6728766 -10769504
13160 -10769504 -12078330 -10039777 -5714653 97123 6559845 12054811 15151543 15054069
13152 15054069 10843779 3198548 -2853896 -1947759 3115065 3345336 -2503574 -4184344
13144 -4184344 3375405 9030793 2370369 -6493474 -436371 15907970 21173189 12133636
13136 12133636 10968519 28833025 43397061 29667822 -1552291 -16700987 -3844305
13129 -3844305 15823879 19087407 5540520 -10694518 -18887385 -16163760 -5171289 6499764
13121 6499764 11010662 8066902 3312267 -1125750 -7145242 -11582839 -6807661 5670947
13113 5670947 11586469 1198425 -15816017 -20819733 -8626320 8133755 16272538 16173285
13105 16173285 16225153 19034497 19123362 13155678 6515764 6758913 13588287 19196939 17567357
13096 17567357 10278525 3889436 4435736 12895859 22354983 22027561 9712601 -2069455
13088 -2069455 -121631 10932866 14575662 6911910 1962655 8258466 14563855 8562738
13080 8562738 -2482955 -3245494 5834981 11095834 7372670 2488313 1861525 2443505
13072 2443505 2400619 4650002 9367626 13590055 19229386 30765895 43652614 46240276
13064 46240276 36117314 24217579 19325496 18458081 16446984 14738881 14962263 12932398
13056 12932398 6274353 1184963 4542930 14094978 21947512 23136424 16382612 2444989
13048 2444989 -12450650 -17262629 -7707093 6086937 10243857 3339376 -4021602 -4134104
13040 -4134104 -585401 -1580567 -9516422 -18466668 -19987930 -11220115 1778349 9427780
13032 9427780 7581754 -505459 -10259924 -19401539 -24669565 -20882318 -7689762 6231394
13024 6231394 10808925 5367346 -1675369 -2882722 1695708 7511565 11578449 14389083
13016 14389083 17420876 20227017 20362280 15867844 7055352 -4125272 -14944545 -21885685
13008 -21885685 -22618732 -19506561 -17906581 -18570294 -15603457 -5618424 5574537 10863419
13000 10863419 11916803 13952007 14594024 8164795 -866861 -644719 10546427 20758553
12992 20758553 21206184 15632479 9235768 616647 -8470738 -7654507 6784919 20324199
12984 20324199 16802867 1102259 -7634247 -2183327 6461548 8112290 5275544 3223812
12976 3223812 119115 -6590126 -11969613 -9204586 593507 10099071 15253021 18468028
12968 18468028 23121507 28215674 29222428 23475042 14627844 10603030 15042668 21724664
12960 21724664 21082237 12651749 6857545 12319802 25029919 33610995 32726112 26558072
12952 26558072 19916533 11783061 226393 -10666689 -13736142 -7474583 2466254 10325394
12944 10325394 14512497 14467587 8773764 -595911 -6677106 -4689583 1913534 6590032
12936 6590032 7980879 8474182 7748622 3959712 -799316 -3110962 -4893957 -9929281
12928 -9929281 -14639105 -11258480 -1049366 4988672 1100521 -6522691 -10943472 -12259726
12920 -12259726 -9762432 1784203 19396780 26435197 12754848 -7253078 -11453860
12913 -11453860 -328439 5608082 -2374486 -9831228 -4174815 5488444 3865243 -7131244
12905 -7131244 -13516121 -10901917 -7612499 -8588863 -8736105 -3759725 2625632 6104612
12897 6104612 8618176 12674416 14137347 6816162 -7678187 -19389318 -19353227 -7517073
12889 -7517073 7426364 14395977 8370545 -4657492 -12845681 -11404871 -8084187 -11884614
12881 -11884614 -19000113 -16885781 -2350029 12243970 14235687 5705487 -1777318 -2108682
12873 -2108682 2358887 8860751 16451351 20736347 15251416 1140331 -11016537 -13220813
12865 -13220813 -9200762 -6971170 -6370993 -824135 9511335 14039209 4958826 -10436955
12857 -10436955 -16829356 -9497198 306450 914543 -4430171 -3369976 7782150 19590430
12849 19590430 22670638 17856480 11250564 6173228 3799283 5705393 10682438 13393046
12841 13393046 10886744 6579118 3906988 1126264 -2945583 -4052951 192414 3923100
12833 3923100 1873215 -529185 4747114 14200979 17155434 11817469 6405849 5336244
12825 5336244 4496622 26316 -7642557 -17910236 -28806726 -33174475 -26622084 -17525173
12817 -17525173 -16937577 -20448316 -15132357 -4035551 -5138172 -21895875 -34061615 -26535899
12809 -26535899 -9789121 -27021 4698902 13757852 23023293 22253820 14134013 8701657
12801 8701657 5565013 -1325433 -6613620 327861 14186567 16894892 3900562 -8918484
12793 -8918484 -8993390 -3775068 -6796059 -17254723 -21815421 -12200527 4475760 11701919
12785 11701919 -493115 -23385440 -35963488 -27778445 -11241358 -4525920 -7527966
12778 -7527966 -5627202 5862508 14978724 12559214 5347930 4086969 8363787 10357020
12770 10357020 7254318 3206557 2202278 3607796 3261055 -2353747 -10787361 -13491527
12762 -13491527 -5404603 6923590 13049652 12768744 14030149 17652050 15409778 5645332
12754 5645332 -1316811 803625 3877261 -455504 -6042737 -3270290 2289157 -3097218
12746 -3097218 -17548635 -21691579 -4447795 20782240 32594479 26586945 16096557
12739 16096557 12776995 15304965 16578581 14203767 11164930 10788056 14002588 18767451
12731 18767451 19977799 12810509 -927863 -11974391 -12477059 -4623637 2212753 1668252
12723 1668252 -4725594 -10764966 -10251979 -597771 13669749 22389580 19623172 10951312
12715 10951312 6092961 6304931 5847756 4108211 6763510 13996674 17712188 14314055
12707 14314055 11332627 15882263 23697206 25438705 18309847 6566685 -4146880 -8984552
12699 -8984552 -6388265 -2012982 -3514325 -8437030 -5953485 5611280 13750630 10155261
12691 10155261 2482791 -293039 -1980691 -7798371 -11132326 -5678055 -77876 -4057116
12683 -4057116 -8932363 -366029 16412443 24382846 23007269 26549947 35681451 34649996
12675 34649996 20160762 9777338 13640492 18882281 13296440 5782810 8935647 16548555
12667 16548555 15250908 8066299 8787323 17995900 20924820 9186882 -7597605 -14500170
12659 -14500170 -8128342 1965713 4857442 -1011407 -8277441 -10979203 -11080178 -11730542
12651 -11730542 -9154552 653587 10645737 9719979 743402 -1206360 8670250 17029059
12643 17029059 12545187 2175934 -648661 5158253 9953173 7372933 -559980 -7577134
12635 -7577134 -7659271 -642086 4059410 -3169934 -16970013 -21567649 -13830680 -8724131
12627 -8724131 -15140071 -20557741 -11397619 3509741 5409867 -5719771 -11508518 -2136668
12619 -2136668 11493873 14299081 5259932 -4133812 -3731178 5343817 12478053 9789064
12611 9789064 2387085 1769134 9029187 13320565 9347411 5237929 7297793 8793131
12603 8793131 3116508 -2905833 -967965 2523315 -3677726 -15839855 -20065859 -13550127
12595 -13550127 -6969632 -6794451 -7904095 -4409211 2520641 8476062 9589239 3251797
12587 3251797 -7951311 -15297631 -13693660 -8578315 -6219181 -3425917 3863077 9043518
12579 9043518 4264413 -4622132 -6380894 -2650973 -2857206 -5417372 -1374910 5881741
12571 5881741 3937409 -5157586 -5040164 7023970 12101029 -2185048 -22278680 -27940443
12563 -27940443 -17223866 -1630517 11863124 22353211 27302069 24433482 16493342
12556 16493342 7347118 -1103482 -4332345 3235076 16851199 22105340 13870213 4185613
12548 4185613 3381245 4437548 -3559752 -16603742 -22963558 -21478024 -19651462 -19154163
12540 -19154163 -16093183 -11779420 -10930323 -11752302 -8902458 -3797342 -1322693 849299
12532 849299 8306900 17691649 20577570 18245567 20066678 27259817 31071256 28332057
12524 28332057 25714164 25629718 21162052 10235235 2350707 3704330 6216164 250377
12516 250377 -10378932 -15560181 -13949449 -10948658 -7349215 -722632 5610408 5938120
12508 5938120 2744981 3596876 8030160 7816121 1050858 -4325328 -3537709 -1533942 -2271699
12499 -2271699 -784981 7627188 17827832 21985991 20537090 18284677 14683699 6961140
12491 6961140 -886079 -2394911 -129636 -2235507 -7723663 -6938602 749090 2084086
12483 2084086 -10426584 -24339025 -22810053 -7581176 4789298 6048507 3587722 4511972
12475 4511972 4078083 -4975816 -19340500 -28155392 -25754567 -15945618 -5127637 3833509
12467 3833509 10284182 12489687 8970342 2234982 -2276380 -2530582 -2434206 -4961096 -5333984
12458 -5333984 3160964 17080221 24108057 19198201 12064951 13066895 18086602 15782423
12450 15782423 5816351 -424263 2829418 7264037 2582941 -9701586 -18790098 -17012307
12442 -17012307 -6614363 3176139 4114688 -3309336 -9184597 -4610800 6598974 11357800
12434 11357800 4157447 -5071621 -4164391 4705636 8199032 30856 -11142417 -13981623
12426 -13981623 -8515049 -2899477 96338 5510812 14270776 16960838 5518450 -13299872
12418 -13299872 -23695582 -18955388 -7292428 -153133 -1458774 -8369432 -15066441 -14681908
12410 -14681908 -5226571 5006372 6277874 2636062 7469301 21488874 28886682 21429947
12402 21429947 11437732 10656298 11187561 2087350 -8479953 -6613199 1823798 525460
12394 525460 -8792173 -9892064 -617242 5574955 5878269 10878937 18481678 11680567
12386 11680567 -9871003 -21763537 -10521677 5948070 8358392 4212265 7647312
12379 7647312 11749656 4153742 -5653590 -453385 13553147 15383263 3066349 -5797578
12371 -5797578 -4068280 -1554195 -1956873 2704518 11381017 10308609 -2992079 -11564047
12363 -11564047 -3960350 8954365 12069283 7091314 4794143 7211703 8608818 6442345
12355 6442345 1533891 -7000735 -18572766 -26998912 -26404929 -18584268 -10300027 -6191020
12347 -6191020 -6412926 -7111463 -2307393 9039602 17596386 12823468 -1832410 -11949690
12339 -11949690 -11496454 -8502003 -9153989 -9059631 -5486663 -4711588 -8525140 -6181700 8367396
12330 8367396 21927770 18956439 5170619 -1101144 4024577 7953530 4611869 2566320
12322 2566320 7744107 12983346 10620703 4170519 633371 -625811 -4524025 -11127263
12314 -11127263 -15430681 -13266603 -4860265 4136377 4783574 -6257853 -19191921 -19634516
12306 -19634516 -6848262 4156354 2093907 -6968062 -10636781 -7346694 -4963352 -7266354
12298 -7266354 -9883228 -7601962 258242 10058196 15226664 10644132 -111260 -6386396
12290 -6386396 -4424310 -3766374 -12130377 -20364243 -14277886 2138140 9668951 831913
12282 831913 -10383704 -10128520 -2786773 167046 -1953337 -2726413 -1907909 -3248243 -4070082
12273 -4070082 968048 7786589 5981620 -5410271 -15060646 -14538021 -8379669 -5834863
12265 -5834863 -8889462 -12514635 -12904621 -11768053 -13703013 -20640871 -28425584 -30241769
12257 -30241769 -24917428 -18962829 -17600315 -17727983 -14223066 -8612751 -4934159 -1514836
12249 -1514836 4358851 7388402 1008093 -8717345 -8693641 1056065 6191468 82495
12241 82495 -6372639 -2512052 7188263 13453000 15643989 15727685 9773396 -3303931 -13392451
12232 -13392451 -11617067 -4281249 -2972825 -7553662 -11104040 -14762686 -23111345 -30160109
12224 -30160109 -26375103 -17041395 -16486696 -24060646 -23523271 -9509120 2769122 1198535
12216 1198535 -4998635 -665110 12878622 21538720 17320030 4477134 -7839766 -11971569
12208 -11971569 -5726083 4118970 6986868 1414820 -3202648 -1215709 1698529 860178
12200 860178 1775336 7556154 7199645 -9295354 -29733536 -30281052 -7980173 12089517
12192 12089517 7670448 -13536982 -25511937 -15946608 2458572 10824578 5807793 -755592
12184 -755592 684374 6466119 7244549 1162821 -5592293 -9107540 -11936946 -16164710
12176 -16164710 -18397325 -14425836 -4718986 6552420 13845505 11302147 -1713973 -14533164
12168 -14533164 -13291040 562820 8594313 -1143035 -17064863 -19241617 -4918149 11441850
12160 11441850 18671402 18127340 15187289 13047700 14563603 20008278 22498711 14638094
12152 14638094 -36583 -10740587 -13832055 -13877339 -11442210 -2412943 8741090 8771863
12144 8771863 -5264000 -18218218 -16051628 -3652273 4858579 5344716 3217722 116793
12136 116793 -7171015 -16436442 -19188142 -11653435 -36150 6865625 6336605 2638167
12128 2638167 2147349 7200208 13024802 12983668 8566360 9670605 21024137 33282217
12120 33282217 34186739 25044000 17920825 18046398 18534582 14227652 11132816 15927374
12112 15927374 22539925 18258539 2146289 -11052303 -8796884 3106666 8231532 882245
12104 882245 -7915817 -7060407 -15724 2801088 152750 -420298 3487741 5636258 2286474
12095 2286474 -2361557 -4412664 -5467475 -6066577 -2374845 5652259 10642580 8191484
12087 8191484 3435821 1032908 -2961735 -10845477 -13898147 -5508970 3278061 -3104141
12079 -3104141 -19001387 -21933898 -4522228 14390973 16488848 7206520 2596315 4858910
12071 4858910 4172176 -1822994 -4655124 -237132 4469246 2769293 -2321491 -4277114
12063 -4277114 -2984678 -3146925 -5517275 -5360748 -424018 3650498 -814876 -13476752
12055 -13476752 -25410888 -29291412 -26582738 -22481634 -17458559 -8563945 2459945 8066263
12047 8066263 3493574 -6787235 -13059236 -9621551 216733 7540792 7019894 3271068
12039 3271068 5528183 14785001 20911886 16327895 7346163 5009925 8428796 6657274
12031 6657274 -3450924 -11125181 -6326509 6978177 16408649 15413191 8599567 5660900
12023 5660900 11427206 19934022 19766657 8569711 -1488522 1105589 11129002 15348697
12015 15348697 13207575 14989903 20668616 17855184 4815595 -2144518 6644234 17856211
12007 17856211 15971929 7072123 6423375 12478626 10897579 -1192347 -12274899 -15301408
11999 -15301408 -13333899 -7097566 6938610 23725488 29509118 19520535 4581634 -4408792
11991 -4408792 -8331284 -11717271 -13217539 -10917317 -8850638 -10306372 -10045531 -808167
11983 -808167 15237157 27780471 29913726 23816054 15492049 7846728 430762 -5633702
11975 -5633702 -5293385 5265418 21396795 31952045 30593715 21927766 14381499 11426772
11967 11426772 12675393 17518382 22077042 18243022 3528019 -11971859 -16293088 -10187791
11959 -10187791 -3515438 -896053 254880 964098 257640 1316613 7755307 15322859
11951 15322859 17491979 17168145 21326635 26136552 21301380 9001352 3344663 8577218
11943 8577218 12909269 8356445 1987065 1367690 3050821 3255552 6369851 13102896
11935 13102896 12404197 -3055270 -22354914 -28576854 -19044156 -4291556 6222906 8812867
11927 8812867 3285029 -5048490 -7470104 -3639953 -3897396 -12639801 -19171907 -14476825
11919 -14476825 -6593800 -7017237 -11247736 -7535033 2290303 6684415 4497381 5288293
11911 5288293 11687739 16257435 15276409 12266937 8026094 -375313 -10573303 -16091279
11903 -16091279 -15848116 -12256213 -3191783 11507166 19726821 9828351 -7891820 -10884820
11895 -10884820 3122110 12453033 4790395 -5418722 -1459226 11620066 19376138 19431892
11887 19431892 16826959 10053419 -2979150 -13453810 -11355277 -1761977 1890276 -2782416
11879 -2782416 -6783360 -6132442 -6363041 -11204031 -17417926 -21430125 -22328000 -18304346 -8977625
11870 -8977625 -1864875 -7381040 -24358904 -37557817 -33700609 -16095362 -436793 1683335
11862 1683335 -6269179 -9997596 -64023 15850616 19879749 5957029 -10370527 -10437537
11854 -10437537 3762048 13780625 10622004 4607182 7095992 14188916 15750032 11916403
11846 11916403 10748117 13969001 15268958 11894825 8757315 9360623 10338548 8456639
11838 8456639 6960952 10093259 15320837 16388821 11907972 5734916 -813 -6697269
11830 -6697269 -13763826 -16849265 -13996056 -9433378 -7931555 -8148590 -5174290 1977719
11822 1977719 9074318 12302741 11928962 10063344 7715995 5472938 5255942 9114954
11814 9114954 15861943 20254619 17410263 8627739 1204355 1010675 6636085 12494249
11806 12494249 15274533 14144674 7635395 -3582773 -12306774 -11072546 -3650643 -1892032
11798 -1892032 -8514124 -12093784 -4155270 7901859 12647571 11275295 12188878 15037389
11790 15037389 12436056 4927591 1913399 7255828 14383918 17170066 16796178 16428325
11782 16428325 17144749 20084505 24794721 25405717 17275250 7095617 5645728 9932855
11774 9932855 5378629 -11110686 -23945461 -20973236 -9888444 -3776754 -1978249 3348972
11766 3348972 10973459 13821742 12231552 11465709 10396155 4674394 -2157991 -2680482
11758 -2680482 1482994 2361114 -412412 -323984 2233065 -131127 -6963456 -8042655 393009
11749 393009 9466606 12036721 11619929 11586661 7612793 -1044303 -4231839 3985638 12078538
11740 12078538 6224564 -7631464 -11731511 -3326319 2517343 -2088611 -6112068 1202884
11732 1202884 12931918 15851926 9702788 4154752 2620138 555934 -2748238 -1711000
11724 -1711000 5431700 12552106 13754359 9785066 5190726 3969509 7908912 13696159
11716 13696159 12503616 -192930 -14340093 -13805240 2577130 17516281 16809861 5336577
11708 5336577 -4114155 -8450355 -11610431 -12047745 -5200994 4615977 6534686 -2400837
11700 -2400837 -14155640 -21410471 -24060195 -23807188 -21106517 -19095228 -22214254 -28179246
11692 -28179246 -28615726 -20696693 -11358070 -6648291 -3720248 2011842 7710731 7104117
11684 7104117 179009 -6509629 -7537293 -2700264 5265690 13650199 20629955 25088493
11676 25088493 26104968 23216112 17960841 13453968 10439623 6219699 565011 -965791
11668 -965791 4897072 11230594 9058954 1307988 -1081953 3327099 4134019 -3198763
11660 -3198763 -9139056 -5740751 -160165 -3454952 -13250642 -17940524 -14049028 -9096087
11652 -9096087 -8285770 -7822069 -3633803 95830 -4253069 -16420528 -25634111 -21493996
11644 -21493996 -7005182 3059599 -381679 -9029533 -8956635 -498546 3171757 -3433029
11636 -3433029 -10638745 -9782300 -5629518 -6390400 -10694566 -12285727 -10298369 -6821052
11628 -6821052 -498781 9100185 15943107 14794853 10010356 9326573 12671402 14653810
11620 14653810 14192522 13465291 10750911 3423022 -3658386 -1651746 9818201 20191312
11612 20191312 19019660 6173958 -7911571 -10281804 2220914 16305741 14419747
11605 14419747 -2628704 -13967624 -5894238 9596734 13865745 8861620 9967077 18756288
11597 18756288 21698503 14323497 7741731 8181151 7338296 -627007 -7502255 -5181160
11589 -5181160 676450 1373804 437548 6714153 17345829 18895326 5264560 -13080623
11581 -13080623 -19755075 -9319552 7308272 13515815 3392380 -12992854 -21453515
11574 -21453515 -18195126 -9817854 -2917341 237648 -1761318 -9527093 -19493543 -26644480
11566 -26644480 -30185824 -30902365 -25270475 -10291303 7468381 17263464 18331290 18658415
11558 18658415 19405524 12419162 -3797260 -17476256 -18807936 -12298557 -7662190 -6642930
11550 -6642930 -5657647 -4511534 -5208615 -6904208 -7808593 -7985187 -6373450 -436081 7457198
11541 7457198 9737948 4384493 -489446 1913686 7231780 7368473 1990063 -3662693
11533 -3662693 -7326298 -9474845 -8556194 -2777646 5984703 14451683 21030774 23858279
11525 23858279 20866535 15036194 13404718 16974014 18455325 14267615 10547142 11604988
11517 11604988 11662372 6008119 1233427 4061561 8072144 3816877 -4297786 -5156146
11509 -5156146 -795203 -4033120 -16988480 -26407913 -22799825 -12208508 -5343877 -4716929
11501 -4716929 -6322597 -6302750 -2638445 3981269 9714752 13114357 19097530 29658726
11493 29658726 34000722 20148827 -4277987 -17272390 -11358373 -2857117 -6355256 -14374845
11485 -14374845 -12602271 -3138270 1311501 -1071206 -428547 6624232 11536658 7929236
11477 7929236 933846 -887808 3539986 8048922 6886544 887064 -2029330 6054598
11469 6054598 22673767 34604656 32395158 22279269 17473192 19967762 18951433 7371750
11461 7371750 -7976897 -15327424 -10686224 984387 11866163 15549549 10216276 1336558
11453 1336558 -2517190 286766 2260673 -2477520 -9974575 -13177068 -12212007 -11895475
11445 -11895475 -12622970 -11323962 -9513354 -11485050 -13944130 -7064193 9858598 21946349
11437 21946349 15244693 -5031095 -20483946 -21307163 -14310571 -10068815 -10582676 -11957898
11429 -11957898 -11961279 -10283584 -6264855 -1307497 222490 -2316528 -1780516 7350431 17686442
11420 17686442 15733403 911096 -11248968 -9206982 -646901 -201681 -8115680 -11687399
11412 -11687399 -5690220 487853 -1707969 -8140287 -10846848 -9741288 -8099151 -3874029
11404 -3874029 5073661 12511375 11386236 6593937 8653175 16153125 17284008 9737918
11396 9737918 5243319 9960676 13866560 7238360 -4320566 -11028273 -14118301 -17760764
11388 -17760764 -15467376 -61030 18888507 24631809 17832289 14410693 18580665 16329693
11380 16329693 558075 -14784199 -15192111 -6132306 -1064831 287090 7752145 21321904
11372 21321904 30157724 28940631 23263758 18619408 14053845 8270861 3725155 1927484
11364 1927484 516316 -2632057 -6599095 -10080536 -12901658 -13706553 -9894346 -1686085
11356 -1686085 6076686 7742770 2035025 -5792672 -6463373 5450871 23298022 31416360
11348 31416360 21482309 3574789 -5126201 -1334651 2252591 -3390477 -10752375 -7603654
11340 -7603654 5164744 15574500 17349990 15782729 16181646 15082738 7841510 -997930
11332 -997930 -2695069 2060462 2511826 -7329012 -19929288 -24386378 -19980462 -13841668
11324 -13841668 -9111767 -3190806 3497086 5400334 495614 -5600079 -7359698 -6166338
11316 -6166338 -6348514 -8965073 -12592303 -15547654 -13732537 -1581920 19183126 35796979
11308 35796979 36343526 23519564 10229010 3149461 -1731286 -7212128 -7566317 2258710
11300 2258710 16157884 22108094 15869286 4401700 -3499899 -5449476 -4513086 -4739098
11292 -4739098 -8935947 -16618005 -21827874 -17234007 -4333462 4259990 -1256498 -14068928
11284 -14068928 -18559579 -11253708 -4451717 -6783372 -10972885 -7553202 -981119 -1550527
11276 -1550527 -7891769 -9839728 -5174765 -900373 587045 3694627 8012117 7921471
11268 7921471 5388151 8799232 15409215 10775031 -6595166 -15697422 -947228 22580825
11260 22580825 27604808 10366809 -8760506 -15705557 -15790701 -16488183 -15010001 -9063374
11252 -9063374 -5997057 -11666737 -18546350 -14579255 -32784 12220553 11917066 1373713
11244 1373713 -9192522 -11760511 -5371750 5380527 14347287 17544237 15307726 11461379
11236 11461379 9037869 6229076 -1248303 -12097730 -17119301 -9745143 3065205 7342843
11228 7342843 10545 -7126533 -3853924 5534038 10898430 11341272 13882646 20197378
11220 20197378 22698178 14644767 -727433 -12899554 -14271060 -7369634 -1961212 -3962708
11212 -3962708 -8587024 -7725944 -2177637 -256427 -4632531 -8416398 -5903438 902224
11204 902224 9048768 19085505 28589028 30101998 21483539 10947279 6271569 6469415
11196 6469415 9134773 16441886 26561851 28942541 18075351 4277789 745122 6467771
11188 6467771 11332966 11101545 7728816 2457542 -1224473 3874670 16116378 20650841
11180 20650841 10501466 1194675 7935584 19186676 14430380 -192043 -266589 15628355
11172 15628355 21478823 5156369 -12545071 -10498697 3894220 12100132 11982984 11769734
11164 11769734 10286867 638569 -13580928 -20310350 -14550310 -2690650 6278918 8416936
11156 8416936 6892955 8956316 16209506 18458735 6009428 -12457717 -16907648 -3132685
11148 -3132685 10664725 9126745 -1693351 -7195950 -3132293 5453206 12880291 13830160
11140 13830160 6495472 -234787 4879831 15875222 14536390 847210 -1416072 19188383
11132 19188383 40441384 38255862 21814238 15726371 21700848 22874509 16727838 16567558
11124 16567558 23218841 21399386 7253187 -2985714 1786320 11853354 13768819 8216164
11116 8216164 2577698 -2140267 -7791704 -11058054 -7970787 -2201052 -2196759 -11279338 -23344189
11107 -23344189 -27784582 -19361594 -4898001 2440819 -1652570 -7174558 -3710148 5249860
11099 5249860 8068094 772911 -9619844 -14208288 -8937431 3459454 13017641 10100954
11091 10100954 -900622 -3565851 7801946 18081591 14493289 7722819 13968270 26300400
11083 26300400 24928073 10409110 3440462 11917520 21175203 20814443 19006268 22088950
11075 22088950 20324512 6348253 -8296155 -9495873 -2147682 -1128571 -8142364 -11087215
11067 -11087215 -3098052 8681463 12738239 4960933 -8403648 -15866660 -10794125 1629482
11059 1629482 10592522 12701501 12868820 12355076 5362757 -9144376 -21361008 -22221863
11051 -22221863 -14482897 -6952753 -3501179 -2754264 -3145461 -3052436 -429153 3190832 2415552
11042 2415552 -4499952 -11708832 -12217250 -4451656 8981544 23551816 32162127 29088061
11034 29088061 17864282 9367924 8968210 11337284 10636091 9025577 11048922 15546311
11026 15546311 17735752 15205604 8977798 2653705 1501352 6838035 10989602 5253098
11018 5253098 -6404134 -10691182 -4112754 1251680 -4792871 -16566068 -21155374 -13311175
11010 -13311175 2497810 16893859 18899732 3976495 -16445553 -22914217 -10570581
11003 -10570581 5608154 12521867 13971254 17563821 19922930 15263284 7542813 2602110
10995 2602110 -2218122 -9092374 -10004976 728183 12505076 11527793 1875701 -906981
10987 -906981 6910574 14190262 12539163 4676497 -2792529 -4567614 2377710 13608366
10979 13608366 17676216 11023707 5352477 9289140 12186696 1141953 -15053767 -17946904
10971 -17946904 -8537678 -2862470 -2870133 4115512 17240882 19069986 5521731 -5266547
10963 -5266547 -2221185 2820438 -1030800 -5287596 -1015710 2914976 -3223159 -10435455
10955 -10435455 -5812146 5138461 7958651 1428895 -5583200 -10598424 -15006193 -13384077
10947 -13384077 -2227850 7361305 3321407 -5857388 -1358076 16788488 28960057 24440521
10939 24440521 13176127 6602224 3094146 -2493734 -8817452 -13794402 -18857178 -21590855
10931 -21590855 -14914593 -317062 7869613 -374497 -16510347 -24368469 -19890460 -12055853
10923 -12055853 -7964118 -5465926 -305150 6039192 8258547 4594426 -44486 648128
10915 648128 6428755 10472056 8670142 5226600 5403338 6707405 3317568 -3569490
10907 -3569490 -7201937 -5744068 -3728553 -3578603 -3297530 -2436193 -2538060 -1824496 2103193
10898 2103193 4738133 67065 -6337539 -2112247 11521606 17834931 8313170 -5381975
10890 -5381975 -10455775 -9561372 -7952162 947999 21291797 38010064 33921050 16739050
10882 16739050 8552602 11744336 6967015 -13918019 -34518940 -39598330 -34952175 -32135865
10874 -32135865 -29602681 -21511429 -13227117 -14184888 -22015455 -25283855 -18302724 -5577404
10866 -5577404 4290163 3989227 -6727774 -15924528 -9118432 9770225 17957322 3349180
10858 3349180 -16873500 -19986473 -9693885 -7611233 -19533418 -29429375 -25852828 -16233339
10850 -16233339 -11888139 -13452831 -15280900 -12741887 -2464934 13731869 23908730 17222306
10842 17222306 1342099 -4981271 1474088 5083237 -1685393 -6623412 -1660862 368024
10834 368024 -12578603 -28414286 -27639218 -13361390 -5125113 -8238428 -8875113 1036745
10826 1036745 12251759 14984433 12434438 11742580 12471314 10693001 7153760 5265171
10818 5265171 5029190 3020597 -3519556 -13595772 -21644019 -21301432 -12975113 -4953884
10810 -4953884 -3045889 -2894689 2179923 10403949 15837103 18864802 23347988 27020970
10802 27020970 25210879 21646923 24177211 30851846 31965895 25624653 19055932 14309875
10794 14309875 6512004 -1801844 -137663 10727638 13924519 -293075 -19025997 -24630477
10786 -24630477 -17592298 -10419304 -7625201 -4202917 1983279 8287215 14069523 19110274
10778 19110274 18430184 8319770 -4895723 -10775403 -7473304 -1503875 1935648 1488870
10770 1488870 -2878915 -6834556 -1353066 14669711 26303559 18773125 -1641488 -15427853
10762 -15427853 -15920991 -13104768 -12028275 -4450841 13122792 28463524 29854139 22301410
10754 22301410 17727036 17329988 14143081 7458219 3862634 5979995 9241194 9931177
10746 9931177 9553262 10005246 9180953 3228229 -8539029 -21068369 -25474242 -16244717
10738 -16244717 985538 11378916 4594121 -13773971 -27245594 -25199957 -12896933
10731 -12896933 -4730658 -8990647 -20243305 -26577542 -22834547 -14367115 -8032863 -3946398
10723 -3946398 1081089 6340712 8948881 9933272 11860117 11896824 5226801 -4193990 -5099903
10714 -5099903 5422918 15223720 11460017 -3376171 -15250206 -14895894 -5429511 3455475
10706 3455475 3972810 -5102175 -17308324 -22320831 -14424987 2273061 18148699 26412005
10698 26412005 26467417 21788046 16897274 14673390 14142380 11591177 5123266 -2627994
10690 -2627994 -6687268 -3799365 4644334 11833642 9833627 -1471433 -11675848 -11252479
10682 -11252479 -3559108 1517339 3521143 10106263 19368487 17778833 2312166 -8981183
10674 -8981183 -1010258 13437556 9410426 -13085484 -25676213 -9530192 18137220
10667 18137220 25510824 5601813 -17931621 -22316486 -11117296 -3665825 -7964222 -14631771
10659 -14631771 -15616412 -15983394 -21336349 -24394261 -15907237 -2739707 -437717 -9461363
10651 -9461363 -14474768 -9253505 -5746624 -12048741 -17387339 -9786461 4549251 12322860
10643 12322860 12788931 12471439 9646431 -339072 -11289491 -13933011 -12382089 -16449857
10635 -16449857 -21797816 -15880381 -1809442 3194798 -4958629 -10465975 -3223545 6193601
10627 6193601 5081698 -2688820 -6202578 -3953324 -664092 3251460 9067424 12727558
10619 12727558 8893823 -1581965 -12898191 -18756678 -13935712 998173 14541059
10612 14541059 13741788 2641801 312344 14669812 29648899 27255206 12371623 4292001
10604 4292001 10403564 20205956 22155743 15860443 8072381 4176871 4216689 3689237 -489617
10595 -489617 -3710720 1678119 13653567 19872637 13535225 1827285 -6515837 -12970341
10587 -12970341 -21091336 -25503500 -19384375 -6874897 2415324 6886739 11222320 15531629
10579 15531629 16600044 16474102 18819674 19136762 10389711 -2145801 -3928610 8404215
10571 8404215 20364175 18239170 6198998 -1198383 2097355 9032771 11281589 9020662
10563 9020662 7397914 7537958 5599763 777696 -666618 6649909 18229132 24463866
10555 24463866 23213151 20892852 20952755 19109161 12480372 6304598 7514417 16501375
10547 16501375 27982307 35532426 34360855 25762075 19457613 23842939 33015196 32551179
10539 32551179 19565690 6497425 2633574 3803746 4199827 5380322 7752549 6356402
10531 6356402 2461658 6051623 18119006 24201277 16200364 7236220 11980107 24322031
10523 24322031 28882879 24356646 20426904 19932313 18830783 17327981 18063498 19192072
10515 19192072 19540170 22867489 28449924 28608754 24259081 27814014 39958691 42229912
10507 42229912 27208859 15326460 22947685 35814447 37213280 38841803 54233820
10500 54233820 64676844 48154930 22859089 21135006 36529445 40790554 37540886
10493 37540886 48399535 60950996 52685438 56685851 124077954 211081922 192142694
10486 192142694 27502885 -156614926 -214373228 -150718169 -80814338 -66278276 -71322370
10479 -71322370 -58145400 -41466132 -40609043 -43013862 -36024509 -30433474 -33921255 -34629526
10471 -34629526 -26166519 -21345948 -28162079 -34861605 -29708482 -17491965 -9357214 -11373852
10463 -11373852 -24974542 -42906559 -46800017 -27568136 -5085927 -5930301 -24419119
10456 -24419119 -30450348 -15236302 -1973121 -7482141 -20311190 -24792758 -22334798 -18521220
10448 -18521220 -10680859 72702 2900986 -5009218 -10456533 -4470489 3826495 3246152
10440 3246152 -3347016 -8472815 -12517137 -16926427 -16783042 -10268299 -5442567 -8016848
10432 -8016848 -11073993 -6036950 3263883 5736179 -2855404 -16882280 -27706258 -29952423
10424 -29952423 -25175837 -20728756 -20622139 -19070892 -9597664 2758981 7686413 4768011
10416 4768011 1236065 -2048747 -8976572 -15296160 -12897124 -6048393 -7165254 -16319474
10408 -16319474 -21802608 -21390023 -24134029 -29120577 -23609501 -7806835 -139839 -8864334
10400 -8864334 -18421136 -15471084 -9875232 -15722368 -27376335 -29833923 -20492363 -6384872
10392 -6384872 8713208 20334104 17774017 -1675550 -21280131 -22807249 -9743495
10385 -9743495 636974 1783265 580100 1044450 -26593 -3333851 -5323437 -5188008
10377 -5188008 -4365346 -1516826 3420291 4012379 -4220809 -13682477 -13460448 -5791337 -2921411
10368 -2921411 -8258857 -11582549 -5105060 4982183 7754917 2755351 328183 7845175
10360 7845175 19760428 24088034 17706983 10204761 9671662 10522096 2771509 -10849654
10352 -10849654 -17682746 -13892823 -8929143 -9976634 -13485465 -15229202 -17340615 -20382615
10344 -20382615 -18830877 -10622515 -2542990 -289688 -971864 -513195 -469373 -2393027 -3265129
10335 -3265129 -1535534 -329039 -587146 998681 3608606 866428 -8023437 -14751790
10327 -14751790 -13902784 -9880052 -8334004 -9652906 -13496896 -19694436 -22910217 -18233084
10319 -18233084 -13170519 -19594505 -32204401 -32582833 -18169544 -7166444 -8415149 -8390659
10311 -8390659 1920491 9933868 5157240 -1862548 -1071133 -2384924 -14096043 -22122800
10303 -22122800 -13915628 -4498292 -12016652 -23202155 -13446964 10138520 18261808 6219109
10295 6219109 -1438991 7275833 16083543 11082619 -54628 -7013145 -11953210 -16998025
10287 -16998025 -15684989 -5791678 4065668 7113143 5196923 -80901 -9493332 -17413665
10279 -17413665 -14946599 -3837550 5805859 11517533 17936933 22035555 16013863 4107142
10271 4107142 -2058117 -4483866 -14584380 -27458538 -24312714 -5177001 5706250 -3579132
10263 -3579132 -14369075 -8631927 3366546 3489844 -4091727 -2777096 8415400 15555700
10255 15555700 11543750 1682025 -7410199 -12114435 -10023760 -4256303 -4285846 -13483886
10247 -13483886 -22099788 -21215286 -16075267 -15715211 -17210228 -12351438 -4130153 -3243556
10239 -3243556 -10555353 -15026587 -9194397 2629953 11970642 14134847 8118049 -4073257
10231 -4073257 -16029241 -20149052 -14970814 -7022117 -4097747 -7858773 -13303111 -14503341
10223 -14503341 -10182775 -3424002 2910713 7578939 7927315 892353 -10305278 -16391821
10215 -16391821 -13585963 -8899746 -8299555 -7112323 -656622 3600415 -3166296 -14070941
10207 -14070941 -14542698 -4005128 5210965 8536413 13083689 21013125 24662220 20198012
10199 20198012 12160809 2989335 -8268247 -16477796 -14727066 -8273488 -7756847 -8875037
10191 -8875037 1553968 18500609 21200011 7367258 -600679 7047310 10291535 -5407998
10183 -5407998 -21870062 -17267757 -1727157 845596 -8932104 -12204050 -6443070 -7131240
10175 -7131240 -18959188 -29165506 -29506131 -25235461 -21325927 -16465164 -11873275 -11663885
10167 -11663885 -13513042 -11153724 -5589524 -2520406 -1001931 3151905 5827012 390068
10159 390068 -7188770 -4047171 8817042 16198530 10780138 1978642 -177392 2413662
10151 2413662 3667396 3270776 4263252 7973664 14045268 19522200 18169978 8224828
10143 8224828 -356618 4148857 18160636 25482232 17635554 1965500 -10637887 -15212881
10135 -15212881 -9389773 6133278 19971662 16490419 -2363679 -13169194 402084
10128 402084 23646302 28175276 8523812 -12494041 -15097799 -5452139 -1488589 -6775734
10120 -6775734 -9634693 -3637006 3665975 4265644 1418263 2357685 7085558 11462809
10112 11462809 15322423 19240061 18234856 8376813 -3736164 -8228719 -5904871 -4229689
10104 -4229689 -2581903 4942407 13611544 11033827 -2065266 -10168119 -6233293 -852529
10096 -852529 -2703663 -6212874 -6169884 -7955872 -13227704 -11671346 423485 8210549
10088 8210549 -703625 -16073217 -20567283 -13812263 -6117978 -113306 5114721 3052539
10080 3052539 -8943691 -17395170 -10717142 -326074 -3607026 -14529077 -14130604 -3781637
10072 -3781637 -2350883 -12320755 -15164144 -3663265 5715440 81322 -11037535 -13469015
10064 -13469015 -8134181 -3190803 205082 4986716 10825415 16395785 20880398 19975520
10056 19975520 9881359 -2607868 -4977764 3525522 10673617 10257874 10118829 16848408
10048 16848408 24100091 22542250 13092914 4727183 4710592 13444144 23794936 25788136
10040 25788136 17624116 9139074 7624697 6743837 100214 -2879841 8459718 22078329
10032 22078329 15861122 -7030205 -18610977 -5533269 14010074 19579740 13697878
10025 13697878 8111589 4010859 -1574614 -5010326 -4245077 -5307743 -9760989 -7785471
10017 -7785471 5506159 18463737 18597977 9555417 2292964 -303182 140058 5696480
10009 5696480 15321007 19125313 11380083 1818680 2865298 11933710 16687867 12422645
10001 12422645 5051771 1701024 5845386 16357396 24853139 20409254 3545953 -10909570
9993 -10909570 -10927976 -553049 8775189 11632679 7834245 -1989694 -12609126 -14649594
9985 -14649594 -6418205 2276147 4176311 3873156 7388917 12403810 15332118 17934283
9977 17934283 20272653 17803535 11886233 11040630 14932181 11345736 -2146598 -9158662
9969 -9158662 1211713 16466732 20880918 18307143 18583049 16171115 2359342 -13465454
9961 -13465454 -16710136 -12513982 -15364747 -21461194 -15870081 -2789399 -2655063 -18308474
9953 -18308474 -28501277 -19818475 -3666593 5009084 6705501 6943607 3814844 -3926105
9945 -3926105 -8968918 -4991396 5181669 17144772 30719245 42448957 42926552 29262524
9937 29262524 11919331 1962802 -1444011 -4490683 -6984517 -5106026 -953921 -991881
9929 -991881 -6251985 -10110322 -6564672 2338326 8749790 8476199 6766350 11517191 20553026
9920 20553026 21844421 10353691 -1990219 -1061472 9147915 11049257 -2673584 -19475556
9912 -19475556 -23350023 -13570027 -3772351 -6334148 -19755771 -29879295 -24232417 -6568825
9904 -6568825 6000383 3023882 -6758967 -7487476 3974454 16648567 20250877 14175639
9896 14175639 3673327 -5980498 -11418224 -11945494 -9326236 -6196609 -6052127 -12432488
9888 -12432488 -22530415 -25135993 -15299614 -7302306 -16568944 -31195501 -26989782 -15263181
9880 -15263181 -41254711 -114151460 -170885131 -146117650 -58948580 10821418 22559444
9873 22559444 7495698 4169110 9813240 9665402 11644160 25517524 37107486 31024279
9865 31024279 18776786 18805175 24783333 18892279 4219442 -1204292 5173728 9524379
9857 9524379 6695218 4516222 5027066 1576765 -4708512 -3795016 5118957 10113876 5230328
9848 5230328 -1054374 -909501 1362226 -1023484 -6183494 -8876446 -9210033 -9216461 -6957147
9839 -6957147 -1233522 2549156 -852253 -6576410 -5013674 2993066 5230357 -4091543
9831 -4091543 -13668849 -9750476 3752184 10316377 4782612 88187 6290340 14767293
9823 14767293 12214843 1423506 -4022328 -885503 941370 -4345408 -10865896 -12498490
9815 -12498490 -11234949 -10472797 -8445070 -2691432 4844405 10398965 11533274 6776377
9807 6776377 -2097483 -6963194 113837 15168704 24044228 18578875 5170206 -5103946
9799 -5103946 -8468501 -7370354 -3733882 1545299 5883860 6523325 3976018 1814930
9791 1814930 3191492 7424107 9522191 4855125 -4672316 -12078130 -14028430 -13235546
9783 -13235546 -10647207 -3090356 7210686 10219264 2510406 -5176507 -4080284 -1307777
9775 -1307777 -5677762 -9838498 -2521893 9366557 9659428 -1067043 -8106573 -8367667
9767 -8367667 -12730328 -23114224 -28615848 -26966593 -29039289 -37439854 -40216299 -31384644
9759 -31384644 -19258753 -9469604 978196 8011934 952484 -13999038 -14196827 4776814
9751 4776814 18498451 11689674 2670836 10718874 21450939 10224681 -15965496 -27735808
9743 -27735808 -15651742 2358660 11185997 12333549 8979419 -740425 -12812254 -16947052
9735 -16947052 -10792043 -2038377 4934934 12778464 20846608 22682083 15909377 5816846
9727 5816846 -2379689 -8059280 -11899521 -13807895 -13637593 -10417815 -3757440 1552254
9719 1552254 -1423856 -10624969 -15184956 -11576909 -9616346 -15710251 -21228804 -16734043
9711 -16734043 -6946940 -587770 4382576 12950056 20071177 19325923 16364838 19405371
9703 19405371 23502695 19097713 10002764 7492948 11324541 12080912 9002312 10287959
9695 10287959 17213495 21576801 18539548 11228119 4220594 1550915 7211557 18485845
9687 18485845 24432255 20334413 15771000 17798572 16791800 3485783 -10731827 -9100306
9679 -9100306 3422607 8801634 5203624 5441374 10158492 6511646 -6223752 -13111724
9671 -13111724 -9274406 -7689082 -15170051 -19712460 -10059365 7460210 19710148 22204164
9663 22204164 17561809 9401814 3032599 3086844 6987219 8238241 5960426 2610770
9655 2610770 -4470103 -17451905 -27526625 -23994923 -10910680 -74094 8351188 20628736
9647 20628736 28936113 18148132 -6300220 -19606114 -10928328 4335441 9957294 6723562
9639 6723562 -179455 -10870701 -19893723 -14690023 5215115 23041726 26857775 22409377
9631 22409377 18280112 14665538 12809112 17891204 25328060 21799464 7436208 -907459
9623 -907459 3859731 8118642 1255183 -9581706 -17494687 -26953478 -35615569 -28156679
9615 -28156679 -3524212 13850448 8280692 -2625743 1760150 10519623 2019198 -17187002
9607 -17187002 -22897971 -12775462 -7255802 -15278462 -24042784 -22100415 -11910809 514640
9599 514640 11133793 14060937 7618154 1864064 5765027 11205745 5119150 -7700922
9591 -7700922 -11357116 -4265687 987796 1129868 6183669 19044870 28963187 28556113
9583 28556113 22426288 16061322 9589283 4725093 4977406 6790331 2610640 -5697034
9575 -5697034 -8725445 -6116552 -8162174 -17873336 -23907095 -16169747 1223297 16650784
9567 16650784 22710295 18924998 10679778 7088196 12204236 17703559 12418239 -1080474
9559 -1080474 -8907291 -4978974 2988351 7977093 12482388 18565284 19698115 9960698
9551 9960698 -4886442 -12524200 -7669681 3713701 12212936 14303512 14190245 16893857
9543 16893857 20429361 17984084 8359377 -954810 -3369843 24489 5935447 13280225
9535 13280225 17960347 13076574 1522643 -1989464 8471123 17628549 10248278 -4443144
9527 -4443144 -6059810 5800918 12707087 7165976 1499679 4805886 9162526 4799404
9519 4799404 -5350016 -13410110 -17913606 -20552081 -19800706 -13699322 -3619240 7712117
9511 7712117 17232061 20598018 16316238 9821688 6877730 5431349 1642047 -419402
9503 -419402 4441176 10497568 8727224 2824122 2790930 5395702 -1640593 -16596653 -23872169
9494 -23872169 -19167029 -14812415 -15639228 -10708592 2489009 6954500 -6816542 -20890450
9486 -20890450 -14605280 4039919 10626354 -648387 -12795366 -12474208 -3501462 5144956
9478 5144956 10272399 11781905 9899411 7311275 6709687 5530275 -822422 -10887478
9470 -10887478 -17730970 -16782152 -8677720 3433878 14465108 17981412 12262770 4520302
9462 4520302 3918431 10934623 17142024 14428539 2102328 -12826276 -20451295 -16361115
9454 -16361115 -6954496 -2213821 -2478740 451372 7299765 7115571 -4350939 -12681689
9446 -12681689 -2736910 18331471 29397027 23364011 13114392 9997140 10813840 9934891
9438 9934891 10965385 17943674 24249366 20806394 10567602 4531415 5029520 3133307
9430 3133307 -5841825 -13901826 -12604511 -6188552 -4378334 -6635998 -3822695 5177627
9422 5177627 9569619 3059808 -5306674 -3254673 8760502 20954240 27641597 28936106
9414 28936106 23972443 12380901 155672 -5278686 -4716340 -3993507 -3649104 -710728
9406 -710728 2353540 1796249 3355997 15003544 28948390 26690037 5882147 -13427482
9398 -13427482 -16384740 -12279470 -15664573 -21987337 -16552676 785851 15313823 18034897
9390 18034897 13099278 6408346 -658665 -5529773 -3552137 4109433 9550107 8252429
9382 8252429 4468436 4007278 6455828 7311152 4391227 -763954 -6244683 -12101715 -18771753
9373 -18771753 -23717550 -21626031 -10696697 2002488 6044692 -29156 -6543286 -5867608
9365 -5867608 -3289062 -9427788 -24100702 -34188031 -29168950 -14472516 -5448729 -8874329
9357 -8874329 -14841885 -10016743 4192941 13199062 8893221 -765027 -5558172 -7268422
9349 -7268422 -12184946 -17296635 -15492124 -9462761 -7450524 -8120217 -3683205 3354799
9341 3354799 2295499 -5880555 -7680267 -315821 1658423 -9139381 -18457582 -12448506
9333 -12448506 -63730 1718002 -5056562 -3837166 9844906 22141263 20837781 9267509
9325 9267509 -1270380 -4236379 -854095 4205201 8061318 11426756 14021698 10158810
9317 10158810 -4304482 -21006821 -25324692 -16061791 -7583277 -8173636 -9268460 -2935581
9309 -2935581 4149698 4557814 4405120 10484985 15035316 8796166 -858055 -1842271 1009645
9300 1009645 -5146400 -16676788 -17564186 -4949456 8514168 16375343 23323009 28387962
9292 28387962 23222345 10554106 5537532 12679168 18074697 11861663 3196132 4009779
9284 4009779 10785639 12513774 7198077 1314859 -57125 4362203 12876693 18700647
9276 18700647 14112633 1562571 -6620528 -4031139 1998891 2769579 -47919 -633074
9268 -633074 903088 1261178 665997 780685 674271 -700634 -2760324 -6860209 -15482478
9259 -15482478 -25163346 -27404886 -19844808 -9218336 -575402 7580710 14297513 13287205
9251 13287205 4771141 -663821 2296452 4601862 -1448515 -7776342 -3721863 5154341
9243 5154341 5984567 563920 2473923 14048739 21861250 17273517 7919290 4214548
9235 4214548 5697261 6915090 7941837 11413921 14791308 13319867 8408338 6872689
9227 6872689 11838711 18092426 17129829 5519604 -11276081 -22581506 -21141146 -9320893
9219 -9320893 3664068 10708511 11684083 9507560 4497797 -4452353 -14206581 -17106056
9211 -17106056 -9045866 3931282 10990068 9215841 7379644 14342101 26473645 31077656
9203 31077656 21783150 6226734 -2515060 1220136 12598966 22884979 26862078 25321841
9195 25321841 22165018 19121633 13753424 3727183 -8123805 -15520605 -15149210 -9079919
9187 -9079919 -1668240 3012734 1881938 -4359896 -8867872 -4013501 8914856 19168479
9179 19168479 18155630 8888519 1502103 1315865 3595481 -439333 -13228704 -26310750
9171 -26310750 -27537532 -14628859 654591 5407146 485559 -2770990 894849 5098586
9163 5098586 3950602 1265171 2750854 5503319 2614547 -4734044 -7392934 -1112300
9155 -1112300 6374703 4189507 -8126082 -19043972 -17357743 -3982877 10160133 16340934
9147 16340934 14431330 7725954 -2294452 -12873824 -17920843 -15442833 -12717875 -16481947
9139 -16481947 -21264121 -16478768 -3141471 6890827 8408764 8515651 12567427 15585474
9131 15585474 12445092 6729930 3295401 632252 -2687817 -2175854 4162818 9044570
9123 9044570 6487446 2721721 6392695 13034155 10968620 88473 -7299066 -4611077
9115 -4611077 1271053 3000836 3574864 9027189 17332327 20802533 16289776 8313374
9107 8313374 3302260 3341894 4810150 2128976 -6084639 -14480124 -16136430 -10094806 -2053835
9098 -2053835 1862626 137682 -4223931 -6280153 -2747111 4084302 7085179 2062728
9090 2062728 -6536875 -11428054 -12272077 -14264933 -17701840 -15928431 -5650682 6912025
9082 6912025 13527519 12448859 5913680 -4856871 -16207288 -18834373 -7027035 10650664
9074 10650664 19182894 16117718 13302844 17286117 18949162 9589384 -2667442 -4358611
9066 -4358611 1459739 -475236 -12456871 -18384795 -7929008 7471856 11071840 2777978
9058 2777978 -5528676 -8752176 -11079399 -14527305 -16650540 -17600749 -19134688 -17798577
9050 -17798577 -8924500 3222306 9108725 7922853 8175307 13307932 16370681 11272583
9042 11272583 597074 -10158939 -17808617 -18982609 -11719018 -2585872 -2661358 -11907299
9034 -11907299 -16413379 -6525311 10307459 20113041 17843954 6748046 -8900794 -23009109
9026 -23009109 -27518444 -21799697 -15975575 -16599762 -15724878 -3971202 12026220 17741372
9018 17741372 12486262 9132752 12524606 12385675 1774388 -9578929 -8001262 6058557
9010 6058557 20950188 29615569 33531132 33173361 24520872 7983275 -6609511 -10232262
9002 -10232262 -6522900 -6801243 -14444715 -21527412 -21733001 -18103622 -14365662 -7730562
8994 -7730562 2303333 6253561 -3220082 -16917046 -19357478 -10317365 -2922063 -2257036
8986 -2257036 -931806 3818574 5180064 2212225 3527836 9685165 8708225 -2285032
8978 -2285032 -7586643 3344641 17877123 19923971 13825014 12313585 12928123 5434898
8970 5434898 -6352797 -10490688 -8643809 -11484356 -16344360 -10924099 1764081 4371096
8962 4371096 -6091165 -12183754 -5361162 -1140050 -13800854 -32308437 -35732525 -22049257
8954 -22049257 -7560138 -3641799 -6303715 -6254856 187518 9758320 15705956 12990415
8946 12990415 3588572 -4539757 -5729771 -1705820 2492517 4090936 3007239 973978
8938 973978 1833881 8466790 17515678 21073357 15677103 6592796 1895650 5030045 13316141
8929 13316141 20230308 19143945 8909716 -3689684 -10410013 -10275158 -8487696 -7775413
8921 -7775413 -5521909 516256 7836130 11273550 7501296 -1418589 -7794910 -5349957
8913 -5349957 1477755 996185 -9556329 -18676681 -16744717 -8754150 -3313160 899070
8905 899070 6391345 4967067 -9300130 -22889306 -18052640 -1580368 2103376 -13506834
8897 -13506834 -28764432 -27906831 -17345133 -8811405 -3650014 -1500775 -6412687 -14652267
8889 -14652267 -12852203 1076289 10346685 3837796 -6305471 -4159527 6309771 10986924
8881 10986924 7375698 1980079 -4191359 -12302502 -15616534 -7803663 3999786 7685402
8873 7685402 3115092 -925506 -1144597 512858 5665347 15554270 23179331 21665082
8865 21665082 16254309 16283307 19858351 18775843 14121751 13466478 15617383 12081850 2838748
8856 2838748 -1982741 3335352 13991197 22701394 24948309 18197110 5244386 -3902705
8848 -3902705 -2578411 3208408 4745765 4286239 7377426 7972465 -3241380 -19063327
8840 -19063327 -21455865 -7371049 6900977 9253825 4926467 2945442 3259338 2321789
8832 2321789 159078 -2986180 -8171841 -13011460 -13475099 -11068892 -9778181 -7729774
8824 -7729774 -2612154 -1986451 -13508952 -27007030 -23895864 -4889270 10431276 13596807
8816 13596807 15821224 21992701 19556777 3651133 -8976781 -5777367 1643884 223127
8808 223127 -675528 11120578 23183623 15850858 -3239015 -8128832 6776014 22135003
8800 22135003 26473187 28546490 33464500 30075537 11622417 -8907474 -15527005 -9516585
8792 -9516585 -3411595 -3756829 -7853749 -10556150 -7824007 744257 8645629 7800194 113003
8783 113003 -3413380 2022295 8657334 8629222 4231258 855271 -2128069 -7197243 -11911015
8774 -11911015 -12426680 -8635399 -1302239 9640077 19390579 18706160 6764883 -3677720
8766 -3677720 -2101161 5434468 7060644 3760633 5079538 10254240 8186527 -3193426
8758 -3193426 -11626087 -9106960 -3764212 -5905013 -11769119 -10786891 -2876825 2201771
8750 2201771 469130 -1516063 1401783 4997754 3660102 310580 2326626 9692237
8742 9692237 12915279 4215009 -12114768 -22695683 -17746267 275952 19628728 28810454
8734 28810454 23654470 8834079 -4921482 -7704053 808187 9693314 8219391 -910890
8726 -910890 -5061780 621481 6550377 4230174 448781 6561856 18798303 22099971
8718 22099971 13089502 5286406 7259326 9258182 896474 -9153335 -4989665 11337215
8710 11337215 22004373 19303728 13834460 13927179 11599733 -2921353 -23365118 -34615982
8702 -34615982 -32083411 -24466711 -20361923 -20483374 -21699449 -21406840 -17974600 -12536271
8694 -12536271 -10207794 -14539531 -21000285 -20826813 -11552665 393027 7373885 6823911
8686 6823911 660282 -6452681 -8169275 -1361717 8382698 10747217 2521375 -7752612
8678 -7752612 -8914250 1357445 15067934 21307541 14935626 1224766 -7810471 -5226448
8670 -5226448 2768752 4745604 -733355 -4556969 -2479897 -2331185 -11288587 -23684952
8662 -23684952 -28590493 -24040016 -15981231 -7479337 2069792 9532303 9467705 2953946
8654 2953946 -3216275 -6447816 -9526536 -11797198 -8572155 -1322003 1218469 -3965671
8646 -3965671 -9176324 -8935387 -8464923 -12171289 -12965018 -3375130 9644387 13034627 6389658
8637 6389658 19714 -2508237 -5651949 -6683889 3948744 22565211 28811073 12304502
8629 12304502 -9626753 -13395314 363928 11576023 10351393 6400764 9616475 15803951
8621 15803951 15660042 7415090 -4160717 -13494522 -14994088 -5359472 10556461 22229849
8613 22229849 25285027 24483146 22105804 12541922 -5157161 -18355543 -15050939 -1663746
8605 -1663746 4951784 714966 -2483173 3168008 10571802 10628442 5006574 -502156 -6877345
8596 -6877345 -17727870 -29431499 -33684014 -27459967 -14202939 1998608 16813501 23283023
8588 23283023 17663642 7183479 3494450 7069469 6286363 -5019694 -17306807 -18505463
8580 -18505463 -11159125 -8080466 -13527429 -17566927 -10765282 2435596 9611931 6417938
8572 6417938 1572253 5288166 16372587 23843934 20460528 10943375 4991983 5203665
8564 5203665 5964859 3138903 -315174 208254 4105388 6918146 6093465 3146865 1887932
8555 1887932 5666838 13762684 19515515 15919044 5000711 -2773984 -1292217 3869026
8547 3869026 4714314 1724966 -551094 -3236754 -9656580 -15810685 -14740441 -9021774
8539 -9021774 -7830084 -11144801 -8940072 977603 7009465 1939744 -4773064 -2343025
8531 -2343025 3836509 2496077 -3009423 438418 13036723 19587535 11753505 -405424
8523 -405424 -4004483 248247 3709217 3616663 3628488 5793806 9109331 13056352 16910172
8514 16910172 17802036 14001527 7924855 2308047 -3362500 -8580093 -8201427 714202
8506 714202 11371900 13807309 7889422 2657538 2995987 4875805 5292787 8324250 16473756
8497 16473756 22859650 19365734 9146171 3532419 7054759 11942101 8901221 -1433741
8489 -1433741 -10356746 -11657573 -7757332 -6002002 -10191455 -16204840 -16707534 -10312508
8481 -10312508 -4006393 -4993877 -12507157 -20207111 -23841095 -22286179 -13850570 1385028
8473 1385028 15889234 19487173 12595696 7544718 12401515 19882267 18092864 6692762
8465 6692762 -4806632 -10325723 -10290452 -4729266 6259036 15359283 12077397 -2786537
8457 -2786537 -15186870 -14708381 -6504984 -1913519 -3802404 -6962013 -7362668 -4124458
8449 -4124458 3695432 15055594 24103396 26030955 23813480 22613589 19784319 8943042
8441 8943042 -6330801 -12572048 -3490967 11029024 17876736 15872338 11700331 6895730
8433 6895730 -1436490 -9326844 -6532074 8487264 22670102 23278985 13562903 7328163
8425 7328163 11197331 18858211 21284116 15841954 5331580 -5321362 -10237974 -6888226
8417 -6888226 -1175773 -1776130 -7116060 -5996460 4413604 10633087 1781644 -11511325
8409 -11511325 -10191681 5189395 14850401 9043594 1015118 4237642 10897834 5443001
8401 5443001 -9086318 -13502961 -90731 15601485 15293189 1717141 -5777591 3426504
8393 3426504 17880351 18964799 4484125 -9380066 -9773031 -2625627 -1134642 -6068785
8385 -6068785 -7782696 -4217004 -3965032 -10409282 -15696531 -14949140 -14446916 -18613852 -19922825
8376 -19922825 -11588207 -1404131 -1245818 -8863919 -12129368 -7265602 -574852 5550715
8368 5550715 15177911 26487370 28867475 16537136 -2945807 -17603296 -22850112 -22094960
8360 -22094960 -20720406 -21556338 -22507334 -17937030 -5767731 7804708 14840997 14952757
8352 14952757 12942706 10013216 4681383 608814 4542778 15495906 23445900 20578033
8344 20578033 8581049 -5042669 -12372239 -8487104 3249833 10923690 7179970 576005
8336 576005 4088682 14526444 16295869 5685499 -3633722 -2806282 155953 -2196587
8328 -2196587 -2226164 8264003 20715505 21347280 12779376 9598587 15740727 20075132
8320 20075132 14758802 6238521 4572244 9744983 13353066 10564489 6760184 11461692
8312 11461692 25565844 36931969 32851498 15709834 -65940 -6146573 -6805390 -6791099
8304 -6791099 -4332866 -116941 -525037 -4617238 -453855 15415710 27087546 21399220
8296 21399220 9694412 10495959 19550915 18076645 5785032 1504812 9578620 10504387
8288 10504387 -6097195 -20991112 -12867951 9075182 17830105 5342418 -10361997
8281 -10361997 -11661242 -445552 9891346 10418899 1735262 -9640959 -16448533 -15636180
8273 -15636180 -10220366 -5542354 -4409274 -6181392 -7697562 -4040902 7440211 21556735
8265 21556735 27928074 22261865 11352280 4294305 3091502 4737076 7195152 9107925
8257 9107925 8528580 6558486 7536720 11422266 12106610 8504994 9502022 19612728 27614720
8248 27614720 21439976 8480423 6087305 14635368 17335036 8375540 2631533 9873440
8240 9873440 16384764 5447589 -16184337 -28035088 -24595398 -18008550 -15985480 -13899634
8232 -13899634 -9398546 -8871356 -14567925 -18375119 -15234033 -12083278 -15460098 -19256222
8224 -19256222 -14601387 -5379934 -2876565 -8377852 -12202101 -9607599 -7235584 -11153131
8216 -11153131 -16802204 -15361764 -5152520 6817383 11062152 1594485 -19103492 -38070866
8208 -38070866 -40434658 -25233770 -8740320 -6313912 -14486503 -18247528 -13254394 -10337062
8200 -10337062 -16456202 -22374372 -16395864 -2532014 5047311 1893606 -3111149 -3482745
8192 -3482745 -3488496 -7678928 -11819708 -10360420 -5775288 -3364029 -2125228 1555832 5256558
8183 5256558 3896366 -787125 -2450875 -302370 1074104 699540 1156492 352140 -6583131
8174 -6583131 -16305763 -18619355 -11268143 -3341163 -1094274 -1161888 -1468953 -6346066 -14516959
8165 -14516959 -15029354 -4415527 4453685 2116366 -1100514 6914846 17127501 13603810
8157 13603810 2719567 5489449 23124235 33541794 25086247 11747290 8155287 9886960
8149 9886960 8709379 8935169 15216905 19158985 13049905 4923220 4607000 5210526 -4583210
8140 -4583210 -17948215 -18454077 -6829361 44143 -3642913 -5448882 1575210 5797922
8132 5797922 -3535677 -17186701 -17770992 -2945132 13947024 22089193 22459894 20532414
8124 20532414 18160403 14175659 7840120 -380374 -9031720 -15656668 -17973186 -15264617
8116 -15264617 -7956073 2719301 12821547 15568470 7390552 -5798311 -13159016 -11826858
8108 -11826858 -10474455 -15846934 -20694438 -13286684 3188438 11708420 4447504 -6318088
8100 -6318088 -6852324 -1283442 -1929303 -8625858 -11768625 -11286392 -16281033 -26012680 -27971038
8091 -27971038 -18867342 -11858425 -15464630 -19227867 -10697600 4420321 11026117 5591621
8083 5591621 -3467927 -10484480 -15885266 -18831725 -17644626 -15418176 -15959299 -16624479 -13738577
8074 -13738577 -11309864 -14126381 -15766514 -6257178 9073457 12063709 -3677618 -22247502
8066 -22247502 -25118463 -12467357 1363326 6614943 4910034 1491800 -1616662 -4661873
8058 -4661873 -7013411 -6730512 -2652815 3116692 5583447 1597152 -5860751 -10174163
8050 -10174163 -8054812 -2160723 3180514 6512373 8675340 9568534 7569417 2660454
8042 2660454 -1297150 -24924 4847861 6445108 2138440 -1890527 -392281 1607693
8034 1607693 -2341208 -5974833 2436262 19382308 27649140 22175549 18596752 27855348
8026 27855348 37604908 32006875 17593960 12579366 18296713 19670876 11267678 5079102
8018 5079102 10284622 19589779 20467832 10646128 -1335241 -5002646 3450345 16268770
8010 16268770 19555132 9077972 -3318639 -5772085 -2382648 -3121463 -5013977 1727541
8002 1727541 13006065 13790857 2067626 -7171962 -5300545 -1610769 -5619136 -11914704
7994 -11914704 -10934925 -4085701 483521 -462766 -5009984 -11400474 -17497545 -19540931
7986 -19540931 -15925018 -9159419 -2817192 -172869 -4048213 -11689075 -12725809 -1265417
7978 -1265417 12816977 15727252 10009667 9194185 14364324 13385301 4398871 550698
7970 550698 6193722 8162653 -281572 -5929532 1240377 8762575 1851530 -11239972
7962 -11239972 -12835108 -4715939 -3299425 -11469412 -15219581 -7828767 393561 -52615
7954 -52615 -4073007 -1634483 7656217 14769366 11358474 -2807003 -19296532 -27345525
7946 -27345525 -23183825 -12449399 -2449627 4386161 7911734 7188550 3914460 3336288
7938 3336288 7139981 10383289 9245447 5750130 1183506 -7049865 -16762806 -18442307
7930 -18442307 -9087813 134950 -689043 -5517128 -4007022 -32077 -4884118 -17088708
7922 -17088708 -23711831 -19895984 -13342499 -9799312 -7626294 -7820728 -15458666 -27020952
7914 -27020952 -29039787 -16637819 -3703159 -5633967 -18237422 -23558482 -14175781 -1939528
7906 -1939528 -554383 -7470806 -9634613 -3366296 1102294 -3069376 -7463963 -1970282
7898 -1970282 7274975 6411135 -2904245 -4548177 5843403 12335137 3765319 -7744122
7890 -7744122 -5242221 7795401 15019583 12001622 8135664 8208332 7334507 3396865 946203
7881 946203 1382123 876746 513693 7972170 24485055 37806421 34086074 13602346
7873 13602346 -8982879 -18798645 -13593782 -3068354 3302221 5370609 7347325 7950700
7865 7950700 2891383 -4571409 -5753238 -530623 1695718 -1890338 -2392002 4562644
7857 4562644 10005418 6795556 1416140 1033301 659177 -5172746 -9000617 -2248236 8783993
7848 8783993 12679022 10402601 9065400 6734729 -1052007 -7616457 -5139326 -1588222
7840 -1588222 -9234354 -21640368 -21986822 -11090803 -6152030 -11918269 -14097938 -4356814
7832 -4356814 7592386 11911927 11423665 10560838 7031954 1286272 910824 8434931 15385343
7823 15385343 14364485 8294148 3900964 4102091 8389605 12466293 8289377 -5694090
7815 -5694090 -16623296 -11406592 3940761 12705301 11595469 10035313 8952168 777684
7807 777684 -10048215 -9260698 1812100 6218248 1761522 6578091 25248620 34654677
7799 34654677 18580709 -5624273 -13278017 -7108519 -5654929 -11334753 -11808488 -4240354
7791 -4240354 2226699 3632903 3756168 2352199 -4530824 -13624462 -15311194 -5285317
7783 -5285317 11459778 25589164 27752342 14195931 -6166121 -17040793 -12794506 -4288440
7775 -4288440 -2630025 -6434299 -9596405 -10354827 -7123804 2317298 11604187 9870881
7767 9870881 1632198 5789381 25586863 38257566 27725203 8716159 1457293 868577
7759 868577 -7749662 -18552284 -15972394 -4198069 270370 -2315392 1034865 8958423
7751 8958423 8839258 3223130 6444863 16168369 15177763 2590306 -3910274 -360119
7743 -360119 -2904290 -14917565 -16443353 748402 13761436 2029187 -20963440 -29192671
7735 -29192671 -20501206 -10775065 -5256136 1718579 6795859 438800 -12834100 -17388913
7727 -17388913 -10910730 -8590083 -19285222 -32235425 -33308638 -22766742 -9911044 732050
7719 732050 9604375 14646568 12744791 6793674 4119775 7503382 12673566 15113271
7711 15113271 14752300 12752681 8159242 521013 -7087137 -10303525 -6721640 4057145
7703 4057145 19215007 29584093 24588311 6045598 -9361040 -9622617 -3430621 -5807403
7695 -5807403 -13466809 -10070454 6077149 18032191 16689172 12491305 13836584 12311356
7687 12311356 761042 -10327551 -9071265 -1823336 -1316856 -6177728 -7845129 -7825705
7679 -7825705 -11263475 -12091894 -2623356 8893561 8640501 -253150 -3851638 -1107658
7671 -1107658 -2063382 -6475367 -5420950 -2413211 -10565314 -27477670 -35158951 -28714697
7663 -28714697 -23291479 -26366019 -24828362 -9406364 7556044 11190405 5143304 879726
7655 879726 -418178 -2330721 -1337363 5951362 12483878 10148221 2629275 -1633969 -2474572
7646 -2474572 -3943813 -4236358 -518110 1954793 -3200732 -11342253 -12470788 -6780075
7638 -6780075 -4155448 -8373709 -11354185 -5892891 2660687 2430556 -9423009 -21862168
7630 -21862168 -22827675 -14137310 -8133523 -9805477 -10754665 -4498299 2629997 4242484
7622 4242484 7195910 19136176 31500692 31639058 25308097 27186457 33081484 25146934
7614 25146934 5120265 -3618218 6452652 12870652 -1713115 -23202234 -30198897 -24632390
7606 -24632390 -20395128 -18091684 -10938898 -3185503 -2857567 -5407875 -2537420 1257002
7598 1257002 -1621885 -4169889 4629797 18450254 21903030 14874812 9405749 6433444
7590 6433444 -3823936 -19429158 -25316913 -17144328 -8514810 -9560512 -13621050 -10912219
7582 -10912219 -2351273 6573087 15001311 23065981 26630200 21503718 8947256 -5168033
7574 -5168033 -13583266 -11835909 -4267175 -2485274 -11228012 -20221877 -18291389 -9753706
7566 -9753706 -5606836 -4240920 4007800 16188626 18046749 7189789 -1908595 -282747
7558 -282747 3825127 2307376 1893041 11633738 26137645 32134060 25941690 15787232
7550 15787232 10363139 11204972 13491243 10300609 -965718 -13961502 -18726635 -12933281
7542 -12933281 -3579004 2700597 5145912 4348961 -685998 -9147211 -18038349 -26128749
7534 -26128749 -32411505 -31649938 -20149686 -5868115 -2210079 -9819167 -15434505 -11957730
7526 -11957730 -7607059 -9438711 -10147952 -1065217 11117584 12487332 1613051 -9806370
7518 -9806370 -13331128 -11283435 -9178317 -9423498 -13048370 -20287629 -27092909 -25950479
7510 -25950479 -13425222 4550943 16859782 17427819 11347158 9123166 13446346 14911463
7502 14911463 5030554 -10115385 -16912797 -13113037 -9526834 -11750072 -11917419 -3902728
7494 -3902728 4458669 3804151 -231917 5104751 19142420 27399583 22054142 11955852
7486 11955852 8543582 10195999 7156330 -2365623 -8784000 -4435060 5790764 11305559
7478 11305559 10008997 9088274 11655721 10671825 765768 -10863734 -13345499 -7483340
7470 -7483340 -2881546 -2513062 -971188 2502642 1267752 -5788012 -9691562 -4723154
7462 -4723154 2744659 4065276 -731701 -6463294 -9462008 -6349906 4987611 17802804
7454 17802804 19342426 8322676 167163 6198902 16692451 15255537 2103747 -9443895
7446 -9443895 -13446918 -14270359 -12661782 -4053180 8579558 13457179 5250519 -7670550
7438 -7670550 -14128696 -11000259 -2075393 6114545 6220219 -3888432 -14866187 -13311411
7430 -13311411 1842952 17018266 20578695 15253448 11152052 12649010 16164128 16387657
7422 16387657 10908543 1606766 -6042239 -7388757 -3565853 164788 790883 -667626
7414 -667626 -2652186 -4310990 -4435825 -3697588 -6234977 -13448572 -18371420 -13690405 -3936930
7405 -3936930 -515877 -4483666 -4732529 4213778 13467803 14120715 10397514 10685178 13394879
7396 13394879 11515179 6170267 5047666 9037491 10408083 5482213 550449 1307454
7388 1307454 2830286 -3306424 -14235209 -15903008 -1278659 17202372 21152818 10690781
7380 10690781 5077873 15340764 27421795 22283279 3717233 -8610596 -8858654 -9573783
7372 -9573783 -16129788 -16398770 -3329643 9594148 7711667 -3115808 -7941533 -5611905
7364 -5611905 -5261532 -7817608 -7397316 -6476746 -12734164 -22120057 -21591036 -10474011 -3793898
7355 -3793898 -9780223 -17334304 -12645632 1896916 12625243 11051966 -804451 -15397846
7347 -15397846 -24164313 -21993645 -12444735 -5004059 -3773757 -2976993 3463860 12840484
7339 12840484 17839940 15535214 8468690 420870 -5245304 -5869405 -1542348 4254862
7331 4254862 7028611 3097827 -8735630 -23000201 -27853609 -17353300 -2455306 -383462
7323 -383462 -12124029 -20703855 -14446819 -1057549 5996728 4044105 -2403950 -10863797
7315 -10863797 -17519113 -14342668 -295822 12371960 13954340 12016551 18192834 27426639
7307 27426639 25355191 12086119 2444318 3459917 7052314 6110454 2815684 -1769345
7299 -1769345 -11506739 -23489366 -26321678 -17197290 -8651120 -10019535 -13049033 -5975485
7291 -5975485 6961529 11675296 4351361 -5923165 -11916256 -15246597 -18671780 -19846104
7283 -19846104 -15309227 -6568134 -276331 -2656529 -12134047 -17861399 -10434513 4859647
7275 4859647 12159090 5242148 -4238234 -4037675 1476328 160147 -8427047 -13796672
7267 -13796672 -11576765 -7535484 -4232893 4437008 20821534 34385167 32011353 13830540
7259 13830540 -6441541 -15824591 -13759766 -9907330 -11955981 -16510827 -13339987 1191057
7251 1191057 17926420 24225140 16578227 1353584 -13188181 -21187538 -19365237 -9937512
7243 -9937512 -2167683 -4223353 -12976928 -17289455 -11673671 -1464150 5547442 6645978
7235 6645978 2701922 -4553577 -11777015 -15767195 -17884786 -22080486 -27597265 -29526356
7227 -29526356 -27899683 -28720532 -32613887 -30464450 -16701950 -587011 4012410 -3578569
7219 -3578569 -11640434 -12654112 -10405083 -10484622 -12329764 -13296515 -13498214 -12555841 -7226447
7210 -7226447 2602766 9679048 7140865 -1600059 -6766549 -5452964 -4783994 -10456295
7202 -10456295 -17977578 -19152396 -13247988 -6488975 -2235799 2679208 11142110 20017652
7194 20017652 23698724 20736289 14617934 9650700 8004218 9294020 10869836 9413397
7186 9413397 4391495 -497302 -1383214 194004 -2045907 -11472354 -22715140 -25809197
7178 -25809197 -16967650 -3347571 5036350 6656677 7909231 11786362 13530869 10537721
7170 10537721 9654008 17371888 27358788 27499700 17873407 11141120 13765893 17591700
7162 17591700 14136194 7192200 4698739 6515651 8225894 10134417 13342273 12205775
7154 12205775 1075465 -13963821 -19824930 -12543160 -970194 5216765 4109910 -1337165
7146 -1337165 -7473819 -10336775 -7755072 -2251874 1797914 3002128 1614559 -3259550
7138 -3259550 -9992843 -12286952 -7866756 -4897092 -10361428 -15900375 -7221992 13910368
7130 13910368 30251460 32381533 27707794 23248701 14255028 -2641521 -17771893 -20512528
7122 -20512528 -14191036 -8396395 -3325954 7022071 20523019 27230500 23008333 13895133
7114 13895133 6965278 4144752 5009323 8568060 10934924 7120846 -2285002 -9805368
7106 -9805368 -8937699 -1828993 2538506 -2117559 -12134611 -17532526 -13899940 -8055395
7098 -8055395 -8269869 -11743501 -8941626 344050 4790117 -1513451 -9199638 -7086000
7090 -7086000 1888892 6430902 3491027 36992 950378 4028676 6324154 7469731
7082 7469731 6330640 1775696 -1905498 2293434 12769074 17089240 6682719 -9841002
7074 -9841002 -14537196 -955268 18634435 28724279 27897664 25765285 26606267 24870522
7066 24870522 17474810 10542842 8441491 4785501 -6707802 -19147550 -21882765 -18490938
7058 -18490938 -21186526 -28505772 -24687132 -4838823 14862862 19706431 15663532 15873802
7050 15873802 19432051 16814155 8866006 6115742 11930105 18448734 18999951 15193432
7042 15193432 11344277 9255032 9100811 10197928 11017147 11716765 14272439 17124879 14565888
7033 14565888 6031521 228033 3692563 10959178 13650062 13561009 17199384 22039160
7025 22039160 19647476 10588697 4970831 7626845 12343816 12272733 7921631 3058649
7017 3058649 -324294 -1071245 1319302 4182642 3376103 -1488943 -6532104 -7807191 -3717290
7008 -3717290 4119042 9711611 7078259 -97160 791065 14683087 29317332 30339512
7000 30339512 19924536 10682595 6678404 2298629 -3931225 -7317994 -7168541 -6955575
6992 -6955575 -5360459 1274431 8836057 9943657 7304955 9421979 14087218 11337687
6984 11337687 3156232 2868694 11485376 13053339 1145758 -7893933 -335163 11475155
6976 11475155 7285168 -9428523 -16149345 -4098828 10461286 9827754 -3064971 -11725743
6968 -11725743 -7389499 3605188 10734112 11093210 8560240 5563775 1377187 -1758141
6960 -1758141 1949373 12568116 20941085 20121398 14449264 10606627 6685822 -292823
6952 -292823 -3080191 6220799 19810246 22457048 14042218 8422119 10595301 11650480
6944 11650480 7748646 6814392 12409909 17237469 17509762 17988709 18001265 9669711 -3692221
6935 -3692221 -5909346 6342722 14486737 6165283 -5389600 -4138755 3451813 3056830
6927 3056830 -1694838 2487569 14220313 20271831 16366849 8885773 1476386 -5419528
6919 -5419528 -7639837 -3698887 -1747911 -7274203 -11979724 -8508406 -6092519 -14839260
6911 -14839260 -24486807 -18858069 -3536149 2907922 -360254 1867548 11268358 12899605
6903 12899605 2691787 -5975258 -6906755 -9306177 -15615587 -13751261 -186393 10194234
6895 10194234 8234973 5182311 10329132 12163136 -1458268 -18549774 -17763172 60865
6887 60865 13232651 8738135 -5160867 -15249134 -18509523 -18033755 -14191537 -5994137
6879 -5994137 3032205 5876731 -74888 -8277594 -9191195 -1791505 5268836 6464999
6871 6464999 7273207 13362363 18649306 14395114 5434526 4026627 9056617 5927556
6863 5927556 -10749149 -28067282 -32823582 -26722124 -18678412 -13009507 -10850146 -13159791
6855 -13159791 -16287275 -13217636 -4084800 3186924 5970230 9755615 14093822 9175841
6847 9175841 -6456627 -18106662 -14805326 -5524304 -4505576 -10860144 -14984189 -15638257
6839 -15638257 -16413366 -12827892 1071095 17370356 21366188 13080804 7557347 12778843
6831 12778843 20207591 20058201 14611253 11563897 12624626 14151117 13782388 11795773
6823 11795773 8695666 4386005 -1339986 -7764982 -11611911 -8514670 1020252 9466334
6815 9466334 10207580 6055665 5632179 12349318 21149256 25670443 24831150 22017828 20334373
6806 20334373 19266710 15630606 8612973 2770365 2551002 4704392 2042061 -4662929
6798 -4662929 -6121431 1233043 8368869 6164423 -2267504 -8098067 -9197238 -8477384
6790 -8477384 -5367116 1990178 9142457 8705044 400504 -8802412 -13306064 -12241312
6782 -12241312 -6698181 361010 3693629 1360886 -1193157 1990276 9056998 14240888
6774 14240888 16554310 18316129 18761018 16390063 14281037 15188444 14573444 7125610 -2664365
6765 -2664365 -5882371 -2785775 -854751 -1205694 1411372 5592300 3289381 -5008487
6757 -5008487 -8073829 -1643827 3676556 -926142 -8557257 -8286087 -2276702 -816764
6749 -816764 -5735692 -9528825 -8419953 -6231131 -5451696 -3366384 1053356 3536195 1078682
6740 1078682 -2823168 -3283149 -1248648 -1577236 -5111502 -6690988 -2258159 4666852 6363032
6731 6363032 289571 -7849486 -11615740 -11551930 -12162093 -12863617 -7331305 6028753 17238287
6722 17238287 13732027 -3934513 -20179050 -20984292 -9485943 -881783 -3256835 -9272682
6714 -9272682 -8223055 -113338 6823350 8059192 6063217 4467290 5469925 11167680
6706 11167680 20531016 26358504 22642244 13836638 8632164 6233199 -203163 -7177292
6698 -7177292 -2629691 12317711 19422812 9726903 -993462 4172722 17180412 19137985
6690 19137985 10954965 9895506 19416745 23190824 11605834 -3708129 -8166542 -3297712
6682 -3297712 -18723 -3199370 -10391585 -18049131 -21920799 -17202905 -4977437 5262585
6674 5262585 4724508 -5292368 -15931795 -20032296 -17096176 -12161769 -11224558 -15167234
6666 -15167234 -18112424 -14881193 -8808135 -7143961 -9494936 -7160732 4963205 21133502
6658 21133502 30856099 28428034 16365880 3392278 -1601329 2107150 5867202 2856575
6650 2856575 -2473162 -1827176 3996364 7850432 8794768 11934862 17461543 20602014 21623501
6641 21623501 24135297 23546474 11133352 -7497318 -12482872 4853247 28324220 36500311
6633 36500311 26277961 9408648 -4300530 -10596611 -6290586 6651878 16587312 12249145
6625 12249145 -3997760 -19750181 -26591553 -24168516 -14373672 -144152 11384347 12783252
6617 12783252 4815260 -3787172 -5620610 -267185 8742237 18369874 26258839 29028824
6609 29028824 23058207 8735783 -6250819 -11821804 -7078379 -3241314 -9181226 -17236257
6601 -17236257 -12142414 6715324 21801207 18394495 877689 -14642341 -16899091 -6604694
6593 -6604694 5680532 6909947 -5943895 -19591738 -18499161 -5134495 4007583 2315701
6585 2315701 -664233 1079379 309266 -6864763 -10376263 -2661027 7073485 6642998 -1337128
6576 -1337128 -6466442 -6036999 -3305934 257204 1392981 -5614471 -16259222 -15395294
6568 -15395294 -1294437 5012317 -9295926 -23767807 -12433479 15492770 28628908
6561 28628908 19841807 11547310 16749745 23757763 23481506 24175393 29752276 27782322
6553 27782322 11919479 -3802879 -7004642 -6018827 -12006557 -17198906 -8183898 10186692
6545 10186692 21897422 23770139 25589619 30220505 29684487 20876705 11508299 7867523
6537 7867523 6972298 4160234 430710 -1735304 -3792185 -7406835 -8841312 -2763431
6529 -2763431 8467976 14710904 10671377 4722340 8265043 17674642 17074620 2289230
6521 2289230 -9884159 -5243068 6058010 5744231 -2699593 209251 16602786 25221514
6513 25221514 13505990 -3856045 -8185329 -2540282 -1696450 -8788057 -15952676 -19891323
6505 -19891323 -22982247 -23972781 -20041453 -15308794 -16634773 -22434558 -24173519 -17550823
6497 -17550823 -5511570 7148618 15610554 15067469 6420573 -1039891 31689 4931853
6489 4931853 4314942 -1878500 -6288301 -6616449 -6191406 -3753124 6016126 20320730 27100218
6480 27100218 20227235 7988018 1668523 1971500 2105518 -488722 -1966937 292239
6472 292239 3715911 4934250 4375437 4464303 4909909 2353774 -4497699 -11068430 -10806395
6463 -10806395 -3394412 3160538 546356 -10480172 -20285471 -19911548 -9496695 3108911
6455 3108911 11229157 14839134 15886407 11317446 -2924488 -20505412 -26133267 -14505743
6447 -14505743 -758417 -2514329 -16183707 -22764188 -14861324 -4139314 -756571 -282341
6439 -282341 3252023 4889682 -1273077 -9994750 -13291232 -13114540 -15118022 -16437752 -11079088
6430 -11079088 -2565397 560842 -1274623 -753888 2340609 1333220 -3215212 -1780859
6422 -1780859 8959489 19652803 21257336 16167855 11702763 9646154 7868692 7017101
6414 7017101 9323792 13188879 13780095 8263448 -2048438 -13366366 -21305076 -22881300
6406 -22881300 -18996352 -14104926 -11727176 -10739721 -7190669 537897 9114829 12839974
6398 12839974 8811439 -333074 -8834276 -12794670 -12779334 -12695731 -16911211 -26256459 -34420843
6389 -34420843 -31077306 -13731946 4929646 8394869 -4076906 -16080541 -14386051 -3389214
6381 -3389214 4272135 3874490 -572756 -5136789 -7767444 -5506834 1969790 8012245
6373 8012245 5314638 -4122480 -10806818 -8822026 -1008427 5210481 3568957 -6523277
6365 -6523277 -17078669 -16771701 -3988586 9011141 10017297 628296 -9374416 -15525187
6357 -15525187 -18509062 -16072910 -6001309 5592240 9974404 8681299 10134695 14230815
6349 14230815 12073706 2049596 -6132752 -6952458 -7112123 -12454550 -17002709 -12802981
6341 -12802981 -3262518 1858131 369610 -1193984 1697768 5975629 5910016 -133728
6333 -133728 -7969995 -11117660 -7000122 -189165 2285615 -1147501 -5852541 -7788801
6325 -7788801 -7668810 -8139110 -10124891 -12516710 -13238273 -11182027 -8864075 -10668992 -15945578
6316 -15945578 -18130021 -14739567 -12264857 -14613509 -13892930 -3079513 8798379 8458388
6308 8458388 763977 1593748 9815938 7635757 -7057927 -11628378 6583085 26945504
6300 26945504 24295098 5224205 -5293545 -2812367 -5205364 -19289504 -29235396 -22144262
6292 -22144262 -6413663 2832149 3078068 1296051 1468091 3075295 5557897 8016065
6284 8016065 8715469 8486227 10089475 12049412 9089387 1479709 -2673520 1145775 5952236
6275 5952236 2452682 -7770904 -14121487 -10037859 727272 9807969 11992322 7640446
6267 7640446 1080840 -2514495 -888672 3432185 5600589 3148567 -1869458 -5251768
6259 -5251768 -5029504 -3422558 -3980257 -6935218 -9022155 -8586543 -8380294 -10876799 -12881378
6250 -12881378 -8724304 1573661 11178558 14177042 11139789 5952041 545495 -4983572
6242 -4983572 -9612160 -11833975 -11936861 -11435608 -10687808 -9166333 -7793421 -8478424 -10613392
6233 -10613392 -10431678 -5787736 107605 2643871 2805405 6197604 13816848 18042667
6225 18042667 11700503 -1436134 -10138649 -8933559 -2825317 1457986 3500004 6340142
6217 6340142 10277721 13134770 13847264 12461044 8556020 2536409 -3315897 -7707333
6209 -7707333 -12306262 -17949675 -20908399 -16963191 -8544469 -3586116 -6000270 -10186810
6201 -10186810 -7359721 3661120 14494420 17036304 13151589 11079628 12615935 9904348
6193 9904348 -1396227 -12010089 -10292883 3322 4029924 -2535998 -8682200 -8000977
6185 -8000977 -9668720 -21038141 -31339295 -25784610 -7987427 6289741 12789899 20021346
6177 20021346 28480975 26299967 9584699 -8499712 -16228069 -17861016 -20922314 -21006290
6169 -21006290 -11296135 1867584 7177645 6901130 12406218 23050753 24945402 13198394
6161 13198394 954254 -373555 1996950 -5021736 -18923373 -25022526 -18208881 -9675073
6153 -9675073 -10704454 -18842331 -23753167 -20557894 -13010151 -7196298 -6194698 -9339575
6145 -9339575 -13917449 -17808130 -20782156 -22182811 -18963803 -9758874 276142 4434340
6137 4434340 4373745 7780222 14329539 13114855 -337073 -13127669 -10292958 4785056
6129 4785056 15701484 14945656 9293663 5538631 3277073 2384106 5348582 9370073
6121 9370073 7295438 57699 -2505132 2821265 7654890 7494854 9367380 16245640
6113 16245640 17032988 3892758 -11643898 -14510759 -9423111 -11645278 -20235464 -19604514
6105 -19604514 -6950644 1067605 -6374545 -18522389 -20209945 -12170789 -5374554 -4461547
6097 -4461547 -5853088 -6060752 -4068645 154680 3721771 1805064 -4842338 -8683364
6089 -8683364 -6456721 -5102558 -10257950 -15003233 -8953438 4987725 12604345 6904869
6081 6904869 -3439742 -6154212 -8085 5811045 4300003 -187950 3655980 19592524
6073 19592524 35297510 33703928 14665941 -1442884 2539795 18789475 24951844 13120311
6065 13120311 -2193171 -5351145 2120098 8830831 9801518 7975608 5536555 2434753
6057 2434753 954099 3647730 7148536 5026571 -2537570 -8161869 -7518831 -4069214
$$ [...]
##END NTUPLES=NMR SPECTRUM
##END=
