##TITLE=31Pdec_SR48_K
 CDCl3, 124 sc
 9.04.2021
##JCAMPDX= 6.0         $$ Bruker NMR JCAMP-DX V2.0
##DATA TYPE= NMR SPECTRUM
##DATA CLASS= NTUPLES
##ORIGIN= UXNMR, Bruker Analytische Messtechnik GmbH
##OWNER= root
$$ XWIN-NMR		Version 3.5
$$ Fri Apr  9 12:10:01 2021 Russian Standard Time (UT+4h)  she@DPX200
##.OBSERVE FREQUENCY= 81.013821
##.OBSERVE NUCLEUS= ^31P
##.ACQUISITION MODE= SIMULTANEOUS
##.ACQUISITION SCHEME= undefined
##.AVERAGES= 124
##.DIGITISER RES= 16
##SPECTROMETER/DATA SYSTEM= spect
##.PULSE SEQUENCE= zgpg30
##.SOLVENT NAME= CDCl3
##.SHIFT REFERENCE= (INTERNAL, CDCl3, 0, 248.564)
##AUDIT TRAIL= $$ (NUMBER, WHEN, WHO, WHERE, WHAT)
$$ ##TITLE= Audit trail, XWIN-NMR		Version 3.5
$$ ##JCAMPDX= 5.01
$$ ##ORIGIN= Bruker BioSpin GmbH
$$ ##OWNER= she
$$ F:/spectra/data/she/nmr/P31/1/pdata/1/auditp.txt
$$ ##AUDIT TRAIL=  $$ (NUMBER, WHEN, WHO, WHERE, WHAT)
(   1,<2021-04-09 12:08:25.78 +0400>,<she>,<DPX200>,
      <continue with go, POWCHK disabled, PULCHK disabled
       configuration hash MD5:
       00 E9 B6 7A A2 85 ED C7 34 08 36 98 17 FE 4E 26
       data hash MD5: 32K
       6D 95 27 51 20 D6 5D 95 74 21 9F 33 55 CE D0 C3>)
(   2,<2021-04-09 12:08:51.40 +0400>,<she>,<DPX200>,
      <Start of raw data processing
       efp BC_mod = 2 LB = 1 FT_mod = 6 PKNL = 1 PHC0 = -5313.03 PHC1 = 618.8021 SI = 64K 
       data hash MD5: 64K
       5C E9 C5 DB 87 D6 F0 62 AD AA 26 03 CF B0 57 56>)
(   3,<2021-04-09 12:09:28.89 +0400>,<she>,<DPX200>,
      <pk PHC0 = -22.23269 PHC1 = 29.2 
       data hash MD5: 64K
       2A F1 AC 27 9A 21 40 8D 65 91 04 C2 6F F7 A0 6B>)
(   4,<2021-04-09 12:09:34.34 +0400>,<she>,<DPX200>,
      <abs ABSG = 5 
       data hash MD5: 64K
       27 E7 B9 7F 96 AD 4F 05 22 A3 92 41 1B 83 3E 84>)
$$ ##END=
$$ 
$$ hash MD5
$$ 7B 03 15 9E 95 46 7D E7 01 34 3D F6 C9 68 3A 1B
##$RELAX= 
##$RELAX= 
##$RELAX= 
##$RELAX= 
##$RELAX= 
##$RELAX= 
##$RELAX= 
##$RELAX= 
$$ Bruker specific parameters
$$ --------------------------
##$DU= <F:/spectra>
##$EXPNO= 1
##$NAME= <P31>
##$PROCNO= 1
##$TYPE= <nmr>
##$USER= <she>
##$AMP= (0..31)
100 100 100 100 100 100 100 100 100 100 100 100 100 100 100 100 100 100 
100 100 100 100 100 100 100 100 100 100 100 100 100 100 
##$AQSEQ= 0
##$AQ_mod= 1
##$AUNM= <au_zg>
##$AUTOPOS= <>
##$BF1= 81.014009
##$BF2= 200.13
##$BF3= 200.13
##$BF4= 200.13
##$BF5= 200.13
##$BF6= 200.13
##$BF7= 200.13
##$BF8= 200.13
##$BYTORDA= 1
##$CFDGTYP= 0
##$CFRGTYP= 5
##$CHEMSTR= <none>
##$CNST= (0..31)
1 1 145 1 1 1 1 1 1 1 1 1 1 1 1 1 1 1 1 1 1 1 1 1 1 1 1 1 1 1 1 1 
##$CPDPRG= <waltz16>
##$CPDPRG1= <>
##$CPDPRG2= <waltz16>
##$CPDPRG3= <>
##$CPDPRG4= <mlev>
##$CPDPRG5= <mlev>
##$CPDPRG6= <mlev>
##$CPDPRG7= <mlev>
##$CPDPRG8= <mlev>
##$CPDPRGB= <>
##$CPDPRGT= <>
##$D= (0..31)
0 1 0 0 0 0 0 0 0 0 0 0.03 2e-05 3e-06 0 0 0 0 0 0 0 0 0 0 0 0 0 0 0 0 
0 0 
##$DATE= 1617955529
##$DBL= (0..7)
120 120 120 11 120 120 24 19 
##$DBP= (0..7)
150 150 150 150 150 150 150 150 
##$DBP07= 0
##$DBPNAM0= <>
##$DBPNAM1= <>
##$DBPNAM2= <>
$$ [...]
##$SUBNAM3= <"">
##$SUBNAM4= <"">
##$SUBNAM5= <"">
##$SUBNAM6= <"">
##$SUBNAM7= <"">
##$SUBNAM8= <"">
##$SUBNAM9= <"">
##$SW= 501.771253377433
##$SWIBOX= (0..15)
0 1 3 0 0 0 0 0 0 0 0 0 0 0 0 0 
##$SW_h= 40650.406504065
##$TD= 32768
##$TD0= 1
##$TE= 0
##$TE2= 300
##$TE3= 300
##$TEG= 300
##$TL= (0..7)
0 120 53 12 22 120 120 120 
##$TP= (0..7)
150 150 150 150 150 150 150 150 
##$TP07= 0
##$TPNAME0= <>
##$TPNAME1= <>
##$TPNAME2= <>
##$TPNAME3= <>
##$TPNAME4= <>
##$TPNAME5= <>
##$TPNAME6= <>
##$TPNAME7= <>
##$TPOAL= (0..7)
0.5 0.5 0.5 0.5 0.5 0.5 0.5 0.5 
##$TPOFFS= (0..7)
0 0 0 0 0 0 0 0 
##$TUNHIN= 0
##$TUNHOUT= 0
##$TUNXOUT= 0
##$USERA1= <user>
##$USERA2= <user>
##$USERA3= <user>
##$USERA4= <user>
##$USERA5= <user>
##$V9= 5
##$VALIST= <valist>
##$VCLIST= <CCCCCCCCCCCCCCC>
##$VD= 0
##$VDLIST= <DDDDDDDDDDDDDDD>
##$VPLIST= <PPPPPPPPPPPPPPP>
##$VTLIST= <TTTTTTTTTTTTTTT>
##$WBST= 1024
##$WBSW= 4
##$XGAIN= (0..3)
0 0 0 0 
##$XL= 0
##$YL= 0
##$YMAX_a= 33465
##$YMIN_a= -13570
##$ZGOPTNS= <>
##$ZL1= 120
##$ZL2= 120
##$ZL3= 120
##$ZL4= 120
##$ABSF1= 248.5645
##$ABSF2= -253.2056
##$ABSG= 5
##$ABSL= 3
##$ALPHA= 0
##$AQORDER= 0
##$ASSFAC= 0
##$ASSFACI= 0
##$ASSFACX= 0
##$ASSWID= 0
##$AUNMP= <proc_1d>
##$AZFE= 0.1
##$AZFW= 0.5
##$BCFW= 0
##$BC_mod= 2
##$BYTORDP= 0
##$COROFFS= 0
##$CY= -3
##$DATMOD= 1
##$DC= 0
##$DFILT= <>
##$DTYPP= 0
##$F1P= 0
##$F2P= 0
##$FCOR= 1
##$FTSIZE= 65536
##$FT_mod= 6
##$GAMMA= 0
##$GB= 0
##$INTBC= 1
##$INTSCL= 5.30512e-09
##$ISEN= 30
##$LB= 1
##$LEV0= 0
##$LPBIN= 0
##$MAXI= 10000
##$MC2= 0
##$MEAN= 0
##$ME_mod= 0
##$MI= 50
##$NCOEF= 0
##$NC_proc= -5
##$NLEV= 6
##$NOISF1= 182.463
##$NOISF2= 159.3651
##$NSP= 0
##$NTH_PI= 0
##$NZP= 0
##$OFFSET= 248.5645
##$PC= 4
##$PHC0= -5335.263
##$PHC1= 648.0021
##$PH_mod= 1
##$PKNL= yes
##$PPARMOD= 0
##$PSCAL= 0
##$PSIGN= 0
##$REVERSE= no
##$SF= 81.014009
##$SI= 65536
##$SIGF1= 159.3651
##$SIGF2= -187.1042
##$SINO= 113.3802
##$SIOLD= 16384
##$SREGLST= <1H.CDCl3>
##$SSB= 0
##$STSI= 65536
##$STSR= 0
##$SW_p= 40650.406504065
##$SYMM= 0
##$S_DEV= 0
##$TDeff= 32768
##$TDoff= 0
##$TI= <>
##$TILT= no
##$TM1= 0
##$TM2= 0
##$TOPLEV= 0
##$USERP1= <user>
##$USERP2= <user>
##$USERP3= <user>
##$USERP4= <user>
##$USERP5= <user>
##$WDW= 1
##$XDIM= 65536
##$YMAX_p= 358366921
##$YMIN_p= -27184381
$$ End of Bruker specific parameters
$$ ---------------------------------
##NTUPLES= NMR SPECTRUM
##VAR_NAME=  FREQUENCY,     SPECTRUM/REAL,   SPECTRUM/IMAG
##SYMBOL=    X,             R,               I
##VAR_TYPE=  INDEPENDENT,   DEPENDENT,       DEPENDENT
##VAR_FORM=  AFFN,          ASDF,            ASDF
##VAR_DIM=   65536,         65536,           65536
##UNITS=     HZ,            ARBITRARY UNITS, ARBITRARY UNITS
##FACTOR=    0.620285442955139, 1,           1
##FIRST=     20137.2065510759, 0,            0
##LAST=      -20513.1999529892, 0,           0
##MIN=       -20513.1999529892, -27184381,   0
##MAX=       20137.2065510759, 358366921,    0
$$ Real data points
##PAGE= N=1
##DATA TABLE= (X++(R..R)), XYDATA
$$ [...]
13109A364098j65549j914522l082824k250920m2507J569074J737708J570165K125291
13100I10014K551150J321810j103452k413087j558573j84600n2893n08002J3634
13091a023999J136459J177114k5844r80192r62626n62528o23R29805J358238K77789
13081A323593r00819L02587K934581K888877p92167l489960j604722J634174R03578
13072C199722k863728l747033R1016L601530K347108j389968k519965k98804J630214
13063E0092J044385k25523K19864J652768J507316o34516k170793j041272J204334
13054A606655J350507r90525k748849j665848P04290J411644j8564j677235k072855
13045d100780j177489M13973J691419J426126j42627p54790Q12548K234636P26230
$$ y = [1364098, 1198549, -715973, -3798797, -6049717, -6092224, -4523150, -2785442, -1215277, 910014, 3461164, 4782974, 3679522, 1266435, -292138, -476738, -529631, -1037633, -1023999, 112460, 1289574, 1263730, 283538, -679088, -1241616, -1242239, -312434, 1045804, 1323593, 422774, 725361, 3659942, 6548819, 5756652, 2266692, 661970, 2296144, 3199722, 335994, -3411039, -3320023, 281507, 2628615, 1238647, -1281318, -1580122, 50092, 1094477, 868954, 1088818, 2741586, 4248902, 3614386, 1443593, 402321, 1606655, 2957162, 1966637, -782212, -2448060, -1743770, -332126, -350690, -2027925, -4100780, -5278269, -4864296, -3172877, -1746751, -1889378, -2644168, -1831620, 403016, 1129246]
13036A129246k244700k569018L31689K503829J361421r02241j336085m98596m70487
13027b694942j169260j283913r87707j025510n85369J157881K573116J600591
13019b415113n65962r45978N09323J058674J44196M38328K731956L508582J65574
13010D629580m179316m484194p60900K353751K384719J601561K211727K557679
13002F314607K28741l376906m407642j691399J909993L370068K757419J891427
12994F996308J202868n39319l533153n383481l403084J668508N535872M801837
12986G346356P56751k448117k729101j481406m87864J63315N81744J2103j384585
12977C29196j789156m08559R87272R64643P80327J602420J613622r55162l705816
$$ y = [1129246, -1115454, -3684472, -3352783, -848954, 512467, -389774, -1725859, -2224455, -2694942, -3864202, -5148115, -6135822, -7161332, -7746701, -6588820, -4015704, -2415113, -2981075, -3927053, -3417730, -2359056, -2214860, -1776532, 955424, 4464006, 4629580, 450264, -4033930, -4794830, -2441079, -56360, 1545201, 3756928, 6314607, 6543348, 3166442, -1241200, -2932599, -1022606, 2347462, 5104881, 6996308, 8199176, 7659857, 4126704, -1256777, -4659861, -2991353, 2544519, 7346356, 8103107, 5654990, 2925889, 1444483, 956619, 1119934, 1701678, 1713781, 329196, -1459960, -1868519, -881247, 83396, 863723, 2466143, 4079765, 3124603, -581213]
12968e81213k896298N96993K303348Q73778m68444M50300J893809J927276J008559
12959E108108l90862k849364n105337m032492L90623L704182K888876K89053o86289
12950f83502k22597J40134O82213J343732J22993k770560k940194J694692O011076
12941C377987M430029n76535k550982j019095p12010k440310k143294R53748K474885
12932A794423N88891r07725N56342K072015O58162j856666k376516j060162M30086
12923a01150J694608K169882M35967k574342l132725r8899K628702J822831k98738
12914B546136k03686J265646J128939l70357p31709J78255L79617l89891o15869
12905C187081j57365m00541j607670k542628k304860o94372K172781M705922L963193
$$ y = [-581213, -3477511, -2880518, -577170, 296608, -171836, 278464, 2172273, 4099549, 5108108, 4717246, 1867882, -3237455, -7269947, -6879324, -3175142, -286266, 2787, -683502, -906099, -765965, -83752, 1259980, 1382973, -1387587, -4327781, -2633089, 3377987, 7808016, 7231481, 4680499, 3661404, 2949394, 509084, -1634210, -680462, 1794423, 2383314, 1475589, 2031931, 4103946, 4762108, 2905442, 528926, -531236, -101150, 1593458, 3763340, 4199307, 1624965, -1507760, -1606659, 1022043, 2844874, 2546136, 2342450, 3608096, 4737035, 4366678, 3634969, 3813224, 4192841, 3802950, 3187081, 3029716, 2629175, 1021505, -1521123, -3825983, -4520355, -2347574, 2358348, 6321541]
12896F321541m67915m268148l194466J030361K987085R67356j518560j502005
12888C55249p0356O49918P23866J154075J786085J962950J622921O98498j035736
12879G847470k679941k461324l25479J278520M75428j464987k037827r25312J43959
12870a49493L23175N37038J323702J567980L28516j270770j378530j06980P00690
12861A875328L87618L62802J386764J862174L72799j623404j818398o79212m00979
12852A725492q86121k080J981572J797939j637300m665596l708072j81321J935366
12843c640121J579040R09479J336170J980150J713195N96003o33548j165447o66570
12834B008351j28114r88475k430532j557358J986313L992216J240969l022765
$$ y = [6321541, 5853626, 1585478, -1608988, -578627, 2408458, 3375814, 1857254, 355249, 284893, 934811, 1658677, 2812752, 4598837, 6561787, 8184708, 8883206, 7847470, 5167529, 2706205, 2380726, 3659246, 4134674, 2669687, 631860, -293452, -149493, 173682, 710720, 2034422, 3602402, 3930918, 2660148, 1281618, 1174638, 1875328, 2262946, 2625748, 4012512, 5874686, 6247485, 4624081, 2805683, 2126471, 1725492, 839371, 837291, 2818863, 4616802, 2979502, -1686094, -5394166, -5575487, -3640121, -2061081, -1151602, 184568, 2164718, 3877913, 4473916, 3840368, 2674921, 2008351, 1880237, 891762, -1538770, -3096128, -1109815, 2882401, 4123370, 1100605]
12826A100605l201239L45400J969923l26245k028857J19482K642925J179899k136403
12817c34510k017121J388282K604835o23583l921882k908236Q50263L050987K733723
12808H22758J851680Q66587j224775l179014k016073J996391M512530K879921
12800F510005l47725j721782j730256k432732k940887j232709J206161J110946
12792a578979q03327n93140K055197K735165k99980k538890p7809L887324L615748
12783F401309o84201l512673k187600J02145k75949k491329l171925j028486K036698
12774d812011L511627K785281J140318j80286j225411k208468k030659L51782
12766b667827L304286L589321P13314k090409k284475j077355n84627m47206N00371
$$ y = [1100605, -2100634, -1755234, 214689, -111556, -2140413, -2020931, 621994, 1801893, -334510, -2351631, -963349, 1641486, 1017903, -2903979, -5812215, -4961952, -1910965, 822758, 2674438, 3541025, 2316250, -862764, -2878837, -882446, 3630084, 6510005, 6162280, 4440498, 2710242, 277510, -2663377, -3896086, -2689925, -1578979, -2382306, -2975446, -920249, 1814916, 1514936, -1023954, -1101763, 2785561, 6401309, 5717108, 2204435, 16835, 118980, -156969, -2648298, -5820223, -6848709, -4812011, -1300384, 1484897, 2625215, 2444929, 1219518, -988950, -3019609, -2667827, 636459, 4225780, 4939094, 2848685, 564210, -513145, -1097772, -1544978, -1044607]
12757a044607J355931P22113l59714R2191J561827J804421L40799j335351k381428
12748G56182k928732k405549k24204K171572K593087J360478P48092J218767R01443
12739D191136q58233k145770j549128k59473O8234k95185j85430M07899O07387
12730a8563J36916m48842n88321k40915P1889l28234j335130j701467m26239J609887
12720c269019K357299J081787o99744j050130K35374J664115J885271J024347
12712C229300K9440q67799k073610k906815j655887J379458K751343K63584k959449
12703b810435k329401J133231K069661p61045k551863m65234J926553J208718
12695b579815n9281J573951L951746L172487N75120R3689J077118j62816l104326
$$ y = [-1044607, 311324, 1033437, 673723, 765914, 2327741, 4132162, 4472961, 3137610, 756182, -2172550, -4578099, -4802303, -2630731, -37644, 1322834, 2070926, 3289693, 4191136, 3332903, 1187133, -361995, -621468, -553234, -848419, -1033849, -625950, -18563, 118353, -330489, -918810, -1159725, -1087836, -1416070, -2751200, -4452667, -4878906, -3269019, -911720, 170067, -529677, -1579807, -1344433, 319682, 2204953, 3229300, 3258740, 2390941, 317331, -2589484, -4245371, -2865913, -114570, 149014, -2810435, -5139836, -4006605, -1936944, -2697989, -5249852, -5715086, -3788533, -2579815, -2639096, -1065145, 2886601, 6059088, 6634208, 6727897, 7805015, 7642199, 4537873]
12686D537873l481124n56995J808376J536890N13396R214r71889k058130j143844
12677A93767J232155J680275o10022k451265j892208p13208l77363L04295J776298
12668h57276J991019P9815j678335j474918m15539K90611J322847K689315K425707
12659D373246j16312k498002k597653j238491Q8692J364195K359213J675570p32355
12650B678103k571880k356985j221261l80625O20869J909737K221964J169937
12642B069859J12159k34370n46480p17043J30245J069955K29999j438630j132654
12633d56960P06049P40273j267274j895263m02633O1833j008880o7999L157890
12624d32964L729066J10076k264388l07468R56942k460888n499384k317752L288103
$$ y = [4537873, 1056749, 499754, 2308130, 3845020, 4358416, 4367630, 3395741, 1337611, 193767, 1425922, 3106197, 2496175, 44910, -1847298, -2560506, -2937869, -2633574, -857276, 1133743, 1213558, -464777, -1939695, -2355234, -2064623, -741776, 1947539, 4373246, 4256934, 1758932, -838721, -2077212, -1988520, -624325, 1734888, 3410458, 2678103, 106223, -2250762, -3472023, -3852648, -3231779, -1322042, 899922, 2069859, 2182018, 1947648, 1401168, 684125, 814370, 1884325, 2114324, 675694, -456960, 249089, 989362, -277912, -2173175, -2575808, -2513975, -3522855, -3590854, -432964, 3296102, 3406178, 1141790, 834322, 1791264, -669624, -6169008, -8486760, -5198657]
12615e198657L951053O57386j29519K041280K041468q28254k105592p39808k20168
12606e30811j205689o48545J431768J539867l73405n31548J378125J368821j339740
12597A088843k664432r04616P62327N61028N78319J267300p1674l171428l525802
12588f080135O6481K703744J150681j307670j066156K29824k8771o23109J13199
12579d841912O86370J8630K85705K439872L262131Q16213j478928m54281J339996
12570B073796L60467j702047j391399L62514P13704L26023J060596J229552j282053
12561A751153l812771k662252K74526O70333m99995R50331L985200L277572j468609
12552B465488m235430j900787J618529K209759Q65817r598m80912p88718L50271
$$ y = [-5198657, -1247604, -590218, -719737, 1321543, 3363011, 2534757, 429165, -310643, -530811, -1736500, -2385045, -953277, 586590, 213185, -318363, 1059762, 2428583, 1088843, -1575589, -2480205, -1717878, -1156850, -578531, 688769, 617095, -2554333, -6080135, -6013654, -3309910, -2159229, -3466899, -4533055, -4303231, -4332002, -4955111, -4841912, -4155542, -4136912, -3851207, -1411335, 1850796, 2667009, 1188081, 733800, 2073796, 2434263, 732216, -659183, -296669, 417035, 743058, 1803654, 3033206, 1751153, -2061618, -4723870, -4449344, -3779011, -4279006, -3328675, 656525, 3934097, 2465488, -1769942, -3670729, -2052200, 157559, 1023376, 1013778, 532866, -255852, 94419]
12543I4419K577632K899285K70710k345874k641820k074675k143558j366018J255857
12534c474042L188870J958878r08346k454937k389713j938281r87554Q93894K674708
12525c436523L466432L756021L190921J85224m041531m853254r12017K373959
12517b70768L77813l456306l088266O35067K272667J098099R06961J851593L51755
12508F78615k736215k009925K778452M824621J032629k818725j766301N89171
12500E72322n35527k392768l00564L083674K080964j659584j536457K708662M361478
12491F382200O69661l252098l053072r17513j58287J07334J494287K221434L15687
12482C809633k244393k195085K32064K038025J495198n70522k184528j616477
$$ y = [94419, 2672051, 5571336, 5842046, 3496172, 854352, -1220323, -3363881, -4729899, -3474042, -285172, 1673706, 765360, -1689577, -4079290, -6017571, -7005125, -6111231, -3436523, 29909, 3785930, 6976851, 7162075, 3120544, -1732710, -2644727, -270768, 107045, -3349261, -6437527, -5802460, -3529793, -2431694, -1524733, 326860, 678615, -2057600, -4067525, -1289073, 3535548, 4568177, 1749452, -16849, 572322, 36795, -2355973, -2656537, 427137, 2508101, 848517, -687940, 2020722, 6382200, 7051861, 3799763, 746691, -170822, -329109, -221775, 1272512, 3493946, 3809633, 1565240, -629845, -397781, 1640244, 3135442, 2564920, 380392, -1236085]
12474a236085J016762K806993R81478k615768l065787N07028L055704R26003k649034
12465b72706k517039R33121L029620J544220j502387l489504l400201j359769
12457g034645J156373J625688l86192j591530Q03918M623580N540683L105423
12449G843298M89474p99407k059321l592605l723242k061064l43094N63152J433162
12440b249647K059248J094850q46335j234351L01544J152760P1081r71278o18303
12431a240431l49314r67986m25501K131283L396151N94382l323049l326394L14543
12422c196316K598426J189780j051621j345287o98114q76132j075695J34862J871869
12413b448228K273350J322949L60657o2857r7507M48356J237778P40479j408948
$$ y = [-1236085, -219323, 2587670, 3569148, 953380, -2112407, -1605379, 1450325, 2376328, -272706, -2789745, -1856624, 1172996, 2717216, 1214829, -2274675, -5674876, -7034645, -5878272, -4252584, -4638776, -6230306, -5426388, -802808, 4737875, 7843298, 8332772, 7533365, 5474044, 1881439, -1841803, -3902867, -4245961, -3682809, -2249647, -190399, 904451, 58116, -1176235, -874691, 278069, 349150, -622128, -1240431, -1589745, -2557731, -2983232, -851949, 2544202, 3138584, -184465, -3510859, -3196316, -597890, 591890, -459731, -1805018, -2503132, -3379264, -4454959, -4320097, -2448228, -174878, 1148071, 1508728, 1445871, 1348364, 1796720, 3034498, 3774977, 2366029]
12404B366029k624650p13267J922368R70999k995294m502434j042157L167295
12396c451111L558894J507684Q45227J364345L09519j834323k116765o31175j15130
12387e62835m01813J316181M220215L622262j287957m944529l407037R0155R77739
12378c77619R9729M14062J077808o6360j256866L42586K684925J462465k431983
12369A948747l677907n68290K849756L047579Q69680j431170k795281k334141
12361b091027L24605K945343K637407L92927j59748J161905P56637k204524l816342
12352e2817j819818P41703P14374n75990p89562o65109j309647r57226J732647
12343b981445M041826K901015m2718j091227l15774n04040j751039j627317j03407
$$ y = [2366029, -258621, -971888, 950480, 1921479, -1073815, -5576249, -6618406, -3451111, 107783, 1615467, 2460694, 3825039, 4134558, 2300235, 183470, -447705, -562835, -964648, 351533, 4571748, 8194010, 6906053, 1961524, -1445513, -1355358, -377619, -277890, 136172, 1213980, 1147620, -109246, 233340, 2918265, 4380730, 1948747, -1729160, -2297450, 552306, 3599885, 4469565, 3038395, 243114, -2091027, -1766422, 1178921, 3816328, 4209255, 4049507, 5211412, 5968049, 3763525, -52817, -1872635, -1130932, -416558, -992548, -1782110, -2447219, -3756866, -4714092, -2981445, 1060381, 3961396, 3918678, 2827451, 2511677, 2007637, 256598, -1370719, -1474126]
12334a474126K39249q52212m69359K238393L855220J713259j838768k764870j046292
12325c99506j42754j394860j940795P46803M336965M047150p37108m867419l787522
12316d139046O20373L010473J944050P43132J303610J364504o46705k126226n75246
12307A498919J682776P88472k483488l729780j345181J665538K341457J121022
12299A539735P181j15073M41699R60177O37754n36106j198072l26939Q06668K38515
12289B455539j463058j800357j93506J184995Q72428K2467j7029K12566j03037
12280A171008k94906L17882P07736l03793j756665j659000M8353J298234P48225
12271B77074m76523m00009J143243K169275R95539j365949k087686j74257J821962
$$ y = [-1474126, -1234877, -2087089, -2556448, -318055, 3537165, 5250424, 3411656, 646786, -399506, -542260, -1937120, -3877915, -3131112, 1205853, 5253003, 4515895, -351524, -4139046, -3518673, -508200, 1435850, 2178982, 3482592, 4847096, 4200391, 2074165, 1498919, 3181695, 3970167, 1486679, -2243101, -3588282, -1922744, 418713, 1539735, 1546916, 1431843, 1873542, 2833719, 3471473, 2935367, 1737295, 1410356, 2217024, 2455539, 992481, -807876, -1001382, 183613, 1056041, 1078508, 1061479, 1274045, 1171008, 876102, 1193984, 1901720, 1597927, -158738, -1817738, -1769385, -471151, 277074, -199449, -599458, 543785, 2713060, 3708599, 2342650, 254964, 80707, 1902669]
12262A902669J039457j494147k029938M95438K747460J753277j023527k324896
12254A065793j802969j280115o60247J720127M671555M122618p48625m702875
12246B385262k829504K352163L970644K58949l211477j698652K158006K668971
12238F054362n89112k679969r22535J429860N32664k154375k247508P40603K521570
12229B685560M44746k416934j721336J703944L044791N00317k390836k248772
12221c98520m11280O9910o55813l38992J063529J615643J067835Q13718O17236
12212C443266r00178k550959j539980J249012J477016j688791l636544j715736
12204e862894M35727m07694j028288K285040N936147L949468j846829l966138
$$ y = [1902669, 2942126, 1447979, -581959, -86521, 2660939, 4414216, 3390689, 1065793, -737176, -2017291, -2677538, -957411, 3714144, 7836762, 7088137, 2385262, -444242, 1907921, 5878565, 6137514, 2926037, 1227385, 3385391, 6054362, 5465250, 2785281, 1862746, 3292606, 3825270, 1670895, -576613, 163990, 2685560, 3130306, 713372, -1007964, 695980, 3740771, 4241088, 1850252, -398520, -809800, -739890, -1395703, -1734695, -671166, 944477, 2012312, 2826030, 3443266, 2543088, -7871, -1547851, -298839, 1178177, -510614, -4147158, -5862894, -5427167, -5834861, -6863149, -4578109, 1358038, 5307506, 3460677, -505461]
12196e05461o99293J979283L94959k063351j829554k93931M53350J229558K234153
12187H99713J240244j549590j962433J300423L297670M64235l217003k564475
12179b091216O37401J492867L20138O98286J914939L94607k707728k473119J262404
12170e51421L146727J102712n08520J336240L127561P96141l485481m539947j641714
12161a217702J056596M35124k210971l553074k153530L49498J449107Q78691P32814
12152d233447J972280K498240N92405j464915m31771K280600K114439j459488
12144A868343l647645j436522K103927K756897Q97698m47941m89571m72071n15969
12135F17146J47057Q37962J92819j188656j248861M26624J881907J378255n08763
$$ y = [-505461, -1204754, 774529, 1169488, -893863, -2723417, -3017348, -2563998, -1334440, 899713, 2139957, 590367, -1372066, -71643, 3226027, 3690262, 473259, -2091216, -1453815, 39052, 359190, 1057476, 2972415, 3367022, 659294, -1813825, -551421, 2595306, 3698018, 3189498, 4525738, 7653299, 8449440, 4963959, 424012, -1217702, -161106, 274018, -1936953, -5490027, -7643557, -7294059, -5844952, -4966261, -4233447, -2261167, 237073, 829478, -635437, -1067208, 1213392, 3327831, 1868343, -1779302, -3215824, -1111897, 1645000, 2542698, 2094757, 1605186, 1133115, 617146, 764203, 1602165, 1794984, 606328, -642533, -215909, 1665998, 3044253, 2535490]
12126B535490j618358n31089J743651K493792M43354k224088k506593q63538l80716
12117i08095j558809j325153J482964L327142J325573j764060j610666R35207
12109i5897J466215r01170k692320k082461j120006j131408k55395K526237M485231
12100A99026K955407m10683j969057j076738j09521m45125r75383m37221Q34198
12091a435097J778408J854630J083674k25750j498498k164628k039300j256479
12083c903040r3762R41347J321522J061402N88963k494p66747r73540K68050K071214
12073E12915K162150J54850j382427o82646K29333j312859l886117l590687J0782
12064g784706K939155K348346o0782j341530j172622o67350K28050J795854K709703
$$ y = [2535490, 917132, 386043, 2129694, 4623486, 5066840, 2842752, 336159, -527379, -908095, -2466904, -3792057, -2309093, 1018049, 2343622, 579562, -1031104, -95897, 1370318, 469148, -2223172, -4305633, -5425639, -6557047, -6812442, -4286205, 199026, 3154433, 2743750, 774693, -302045, -411566, -856691, -1832074, -2269295, -1435097, 343311, 2197941, 3281615, 3055865, 1557367, -607261, -2646561, -3903040, -3996802, -3055455, -1733933, -672531, -83568, -86062, -852809, -1826349, -1558299, 512915, 2675065, 2829915, 1447488, 764842, 994175, -318684, -4204801, -7795488, -7784706, -4845551, -2497205, -2557987, -3899517, -5072139, -5739489, -5511439, -3715585, -1005882]
12055a005882J598770n43145j612896j246401n56890L4638P33845J053428O73465
12046h71068P42718K031525K714906P60815k164680k445541l0318J326805j71076
12037A894086j983611j780620q14327q67077j044108m8916J057002J074245J285450
12028a227876K896214L906122J862448j762998l397330k551289j747113j953985
12020c975807j656510l16518O79518P93468R40577J055374J74514p55237M37333
12011b623288L022979L547543J224073o01830J364M83714j214170k478200m43430
12002I18755K496596K020635j286866l075191k084649j112633j369432o71222
11994d164007J868509L671573K890337J201416M75640j90328j863099k969768
$$ y = [-1005882, 592888, 49743, -1563153, -2809554, -3366444, -3331806, -2597961, -1544533, -871068, -128350, 1903175, 4618081, 5378896, 3214216, 768675, 738357, 2065162, 1894086, -89525, -1870145, -2684472, -3551549, -4595657, -4644573, -3587571, -2513326, -1227876, 1668338, 5574460, 7436908, 5673910, 2276580, -274709, -2021822, -3975807, -5632317, -5948835, -5269317, -4475849, -3535272, -2479898, -2305384, -3060621, -2623288, 399691, 3947234, 5171307, 4569477, 4570841, 5054555, 3840385, 1362185, 918755, 3415351, 5435986, 4149120, 1073929, -1010720, -2123353, -3492785, -4164007, -2295498, 1376075, 4266412, 5467828, 5943468, 5753140, 3890041, 920273]
11986I20273j796505K86737Q26183m9800n70982n93675j212548k081661j872674
11977f144652q43954m04121n76265l93694k83065j206767j776782M15809M264097
11968f949394N501895K764990j07686K38832J781615P01321k461554l650768j270257
11959c451006J866036K536511O69711j395576j539932M23280K493593K177114
11951C779731n08816k430531j130958J655370K215904l3876k008138j479573K60135
11942C19248Q95140J59329o98391j038405j134026j144383q74912l46599R879
11933c853120j65221n13623p458J705799L049093J926497j134819k975545k001853
11924c970250l87287l31107l72643J715257M278767L875013R42959r11040r44152
$$ y = [920273, -876232, -589495, 236688, 186888, -384094, -977769, -2190317, -4271978, -6144652, -6988606, -7392727, -7968992, -8362686, -8645751, -9852518, -11629300, -11213491, -6949394, -1447499, 1317491, 1209805, 1448637, 3230252, 3931573, 1470019, -2180749, -3451006, -1584970, 951541, 1621252, 225676, -1314256, -890976, 1602617, 3779731, 3270915, 840384, -290574, 1364796, 3580700, 3546824, 1538686, 59113, 319248, 1214388, 1373717, 675326, -363079, -1497105, -2641488, -3516400, -3862999, -3853120, -4018341, -4531964, -4539422, -2833623, 215470, 2141967, 1007148, -1968397, -3970250, -4357537, -4688644, -5061287, -3346030, 932737, 4807750, 5750709, 4839669, 3895517]
11915C895517j868066l925757l545763K53350L069267J784355k98597R72639L431035
11906C767980K075783k352678l857667q2472M239488L991518M9469l021114l029052
11897A781255j558594o36840l48688J28287O90805N40875j98952l65990L06704
11888C38862M26017p29937j458662k30352J170831J02660k082123j622032J099689
11879b985047J445470j549544k471514J908235O273480M101008k192786m619976
11871i0674j259013J981705J024133j246826r52946R52690J379040q9952j651637
11862D6520k068008j041785J144612K924711K367857k0744j429517o54375L62826
11853A632097J8038l98053P21384K310109K238523M42660j384518k159834j978932
$$ y = [3895517, 2027451, -1898306, -5444069, -5190719, -2121452, -337097, -635694, 336945, 3767980, 5843763, 3491085, -366582, -449054, 3790434, 7781952, 7831421, 4810307, 1781255, 222661, -414179, -762867, -634580, 56225, 597100, 398148, 32158, 338862, 764879, 34942, -1423720, -1654072, -483241, -380581, -2462704, -4084736, -2985047, -1539577, -3089121, -5560635, -3652400, 2621080, 6722088, 4529302, -90674, -1349687, 632018, 1656151, 409325, -543621, 409069, 1788109, 1698157, 46520, -2021488, -3063273, -1918661, 1006050, 3373907, 3353163, 1923646, 1269271, 1632097, 1650135, 1252082, 1973466, 4283575, 6522098, 6964758, 5580240, 3420406, 1441474]
11844A441474j262967n69158l85583k46825Q12228K170701J608279j374621l825021
11835a631493k747527P92027K899014J693231q67782j966473j157249j14857j22153
11826c223262o41116l68048P97713J514926R19053q8788k62816J33658J86082
11817a032598K48433J144805J959779J011281r48016j207088N81791J416337l68301
11808B806423k260018j579562J89963M7553j409571j110570J110371K092806N61733
11799D49128q31643J24809J849288J834973M84805j88916K6145q9181n54013n22399
11789B582996n72096j848650l053166j405989K590108M448409J616003k462860
11781A894755k830210K71505K341052J265842n42623p37578k34628o24774j285116
$$ y = [1441474, 178507, -390651, -776234, -1023059, -210831, 1959870, 3568149, 2193528, -1631493, -4379020, -3586993, -687979, 1005252, 137470, -1829003, -2986252, -3101109, -3223262, -3864378, -4232426, -3434713, -1919787, -1000734, -1089522, -1352338, -1218680, -1032598, -784165, 360640, 2320419, 3331700, 2383684, 1176596, 1758387, 3174724, 2806423, 546405, -1033157, -843194, -795641, -2205212, -3315782, -2205411, -112605, 449128, -382515, -257706, 1591582, 3426555, 3911360, 3722444, 3748589, 3659408, 3105395, 2582996, 2010900, 162250, -2890916, -4296905, -1706797, 2741612, 4357615, 1894755, -935455, -663950, 1677102, 2942944, 2400321, 1662743, 1428115, 803341, -481775]
11772d81775r62814k54255n17636j568894k150800j764850o74416R45816K514572
11763d915052K636461O88759j739484k281996m15025K086551K876086R01427k540852
11754b703125m365767k648747O97815J971892P59888M21060K481280L715896J252133
11745A582325k200427j852686J975731M120929J764990k179339l493649j632204
11737a914330Q63158J936939J618858R75022N82019J55415n05020p66699k04631
11728B740731J18132q94356j916509p11069J745235J927254n44552j734699K07780
11719I37947J655624m31882l096696k269430L67486N26573j214336p48891K167396
11710b106209L480217J376518j681299l319442l302626j615461J289428K940595
$$ y = [-481775, -1444589, -1698844, -2216480, -3785374, -5936174, -7701024, -8375440, -7429624, -4915052, -2278591, -1589832, -3329316, -5611312, -6026337, -3939786, -1063700, -162273, -2703125, -7068892, -9717639, -9019824, -7047932, -6288044, -5866984, -3385704, 330192, 1582325, -618102, -2470788, -495057, 3625872, 5390862, 3211523, -282126, -1914330, -1051172, 885767, 2504625, 3479647, 4061666, 4217081, 3712061, 2945362, 2740731, 2858863, 1964507, 47998, -663071, 1082164, 3009418, 2464866, 730167, 937947, 2593571, 2161689, -935007, -3204437, -2836951, -2310378, -3524714, -4273605, -2106209, 1374008, 2750526, 1069227, -2250215, -5552841, -7168302, -5878874, -2938279]
11702b938279J696942Q6642R48424K045588p8078k915521j539775K119765J679187
11693A104895k352886k707998K002595M387348R21937k102392L9733K298213n60942
11684C030503m229096k575271J460634J386725j432253j049822J836022J342436
11676b30122k615408l876541m75696K639071K274326J135903J627374J854705
11668B333612J75149j446311j176496l42725m62445o63076o2464L02289j85868
11659a528335j15419J363111K562953J698865l89966j574735j277641o22974n35472
11650d19613p69286o02513M2514M16204J66691L06344J649815K529860M70912
11641C790928l284865m033638j71190L647243K776203p65427j679446O74954K228605
$$ y = [-2938279, -1241337, -1154695, -206271, 1839317, 1761239, -1154282, -2694057, -574292, 1104895, -1247991, -3955989, -1953394, 2433954, 3355891, 1253499, 1293232, 3591445, 3030503, -1198593, -3773864, -2313230, -926505, -2358758, -3408580, -1572558, -230122, -2845530, -6722071, -7197767, -4558696, -2284370, -1148467, 478907, 2333612, 2508761, 1062450, -114046, -456771, -919216, -1582292, -1644756, -1342467, -1528335, -1643754, -280643, 2282310, 3981175, 3591209, 2016474, 738833, 115859, -419613, -1188899, -1791412, -1748898, -1332694, -1166003, -859659, 790156, 3320016, 3790928, 506063, -3527575, -3698765, -51522, 2724681, 1959254, 279808, 954762, 3183367]
11632C183367J082972k62491J66360Q45130r3145j852916k554369j728578k10143
11623a423813R61966J071868M20959L93326J541038K267407J101993o34883o65956
11614E033905N33776M91136j190394k265799j459053j05310K35239l08296q40425
11605A24779q27969m6818J167207J667630Q06091m27929r05557j137851j883836
11596a464253k060025k79678K271052K893811R96055j372251k201816j019209
11588b236314J466626L367703K420257j087760l504147k296088K10206L96125
11580a263392j075326q92428J023732J538433k20560j578858p74251Q71851J546185
11571h24614O61008j763657m293062l523403J742208O669971N521083P7696k537496
$$ y = [3183367, 4266339, 4003848, 4170208, 5015338, 4922193, 3069277, 514908, -1213670, -1423813, -461847, 610021, 1030980, 1424306, 2965344, 5232751, 6334744, 5699861, 5033905, 5567681, 6058817, 4868423, 2602624, 1143571, 1038261, 1273500, 965204, 124779, -703190, -750008, 417199, 2084829, 2890920, 2462991, 1557434, 419583, -1464253, -3524278, -3803956, -1532904, 1360907, 2356962, 984711, -1217105, -2236314, -769688, 2598015, 5018272, 3930512, 426365, -1869723, -1659517, -1263392, -2338718, -3231146, -2207414, -668981, -889541, -2468399, -3242650, -2370799, -824614, -163606, -1927263, -6220325, -9743728, -8001520, -1331549, 4189534, 4267230, 1729734]
11562A729734m50555R56326j219045k681816k0770K992965J843916j191958j397850
11553E60947L88936k0479k489401k919309k06871K293389K104035L07683j166201
11544a147271j568178o50712J131068J905437M95719j186505n29425J565495J817170
11535A832798m21941k398650k257122j037769Q521J102469K123324J883239M13384
11526A248253l53565N10730J360680O41460p43121j187272q11381n24728k11235
11517g0179L24039K1857j585017k310204J33962L928179M578150J128049k062885
11508D085951j297792J344279J405239j266445k568427m79573J979941J141377
11500D344550k331027m498225l015860M43251K264435P20149k128539k508336
$$ y = [1729734, 1279179, 2235505, 1016460, -1665356, -1686126, 1306839, 3150755, 1958797, 560947, 949883, 929404, -1559997, -4479306, -4686177, -2392788, -288753, 18930, -1147271, -2715449, -3366161, -2235093, -329656, 166063, -1020442, -1549867, 15628, 1832798, 1410857, -987793, -3244915, -4282684, -4274163, -3171694, -1048370, 834869, 1248253, 894688, 1405418, 2766098, 3407558, 2664437, 1477165, 665784, 141056, -70179, 253860, 275717, -1309300, -3619504, -3485542, 442637, 5020787, 6148836, 4085951, 2788159, 4132438, 5537677, 4271232, 1702805, 1223232, 3203173, 4344550, 2013523, -2484702, -5500562, -5057311, -2792876, -2072727, -4201266, -6709602]
11492f709602O01614L843273L573650O59534r94817j33950O10877n49354j842804
11483i41579j222660M48531J238518R13696K24329n42842r01266j78784O89273
11474b72784m7615j412496m19953K317518K193663j717298l719664l20984L097457
11465c02156L46815n049337m854703R56575M498094K397280l57069J46287J285902
11456i32312K16080j153437o46025K31969j8128j1837Q31853L54853j687898j709789
11446d524671J646781M012397J729195k173992k668767m0422J873144J977962
11438A831627J906262J710872O4398k278988k975352j502473N86488J894970J614050
11429B851854n91970l005613k406060J290074L508258J198572k177076j664838
$$ y = [-6709602, -6107988, -2264715, 1308935, 1968469, 973652, 839702, 1450579, 901225, -941579, -2164239, -1715708, -477190, 436506, 660835, 117993, -783273, -962057, -272784, -320399, -1732895, -2152848, 164670, 2358333, 641035, -3078629, -3399613, -302156, 44659, -5004678, -9859381, -8902806, -4404712, -2007432, -2364501, -2218214, -932312, -716232, -1869669, -2515694, -2283725, -2301853, -2313690, -1481837, -1126984, -2814882, -4524671, -2877890, 1134507, 2863702, 689710, -1979057, -2019479, -146335, 1831627, 3737889, 5448761, 5513159, 3234171, 258819, -1243654, -657166, 1237804, 2851854, 2259884, -745729, -3151789, -1861715, 1646543, 2845115, 668039, -996799]
11421i96799J673141K896180R87040o55601n80533p39340j540622p80734J433005
11412A695737J599821j432829l866747k567704J87075M52128j524198k257896
11404g714613j94484K893743M695905M204681J538674j881489l464809j838868
11396a761260J020281J822828M9124j733112j602777l52129N59000R93930J101485
11387I7370L33029q97268m31163K416406M295964J612589l668690n570536k001846
11378c814145K382686K662974k11005j970943j033788P95048J712648J272539
11370A796014l17978j943054j919062m54135O3148r60490p76638J784930L198886
11361D71621P41121k241693j391528J342110J303766m74907N03147L150321J956036
$$ y = [-996799, 676342, 3572522, 4559562, 3903961, 3323428, 2584088, 1043466, 262732, 1695737, 3295558, 1862729, -2004018, -4571722, -4384647, -3932519, -5456717, -7714613, -7909097, -5015354, -319449, 3885232, 5423906, 3542417, 77608, -1761260, -740979, 1081849, 1130973, -602139, -2204916, -2557045, -1998045, -1004115, 97370, 430399, -466869, -898032, 1518374, 5814338, 7426927, 3758237, -1812299, -3814145, -1431459, 1231515, 1020510, -950433, -1984221, -1189173, 523475, 1796014, 1478036, -465018, -2384080, -2838215, -2775067, -3735557, -4512195, -2727265, 471621, 1212742, -1028951, -2420479, -1078369, 225397, -249510, 253637, 3403958, 5359994]
11352E359994k857195m609942j015422K230163J170401p39211k0558J035003J33863
11343F87096j86193J728344K282171p75793l123382r21738K158961J079518k178390
11334G50594k841699j636555j919755k300539M08611L736397K703472j448033
11326b547507l046441j200177l6134o25110J02645K507791L210572J421070R4022
11317a19269J78752m49683j797020j296748P28308Q19738j462892k545518r55849
11308f900181Q06568J360186K035328K525414O58055k235119j623688K672123
11300g01314M985586K244655j551838k092713q36096j062870k393922k745081
11292d153593k014391o85137J833459M718337N020757K071181p45723r44828j15963
$$ y = [5359994, 2502799, -2107143, -3122565, -892402, 277999, -461212, -481770, 553233, 687096, 500903, 2229247, 4511418, 3735625, 612243, -309495, 1849466, 2928984, 750594, -2091105, -3727660, -5647415, -7947954, -7539343, -3802946, -1099474, -2547507, -5593948, -6794125, -6830259, -7455369, -7352724, -4844933, -1634361, -213291, -119269, 59483, -390200, -2187220, -3483968, -2755660, -1935922, -3398814, -5944332, -6900181, -6093613, -4733427, -2698099, -172685, 485370, -1749749, -3373437, -701314, 4284272, 6528927, 4977089, 2884376, 2048280, 985410, -1408512, -4153593, -6167984, -6853121, -5019662, -301325, 4719432, 6790613, 6044890, 5100062, 4984099]
11283D984099m0044K20537R00824k26591l084045l425106M28380L484687J279745
11274D522486k904184l221664k12081J176473m9182n45520Q10737J650227Q61591
11265B088883k37062j122083k194966k248390J4169K503773K008800n34007j258769
11256i79652N20366J791550J287136Q93927J314663Q51428o59769r78228L32856
11247D374277Q26179l83476r76479J60952O51830j140569k914774j928196Q83631
11238d46625K603627K101100K07494j916571k940638j844619L17759J143489M44998
11229c29986N19456J749097J360665j462049l012649p37426K013213J013110j956079
11220h42648k154201L07164J298228J86983L82893K216600J656056k175417m219408
$$ y = [4984099, 4944055, 5164592, 6065416, 5838825, 2754780, -670326, -241946, 3242741, 4522486, 1618302, -1603362, -1815443, -638970, -688152, -1233672, -422935, 1227292, 2088883, 1851821, 729738, -1465228, -3713618, -3699449, -1195676, 813124, 279117, -979652, -459286, 1332264, 2619400, 3513327, 4827990, 5679418, 5019649, 4041421, 4374277, 5200456, 4816980, 3840501, 4001453, 4653283, 3512714, 597940, -1330256, -446625, 2157002, 4258102, 4465596, 2549025, -391613, -2236232, -1918473, -774984, -329986, 189470, 1938567, 3299232, 1837183, -1175466, -1912892, 100321, 1113431, -842648, -2996849, -2689685, -1391457, -1204474, -821581, 1395019, 3051075, 875658, -3343750]
11211c343750j254161K795080L234550J686232J935714K572227j62203m563100
11203B900589n178470j648585P16601k46979o66441J540460K321705j286347m911815
11194f459282l025882K198962L954704Q16013k025751j054998J403493K040086
11186b152655R39829m31181j825082k873313k202423Q2514J538705R32019K49567
11177e742020J103897J603321l81052k809464j875443K039891M428485K921536
11169A289151K61090j10325J249881J422868k59764j640625j316612n85629j128949
11160h18914k217074j658811Q16656K633918J511759j457077l079452k001648
11152f270643N9778J084444J099084J027109P36831k83894j228402p03405J050143
$$ y = [-3343750, -4597911, -1802831, 1431719, 3117951, 5053665, 7625892, 7463689, 2900589, -2277881, -3926466, -3209865, -3456844, -4123285, -2582825, -261120, -1547467, -6459282, -9485164, -7286202, -3331498, -2515485, -4541236, -5596234, -4192741, -2152655, -1212826, -1644007, -3469089, -6342402, -8544825, -8462311, -6923606, -5991587, -5742020, -4638123, -3034802, -3415854, -6225318, -8100761, -6060870, -1632385, 1289151, 1550241, 1439916, 2689797, 4112665, 3852901, 2212276, 895664, 310035, -818914, -3035988, -4694799, -3878143, -1244225, 267534, -1189543, -4268995, -6270643, -6210865, -5126421, -4027337, -3000228, -2263397, -2547291, -3775693, -4479098, -3428955]
11143c428955K208589J776918O35360j17431o10608j379568k102551k016507j046106
11134f080859K33753J432370K466842L013072K490523P94274j231703k281201
11126H37071j648585J09195J612040J869370J024636q1286p30273n41190N20028
11117B971006J706523J600708k94029k315467k296322n51552K89916r96051k273250
11108b158518j045649J867397L411433K351852L23364r75870j604619j972098
11100A97292j535367m3507J211198P87163q60297j928723j612132q44571o39718
11091e268662n86754M41527K388078L566233K642873O79089K5676R20409Q06875
11082E615344j688488l766290j982404K128175L388175L02631k628113j572116
$$ y = [-3428955, -1220366, 556552, 1191912, 1074481, 463873, -915695, -3018246, -5034753, -6080859, -5847106, -4414736, -1947894, 1065178, 3555701, 4349975, 3118272, 837071, -811514, -702319, 909721, 2779091, 3803727, 3722441, 2992168, 2450978, 2971006, 4677529, 6278237, 5984208, 3668741, 1372419, 820867, 1110783, 114732, -2158518, -3204167, -1336770, 2074663, 4426515, 4749879, 3774009, 2169390, 197292, -1338075, -1381582, -170384, 616779, -243518, -2172241, -3784373, -4628944, -5268662, -5855416, -5413889, -3025811, 540422, 3183295, 3862384, 3888060, 4808469, 5615344, 3926856, 160566, -1821838, 306337, 3694512, 3997143, 1369030, -203086]
11074b03086J108039R33667j704799k549272k43701J941490J282928r20833j911615
11065b267182q97663J079726K648176K576199N40470j744404j802571L94703K023426
11056B550880R90646j524562k891126k000923L47581K658229L465584K149146
11048E745455k1070p38684N66280J812698R28601j550924l353320l094166j347014
11039a052144J72973O8859j293648j702060L81760L260491L678218J219387j172361
11030C561475j640325j676804k554174k429994L12877L130991K344841j024143
11022B4744k335288k17583J521691q232k359473j764735J054875K266477P74471
11013a043053o74900j23407J012135Q76646M4183j70407k04458r74974j627054
$$ y = [-203086, 904953, 1838620, 133821, -2415451, -2659152, -717662, 565266, -355567, -2267182, -3164845, -2085119, 563057, 3139256, 3679726, 1935322, 132751, 527454, 2550880, 3541526, 2016964, -874162, -2875085, -2527504, 130725, 3596309, 5745455, 5724385, 4985701, 5551981, 7364679, 8293280, 6742356, 3389036, 294870, -1052144, -879171, -810312, -2103960, -3806020, -3424260, -163769, 3514449, 4733836, 3561475, 1921150, 244346, -2309828, -4739822, -4426945, -1295954, 1048887, 24744, -2310544, -2528127, -1006436, -1014668, -3374141, -5138876, -4084001, -1817524, -1043053, -1717953, -1841360, -829225, 47421, 91604, -78803, -283261, -1258235, -2885289]
11004b885289r28184J59351p0280q04361L4851J605613Q79251j913739k589861
10995f512648N42520L392515K003360j493342k341666r7093J808335J751761J142473
10986A96215Q63864L01812l80440k58503K76815K19851J18277Q11988J048168
10977C198047n20101k130776j285164P95904J053623j11957J44171J637160J594973
10968D375880J01015j55564N91191m25132k377046j362273K029108K376352j418934
10959C734597l491834n62815K528053J000933k203839k051624M03726J102105
10951D59302J71397K34785O46233q30076k780347j996745Q42661K130762J014145
10942a07883K7959P41083K060498K236715L32627k990096m685856j928956K948303
$$ y = [-2885289, -3813473, -3654122, -3724402, -4528763, -4493912, -2888299, -2009048, -3922787, -6512648, -5970128, -2577613, -574253, -2067595, -4409261, -4506354, -2698019, -946258, 196215, 1060079, 1361891, 981451, 722948, 999763, 1219614, 1337891, 2149879, 3198047, 2677946, 547170, -737994, 57910, 1111533, 999576, 1143747, 2780907, 4375880, 4476895, 4321331, 4912522, 4487390, 2110344, 748071, 2777179, 5153531, 3734597, 242763, -320052, 2208001, 3208934, 1005095, -1046529, -642803, 459302, 630699, 865484, 1511717, 681641, -2098706, -4095451, -3252790, -1122028, -107883, -79924, 661159, 2721657, 4958372, 5290999, 2300903, -2384953, -4313909, -1365606]
10933a365606L897914k63890l369045j180661K108851J320018j028440J88617
10925C07758L182186K289119k100123m195784k090188N76362J534249J958984
10917A462563J979960L20102j606895j042298O93022k28440l205121l685441q38716
10908f151264J160921K63378p68073M1569R75199P83890Q13690J435955Q99295
10899e45440q05729j261629j09483R3569j201569j181296J141738K652627J055369
10890a61843j614186k344216q51461J561399L708733L869174P89655l336538m238039
10881b617322j316963J260122O99128n99935O17028L299271L894142J503621j166343
10872E572749j462610N669J01040k743952n595196m137516Q95806L734845J724112
$$ y = [-1365606, 2532308, 2268418, -1100627, -2281288, -172437, 1147581, 119141, 307758, 3489944, 5779063, 3678940, -516844, -2607032, -2030670, -496421, 1462563, 3442523, 3762625, 2155730, 1113432, 1806454, 1578014, -1627107, -5312548, -6151264, -4990343, -4726965, -5495038, -5453469, -4478270, -3694380, -2880690, -1444735, -545440, -1351169, -2612798, -2722281, -2628712, -3830281, -5011577, -3869839, -1217212, -161843, -1776029, -4120245, -4971706, -3410307, 298426, 4167600, 4957255, 1620717, -2617322, -3934285, -2674163, -1975035, -2574970, -1957942, 1341329, 5235471, 6739092, 5572749, 4110139, 4115808, 4216848, 1472896, -4122300, -8259816, -7364010, -3629165, -1905053]
10863a905053o88220O17055K574962P05067k397895j277940K581840L078802k0596
10854C268022j326874k8574r13720m323455m208158J173867N075584K695835j539569
10845a27042j741115O57206R52765r62192j874441q02243R44284K368455K397536
10836A813213n669k957826k533330J211236L187009O86322k502925k168793M91265
10827b779498K194058K561432K502878J456918m72367j111289J44735P67083l91541
10818D872409j001205n6791j45964k092367k382895M89310K200991n29180l963282
10809b608974l153410M20226K170456J677056J329521R59443o90110j837101m19719
10800b152612J291970R1742k232670j660645J152228K154540Q19163L32802J447533
$$ y = [-1905053, -2593273, -1976218, 598744, 1303811, -1094084, -2372024, 209816, 3288618, 3268022, 1941148, 1912574, 998854, -3324601, -7532759, -6358892, -1283308, 1412527, -127042, -1868157, -1210951, -258186, -1220378, -3094819, -3897062, -2952778, -584323, 1813213, 1807544, -1150282, -3683612, -2472376, 714633, 1400955, -1101970, -3270763, -2779498, -585440, 1975992, 4478870, 5935788, 5463421, 4352132, 4496867, 5263950, 4872409, 3871204, 3814413, 3668449, 1576082, -806813, -317503, 1883488, 1354308, -2608974, -5762384, -5342158, -3171702, -1494646, -165125, 794318, 104208, -1732893, -2152612, -860642, -768900, -3001570, -4662215, -3509987, -1355447, -536284, -203482, 1244051]
10791A244051J376922r18807k837845k254325r3073J745082K299532J270894p41954
10782A090477j804464n31810J862102K998699K042135l09581l020149m490637
10774b163228l237213n24499J62135j690180j959260J833884N815043N084068
10766C320750R55772j535367j140822n14529m12500P93545K263966Q56911k982534
10757A605192m393075j039044L067860L181201K51983j276040k50737J00887k213762
10748i65535m390618k644219K074807M797919K930572o98762k234558j646247
10740b776641j044900m98093J151048K715138J784494r55575k180078q21390Q23307
10731a802690J090930Q09861Q43234Q76719R85924J577408J764886N62025q22154
$$ y = [1244051, 2620973, 1702166, -1135679, -3390004, -3483077, -1737995, 561537, 1832431, 1090477, -713987, -1245797, 616305, 3615004, 5657139, 5347558, 2327409, -2163228, -5400441, -5924940, -5762805, -7452985, -9412245, -7578361, -1763318, 3320750, 4276522, 2741155, 1600333, 1085804, 673304, 1466849, 3730815, 4587726, 1605192, -2787883, -3826927, -759067, 2422134, 2674117, 1398077, 1147340, 1248227, -965535, -5356153, -8000372, -5925565, -1127646, 1802926, 1104164, -1130394, -2776641, -3821541, -4319634, -3168586, -453448, 1331046, 375471, -1804607, -2625997, -1802690, -711760, 98101, 941335, 1818054, 2803978, 4381386, 6146272, 6708297, 5886143]
10722E886143q19951n18583j429275j971566m43532O40824j397270l246205l07471
10713c606886M259204L372840j956320l692941k03737J425012j645744l190785
10705e239357K76990L046035P55641j922726l79011J615042l63017k881754j348519
10696f440676J367405O53019j233626Q2099K703520K317119Q6758m00273j2880
10687h77535j137032j902695l1163J569304j97259j976895O74318M887633M584762
10678E593438N6495l309763l313160j791595J90124K240938K406721K41213r28752
10669A385659O05252J388022o93098j687865J018503K564666j199732n275876
10661a894469l335128J376876J808701r38252q90271J478892J104548j388756
$$ y = [5886143, 5066192, 4547609, 3118334, 1146768, 703236, 1344060, -53210, -3299415, -3606886, 652318, 4025158, 2068838, -1624103, -1827840, -402828, -2048572, -5239357, -4962367, -1916332, -1160691, -3083417, -3462428, -1847386, -2210403, -5092157, -6440676, -5073271, -4420252, -5653878, -5571779, -2868259, -551140, -464382, -864655, -877535, -2014567, -3917262, -3948425, -2379121, -2576380, -4553275, -3878957, 1008676, 5593438, 5649933, 2340170, -972990, -2764585, -2574461, -333523, 2073198, 2314411, 1385659, 1990911, 3378933, 2685835, 997970, 2016473, 4581139, 3381407, -1894469, -5229597, -3852721, -2044020, -2982272, -3872543, -2393651, -1289103, -2677859]
10653b677859j097956J477248J543796p45157j069412M59559R8889j536593p84205
10644d331690J188225L29633j869149n82400K917504K880492o63531k036710J56761
10635b010865J781067J505644J908606K442711j52173m167372l990734M65399
10627b217717L144217J360775j285891k002763j869141j482709q8532R50727q5359
10618c576393r18294J162982L285124J511549j152265M91433L585008J331676
10610E720820m347138m907170M09033L220756J67055k317351J17492L000212J819974
10601B883683r47551j621376j112684j197934q65854M07011P07421m93211q71524
10592c112019P04213K451432K789678J792411j99474k185843k154127l81792l67223
$$ y = [-2677859, -3775815, -2298567, -754771, -1499928, -2569340, -2109781, -2010892, -3547485, -4331690, -3143465, -2813832, -4682981, -5265381, -2347877, 532615, -130916, -2167626, -2010865, -229798, 1275846, 3184452, 5627163, 5474990, 1307618, -2683116, -2217717, 926500, 2287275, 1001384, -1001379, -2870520, -4353229, -4441761, -3491034, -3576393, -4494687, -3331705, -46581, 1464968, 312703, 804136, 4389144, 5720820, 1373682, -3533488, -3124455, 96301, 263356, -2053995, -1936503, 1063709, 2883683, 1936132, 314756, -797928, -1995862, -2861716, -2454705, -1747284, -2240495, -3112019, -2407806, 43626, 2833304, 4625715, 4426241, 2240398, 86271, -295521, -662744]
10583f62744k836087k995092J565400N418881L702687K35588J25815N52807k431792
10574B675463m332415J37762N522718L340347l305717m833589q90202J315062
10566c70571O81773J523231K525603n30286l950577j265149L700207K439983k604629
10557B149585k393709J719605Q11107m105331l700096J811364L014563r19228
10549a612140j364510K733669L489545J10711k40974K033427m48920n595714l718196
10540d613102L350623L558056l416821m703801K648083O511878J468515l181102
10532A622329j718739j35169j405144k79743L071514J596272l193646k004402
10524b446728L793536L289191k895426l033295K843377K524696m293139m944102
$$ y = [-662744, -3498831, -6493923, -4928523, 490358, 4193045, 4428633, 4554448, 5107255, 2675463, -1656952, -1519190, 4003528, 7343875, 4038158, -795431, -1685633, -370571, 311202, 1834433, 4360036, 3829750, -120827, -1385976, 2314231, 4754214, 2149585, -244124, 1475481, 2286588, -1818743, -5518839, -3707475, -692912, -1612140, -2976650, -242981, 3246564, 3357275, 3116301, 5149728, 4700808, -894906, -4613102, -1262479, 2295577, -1121244, -5825045, -3176962, 3334916, 4803431, 1622329, -96410, -231579, -1636723, -1916466, 1155048, 2751320, -442326, -2446728, 1346808, 4635999, 1740573, -1292722, 1550655, 4075351, -217788, -5161890]
10516e161890J260522J812350l272722j015934P107039N850146l255267k837164
10508D87080O096345M508586o803176o765240M255684L334490q701129n751377
10500i338737J0774408R356064r947749r619085J2948603J3742384j2940863j4241507
10492i266482J9848310K2570730k3204869j9970068Q8304889J79002787J01081624
10485C58366921q6864559j76301638r5011264J4426172K2961934k2796905k4203604
10478i422943R207886J2289515j0746277j0951594Q803412R109127p159160o402397
10470e272431Q004939N536191j0214688r234605P223657J0121254l482153q314907
10462e632743J500921O242387J63233j732531L742507L381625l907428m897395
$$ y = [-5161890, -3901368, -2089018, -5361740, -6377674, 729365, 6579511, 3324244, 487080, 6583425, 11092011, 4288835, -2476405, 1779279, 5113769, -3587360, -9338737, 1435671, 10791735, 843986, -8775099, 4173504, 17915888, 4975025, -9266482, 10581828, 33152558, 9947689, -10022379, 78282510, 257285297, 358366921, 271502362, 95200724, 189460, 14615632, 37577566, 14780661, -9422943, -215057, 12074458, 1328181, -9623413, -820001, 8289126, 1129966, -5272431, 2732508, 8268699, -1945989, -11180594, -3956937, 6164317, 2682164, -5632743, -4131822, 2110565, 2273798, 541267, 4283774, 7665399, 3757971, -1139424]
10454a139424J306180K197447k990039k866062K580150K548227k162066r92612
10446a518199M170843J965412n294852m627201L001528M076150k296607l465288
10438c988214K349343L284196k910281m633668J417834M302735n91837l715541
10430d485433O63794N254524L987275R62255K03759o38602k237039j017941K148018
10421D840610J696369k031086k734755J4421N5535l201332l435021L70499J878826
10412b545934n81573j137307K204212L872737J152280j452338r31184N384k73842
10403C12435M18209K045250J348649j481836k399477p95548j70966j084656n67092
10394b375032J273536J251293l00974l2044J629473J303865k94554N26577K926799
$$ y = [-1139424, 166756, 2364203, -625836, -3491898, -911748, 1636479, -525587, -1518199, 2652644, 4618056, -676796, -5303997, -2302469, 1773681, -522926, -3988214, -1638871, 1645325, -1264956, -5898624, -4480790, -178055, -769892, -4485433, -3821639, 1432885, 5420160, 6382415, 6586174, 5947572, 3710533, 2692592, 4840610, 6536979, 4505893, 1771138, 1785559, 1841094, -1360238, -4795259, -4424760, -2545934, -3127507, -4264814, -2060602, 1812135, 2964415, 1512077, 580893, 586277, 312435, 730644, 2775894, 4124543, 2642707, 243230, -552318, -723284, -1807940, -2375032, -1101496, 149797, -151177, -183221, 1446252, 2750117, 2455563, 2982140, 5908939]
10385E908939K622173j23426j114085k03025j033538l326509l130767n32951L75574
10376e57615r13116j001595L76925J33891j546056j288995Q66250J473174J2808
10367b444329q40086n51639n65640k01228J599014K605622J222073Q41672L704599
10358E370058M602143j077134p245037m987196K710462N044521J72235l500098
10350A089954j960665P9858m4500Q14789K988762K116802j795353l032462k29288
10341B7897J285649n59474j300741Q51438J413793j605654l605803j545556J200722
10332c837729J464847R67434J385188J167673m0927O4579J308908N77649j784849
10323A272773j689649R34286J165380k062176l421182k19463L048879K383202
$$ y = [5908939, 8531112, 8407686, 7293601, 7090576, 6057038, 2730529, -400238, -933189, -557615, -1470731, -2472326, -2095401, -1961510, -3507566, -4796561, -3930311, -2457137, -2444329, -3284415, -3836054, -4401694, -4602922, -3003908, -398286, 823787, 1665459, 5370058, 9972201, 8895067, 1650030, -3337166, -626704, 4417817, 4590052, 1089954, -870711, -790853, -835353, -20564, 2968198, 5085000, 3289647, 257185, 27897, 1313546, 754072, -546669, 304769, 1718562, 112908, -3492895, -5038451, -3837729, -2372882, -1405448, -20260, 1147413, 1106486, 1171065, 2479973, 3057622, 1272773, -416876, 517410, 1682790, -379386, -3800568, -4020031, -971152, 1412050]
10315A412050L5585p74744r25789j721752j558884L64213J677727R79503L8819
10306d73272j25409q20906j781282o41076K139502K883700P21194j059404r01865
10297e8818r03686j735756j287122M01089O06346n44467k8536J616458M69286
10288a465206k851687k779251J553591L789423O04703k753007j237981K192079
10280b947336K260489m69258j882153p44480J142200K052557R29338j947797l436860
10271e043300o05720L924120M618936J465561l12615M51768o71424m354591m958400
10262e485665n14617K963344J494953m08562J443082L179788L62005l396997k556828
10253b919497Q70986J365504p41430j194929J69433L59352l16316O20731K071990
$$ y = [1412050, 1447635, 672891, -252898, -1974650, -3533534, -3169321, -1491594, -512091, -473272, -598681, -1419587, -3200869, -3841945, -1702443, 1181257, 1902451, 843047, -58818, -962504, -2698260, -3985382, -3584293, -2977947, -3522414, -3550950, -1934492, -1465206, -4316893, -7096144, -5542553, -1753130, -1148427, -3901434, -5139415, -2947336, -686847, -1156105, -3038258, -3782738, -2640538, -587981, 341357, -1606440, -5043300, -5649020, -1724900, 2894036, 4359597, 4046982, 4498750, 3827326, -527265, -5485665, -6000282, -3036938, -1541985, -1950547, -507465, 2672323, 3034328, -362669, -2919497, -2048511, -683007, -1424437, -2619366, -2449933, -2090581, -2406897, -1786166, 285824]
10244B85824R90261j546452j686976N96182J591169J55472q38845N18431K662037
10235B727103L300531J814939r61952l160524k808767l25427J129673l07222k436795
10226a028441k263551j37743J601169K191815K199687J431365l41698j860745
10218A791858j773473n04337P77840J680022J918915R87950l64859m25638O38261
10209D726539N95721j138537k341432j709803p62212o34173j49394J254678J878458
10200A719845Q90308k9204j8311o94855k444432k557194L33323L142515K552038
10191B894033l20405k188429k120441j215517N885J353819J915995J346972O84180
10182B356092N51574K98734l58916j025873k130969l908707m133713p55518L365804
$$ y = [285824, 1276085, -270367, -1957343, -1361161, 230008, 385480, -453365, 65066, 2727103, 6027634, 7842573, 6880621, 3720097, 911330, 585903, 1715576, 1408354, -1028441, -3291992, -3429735, -1828566, 363249, 2562936, 3994301, 3652603, 1791858, 18385, -485952, 291888, 1971910, 3890825, 4878775, 4513916, 4088278, 4726539, 5322260, 4183723, 1842291, 132488, -629724, -1263897, -1413291, -158613, 1719845, 2610153, 2580949, 2562638, 1867783, -576649, -3133843, -2800520, 341995, 2894033, 2573628, 385199, -1735242, -2950759, -2944874, -1591055, 324940, 1671912, 2356092, 2907666, 3206400, 2847484, 1821611, -309358, -4218065, -8351778, -9107296, -5741492]
10173e741492L217672n61343k179546K12563K171352J199942M64300J745211J787813
10164B316472p44661j719962O61714J533514j855269l967536j23533M570263L109188
10155C780190j937174l183221m10826R15703o6360K74947J736133Q43066j326848
10146F25610l41174K914652K929820p56046k520779l73184R78958j177443k830677
10137e50263k80315L786406M672264J948735j511982l470887l114563q54260J022744
10128A647879J97781k136656k403086K7326J867005J095768l27803k14444O02387
10119C56157M59534k58744k38041M98768Q56681J99237r78993j236963N11223
10110A68859K961790K984447k14797l200003k779746m79132K74374n57303o96666
$$ y = [-5741492, -2523820, -3085163, -5264709, -5052146, -2880794, -1680852, -1216552, 528659, 2316472, 1571811, -148151, 513563, 2047077, 191808, -3775728, -3899261, 671002, 3780190, 1843016, -1340205, -1751031, -835328, -901688, -626741, 1109392, 1952458, 625610, 284436, 3199088, 6128908, 5372862, 2852083, 2478899, 3457857, 2280414, -550263, -830578, 2955828, 7628092, 9576827, 8064845, 4593958, 1479395, 625135, 1647879, 1845660, -290996, -2694082, -2666756, -799751, 296017, -31786, -246230, 356157, 815691, 556947, 318906, 817674, 1674355, 1873592, 894599, -342364, 168859, 3130649, 6115096, 5900299, 2700296, -79450, -558582, -284208, -841511, -1538177]
10101a538177j57591n94643j259912m2520K162495K509220J102999M58829O26465
10092C267165l97897j829966r53824J161986N40436k422553k639468J086039L355374
10083A167292Q30515k277919j311912J344895Q17580k071517k670498k69189J374487
10074c066266M34467p51813q3198J349748J580753N79866k04702J98948J297458
10065A335261J570621J60600j628835j583002K23260J134709j59165j317739J79248
10056h5042K794911K731427n71402l311010k226845J283217L107391J460261j392111
10047C790797k336674j047281M08419P62452P43035J040280R65288R5099m22424
10038C998991K48799P77957m28430k431141k882029j344169M04463R49004M52093
$$ y = [-1538177, -1695768, -2290411, -3550323, -3592843, -1430348, 1078872, 2181871, 2640700, 3267165, 2869268, 1039302, 85478, 1247464, 1787900, -634653, -3274121, -2188082, 1167292, 1997807, -280112, -1592024, -247129, 570451, -1501066, -4171564, -4440753, -3066266, -2631799, -3383612, -3466810, -2117062, -536309, 43557, -161145, 37803, 1335261, 2905882, 3066482, 1437647, -145355, 77905, 1212614, 1053449, -264290, -85042, 2709869, 5441296, 4869894, 1558884, -667961, 615256, 3722647, 5182908, 3790797, 1454123, 406842, 815261, 1577713, 2320748, 3361028, 4326316, 4421415, 3998991, 4247790, 5025747, 4597317, 2166176, -715853, -2060022, -1655559, -706555, -254462]
10029b54462k00507l8089J356199K545703J147282k304512l695314j072907J650189
10020h66418M64765j994980o82217K983119L079916o69544k151499P43263K587047
10011C493452J128k465044l93472K795713J721677k178716l684463k086377o53142
10002c449244m69691l19628n22212j599265j173303K418765N368159L069935j975819
9993A347697l190642N7297K096622N46784p23368O02679J405302m29029j816046
9984a02704k35146J442134j4575k404928j777908J024389J919795j10093k228143
9975b487179k298363r54726M29347J257964J330576O92553k40039j216305k147573
9966e633745k294024r00951J082794J862259J597032J849018K063845Q2689l061155
$$ y = [-254462, -454969, -493058, 863141, 3408844, 4556126, 2251614, -1443700, -2516607, -866418, -401653, -2396633, -3078850, -95731, 2984185, 2314641, 163142, 906405, 3493452, 3494580, 1029536, 636064, 3431777, 5153454, 2974738, -709725, -2796102, -3449244, -3918935, -4238563, -4760775, -6360040, -7533343, -5114578, 253581, 3323516, 1347697, -1842945, -1785648, 310974, 857758, 134390, 737069, 2142371, 1713342, -102704, -337850, 1104284, 1089709, -1315219, -3093127, -2068738, -148943, -259036, -2487179, -4785542, -5740268, -5310921, -4052957, -2722381, -2029828, -2269867, -3486172, -5633745, -7927769, -8828720, -7745926, -5883667, -4286635, -2437617, -373772, -291083, -3352238]
9957c352238l111375P64326L668705K148768o07168m37689J106020N69120n24644
9948B23825J430862M693187M089726n56954m075626l940784k783683k437955j278629
9939d636031J115233J990930K54463j226077m32283O70058J57193m24111O31979
9930a898646J670328M93326j704348k146743n69808R72910J168862L27443p42917
9921b429593j135081p1289J957551L082030K063937k20961j844378j782821o84792
9912a065397j61067r64144j701666p06390O70068n13788l138021k117198L267574
9903f430029O268141K505592k344748j308055K389974J261668l029363k810328
9895c497148J503987K362090p42723q69571K078910N52528n090755n216953J061501
$$ y = [-3352238, -6463613, -5699287, -2030582, 118186, -488982, -926671, 179349, 748469, 223825, 1654687, 6347874, 10437600, 9880646, 5805020, 1864236, -919447, -3357402, -4636031, -3520798, -1529868, -1275405, -2501482, -2933765, -2263707, -2106514, -2530625, -1898646, -228318, 265008, -1439340, -3586083, -4155891, -3182981, -2014119, -1686676, -2429593, -3564674, -3635963, -1678412, 1403618, 3467555, 3246594, 1402216, -380605, -1065397, -1226464, -2190608, -3892274, -4598664, -3928596, -4442384, -7580405, -9697603, -6430029, -161888, 2343704, -1044, -1309099, 1080875, 2342543, -686820, -3497148, -1993161, 368929, -373794, -1243365, 835545, 1388073, -3702682, -8919635, -7858134]
9886g858134K688238k706773l011165M557844M037137j0109568j4781960Q146465
9878a9037916L6009369L1988725p57798k2625268j4194123J929111K107647n494423
9870I925324l526796L628279J785410o300149p044237J93284M110210J361997
9862D133322o82289J127487J901505l89241j634096j55956N66951r01947j360363
9853B605373Q58723K750731J306362k457056n123145m277913m46025K946699K805549
9844I69298M06215k98748J049698Q07703j588170j603486K538306N574887K933826
9835A0789529k142790l938688k493173j472876j481591p74076J29847m52770j666535
9826c503123j666741r55019q04102o31775J27356K64119m37056N2930J981162
$$ y = [-7858134, -5169896, -7876669, -10887834, -6329990, -2292853, -12402421, -27184381, -19037916, 16971453, 48960178, 48202380, 25577112, 11382989, 13312100, 15419747, 9925324, 6398528, 10026807, 11812217, 5512068, -1532169, -1338885, 2771325, 4133322, 3451033, 4578520, 6480025, 6090784, 4456688, 4300732, 4867683, 3965736, 2605373, 3464096, 6214827, 7521189, 5064133, -59012, -4336925, -4782950, -1836251, 969298, 1375513, 1076765, 2126463, 2934166, 1345996, -257490, 2280816, 7855703, 10789529, 8646739, 4708051, 2214878, 742002, -739589, -1513665, -1383818, -1836588, -3503123, -5169864, -6124883, -6928985, -7560760, -7433404, -7169285, -7606341, -7553411, -5572249]
9817e572249K486860Q89629N70695K580985K885113j97703j851461R80060L336774
9808F108703M53160l506733k257783J939159K508832l21687j044677J124599K008264
9799G011837N56617m61822o20962j676314k551287j188407J85274j532323l493048
9790c770435q80656L922384M165817k18887k633144o43006J397533R20054K59888
9781B519548K84108j222946l407712k192881J955197L423325N61566j854302j378720
9772a312817j500705l585494k978455K490653O986711M979104l75666k581375
9764B121956j100319J15719j44868p5394N09320K31992m78950j70483M31103n34313
9754I05763k467349k784766p92188J294748J366890j32625j120452m39592R28459
$$ y = [-5572249, -3085389, -2195760, -1625065, 955920, 3841033, 3643330, 1791869, 2771929, 6108703, 6561863, 3055130, 797347, 2736506, 5245338, 4923651, 3878974, 5003573, 7011837, 7568454, 7106632, 6485670, 4809356, 2258069, 1069662, 1254936, -277387, -3770435, -4651091, -728707, 3437110, 3218223, 585079, -57927, 1339606, 2259660, 2519548, 2803656, 1580710, -1827002, -4019883, -2064686, 1358639, 1920205, 65903, -1312817, -2813522, -6399016, -9377471, -6886818, 99893, 5078997, 4703331, 2121956, 1021637, 1137356, 992488, 917094, 1426414, 1658406, 1179456, 1008973, 1440076, 905763, -1561586, -4346352, -5138540, -3843792, -2476902, -2609527, -3729979, -4169571, -3241112]
9745c241112J385528J136821J783578L115383K485027j062339m317905l996704
9737b711723j252089O99979J355968K006635K159076P91099o18938l76794k5221
9728B027992j258421j727691R43214L429859J327786k530299j833880K280794
9720B659354K466891k478855n372236k527566Q33981K69319r70805P90221K659772
9711a669924R11856k036805k034348o3151O07340L28205J086082J854470P36372
9702b79903q97785p44931K96888J77858m06804K52691J456849J716764J611261
9693C182888J928216J205742j757344m929861n403972k970149O72779L943713
9685d127988M908890J982670k713612m122006r08380K155186J152768j481661
$$ y = [-3241112, -1855584, -718763, 1064815, 4180198, 6665225, 5602886, 1284981, -2711723, -3963812, -3263833, -1907865, 98770, 2257846, 3048945, 2430007, 2053213, 2027992, 769571, -958120, -14906, 3414953, 4742739, 2212440, 378560, 2659354, 5126245, 2647390, -2724846, -5252412, -4418431, -4149112, -5119917, -4329696, -1669924, -758068, -2794873, -4829221, -4892372, -4285032, -3956827, -2870745, -1016275, -279903, -1177688, -1922619, -1625731, -1447873, -1854677, -1601986, -145137, 1571627, 3182888, 5111104, 6316846, 4559502, -370359, -5774331, -8744480, -8071701, -4127988, 780902, 2763572, 49960, -4072046, -4980426, -2825240, -1672472, -3154133]
9677c154133j663134O7042Q78120P55149J032554Q92585m13648p15210J426372
9668h94303L065440J359369j133257n46346J557221J003923j547592j845954N62831
9659A581332K038111J328103O59265M43678j432348m365993m467175p41069K738713
9650b217383K706680R09048M29360J098398Q71395n77615j835025j914298q94283
9641a423723O50314J901721K207420J668473P80369k66888j188181j196266j27013
9632C006226P29945J33104j466005k743562k919050j537901J400885L953503L227923
9623C785068k95760k060278L95635L270339J918720k076343l581551j788963m17907
9614h51040r92453j207400r1683L27733n60212n59001R26789J392090j54623j082486
$$ y = [-3154133, -4817267, -4750225, -3872105, -3116956, -2084402, -1191817, -1605465, -2320675, -894303, 2171137, 3530506, 2397249, 1850903, 3408124, 4412047, 2864455, 1018501, 1581332, 3619443, 4947546, 5606811, 6050489, 4618141, 252148, -4215027, -4956096, -2217383, 489297, 1398345, 1827705, 2926103, 3797498, 3219883, 1384858, -529440, -1423723, -773409, 1128312, 3335732, 5004205, 5784574, 5517686, 4329505, 3133239, 3006226, 3736171, 3869275, 2403270, -340292, -3259342, -4797243, -3396358, 557145, 3785068, 3489308, 1429030, 1824665, 5095004, 7013724, 4937381, 1355830, -433133, -851040, -1843493, -3050893, -3142576, -2814843, -3375055, -3934056, -3007267, -1615177, -1769800, -2852286]
9604b852286L59848K131924K157099J452509J159233L5478k242036k803689j81637
9595g83557J989605J57124k881923j975596J849012K694332o62469k674657R0676
9586b197453L681707L323377M59722q14019o05589j540696k717859j005764K509695
9577A093121L087502j08058k330681p14361J547982R99285p06342p60044n24947
9568A583457k323441l887250j379027L595931N397173K417991j194594k148025
9560B062215j638849j548816j449124q65819o90726p35428O28095K862245K911767
9551A535560K80156j228134P48960L101461J964968j455725l171775k256272q53353
9542a334154N3736J250401K400164J851628n34140k698753k817427j021477J150337
$$ y = [-2852286, -2492438, -360514, 1796585, 3249094, 4408327, 4443805, 2201769, -601920, -783557, 1206048, 1363172, -1518751, -3494347, -1645335, 1048997, 386528, -2288129, -2197453, 1484254, 4807631, 5267353, 4453334, 3847745, 2307049, -410810, -1416574, 1093121, 4180623, 4072565, 1741884, 1027523, 2575505, 3574790, 2868448, 2108404, 1583457, -739984, -4627234, -6006261, -2410330, 2986843, 5404834, 4210240, 2062215, 423366, -1125450, -2574574, -3440393, -4131119, -4866547, -4238452, -1376207, 1535560, 1815716, 587582, 1336542, 4438003, 6402971, 4947246, 1775471, -480801, -1334154, -1280418, -30017, 2370147, 4221775, 3687635, 988882, -1828545, -2850022, -1699685]
9533a699685K035333J131893j75935j19547P94669L18877j707663k451057l56727
9524b229842K191937K460420J196613M59264m8349j436041k362566q80633J650901
9515A001704K107290M02564p62031o04855r99292k230453j842099R93037L262097
9506A327962K320104j70827r28693N5724J04586j442933k152986p04332N31761
9497a059634r34023l281885k470177J568202M145683K380755o79498r63423M41052
9488h52948j56136k229515j757611J630746L552120J993572M13403J439287K248954
9479F281872k03524l267903k484743J109564K447254J13802k068624j286600M72916
9470A114014J53920j723231k122210L6533K244509J549359j450464k990620j071962
$$ y = [-1699685, 335648, 1467541, 1291606, 1172059, 1966728, 2285605, 577942, -1873115, -2229842, -37905, 2422515, 3619128, 4078392, 4030043, 2594002, 231436, -649197, 1001704, 3108994, 3511558, 2749527, 2144672, 1145380, -1085073, -2927172, -1934135, 1327962, 3648066, 3477239, 2548546, 2604270, 2708856, 1265923, -887063, -1591395, -1059634, -1993657, -5275542, -7745719, -6177517, -2031834, 348921, -330577, -1294000, -852948, -1009084, -3238599, -4996210, -3365464, 186656, 2180228, 2593631, 4032918, 6281872, 6078348, 2810445, 325702, 1435266, 3882520, 3996322, 1927698, 641098, 1114014, 1267934, -455297, -2577507, -2540974, -296465, 1252894, -197570, -3188190, -4260152]
9461d260152J559033J318700o99929m87398K141170K994137N18398j453112k18426
9452A412421J187972n33044k913537j831682J291854J691756j002940k527880
9444c225080r60802R97231J052581K14474l06720j224133k618328k378913O77025
9435g772665M066819M144606O65797k630132k201788J112500K883421O17724k544923
9426a658641j705395K707841N033639K369422j344118j474439O95484J029800
9418E653593o80790j416508o55769p14038j945479k008773k19253J136938N84415
9409b65664n28989o27517N8471Q30037J646875K103622J141177j311451l551950
9400e05389l536868o98980L247405M953696K274649k597559m620645j949064J559966
$$ y = [-4260152, -2701119, -1382419, -2082348, -2569746, -428576, 2565561, 3083959, 1630847, 1412421, 2600393, 2067349, -846188, -2677870, -1386016, 305740, -697200, -3225080, -4185882, -3188651, -2136070, -1921596, -2228316, -3452449, -6070777, -8449690, -7772665, -3705846, 438760, 1104557, -1525575, -3727363, -2614863, 268558, 886282, -1658641, -3364036, -656195, 4377444, 6746866, 5402748, 3928309, 4623793, 5653593, 4972803, 3556295, 2900526, 2186488, 241009, -1767764, -1987017, -850079, -265664, -794653, -1422170, -1363699, -533662, 1113213, 3216835, 4358012, 3046561, -505389, -4042257, -4741237, -1493832, 3459864, 5734513, 3136954, -1483691, -3432755, -1872789]
9391a872789J744091m12938j438363j009643j157340j593795k53453K197016K731228
9382a065986R44866k72101M69542J235787N55580l43353k82498j94784r62970
9373H4083j516460o51858Q54665J292547K08496j239510j500201k8767J978087
9364e18918K576876J355407r5062n40531m87520l85611M74645J843984J683373
9355E906643n02799j978499r58563J47015j144085k684018j168723J932217K626180
9346B175368R69111L21245J026280J94308k367608l298486j381750O43532Q50609
9337h67391L95546J88327n01003j222331k74838J600003J574420k68468n93028
9328C1237J378606K218153R8041k157323j908346m90561J02178M21074R97103
$$ y = [-1872789, -128698, -541636, -1979999, -2989642, -4146982, -5740777, -5994230, -3797214, -1065986, -121120, -393221, 76321, 1312108, 1867688, 1524335, 1241837, 1047053, 84083, -1432377, -2084235, -1229570, 62977, 271473, -968037, -2468238, -2497005, -518918, 2057958, 3413365, 3318303, 2777772, 2290252, 1904641, 2379286, 4223270, 5906643, 5403844, 3425345, 2466782, 2613797, 1469712, -1214306, -2383029, -450812, 2175368, 3144479, 3465724, 4492004, 4686312, 2318704, -979782, -2361532, -1718000, -867391, -471845, -283518, -784521, -2006852, -2281690, -681687, 892733, 624265, 31237, 1409843, 3627996, 3726037, 1568714, -339632, -830193, -728015, -306941, 690162]
9319F90162L37618j781106k506617l05063K024849J678345J23593j8893O43802
9310H86690M51433M25577J903955K760291L44004l316124l730903p54467J134884
9301A05340m30372k630573k159692K61155J771521J476486O93799L83111K11627
9292c17598j74671l98519j28003K64128K86514O3055r6265m53761j271807j691499
9282c918426n12817J656111K557538J264421n90650j469357j897262k378714j548824
9273f837980J275047L595734K770473K18601o36173L09111J31011j853024k838951
9264c866151j060731J674804K868848K162574N50281r60087j351548l47605N63677
9255B34062j56535j526752j457176k81588n6177o62265O6679K168585K964710
$$ y = [690162, 1027780, -753326, -3259943, -3565006, -1540157, 138188, 261781, 242888, 886690, 1338123, 1763700, 3667655, 6427946, 6771950, 3455826, -275077, -1029544, 105340, -325032, -2955605, -5115297, -4854142, -3082621, -1606135, -912336, -529225, -317598, -492269, -890788, -1018791, -754663, -468149, -405094, -501359, -955120, -2226927, -3918426, -4431243, -2775132, -217594, 1046827, 456177, -1013180, -2910442, -5289156, -6837980, -5562933, -1967199, 803274, 1021875, 385702, 694813, 825824, -1027200, -3866151, -4926882, -3252078, -383230, 1779344, 2329625, 1369538, 17990, -329615, 234062, 77527, -1449225, -2906401, -3187989, -3244166, -3906431, -3839752, -1671167, 1293543]
9246A293543J354007m86276o42028J15745L52011j54445j232845k529442k539279
9237d469009j49951K636718K589135J13106j155345m7641O40248p13073j847271
9228b403083p25600J128554J429187M38363m02042p22427n22065N30428J773320
9219E24635J676133K86203n87948k56539R1790k05973o84152j492950k775980
9210c424781k713765R8268K811096J524325j826845j411251K986434M739780O93444
9201C476705l692179k920409N63189J365368n92148j649499p27139N53988J453276
9192b168848J895835J011128q85897j371636K48970J173239j64364j192880l8697
9183a493150Q27864n34237j262105J147887L355802J239235k758557l118241K42584
$$ y = [1293543, 2647550, 2161274, 1519246, 1634991, 1987002, 1832557, 599712, -1929730, -4469009, -4618960, -1982242, 606893, 719999, -435346, -482987, 157261, -555812, -2403083, -3128683, -2000129, -570942, -132579, -534621, -1257048, -1779113, -1248685, 524635, 2200768, 2486971, 1899023, 1642484, 1734274, 1528301, 844149, -648801, -3424781, -6138546, -6040278, -3229182, -1704857, -3531702, -4942953, -1956519, 2783261, 3476705, -215474, -3135883, -2572694, -1207326, -1799474, -3448973, -4176112, -3622124, -2168848, -273013, 738115, -147782, -1519418, -1270448, -97209, -261573, -1454453, -1493150, -665286, -1199523, -2461628, -1313741, 2042061, 3281296, 522739, -2595502, -2352918]
9174b352918K658510K200570R11313j59690j666503k468934o82240K024462J959231
9165B423801q06574k513810j482800L32557J433406K281084K627611J350878o66173
9156D979980j107599l7148K28646o86476n64735J342079K774459J844538n35532
9147H238212k251953k086400j65410J831812J379376j888990m590043l403090
9139b936486K66478K111512Q33525o68579R4602K128710K869693J223094j576123
9130D346426l000135j606233Q17872R41066j302487k021255P60136L497120K257872
9121D690382j296030k693732j178772N03685J019733J055199N04450q58611j236775
9112E09529N90016J946505j00322l195016k641351J121602L155001J640035l64854
$$ y = [-2352918, 305592, 2506162, 3417475, 3257785, 1591282, -877652, -1559892, 464570, 2423801, 1617227, -896583, -2379383, -2046826, -613420, 1667664, 4295275, 5646153, 4979980, 3872381, 3835233, 4063879, 3377403, 2812668, 4154747, 6929206, 8773744, 8238212, 5986259, 3899859, 3734449, 5566261, 6945637, 5056647, 466604, -2936486, -2670008, -558496, 275029, -393550, -298948, 1829762, 4699455, 5922549, 4346426, 1346291, -259942, 557930, 1498996, 196509, -1824746, -1064610, 2432510, 4690382, 3394352, 700620, -478152, 25533, 1045266, 2100465, 2604915, 1746304, 509529, 1099545, 3046050, 2945728, -249288, -2890639, -1769037, 1385964, 3025999, 2661145]
9103B661145p48477p27426r94970m96836K45641o76139k340810j652607J121681
9094c608798K344614J267104J019686K268512J667936j403324k515641L10829
9086A350918K347563m39855m454252l903870L18174K491506O77723j596627j350219
9077d558939N42861J993192K227159J376777k549p84579l53431L56797K71249
9068A068537m2820M98802J378188J203012O825q50730p60205l39262n8795J66436
9058B269988K4107j175236l078326l881696k183546J024184L053381K570368J230945
9049a45831J291922K144229J083495k262700m647075l565055o41588J221001J872829
9040c648773K507269K291478k9947k421364j520105J869744L148571L63738l137358
$$ y = [2661145, 1912668, 1185242, 190272, -306564, -60923, -737062, -3077872, -4730479, -3608798, -1264184, 2920, 1022606, 3291118, 4959054, 3555730, 1040089, 1350918, 3698481, 3258626, -1195626, -5099496, -4781322, -2289816, -1612093, -3208720, -4558939, -4016078, -2022886, 204273, 1581050, 1578501, 793922, 440491, 797288, 1068537, 1025717, 1524519, 2902707, 4105719, 4112544, 3261814, 2501609, 2162347, 2103552, 2269988, 2294095, 1118859, -1959467, -5841163, -8024709, -7000525, -3947144, -1376776, -145831, 1146091, 3290320, 4373815, 2111115, -2535960, -6101015, -6742603, -5521602, -3648773, -1141504, 1149974, 1120027, -1301337, -2821442, -951698, 2196873, 2560611, -576747]
9031e76747l424555m51836L084585M700817L168665p38017l722436k772917P54401
9022B1960K499215J150536k1810J238927K546037R40309k318981l734245k407856
9013h5908l31132Q84633J294392J417739J553206J808416J664668K16943k236771
9004F186186l744692k802350k01812J894094K060587N14750j177736j194861O22989
8995B157155J992343P08135k191303l521850k181712k47279L64489J16113J52407
8986b651502M91581P70937J057648J170715P11542J66239L52352O64669j39376
8977B594805j372146j074250N28336J034640n3283l36005J203912K024594P1256
8968D621859k620516k809869p14157O74877j24007j593712j545964N17559L122194
$$ y = [-576747, -4001302, -4453138, -1368553, 3332264, 6500929, 5762912, 2040476, -732441, 21960, 2521175, 3671711, 3649901, 4888828, 7434865, 8375174, 6056193, 2321948, -85908, -417040, 467593, 1761985, 3179724, 4732930, 6541346, 8206014, 8422957, 6186186, 2441494, -360856, -562668, 1331426, 3392013, 3906763, 2729027, 1534166, 2157155, 4149498, 4857633, 2666330, -855520, -3037232, -3284511, -2920022, -2803909, -2651502, -2159921, -1388984, -331336, 839379, 1550921, 1717160, 2069512, 2734181, 2594805, 1222659, 148409, 676745, 1711385, 1658102, 1322097, 2526009, 4550603, 4621859, 2001343, -808526, -1522683, -847806, -971813, -2565525, -4111489, -3593930, -471736]
8959d71736M140814K731637J68941j679347k187523j493346M48749K526798J933142
8950F118129j928814m533196j545693L846199M324960o72449l754619r97472K098734
8941B955779j70288m549865m396071L0895L095358K715225J443653L88594j599024
8932h5744l259354j575443K336708L443862K60605k590367j161828K403399L531740
8923C303578J308363j449258k205536q55998Q27235P35410j399727k982993j437687
8914d156613J766922K513622N6088j463074Q68978M104050L644005j26064k813754
8905D394160k482715j473554j736068j895362k77401J906713K453806J457771
8897B347350N14461j26465j181732j832511m51310K006287K252960n92463l133489
$$ y = [-471736, 3669078, 6400715, 6569656, 4890309, 2702786, 1209440, 1658189, 4184987, 6118129, 4189315, -343881, -1889574, 1956625, 6281585, 5609136, 1854517, 857045, 2955779, 2785491, -1764374, -6160445, -6129550, -3034192, -318967, 1124686, 1513280, -85744, -3345098, -4920541, -2583833, 860029, 1120634, -1469733, -2631561, -228162, 3303578, 4611941, 3162683, 957147, 101149, 928384, 1663794, 264067, -2718926, -4156613, -2389691, 123931, 180019, -1283055, -414077, 3689973, 7333978, 7207914, 4394160, 1911445, 437891, -1298177, -3193539, -3470940, -1564227, 889579, 2347350, 2861811, 2735346, 1553614, -278897, -730207, 1276080, 3529040, 2936577, -196912]
8888a96912k333862K41173J163664J88960m40281l48277j023519j928536o06200
8879e283790K656859M070499J851946q09747n55836J179227R06265j262878k088462
8870F64083m35166J219388O53400j249210k132876r50030J408104L052224K477685
8861D707602J15579j553957o80207J337638J500381n21801j834464p32052N47338
8852B886057p40535l281177l224252J51227L072182K313255p03954k281080j148544
8843b956821J000540K362883K349558R64891r68497j598753k46170Q78320l33062
8834A452889j986914o21914K856956L785128P49605k412384k812823k038573j595209
8825b623239P9655L055727L531134J94484j949080O60898L254371K07368m659257
$$ y = [-196912, -2530774, -2289601, -1125937, -936977, -1377258, -1725535, -2749054, -4677590, -5283790, -2626931, 1443568, 3295514, 2485767, 1929931, 3109158, 4015423, 2752545, 664083, 228917, 1448305, 2101705, 852495, -1280381, -2230411, -822307, 2229917, 4707602, 4823181, 3269224, 2589017, 3926655, 5427036, 4905235, 3070771, 2338719, 2886057, 2145522, -1135655, -4359907, -4208680, -1136498, 1176757, 472803, -1808277, -2956821, -1956281, 406602, 2756160, 3721051, 2752554, 1153801, 907631, 1785951, 1452889, -534025, -1155939, 1701017, 5486145, 6235750, 3823366, 1010543, -1028030, -2623239, -2543584, 512143, 4043277, 4237761, 2288681, 2949579, 6203950, 6411318, 1752061]
8816A752061l459123K570701M459384l08454m228397j993607K210562K712519
8808C715646L91003j175165j593686j585836J3133L128279M372550J762524j885132
8799G143316l172676k362868j108186K52082R61445m20840k425085j365318K261582
8790b36548L292856K28638j956867m89881M10275k171276l711327m12473L000151
8781b046452J011853k778916j866549J728651J544683j290033k72807M017283
8773D7713M134820j442472n621092m276118j470550p58128K23893L094368M267300
8764a800266J414444j787095j632863N9776L04811O2933J086036J988136J333388
8755A029300P06355J070654P9745l134931m548252j114294L471704L807180P50165
$$ y = [1752061, -1707062, 863639, 5323023, 5014569, 786172, -1207435, 1003127, 3715646, 4106649, 2931484, 1337798, -248038, -234905, 2893374, 7265924, 9028448, 7143316, 3970640, 1607772, 499586, 751668, 1713113, 1292273, -1132812, -2498130, -236548, 3056308, 3284946, 1328079, 838198, 1248473, -922803, -4634130, -5046603, -2046452, -1034599, -3813515, -5680064, -3951413, -2406730, -3696763, -3969570, 47713, 4182533, 2740061, -2881031, -7157149, -8627699, -9385827, -9161934, -6067566, -1800266, -385822, -2172917, -3805780, -3746004, -3441193, -3378260, -2292224, -304088, 1029300, 1735655, 2806309, 2886054, -248877, -4797129, -5911423, -2439719, 1367461, 2117626]
8746B117626p60185L24270P13066r05120k243115j829027o14732P93631K535702
8737A32116L159374Q84463k465844k719892O39350L354682K411834k50035j546816
8728C599232j504040j596719j599701o95180K45170J20484o5860J095705K462475
8719B061566J792826m05136j243109K80789J955226J788599M26760o83443j372710
8710D601368j812573j453450m04908k05437j479513k288443q43991J340546J403613
8701a142788m87430j319073L00469K359775K569101J094606n39197j425837j312856
8692I6770k29026J002859J087578j21808j266608j225255k90172O32964R83748
8683F71050O02702j00078j00809R77138J897955J448509L98263P8338j43599j593442
$$ y = [2117626, 1357441, 1681711, 2394777, 1489657, -753458, -2582485, -3197217, -2403586, 132116, 3291490, 4175953, 1710109, -1009783, -370433, 2984249, 5396083, 5146048, 3599232, 2095192, 498473, -1101228, -1796408, -1551238, -1430754, -1496614, -400909, 2061566, 3854392, 3449256, 2206147, 2486936, 4442162, 6230761, 6657521, 5974078, 4601368, 2788795, 1335345, 930437, 725000, -754513, -3042956, -3886947, -2546401, -1142788, -1630218, -2949291, -2648822, -289047, 2280054, 3374660, 2835463, 1409626, 96770, -132256, 870603, 1958181, 1836373, 569765, -655490, -945662, -312698, 671050, 1273752, 1173674, 1072865, 2050003, 3947958, 5396467, 5794730, 5873068, 5729469, 4136027]
8673D136027l254749k949221j112876j35123k32130K99206Q78674p82898l438893
8664f591983k789482J319871L525226J179846j409813l41540J612721O38009j063850
8655c920995M32633L208065K630128n03133j511498M2403L50371j198995j144198
8646a615219J121609J787318o42255k530353j010570J857060K911135J963595
8638C842320J29474k195229l647172j815246K618845M792424J639471l423474
8630A941413m777769j825004J135664J241957J19118L97697J784938J987754L35045
8621B340813j210736q37922N78185P89890o05111j788625j505930n22439L3528
8612b728347K1055n13127j552093j941506k69208K308396K771570Q55916j16580
$$ y = [4136027, 881278, -2067943, -3180819, -3315942, -3548072, -3248866, -2370192, -3153090, -6591983, -9381465, -8061594, -4536368, -3356522, -4766335, -5107875, -3495154, -2857145, -3920995, -3488362, -280297, 2349831, 1846698, 335200, 377603, 727974, -471021, -1615219, -493610, 1293708, 651453, -1878900, -2889470, -1032410, 1878725, 3842320, 3971794, 1776565, -1870607, -3685853, -1067008, 3725416, 5364887, 1941413, -2836356, -4661360, -3525696, -2283739, -2164621, -1766924, 18014, 2005768, 2340813, 1130077, 292155, 870340, 1660230, 1055119, -733506, -2239436, -2761875, -2728347, -2707292, -3220419, -4772512, -6714018, -6983226, -4674830, -1903260, -1047344, -1163924]
8603a163924J392052K424271N88601j700225j322472L24989M2573j762608k352864
8594c529607j311119j59503P62649J584302J289101J69741R97785M004662M386727
8585H194738l27035m423762j873900L515481L535714j384449l342184j22892J998382
8576E770093o59882l967415l818986j621842L00998K008550K640577M21179k283373
8567a210101p79332L385331L222256k096382m670194l64574M361982K918038j641384
8558C125640k936722q45679J141000K419716L252462J448030l147996n640994
8550a184543l028267O73436J380830J416378L281474L222421j703736n957847
8542a899854l442390J772998J918854j354074n68042L655684L412044k390752
$$ y = [-1163924, 228128, 2652399, 3241000, 1540775, 218303, 543292, 585865, -1176743, -3529607, -4840726, -5000229, -4237580, -2653278, -1364177, -1194436, -196651, 3808011, 8194738, 7867703, 3443941, 1570041, 5085522, 8621236, 7236787, 3894603, 3771711, 5770093, 5110211, 1142796, -2676190, -4298032, -3997034, -1988484, 652093, 1073272, -1210101, -1989433, 1395898, 4618154, 2521772, -2148422, -2512996, 1848986, 4767024, 3125640, 188918, -656761, 484239, 2903955, 6156417, 7604447, 4456451, -1184543, -4212810, -3539374, -2158544, -742166, 2539308, 5761729, 4057993, -1899854, -5342244, -3569246, -1650392, -3004466, -3572508, 83176, 3495220, 1104468]
8534A104468n711814k527267J584943J626247J96734P97936J599762J14595j728535
8525b942931j256688N98230J820628K388743K489534J414313K9094M14904J650105
8516F605932L81097l014859l893771q80036J462040J83973j288966L59288K247251
8507B161949N01281k626572k385318N74380J595578k92129j520685l20251J053829
8498a257938Q56073L63122P72763J064822M48835J73097J055322J310800q84303
8489C902593l801379l652616J61922L470827K335164j676119l313211n16055K980152
8480a08722K877054j02926j913385r30930O61595O87746m75123j428919j695240
8471b428850j493297j044417n68613l2496R56273K067985J877291N9606j101732
$$ y = [1104468, -4607346, -7134613, -5549670, -3923423, -3726689, -2928753, -1328991, -1214396, -2942931, -4199619, -3601389, -1780761, 607982, 3097516, 4511829, 4540923, 4955827, 6605932, 6987029, 3972170, 78399, -801637, 660403, 844376, -444590, -85302, 2161949, 2663230, 36658, -2348660, -1774280, -178702, -470831, -1991516, -2311767, -1257938, -401865, -38743, 734020, 1798842, 2247677, 2420774, 3476096, 4786896, 3902593, 101214, -3551402, -3389480, 81347, 2416511, 740392, -2572819, -3088874, -108722, 2768332, 2665406, 752021, -178909, 482686, 1170432, 695309, -733610, -2428850, -3922147, -4966564, -5535177, -5567673, -4611400, -2543415, -666124, -606518, -1708250]
8462a708250M02655K805665K692920J34503j468546o90531K03372m30249j057830
8453H83709k77327M13143n98588j846849r81498J318001K175875O66641j004171
8444G48936n81722J337313K017462o9303k945542k957096N78667L832771L160434
8435E121920R8158r50272P17783J380086q89449l075858k006722Q92420K097306
8426C385372R81007l36551o74932q13997j553520k678653l415677k725674R810
8417g822815L536311N105012L498722N66308j292620j750207j530923n93762R23326
8408F39352J553980L93539j069969j051281k30730k61534o99592n2921Q97007
8399A17851j38519k829435l801898j237654K379230L430504J572660l94734k63036
$$ y = [-1708250, -1305595, 1500070, 4192990, 4327493, 2858947, 2168416, 2371788, 1941539, 883709, 606382, 1019525, 420937, -1425912, -2407410, -1089409, 1086466, 1753107, 748936, 167214, 1504527, 3521989, 3452686, 507144, -2449952, -1871285, 1961486, 5121920, 5220078, 4269806, 4987589, 6367675, 5478226, 2402368, 395646, 1288066, 3385372, 4366379, 4029828, 3354896, 2540899, 987379, -1691274, -5106951, -7832625, -7822815, -4286504, 818508, 4317230, 4883538, 3590918, 1840711, 309788, -283974, 639352, 2193332, 2586871, 1516902, 465621, 234891, -26643, -726235, -779156, 117851, -20668, -2850103, -6652001, -7889655, -5510425, -2079921, -507261, -901995, -1165031]
8390a165031J254323J927622R93152O895L65732P87739j052285m326150m946122
8381f154125j084940L450603L836598O04963j673627j108509k39408r68095j502722
8372d839262J81543K709441L203368J115609j569872k838526k109887k01437J285262
8363c063761J470768J395296K340118L081269J274367k088522k942504k79211
8355A187820J608229l95829l016994j731749J777361K356206j90969j214562O02045
8346I81558J313999q77263k286113m79196J032513j158838l937256k300353K419149
8337e291800M344379J768186r89619l49217K239023L428897K036582q11593l024071
8328C350767k627498K60296K575546J658172j041487k184546j571814j486481
$$ y = [-1165031, 89292, 2016914, 3010066, 3016961, 3382693, 4170432, 3118147, -1208003, -6154125, -7239065, -3788462, 48136, 653099, -1020528, -2129037, -2368445, -3336540, -4839262, -4657719, -1948278, 1255090, 2370699, 800827, -2037699, -4147586, -4349023, -3063761, -1592993, -197697, 2142421, 5223690, 6498057, 4409535, 1467031, 1187820, 2796049, 2400220, -616774, -2348523, -571162, 1785044, 1594075, 379513, 981558, 2295557, 1418294, -867819, -1347015, -314502, -1473340, -5410596, -7710949, -5291800, -947421, 820765, -168854, -518071, 1720952, 5149849, 7186431, 6374838, 3350767, 723269, 983565, 3559111, 5217283, 4175796, 1991250, 419436, -1067045]
8320a067045j729030J92603L599279M225762P87305k513686k250856m62942m03042
8311C78348j379076j070799K16533J051223J821455K723154J604394k276425m963405
8302a894598k804905J364487K048346m53444j012898J523045K607222m2644k608620
8293a274009j640759N80677M74352q37006P2919K850683L716377J105378k327029
8284B721583l442477k014721L0446J100196R81446L43727o3598J00526O27402
8275C84530Q47354P8129j416265k005461l68930K111127K264548n89277l117515
8266a811760k409748o6004O18850j33694M18302K307962K622245N80589j095268
8257A031474p67733j67092o92470q84889M47084J624689R89566j40470K5480M11651
$$ y = [-1067045, -2796075, -2603472, 995807, 5221569, 6008874, 3495188, 1244332, 781390, 378348, -1000728, -2071527, -1854994, -803771, 1017684, 3740838, 5345232, 3068807, -1894598, -4699503, -3335016, -1286670, -1740114, -2753012, -1229967, 1377255, 1334611, -1274009, -2914768, -2334091, -1859739, -2696745, -2623826, 226857, 3943234, 5048612, 2721583, -720894, -2735615, -2705169, -1604973, -623527, -279800, -343398, -242872, 384530, 1231884, 1310013, -106252, -2111713, -2480643, -369516, 1895032, 1305755, -1811760, -4221508, -4287512, -3668662, -3802356, -3384054, -1076092, 1546153, 2126742, 1031474, 263741, 96649, -595821, -1480710, -1033626, 591063, 1580629, 1440159, 1465639, 1877290]
8247A877290r35298l017043k949823j97595K678918L305515J776787j65822r50700
8238A422229l59463L80125J23649m82695j04530N01345q47014l663827m315351
8229g345532j316640J799384J478090n40792k12111K424388L701344K218519L67329
8220B573979l1551r3688j158743k462824k487924q34044J680016L338327K312002
8211B835550j014188l170418j501001J697952J979660o68915j789684N27426K709293
8202A605675J486947j166876j662395m11692l61159j736757j960275k16954J283483
8193c140003J014925L63163J028504K104178J362631j294647l208762k109948
8185c879959R95330K948436K176857J39969j164303j526426j387669k70811J610080
$$ y = [1877290, 941992, -2075051, -5024874, -5222469, -2543551, 761964, 2538751, 2372929, 1422229, 1062766, 1442891, 1566540, 1083845, 979315, 1480660, 633646, -3030181, -7345532, -8662172, -6862788, -5384698, -5925490, -6137601, -3713213, -11869, 2206650, 2573979, 2542428, 2448740, 1289997, -1172827, -3660751, -4494795, -2814779, 523548, 2835550, 1821362, -1349056, -2850057, -1152105, 827555, 158640, -1631044, -1103618, 1605675, 3092622, 1925746, 263351, -148341, -509500, -2246257, -4206532, -4423486, -3140003, -2125078, -1761915, -733411, 1370767, 2733398, 1438751, -1770011, -3879959, -2884629, 63807, 2240664, 2380633, 1216330, -310096, -1697765, -1968576, -358496]
8176c58496J891786p24746l061553j294896K356529J871784k908105m771752j6636
8167g016085N036416L291600k173565l005362J619167M585081K211554j513474
8159C035332k748700k723569k827341j289612K091975L541070J373966m49225
8151C896J047967K383029k79270l748132k590015J718300L083679N88205q52037
8142A355622P47245J779925J08333j499463j022139p24990k254783k990739p18948
8133e219937J931904J483162r00644j611796n9327J563489K154629K009678Q33823
8124B184981j208658j814780N86057L274052K214225j885284m183538k447341
8116c280286M58801J473041J180292J317252J509316O71657m46650m41405K60045
$$ y = [-358496, 1533290, 808544, -2253009, -3547905, -1191376, 680408, -2227697, -6999449, -7016085, -1979669, 1311931, -861634, -3866996, -2247829, 2337252, 4548806, 3035332, 286632, -2436937, -5264278, -6553890, -4461915, -920845, 453121, 3896, 1051863, 3434892, 3155622, -592510, -3182525, -1464225, 1619454, 2207659, 1355622, 2102867, 3882792, 3991125, 2491662, 1469523, 744533, -1510250, -4500989, -5219937, -3288033, -1804871, -2705515, -4317311, -4376638, -2813149, -658520, 1351158, 2184981, 976323, -838457, -252400, 3021652, 5235877, 3350593, -832945, -3280286, -2821485, -1348444, -168152, 1149100, 2658416, 3330073, 2883423, 2442018, 2702063]
8107B702063J52821q08732j228421n34586K77826K43791l27491m78521J27044
8098A25794P79618M08893j159611k567421k083551K44330K220398J961871K45920
8089A76241n54048L48142J271085O91948n42758p01523L8090m6768j221048j574614
8079b115253m3181J568414J047323r29956j790892p04590P29301J198948J064633
8070B4747Q24772J62253q54142j279821p74106j97646p9391J68382Q90266J394576
8060B79890J100966J74154j267574k898626l025188j52854L663745M064007M64903
8051B403423k254116n58836K290897J139298l038325m499971j223237K584207
8043c156660K957284J113934L91162J318475J894598R82914o24372j832604k445088
$$ y = [2702063, 2854884, 2046152, 817731, 283145, 560971, 804762, 477271, -1250, 125794, 905412, 1314305, 154694, -2412727, -4496278, -4251948, -2031550, -69679, 176241, -377807, -29665, 1241420, 1933368, 1390610, 689087, 727177, 680409, -540639, -2115253, -2158434, -590020, 457303, -472653, -2263545, -2968135, -2238834, -1039886, 24747, 849519, 1011772, 157630, -1122191, -1896297, -2093943, -2173334, -2004952, -1114686, 279890, 1380856, 1555010, 287436, -2611190, -5636378, -5789232, -2125487, 1938520, 2403423, 149307, -409529, 1881368, 3020666, -17659, -4517630, -5740867, -3156660, -199376, 914558, 1305720, 2624195, 4518793, 5501707, 4877335, 3044731, 599643]
8034E99643k692104k281819n06040K274318L750595J849720j907440l301663p58515
8025b973305K407337K760185J331873R35479J266320K28760j516494j455174Q5853
8016C070834K62245j416924k506680k091893j862990k160886r27888K240715M587693
8007h05774M163777K248591O27664n30908j051710k22775R57059K70161j810130
7998C845955k175473l07601M35996j497213k957698j264520J614111K845692K976158
7989C515407L247098K309980o87706k952486j967731J72415K57595r13810r47422
7980B033340n61602j308806j296546J556925M234960K430450j905437l013577
7972B169707m89240N05607j779500l169011j169621J252436J519853J274489J806544
$$ y = [599643, -2092461, -4374280, -4880320, -2606002, 1144593, 2994313, 1086873, -2214790, -2973305, -565968, 2194217, 3526090, 4461569, 5727889, 5956649, 4440155, 2984981, 3070834, 3333079, 1916155, -590525, -2682418, -4545408, -6706294, -7634182, -5393467, -805774, 3358003, 5606594, 6234258, 5703350, 4651640, 4428865, 5385924, 5656085, 3845955, 1670482, 1362881, 1798877, 301664, -2656034, -3920554, -2306443, 539249, 3515407, 6762505, 9072485, 8384779, 5432293, 3464562, 3636977, 3894572, 2980762, 2033340, 1471738, 162932, -1133614, 423311, 4658271, 7088721, 5183284, 2169707, 1680467, 2186074, 406574, -2762437, -3932058, -2679622, -1159769, 114720, 1921264]
7963A921264J029315j862628l533705j829810K51911l89698j746813m91487K343530
7954d308121L605206L134168K530574J360770j153099k921415j875913p9492m23298
7945a30620j224176O92539L200637J393312l548486m715951J14774M799008M048850
7936D629887O15260l26772R44377J001419k66731o06226l84306j444715k429017
7927A733176n10261K644860J999385k902435o063453l249988J989086L563737
7919g95893J113394o85652N02998J932166N39348k658578m176800k331257J324017
7910e236257L905640L621672R19361j881162k372809k90750K010715J946605l04724
7901B318291j929094j017588R46169J297487J57983P1532J499036J450613j665190
$$ y = [1921264, 2950579, 1087951, -2445754, -4275564, -4023653, -4413351, -6160164, -6651651, -4308121, -702915, 2431253, 4961827, 6322597, 5169498, 2248083, 372170, 292678, -130620, -1354796, -662257, 2538380, 3931692, 383206, -4332745, -4217971, 581037, 4629887, 5245147, 4918375, 5862752, 6864171, 6597440, 5991214, 5606908, 4162193, 1733176, 1222915, 3867775, 5867160, 2964725, -3098728, -6348716, -4359630, -795893, 317501, -368151, 134847, 2067013, 2606361, -52217, -4229017, -6560274, -5236257, -1330617, 2291055, 3210416, 1329254, -1043555, -1334305, 676410, 2623015, 2318291, 389197, -628391, 317778, 1615265, 1773248, 1844780, 3343816, 4794429, 3129239]
7892C129239m362362k475856K178553L618946J56763l249569k427957L37381P45352
7883b349510q20568q23754J310321K761338K131746Q36202j64336j419701k453635
7874i91897j618799O22210J404861k55562j714569q21966Q56046J008921M25524
7865a085231J138356K322333J233854k134653m259132k618655J022788K952983
7857a427357J890615j55604q71428k92145j02370r19932j298176J29068K324889
7848g22440K858538J074452j084164j731758j172877o43134k32644N82396J191372
7839A19741M24064j169941j361240P02417K799591K298114j86673j443812o493
7830B175768J937558J805141J07578r79607j216707j996004l050558k521097o44039
$$ y = [3129239, -1233123, -3708979, -1530426, 2088520, 2245283, -1004286, -3432243, -3094862, -2349510, -3170078, -3993832, -2683511, 77827, 2209573, 3045775, 2881439, 1461738, -991897, -2610696, -1988486, -583625, -839187, -2553756, -3375722, -2519676, -1510755, -1085231, 53125, 2375458, 3609312, 1474659, -2784473, -5403128, -4380340, -1427357, 463258, 307654, -563774, -855919, -958289, -1878221, -3176397, -3047329, -722440, 2136098, 3210550, 2126386, 394628, -778249, -1421383, -1654027, -1071631, 119741, 543805, -626136, -1987376, -1284959, 1514632, 3812746, 3626073, 2182261, 2175768, 4113326, 5918467, 6026045, 5046438, 3829731, 1833727, -1216831, -3737928, -4381967]
7821d381967r8119j403328j283163K090099N241483M089338J91658j683155p53269
$$ y = [-4381967, -4480086, -5883414, -7166577, -5076478, 165005, 4254343, 4446001, 2762846, 2009577]
$$ [...]
##END NTUPLES=NMR SPECTRUM
##END=
