##TITLE=31Pdec_SR47_k_vak
 CDCl3, 24 sc
 25.10.2021
##JCAMPDX= 6.0         $$ Bruker NMR JCAMP-DX V2.0
##DATA TYPE= NMR SPECTRUM
##DATA CLASS= NTUPLES
##ORIGIN= UXNMR, Bruker Analytische Messtechnik GmbH
##OWNER= root
$$ XWIN-NMR		Version 3.5
$$ Mon Oct 25 11:43:06 2021 Russian Standard Time (UT+4h)  she@DPX200
##.OBSERVE FREQUENCY= 81.013821
##.OBSERVE NUCLEUS= ^31P
##.ACQUISITION MODE= SIMULTANEOUS
##.ACQUISITION SCHEME= undefined
##.AVERAGES= 24
##.DIGITISER RES= 16
##SPECTROMETER/DATA SYSTEM= spect
##.PULSE SEQUENCE= zgpg30
##.SOLVENT NAME= CDCl3
##.SHIFT REFERENCE= (INTERNAL, CDCl3, 0, 248.564)
##AUDIT TRAIL= $$ (NUMBER, WHEN, WHO, WHERE, WHAT)
$$ ##TITLE= Audit trail, XWIN-NMR		Version 3.5
$$ ##JCAMPDX= 5.01
$$ ##ORIGIN= Bruker BioSpin GmbH
$$ ##OWNER= she
$$ F:/spectra/data/she/nmr/P31/1/pdata/1/auditp.txt
$$ ##AUDIT TRAIL=  $$ (NUMBER, WHEN, WHO, WHERE, WHAT)
(   1,<2021-10-25 11:41:04.87 +0400>,<she>,<DPX200>,
      <created by zg, POWCHK disabled, PULCHK disabled
       configuration hash MD5:
       00 E9 B6 7A A2 85 ED C7 34 08 36 98 17 FE 4E 26
       data hash MD5: 32K
       C3 02 1F A9 45 61 96 6E 67 9A C7 2D 09 7D 19 81>)
(   2,<2021-10-25 11:41:08.25 +0400>,<she>,<DPX200>,
      <Start of raw data processing
       efp BC_mod = 2 LB = 1 FT_mod = 6 PKNL = 1 PHC0 = -8839.808 PHC1 = 115.669 SI = 64K 
       data hash MD5: 64K
       08 2D AD 06 BC A5 EF 22 2E 43 66 A6 93 AA EF FF>)
(   3,<2021-10-25 11:41:34.79 +0400>,<she>,<DPX200>,
      <pk PHC0 = 78.9208 PHC1 = -164.4001 
       data hash MD5: 64K
       FD 7D ED 79 9C 37 18 58 42 87 CA 0C 07 6C 10 65>)
(   4,<2021-10-25 11:41:39.20 +0400>,<she>,<DPX200>,
      <abs ABSG = 5 
       data hash MD5: 64K
       30 7F 30 94 A1 F4 91 D3 28 B1 81 39 B9 CD 4E C6>)
$$ ##END=
$$ 
$$ hash MD5
$$ 1E D7 3C 95 7B 0B E3 B9 2E E8 85 37 36 74 02 09
##$RELAX= 
##$RELAX= 
##$RELAX= 
##$RELAX= 
##$RELAX= 
##$RELAX= 
##$RELAX= 
##$RELAX= 
$$ Bruker specific parameters
$$ --------------------------
##$DU= <F:/spectra>
##$EXPNO= 1
##$NAME= <P31>
##$PROCNO= 1
##$TYPE= <nmr>
##$USER= <she>
##$AMP= (0..31)
100 100 100 100 100 100 100 100 100 100 100 100 100 100 100 100 100 100 
100 100 100 100 100 100 100 100 100 100 100 100 100 100 
##$AQSEQ= 0
##$AQ_mod= 1
##$AUNM= <au_zg>
##$AUTOPOS= <>
##$BF1= 81.014009
##$BF2= 200.13
##$BF3= 200.13
##$BF4= 200.13
##$BF5= 200.13
##$BF6= 200.13
##$BF7= 200.13
##$BF8= 200.13
##$BYTORDA= 1
##$CFDGTYP= 0
##$CFRGTYP= 5
##$CHEMSTR= <none>
##$CNST= (0..31)
1 1 145 1 1 1 1 1 1 1 1 1 1 1 1 1 1 1 1 1 1 1 1 1 1 1 1 1 1 1 1 1 
##$CPDPRG= <waltz16>
##$CPDPRG1= <>
##$CPDPRG2= <waltz16>
##$CPDPRG3= <>
##$CPDPRG4= <mlev>
##$CPDPRG5= <mlev>
##$CPDPRG6= <mlev>
##$CPDPRG7= <mlev>
##$CPDPRG8= <mlev>
##$CPDPRGB= <>
##$CPDPRGT= <>
##$D= (0..31)
0 1 0 0 0 0 0 0 0 0 0 0.03 2e-05 3e-06 0 0 0 0 0 0 0 0 0 0 0 0 0 0 0 0 
0 0 
##$DATE= 1635147664
##$DBL= (0..7)
120 120 120 11 120 120 24 19 
##$DBP= (0..7)
150 150 150 150 150 150 150 150 
##$DBP07= 0
##$DBPNAM0= <>
##$DBPNAM1= <>
$$ [...]
##$SUBNAM3= <"">
##$SUBNAM4= <"">
##$SUBNAM5= <"">
##$SUBNAM6= <"">
##$SUBNAM7= <"">
##$SUBNAM8= <"">
##$SUBNAM9= <"">
##$SW= 501.771253377433
##$SWIBOX= (0..15)
0 1 3 0 0 0 0 0 0 0 0 0 0 0 0 0 
##$SW_h= 40650.406504065
##$TD= 32768
##$TD0= 1
##$TE= 0
##$TE2= 300
##$TE3= 300
##$TEG= 300
##$TL= (0..7)
0 120 53 12 22 120 120 120 
##$TP= (0..7)
150 150 150 150 150 150 150 150 
##$TP07= 0
##$TPNAME0= <>
##$TPNAME1= <>
##$TPNAME2= <>
##$TPNAME3= <>
##$TPNAME4= <>
##$TPNAME5= <>
##$TPNAME6= <>
##$TPNAME7= <>
##$TPOAL= (0..7)
0.5 0.5 0.5 0.5 0.5 0.5 0.5 0.5 
##$TPOFFS= (0..7)
0 0 0 0 0 0 0 0 
##$TUNHIN= 0
##$TUNHOUT= 0
##$TUNXOUT= 0
##$USERA1= <user>
##$USERA2= <user>
##$USERA3= <user>
##$USERA4= <user>
##$USERA5= <user>
##$V9= 5
##$VALIST= <valist>
##$VCLIST= <CCCCCCCCCCCCCCC>
##$VD= 0
##$VDLIST= <DDDDDDDDDDDDDDD>
##$VPLIST= <PPPPPPPPPPPPPPP>
##$VTLIST= <TTTTTTTTTTTTTTT>
##$WBST= 1024
##$WBSW= 4
##$XGAIN= (0..3)
0 0 0 0 
##$XL= 0
##$YL= 0
##$YMAX_a= 1562
##$YMIN_a= -1749
##$ZGOPTNS= <>
##$ZL1= 120
##$ZL2= 120
##$ZL3= 120
##$ZL4= 120
##$ABSF1= 248.5645
##$ABSF2= -253.2056
##$ABSG= 5
##$ABSL= 3
##$ALPHA= 0
##$AQORDER= 0
##$ASSFAC= 0
##$ASSFACI= 0
##$ASSFACX= 0
##$ASSWID= 0
##$AUNMP= <proc_1d>
##$AZFE= 0.1
##$AZFW= 0.5
##$BCFW= 0
##$BC_mod= 2
##$BYTORDP= 0
##$COROFFS= 0
##$CY= -3
##$DATMOD= 1
##$DC= 0
##$DFILT= <>
##$DTYPP= 0
##$F1P= 0
##$F2P= 0
##$FCOR= 1
##$FTSIZE= 65536
##$FT_mod= 6
##$GAMMA= 0
##$GB= 0
##$INTBC= 1
##$INTSCL= 5.30512e-09
##$ISEN= 30
##$LB= 1
##$LEV0= 0
##$LPBIN= 0
##$MAXI= 10000
##$MC2= 0
##$MEAN= 0
##$ME_mod= 0
##$MI= 50
##$NCOEF= 0
##$NC_proc= -8
##$NLEV= 6
##$NOISF1= 182.463
##$NOISF2= 159.3651
##$NSP= 0
##$NTH_PI= 0
##$NZP= 0
##$OFFSET= 248.5645
##$PC= 4
##$PHC0= -8760.887
##$PHC1= -48.7311
##$PH_mod= 1
##$PKNL= yes
##$PPARMOD= 0
##$PSCAL= 0
##$PSIGN= 0
##$REVERSE= no
##$SF= 81.014009
##$SI= 65536
##$SIGF1= 159.3651
##$SIGF2= -187.1042
##$SINO= 113.3802
##$SIOLD= 16384
##$SREGLST= <1H.CDCl3>
##$SSB= 0
##$STSI= 65536
##$STSR= 0
##$SW_p= 40650.406504065
##$SYMM= 0
##$S_DEV= 0
##$TDeff= 32768
##$TDoff= 0
##$TI= <>
##$TILT= no
##$TM1= 0
##$TM2= 0
##$TOPLEV= 0
##$USERP1= <user>
##$USERP2= <user>
##$USERP3= <user>
##$USERP4= <user>
##$USERP5= <user>
##$WDW= 1
##$XDIM= 65536
##$YMAX_p= 386719410
##$YMIN_p= -44211377
$$ End of Bruker specific parameters
$$ ---------------------------------
##NTUPLES= NMR SPECTRUM
##VAR_NAME=  FREQUENCY,     SPECTRUM/REAL,   SPECTRUM/IMAG
##SYMBOL=    X,             R,               I
##VAR_TYPE=  INDEPENDENT,   DEPENDENT,       DEPENDENT
##VAR_FORM=  AFFN,          ASDF,            ASDF
##VAR_DIM=   65536,         65536,           65536
##UNITS=     HZ,            ARBITRARY UNITS, ARBITRARY UNITS
##FACTOR=    0.620285442955139, 1,           1
##FIRST=     20137.2065510759, 0,            0
##LAST=      -20513.1999529892, 0,           0
##MIN=       -20513.1999529892, -44211377,   0
##MAX=       20137.2065510759, 386719410,    0
$$ Real data points
##PAGE= N=1
##DATA TABLE= (X++(R..R)), XYDATA
$$ [...]
$$ plain form
13029 -901926 -2578726 -1284450 2717257 5109340 4026507 2827027 4503952 7663915
13021 7663915 9686766 9750724 7469587 2914049 -821285 173345 4370052 5567877 1497668
13012 1497668 -3342551 -5125328 -5363173 -5822063 -4836496 -2251453 -2235759 -6511021 -9837783
13003 -9837783 -7611809 -3688583 -4674407 -9641142 -11760542 -8155528 -2212754 2573572
12995 2573572 5326523 5060854 890289 -4662893 -7284260 -6409370 -5203969 -4874785 -3380995
12986 -3380995 -440310 844961 -831203 -2143416 13554 3938269 6250936 7220713
12978 7220713 9511525 12717789 12832704 7925261 1773724 47688 3853706 8694889
12970 8694889 9659907 6177754 1251451 -2502624 -4678818 -5742368 -5684400 -4380488 -2278250
$$ packed form
13029i01926j676800J294276M001707K392083j082833j199480J676925L159963
13021G663915K022851O3958k281137m555538l735334R94630M196707J197825m070209
13012A497668m840219j782777k37845m58890R85567K585043J5694m275262l326762
13003i837783K225974L923226r85824m966735k119400L605014N942774M786326
12995B573572K752951k65669m170565n553182k621367Q74890J205401L29184J493790
12986c380995K940685J285271j676164j312213K156970L924715K312667R69777
12978G220713K290812L206264J14915m907443o151537j726036L806018M841183
12970H694889R65018l482153m926303l754075k176194j063550N7968J303912K102238
$$ plain form
12961 -2278250 -326433 429359 -468707 -1976214 -2005714 111742 2286319 2111654 -22647
12952 -22647 -1745860 -1805880 -547245 1678928 4086532 4243065 430650 -4889627 -7110549
12943 -7110549 -5163386 -2100058 -43198 1593505 2452773 543484 -3058905 -3530209
12935 -3530209 684135 4244423 2124685 -2906640 -4448394 -1556518 1335328 2115733
12927 2115733 3204614 5905388 7463485 5378877 1168747 -2077567 -3470373 -3909278
12919 -3909278 -3863027 -3452340 -3393916 -3848075 -3005442 1061096 6902565 9940926 7340080
12910 7340080 1318837 -3999977 -7798917 -11740174 -14399023 -11146874 -1852737 5649775
12902 5649775 4443809 -1836494 -3878788 277941 3673387 2023493 -346173 1428158
$$ packed form
12961b278250J951817P55792q98066j507507k9500K117456K174577j74665k134301
12952b2647j723213o0020J258635K226173K407604J56533l812415n320277k220922
12943g110549J947163L063328K056860J636703Q59268j909289l602389m71304
12935c530209M214344L560288k119738n031325j541754K891876K891846P80405
12927B115733J088881K700774J558097k084608m210130l246314j392806m38905
12919c909278M6251M10687N8424m54159Q42633M066538N841469L038361k600846
12910G340080o021243n318814l798940l941257k658849L252149R294137P502512
12902E649775j205966o280303k042294M156729L395446j649894k369666J774331
$$ plain form
12894 1428158 5357544 7400663 8232375 10050285 10743549 7086224 1212029 -1767950
12886 -1767950 -1203457 -783934 -1826513 -1695546 1094718 4614730 6785621 7198506 5364041
12877 5364041 867245 -3946559 -4856608 -812966 4152972 5195499 1284871 -4796969
12869 -4796969 -9355628 -10274986 -8053950 -4743124 -1335227 2787612 6897387 7657173
12861 7657173 3444548 -1845491 -2943853 -235128 1370216 318556 442623 3812804
12853 3812804 6178192 2907441 -3362138 -5280371 -484939 5023072 4573083 -677393
12845 -677393 -3703204 -1223918 2293715 1744958 -1015153 -699993 2305582 2137011 -2945996
12836 -2945996 -7363258 -7079086 -5749192 -7735101 -10177342 -7991521 -2972462 -990677
$$ packed form
12894A428158L929386K043119Q31712J817910O93264l657325n874195k979979
12886a767950N64493M19523j042579J30967K790264L520012K170891M12885j834465
12877E364041m496796m813804r10049M043642M965938J042527l910628o081840
12869d796969m558659r19358K221036L310826L407897M122839M109775P59786
12861G657173m212625n290039j098362K708725J605344j051660J24067L370181
12853C812804K365388l270751o269579j918233M795432N508011m49989n250476
12845f77393l025811K479286L517633n48757k760111L15160L005575j68571n083007
12836b945996m417262K84172J329894j985909k442241K185821N019059J981785
$$ plain form
12828 -990677 -2384771 -2428518 -319514 -67291 -2075603 -1586927 2474248 4346404 613097
12819 613097 -3654681 -2527814 1838414 3061729 -54174 -3249288 -3929482 -3513082 -3353321
12810 -3353321 -2627303 -653803 1697537 3425435 4235114 3814999 1902494 -820717 -3022072
12801 -3022072 -3832861 -3105100 -1272148 424264 641821 -299304 -545775 442710 524841
12792 524841 -2265795 -6525896 -8713663 -7195564 -3972552 -2481823 -4072100 -6388642
12784 -6388642 -5593200 -1168565 2224142 -168443 -6558466 -10137352 -7858559 -4123420
12776 -4123420 -3802193 -5210944 -3654613 531109 2218016 -792137 -4805448 -5892595
12768 -5892595 -4645034 -3352695 -1647599 1810388 5004060 3856589 -1682610 -6127218
$$ packed form
12828i90677j394094m3747K109004K52223k008312M88676M061175J872156l733307
12819F13097m267778J126867M366228J223315l115903l195114o80194M16400J59761
12810c353321P26018J973500K351340J727898Q09679m20115j912505k723211k201355
12801c022072q10789P27761J832952J696412K17557r41125k46471R88485Q2131
12792E24841k790636m260101k187767J518099L223012J490729j590277k316542
12784f388642P95442M424635L392707k392585o390023l578886K278793L735139
12776d123420L21227j408751J556331M185722J686907l010153m013311j087147
12768e892595J247561J292339J705096L457987L193672j147471n539199m444608
$$ plain form
12760 -6127218 -4968862 -547576 1329237 -551273 -1708572 769062 3761125 3039919
12752 3039919 -535002 -3119950 -4000110 -5370964 -6936354 -5435960 -322393 4208872
12744 4208872 4682014 2757275 2204940 3958699 6242910 7533844 7217653 4952738 1546748
12735 1546748 -773722 -961874 -950787 -2905070 -5592692 -5651581 -2156442 2002673 3517691
12726 3517691 2074365 -51432 -947643 -945920 -1533076 -2845826 -3216846 -1651555 534164
12717 534164 1839178 2964941 4890126 5823844 3457116 -139469 -38281 4149961 6574620
12708 6574620 3076284 -2791944 -4794774 -2220376 719912 1854357 3193974 6382354
12700 6382354 9583969 9813706 6287772 759214 -4153629 -6579500 -6249534 -4089276
$$ packed form
12760f127218J158356M421286J876813j880510j157299K477634K992063p21206
12752C039919l574921k584948q80160j370854j565390J500394N113567M531265
12744D208872M73142j924739n52335J753759K284211J290934l16191k264915l405990
12735A546748k320470j88152J1087j954283k687622n8889L495139M159115J515018
12726C517691j443326k125797q96211J723n87156j312750l71020J565291K185719
12717E34164J305014J125763J925185R33718k366728l596585J01188M188242K424659
12708F574620l498336n868228k002830K574398K940288J134445J339617L188380
12700F382354L201615K29737l525934n528558m912843k425871L29966K160258
$$ plain form
12692 -4089276 -1002224 2227494 3934900 2330527 -1810452 -4878800 -4179012 -710969
12684 -710969 2768238 4858949 5517083 4729647 2863152 1071753 17196 -687661 -1147651
12675 -1147651 -1211293 -2290573 -6132449 -10596137 -10384625 -4373089 1413762 1390247 -2311840
12666 -2311840 -3923402 -2219703 -37214 1641723 3684459 4675081 2520568 -637137
12658 -637137 -627517 2026221 3033124 1776398 1971209 4380339 4931617 1649225 -2140857
12649 -2140857 -3631669 -4383316 -5872355 -6038016 -3253652 351917 2391642 3321588 3615854
12640 3615854 1928770 -1237794 -2280824 20899 2000706 1344674 1236061 4284211
12632 4284211 7084542 5890110 3306091 3441302 4464265 2911837 1795060 5937898
$$ packed form
12692d089276L087052L229718J707406j604373m140979l068348O99788L468043
12684g10969L479207K090711O58134p87436j866495j791399j054557p04857m59990
12675a147651o3642j079280l841876m463688K11512O011536N786851k3515l702087
12666b311840j611562J703699K182489J678937K042736R90622k154513l157705
12658f37137R620K653738J006903j256726J94811K409130N51278l282392l790082
12649b140857j490812p51647j489039j65661K784364L605569K039725R29946K94266
12640C615854j687084l166564j043030K301723J979807o56032j08613L048150
12632D284211K800331j194432k584019J35211J022963j552428j116777M142838
$$ plain form
12624 5937898 11449874 9622348 1444898 -1883466 4307154 10269294 5824997 -5357235
12616 -5357235 -12159547 -11228449 -8313054 -7553017 -6991561 -4199715 -259708 2636410 3393334
12607 3393334 1404885 -2752256 -5894311 -4947425 -1385190 270560 -1343661 -3100996
12599 -3100996 -2793531 -2138671 -2841947 -3024078 -111826 4872543 8450309 8824254 6820788
12590 6820788 3875455 1215167 224268 1347679 2701341 1577015 -2374598 -6577610
12582 -6577610 -8190348 -6488875 -2952774 -107812 -64099 -2994059 -6928656 -9693411
12574 -9693411 -10602903 -9520586 -5508009 1498867 8184311 9749329 5191981 -1164151
12566 -1164151 -4348115 -3430011 -833079 1123895 1645421 980768 181909 406117 1289814
$$ packed form
12624E937898N511976j827526q177450l328364O190620N962140m444297j1182232
12616e357235o802312R31098K915395P60037N61456K791846L940007K896118P56924
12607C393334j988449m157141l142055R46886L562235J655750j614221j757335
12599c100996L07465O54860p03276j82131K912252M984369L577766L73945k003466
12590F820788k945333k660288r90899J123411J353662j124326l951613m203012
12582f577610j612738J701473L536101K844962M3713k929960l934597k764755
12574i693411r09492J082317M012577P006876O685444J565018m557348o356132
12566a164151l183964R18104K596932J956974N21526o64653p98859K24208Q83697
$$ plain form
12557 1289814 1192692 128889 641780 3922291 6874410 5756074 1521450 -1603001 -2231014
12548 -2231014 -2993502 -5431717 -7356386 -6582884 -4297881 -2905916 -2770688 -2815190 -2395446
12539 -2395446 -924216 2381603 6487438 8192554 6067916 3131783 3031676 4800390
12531 4800390 4274203 79067 -4692549 -6709090 -5657774 -3081733 -574781 224876
12523 224876 -1658671 -4551665 -4775919 -899769 3847775 4965871 1881182 -1540762
12515 -1540762 -1530098 1455026 3294061 556262 -5817073 -11187085 -11554175 -6980001 -834206
12506 -834206 3362142 3889639 1029915 -3188567 -6137660 -6923439 -7004484 -7247624 -5682303
12497 -5682303 -480104 5934651 9045669 8284098 7228559 7334097 5808910 1553931
$$ packed form
12557A289814r7122j063803N12891L280511K952119j118336m234624l124451o28013
12548b231014p62488k438215j924669P73502K285003J391965J35228m4502M19744
12539b395446J471230L305819M105835J705116k124638k936133j00107J768714
12531D800390n26187m195136m771616k016541J051316K576041K506952P99657
12523B24876j883547k892994k24254L876150M747544J118096l084689l421944
12515a540762J0664K985124J839035k737799o373335n370012l67090M574174O145795
12506h34206M196348N27497k859724m218482k949093p85779q1045k43140J565321
12497e682303N202199O414755L111018p61571j055539J05538j525187m254979
$$ plain form
12489 1553931 -1287347 616807 3648830 2056225 -3041458 -4914437 -1199745 2782175
12481 2782175 1987511 -1820400 -4033162 -3883102 -3637628 -3589524 -1954453 979744 2322761
12472 2322761 773518 -1432187 -1913731 -1457958 -2355402 -4647952 -5918702 -4666478 -2277851
12463 -2277851 -976621 -858487 -165992 1750210 3059150 1584282 -2481934 -6625391
12455 -6625391 -8186173 -6026803 -1071859 3717893 4881493 1804570 -1726227 -1227681
12447 -1227681 3021791 6142844 4790090 1021574 -1119213 -804664 -118134 41687 938164
12438 938164 2858267 3426269 281941 -5499966 -9643545 -8434081 -2450837 3311090
12430 3311090 3855329 -581556 -4656727 -4331573 -1794618 -1850191 -4472428 -4481323 723722
$$ packed form
12489A553931k841278J904154L032023j592605n097683j872979L714692L981920
12481B782175p94664l807911k212762J50060K45474M8104J635071K934197J343017
12472B322761j549243k205705m81544M55773q97444k292550j270750J252224K388627
12463b277851J301230J18134O92495J916202J308940j474868m066216m143457
12455f625391j560782K159370M954944M789752J163600l076923l530797M98546
12447a227681M249472L121053j352754l768516k140787L14549O86530J59821Q96477
12438I38164J920103N68002l144328n781907m143579J209464N983244N761927
12430C311090N44239m436885m075171L25154K536955n5573k622237q895N205045
$$ plain form
12421 723722 6657496 7271812 2571446 -2165191 -3279538 -1649884 657713 3211980
12413 3211980 6044089 8440497 10144608 11760402 12864791 11644761 7658316 3107901
12405 3107901 16646 -1859881 -2715436 -884308 3760223 6829167 4047109 -2067563
12397 -2067563 -4751681 -2339334 -148452 -1845701 -4254880 -3727080 -2695516 -5001591
12389 -5001591 -8250995 -6871811 -1079599 3446015 4541468 5936069 9532848 11431525
12381 11431525 8478562 3754856 1775328 2097950 1853168 1528078 3490459 6650173
12373 6650173 7417142 5296019 3267077 2806985 2575898 2284884 3766027 7030636 8848685
12364 8848685 7154215 4185247 3171176 3934551 4040335 3018139 3048501 5551866 8775260
$$ packed form
12421G23722N933774O14316m700366m736637j114347J629654K307597K554267
12413C211980K832109K396408J704111J615794J104389j220030l986445m550415
12405C107901l091255j876527q55555J831128M644531L068944k782058o114672
12397b067563k684118K412347K190882j697249k409179N27800J031564k306075
12389e001591l249404J379184N792212M525614J095453J394601L596779J898677
12381A1431525k952963m723706j979528L22622k44782l25090J962381L159714
12373F650173P66969k121123k028942m60092k31087k91014J481143L264609J818049
12364H848685j694470k968968j014071P63375J05784j022196L0362K503365L223394
$$ plain form
12355 8775260 9458733 6467233 2184033 -167456 -337480 -922301 -3032629 -4083506 -1594972
12346 -1594972 2648758 4937507 4765254 4191589 2975244 -1184659 -7111429 -9605190
12338 -9605190 -6345307 -1227268 1682715 3517785 6547962 8606901 6520859 2593089
12330 2593089 1930338 4186747 3807165 -908611 -4598903 -2815080 1570221 3277401
12322 3277401 2443732 3383742 7324292 10502509 9415008 4940287 707096 -683430
12314 -683430 580744 2073523 1218606 -2089276 -5127330 -5630985 -4647468 -4405822 -4264766
12305 -4264766 -1623114 3126087 5859182 4124460 246542 -2779784 -5365557 -8434283
12297 -8434283 -9498546 -6195201 -2032094 -3040129 -8604804 -11331899 -7670513 -3055352
$$ packed form
12355H775260O83473k991500m283200k351489j70024n84821k110328j050877K488534
12346a594972M243730K288749j72253n73665j216345m159903n926770k493761
12338i605190L259883N118039K909983J835070L030177K058939k086042l927770
12330B593089o62751K256409l79582m715776l690292J783823M385301J707180
12322C277401q33669R40010L940550L178217j087501m474721m233191j390526
12314f83430J264174J492779q54917l307882l038054n03655R83517K41646J41056
12305d264766K641652M749201K733095j734722l877918l026326k585773l068726
12297h434283j064263L303345M163107j008035n564675k727095L661386M615161
$$ plain form
12289 -3055352 -3178124 -5211743 -2840482 3493521 7515206 6680838 4624920 4082877 3268753
12280 3268753 790011 -792226 1189519 5541406 9276772 10859052 9647215 5054774
12272 5054774 -1614354 -6907209 -8793523 -8550067 -7891439 -6877158 -5941262 -6600758 -8072491
12263 -8072491 -6726407 -1763547 1976412 486601 -3212487 -3689237 -1359169 -989066
12255 -989066 -3433657 -4366825 -1179384 3751940 7239658 8446059 7223761 3508391
12247 3508391 -566017 -1890531 -1028185 -1848137 -5088344 -6471714 -3662253 -1025322
12239 -1025322 -3519285 -8521098 -8478563 -1206908 6504661 6700677 -693324 -8126004 -8811450
12230 -8811450 -3637460 531464 -1150177 -6365780 -9129694 -7146551 -3706528 -2608271
$$ packed form
12289c055352j22772k033619K371261O334003M021685q34368k055918n42043q14124
12280C268753k478742j582237J981745M351887L735366J582280j211837m592441
12272E054774o669128n292855j886314K43456O58628J014281R35896o59496j471733
12263h072491J346084M962860L739959j489811l699088m76750K330068L70103
12255i89066k444591r33168L187441M931324L487718J206401j222298l715370
12247C508391m074408j324514Q62346q19952l240207j383370K809461K636931
12239a025322k493963n001813M2535P271655P711569J96016p394001p432680o85446
12230h811450N173990M168924j681641n215603k763914J983143L440023J098257
$$ plain form
12222 -2608271 -3694115 -4304727 -3214877 -1609007 -1052571 -1676213 -2170678 -1342106 21467
12213 21467 -542657 -3887746 -7124342 -6783731 -3645503 -1842440 -3075852 -4593369 -3635480
12204 -3635480 -983446 1216010 2404234 2664079 1451838 -469862 -173628 3497175
12196 3497175 6802982 5094737 -915576 -5975548 -7139878 -6632860 -7196264 -7587399 -4879276
12187 -4879276 309458 3683819 2783302 472062 1150864 4583134 6210050 3867662
12179 3867662 957131 1041927 2406929 1522972 -425320 589497 3947986 4380870 231383
12170 231383 -3670855 -3309356 -666256 1053728 2604685 5479183 7685654 7097280 5709065
12161 5709065 6063736 6375034 4068762 1563747 2958212 6708656 7553936 5010823 3972888
$$ packed form
12222b608271j085844o10612J089850J605870N56436o23642m94465Q28572J363573
12213B1467n64124l345089l236596L40611L138228J803063j233412j517517R57889
12204c635480K652034K199456J188224K59845j212241j921700K96234L670803
12196C497175L305807j708245o010313n059972j164330N07018n63404l91135K708123
12187d879276N188734L374361r00517k311240O78802L432270J626916k342388
12179C867662k910531Q4796J365002q83957j948292J014817L358489M32884m149487
12170B31383l902238L61499K643100J719984J550957K874498K206471n88374j388215
12161E709065L54671L11298k306272k505015J394465L750444Q45280k543113j037935
$$ plain form
12152 3972888 6521496 8811355 7377474 3573316 16689 -2942078 -5112773 -4787903
12144 -4787903 -1771170 951617 1147371 638163 2292604 5473286 6748128 4202434
12136 4202434 -602253 -4572040 -6175321 -6689186 -8071478 -9498834 -7894872 -3153440
12128 -3153440 32005 -1382610 -3360702 -578764 4512341 4742767 -390706 -3591378
12120 -3591378 -997008 2791141 3389289 3089874 4557375 4727385 671707 -3680009 -3053043
12111 -3053043 757087 2294522 1151540 753276 959688 -1002153 -3513581 -1751846
12103 -1751846 3916789 7358220 5572214 2341081 1533550 2226820 2514163 3129728 4526678
12094 4526678 4501831 1854218 -702902 -263279 1937613 2461376 135670 -3443646 -6169617
$$ packed form
12152C972888K548608K289859j433881l804158l556627k958767k170695L24870
12144d787903L016733K722787J95754n09208J654441L180682J274842k545694
12136D202434m804687l969787j603281n13865j382292j427356J603962M741432
12128c153440L185445j414615j978092K781938N091105K30426n133473l200672
12120c591378K594370L788149N98148k99415J467501J70010m055678m351716O26966
12111c053043L810130J537435j142982l98264K06412j961841k511428J761735
12103a751846N668635L441431j786006l231133q07531O93270K87343O15565J396950
12094D526678k4847k647613k557120M39623K200892N23763k325706l579316k725971
$$ plain form
12085 -6169617 -6451461 -3723209 352660 2688604 2263120 1415006 2501600 4895436 6469305
12076 6469305 6291400 4538046 1588984 -1129214 -1016141 2988329 8368504 11186743
12068 11186743 9815400 5933102 2816659 3031139 6268756 8883791 7317231 2672065
12060 2672065 -115761 1501625 4650181 5475807 4014942 2620870 1907323 968933 -13807
12051 -13807 -262758 -507949 -1963835 -3833671 -4207024 -2928701 -1368461 70547 1783786
12042 1783786 2659613 633627 -3998639 -7974173 -8536595 -6089495 -2947560 -791901
12034 -791901 146367 443604 508737 -275011 -3180878 -8020356 -11827560 -11119389 -5732973
12025 -5732973 558306 3513273 1946755 -2026719 -5410279 -6779178 -6696919 -5949662 -4051171
$$ packed form
12085f169617k81844K728252M075869K335944m25484q48114J086594K393836J573869
12076F469305j77905j753354k949062k718198J13073M004470N380175K818239
12068A1186743j371343l882298l116443K14480L237617K615035j566560m645166
12060B672065k787826J617386L148556Q25626j460865j394072p13547r38390r82740
12051a3807k48951k45191j455886j869836l73353J278323J560240J439008J713239
12042A783786Q75827k025986m632266l975534n62422K447100L141935K155659
12034g91901R38268K97237O5133p83748k905867m839478l807204P08171N386416
12025e732973O291279K954967j566518l973474l383560j368899Q2259P47257J898491
$$ plain form
12016 -4051171 -551602 2628687 2278468 -2070942 -7134494 -9766596 -9798066 -8013189 -4084864
12007 -4084864 1413210 5506187 6115914 4871660 3912566 2199285 -1547533 -4539205
11999 -4539205 -3107809 1157255 3271443 2091335 710107 110947 -1859130 -4722382
11991 -4722382 -4742458 -1841570 -1157596 -4763896 -7431179 -4724354 -443488 -808352 -4847910
11982 -4847910 -6422103 -3775438 -1252183 -2008866 -4216184 -5204439 -5233469 -5670394 -6210117
11973 -6210117 -5546852 -3485512 -1399207 -949676 -2298199 -3524905 -2766318 -901699 -276551
11964 -276551 -727170 101932 1764941 432594 -4514062 -7615042 -4779489 140363 1014319
11955 1014319 -1306986 -1068867 2904408 5889504 4887879 1846786 -890408 -2957072
$$ packed form
12016d051171L499569L180289l50219m349410n063552k632102l1470J784877L928325
12007d084864N498074M092977O09727j244254r59094j713281l746818k991672
11999d539205J431396M265064K114188j180108j381228n99160j970077k863252
11991d722382k0076K900888O83974l606300k667283K706825M280866l64864m039558
11982d847910j574193K646665K523255p56683k207318r88255k9030m36925n39723
11973f210117O63265K061340K086305M49531j348523j226706P58587J864619O25148
11964b76551m50619Q29102J663009j332347m946656l100980K835553M919852Q73956
11955A014319k321305K38119L973275K985096j001625l041093k737194k066664
$$ plain form
11947 -2957072 -3276128 -404355 3273816 2839171 -1967855 -5555910 -4391599 -1457832
11939 -1457832 -415106 143557 3230774 7812391 10319062 9496100 6671611 3150313
11931 3150313 95663 -741798 1114567 3413591 3645636 1978331 336335 -138976 477135
11922 477135 1559802 2062070 1439966 906944 1857602 2977883 1706929 -1134735 -1624969
11913 -1624969 1520690 5155055 6804310 7590110 8437226 7632119 4560411 1921559 1558515
11904 1558515 1812922 1521411 2389534 4476170 4093462 94215 -2501218 50577 3618410
11895 3618410 2629034 -990615 -1720487 209448 672717 309075 3328745 8632250 9950834
11886 9950834 5213223 -1081308 -5336785 -8073798 -9065467 -6303853 -1492024 81038
$$ packed form
11947b957072l19056K871773L678171m34645m807026l588055J164311K933767
11939a457832J042726N58663L087217M581617K506671q22962k824489l521298
11931C150313l054650q37461J856365K299024K32045j667305j641996m75311O16111
11922D77135J082667N02268o22104n33022R50658J120281j270954k841664m90234
11913a624969L145659L634365J649255P85800Q47116q05107l071708k638852l63044
11904A558515K54407k91511Q68123K086636l82708l999247k595433K551795L567833
11895C618410r89376l619649p29872J929935M63269l63642L019670N303505J318584
11886I950834m737611o294531m255477k737013r91669K761614M811829J573062
$$ plain form
11878 81038 -2362507 -3032382 1535897 6857036 7023688 2420975 -2268017 -4064043 -2911729
11869 -2911729 -229749 1356785 -109932 -2551276 -1671252 2508747 4912519 2759227
11861 2759227 -771693 -2231958 -2594449 -3566065 -3705342 -1549256 1143217 2420875 2899157
11852 2899157 2721191 -191194 -5524336 -8216334 -4669795 1965771 6389157 7707932
11844 7707932 7754618 6487124 3465345 870472 574742 748479 -565684 -1339706 785307
11835 785307 3773798 4683342 4778059 6164134 6508157 2943382 -1527872 -2052971 -213092
11826 -213092 -1257919 -4505323 -4221042 32239 1788364 -2095940 -6682226 -6951871 -4615403
11817 -4615403 -3950833 -5705085 -8075527 -9695655 -8999759 -4340079 2621991 6796241
$$ packed form
11878H1038k443545o69875M568279N321139J66652m602713m688992j796026J152314
11869b911729K681980J586534j466717k441344Q80024M179999K403772k153292
11861B759227l530920j460265l62491r71616j39277K156086K692473J277658M78282
11852B899157j77966k912385n333142k691998L546539O635566M423386J318775
11844G707932M6686j267494l021779k594873k95730J73737j314163p74022K125013
11835G85307K988491R09544R4717J386075L44023l564775m471254n25099J839879
11826b13092j044827l247404K84281M253281J756125l884304m586286k69645K336468
11817d615403O64570j754252k370442j620128O95896M659680O962070M174250
$$ plain form
11809 6796241 5298074 631854 -3216782 -4892548 -4750920 -3516294 -3459238 -7101307 -12712770
11800 -12712770 -14807170 -11395886 -7007023 -5810663 -5551005 -1839565 4739428 9879247
11792 9879247 11557732 10701538 7622070 2180520 -3168978 -4673417 -2178313 260311
11784 260311 -557224 -3444852 -5085554 -4132460 -2122108 -1156187 -1516881 -1698120 -660817
11775 -660817 601221 520557 -726252 -1956598 -3555946 -6885308 -10826612 -11716880 -8078700
11766 -8078700 -3087472 -511696 -80128 956238 3003690 3415430 484861 -3732834
11758 -3732834 -5313447 -2649363 1752823 4013668 3267459 2059176 1885959 678487
11750 678487 -3150480 -6601819 -5940894 -3070960 -2943812 -5025430 -3467603 2812986 6553745
$$ packed form
11809F796241j498167m666220l848636j675766J41628J234626N7056l642069n611463
11800a2712770k094400L411284M388863J196360K59658L711440O578993N139819
11792I879247J678485q56194l079468n441550n349498j504439K495104K438624
11784B60311q17535k887628j640702R53094K010352R65921l60694j81239J037303
11775f60817J262038q0664j246809j230346j599348l329362l941304q90268L638180
11766h078700M991228K575776M31568J036366K047452M11740k930569m217695
11758c732834j580613K664084M402186K260845p46209j208283j73217j207472
11750F78487l828967l451339O60925K869934J27148k081618J557827O280589L740759
$$ plain form
11741 6553745 2120467 -6093858 -9672295 -6588527 -1035241 3507953 5638462 3317159
11733 3317159 -3868081 -10750196 -10861947 -4983257 -521306 -1858138 -5888747 -7980256
11725 -7980256 -7768600 -7225105 -6836628 -6269865 -6269658 -7406869 -8335071 -7047812 -3029505
11716 -3029505 2639990 8155362 11403912 10992585 7787900 4508655 3202593 3755633
11708 3755633 4789056 4967510 3627916 1502573 812713 3270750 7823512 11365412
11700 11365412 11501435 7815337 1493063 -4627837 -6786413 -3743381 795705 1870107
11692 1870107 -548808 -1843139 314541 2422048 160699 -5441826 -9128734 -7569936
11684 -7569936 -2549188 1481202 1593563 -1790040 -6239098 -9854082 -12156669 -12723575
$$ packed form
11741F553745m433278q214325l578437L083768N553286M543194K130509k321303
11733C317159p185240o882115j11751N878690M461951j336832m030609k091509
11725g980256K11656N43495L88477N66763K07j137211r28202J287259M018307
11716c029505N669495N515372L248550m11327l204685l279245j306062N53040
11708C755633J033423J78454j339594k125343o89860K458037M552762L541900
11700A1365412J36023l686098o322274o120900k158576L043032M539086J074402
11692A870107k418915j294331K157680K107507k261349n602525l686908J558798
11684g569936N020748M030390J12361l383603m449058l614984k302587n66906
$$ plain form
11676 -12723575 -10526674 -6003036 -2520805 -3335912 -7246036 -9583342 -7762816 -3625843
11668 -3625843 29926 2601684 4362154 4626266 3150556 1546295 1256930 1372216 373509
11659 373509 -1001206 -771218 948483 1768192 311092 -2012845 -2887868 -1408203 1866415
11650 1866415 5754062 8429463 7693459 2945521 -3093766 -6155834 -4847041 -2403192
11642 -2403192 -2769211 -5498451 -6383782 -3312666 669482 1318778 -1610230 -4929921 -6318295
11633 -6318295 -5675661 -3196795 781038 3842542 2601856 -2745756 -7247079 -6584792
11625 -6584792 -2293478 469862 -430508 -2044055 -1157613 1040102 809178 -2517780 -5023081
11616 -5023081 -3158484 1430244 3958767 2707065 721424 1046441 2952493 4175603
$$ packed form
11676a2723575K196901M523638L482231q15107l910124k337306J820526M136973
11668c625843L655769K571758J760470K64112j475710j604261k89365J15286r98707
11659C73509j374715K29988J719701Q19709j457100k323937q75023J479665L274618
11650A866415L887647K675401p36004m747938o039287l062068J308793K443849
11642b403192l66019k729240q85331L071116L982148O49296k929008l319691j388374
11633f318295O42634K478866L977833L061504j240686n347612m501323O62287
11625f584792M291314K763340r00370j613547Q86442K197715k30924l326958k505301
11616e023081J864597M588728K528523j251702j985641L25017J906052J223110
$$ plain form
11608 4175603 4209389 3052663 -849692 -7768347 -13143739 -11327070 -3292290 3302617
11600 3302617 3111844 -1129429 -3566242 -2711048 -1121650 -45899 1665451 3890808
11592 3890808 4298882 2232242 874882 3469293 8595454 11384137 9289099 4684653
11584 4684653 1157313 -738707 -2338119 -3225494 -1864078 497110 240932 -3067758
11576 -3067758 -4927530 -1993908 2926264 5008999 4184000 3990857 5243964 5183183 2575592
11567 2575592 -453710 -2122878 -2930787 -3115024 -1357808 2832273 7738814 11036813
11559 11036813 10955368 6537801 -414267 -4602082 -2392831 2728771 4326934 2267233
11551 2267233 2251636 5779699 7428100 4392123 1774447 4237354 8541438 9674556
$$ packed form
11608D175603L3786j156726l902355o918655n375392J816669Q034780O594907
11600C302617j90773m241273k436813Q55194J589398J075751J711350K225357
11592C890808M08074k066640j357360K594411N126161K788683k095038m604446
11584D684653l527340j896020j599412q87375J361416K361188k56178l308690
11576c067758j859772K933622M920172K082735q24999j93143J253107o0781k607591
11567B575592l029302j669168q07909j84237J757216M190081M906541L297999
11559A1036813q1445m417567o952068m187815K209251N121602J598163k059701
11551B267233j5597L528063J648401l035977k617676K462907M304084J133118
$$ plain form
11543 9674556 9041305 10271608 11319576 7961581 2116294 -806658 -911671 -2590851
11535 -2590851 -5402717 -4190597 1336901 4963504 3584858 1317306 1498132 1348602
11527 1348602 -1790939 -4882668 -4385999 -2290451 -2148557 -2899510 -1667916 279628 -328597
11518 -328597 -2637742 -2912601 -928728 -144684 -1666268 -2740180 -1988445 -1950797 -4761936
11509 -4761936 -8431363 -9440514 -7081118 -3549612 -1067290 -155496 247371 1801231
11501 1801231 4967460 7759907 7526791 4404419 1482976 921556 1668559 2024572 2388110
11492 2388110 3598926 4431626 3516278 2553235 4133640 6648145 5501194 569928 -1801593
11483 -1801593 2763664 9606016 10636065 4960097 -966973 -2877648 -2833080 -3201116 -2358560
$$ packed form
11543I674556o33251J230303J047968l357995n845287k922952j05013j679180
11535b590851k811866J212120N527498L626603j378646k267552J80826j49530
11527A348602l139541l091729M96669K095548J41894p50953J231594J947544o08225
11518c28597k309145k74859J983873P84044j521584j073912P51735L7648k811139
11509d761936l669427j009151K359396L531506K482322R11794M02867J553860
11501A801231L166229K792447k33116l122372k921443n61420P47003L56013L63538
11492B388110J210816Q32700r15348r63043J580405K514505j146951m931266k371521
11483a801593M565257O842352J030049n675968n927070j910675M4568l68036Q42556
$$ plain form
11474 -2358560 770573 2675396 9539 -4609336 -5816088 -2609980 1607024 4401905
11466 4401905 5652667 4872231 1722255 -1258957 -853406 1774175 2371976 290972 -533624
11457 -533624 1744409 3789573 2712439 793447 1714698 4972225 6962462 5677141
11449 5677141 1956028 -2224438 -4757671 -4402573 -2390359 -1218948 -760211 1644522
11441 1644522 5733644 6676503 1725713 -4943869 -7855938 -7698543 -8577306 -10262884 -8800330
11432 -8800330 -3785359 732417 2735177 4205084 5867780 5418695 2718953 1634393
11424 1634393 4058191 6583794 6248815 5422580 7100377 9041999 7507856 4192179
11416 4192179 3757810 5641760 4395807 -1088647 -4426343 -554184 6504229 8648247
$$ packed form
11474b358560L129133J904823k665857m618875j206752L206108M217004K794881
11466D401905J250762p80436l149976k981212M05551K627581N97801k081004q24596
11457e33624K278033K045164j077134j918992R21251L257527J990237j285321
11449E677141l721113m180466k533233L55098K012214J171411M58737K404733
11441A644522M089122R42859m950790o669582k912069J57395q78763j685578J462554
11432h800330N014971M517776K002760J469907J662696m49085k699742j084560
11424A634393K423798K525603l34979q26235J677797J941622j534143l315677
11416D192179m34369J883950j245953n484454l337696L872159P058413K144018
$$ plain form
11408 8648247 4245526 -582202 -884782 929751 -360669 -4672866 -6430083 -2481336
11400 -2481336 2962088 3484832 -1198022 -5303678 -5130516 -3387955 -3893173 -5519157 -4780680
11391 -4780680 -2200041 -1748119 -4430457 -6656359 -5797320 -3697959 -3058157 -3402940 -2811109
11382 -2811109 -1229255 375099 2239991 4458501 4801133 1018748 -5085122 -8829199
11374 -8829199 -8275985 -6182865 -5530165 -5434967 -3274051 571667 2578233 967469 -1232041
11365 -1232041 298130 5212856 8338601 6338475 2303605 1278901 2835797 2082418
11357 2082418 -1977161 -3975526 -315551 4598282 4368553 -165347 -2846347 -1871759
11349 -1871759 -1879534 -5991700 -10986001 -12246410 -9537075 -5646370 -2466053 -701478 -855310
$$ packed form
11408H648247m402721m827728l02580J814533j290420m312197j757217L948747
11400b481336N443424N22744m682854m105656J73162J742561n05218j625984P38477
11391d780680K580639M51922k682338k225902Q59039K099361O39802l44783N91831
11382b811109J581854J604354J864892K218510L42632l782385o103870l744077
11374h829199N53214K093120O52700R5198K160916L845718K006566j610764k199510
11365a232041J530171M914726L125745k000126m034870j024704J556896p53379
11357B082418m059579j998365L659975M913833k29729m533900k681000R74588
11349a871759p775m112166m994301j260409K709335L890705L180317J764575j53832
$$ plain form
11340 -855310 -2196650 -2748467 -1993914 -1345742 -525557 3261577 10039971 14284488 11336794
11331 11336794 4445220 1165981 3922483 8245698 9662535 7953211 4503523 -31248
11323 -31248 -4064551 -4835471 -1879937 1847805 4013702 5629646 8036762 9793961 9187638
11314 9187638 7935518 9153817 12263777 13021641 9156563 3570506 685230 1253643
11306 1253643 2535123 2742562 2949144 4003278 3846773 218577 -4958597 -6977193 -4619506
11297 -4619506 -1935736 -2119250 -2675496 189814 4674385 5243573 639114 -4560959 -6830764
11288 -6830764 -7523974 -8243466 -7050162 -2594025 1612559 1574133 -571212 765107 5806807
11279 5806807 8185713 3774801 -3241932 -5530888 -1221952 5269307 9283533 9837387
$$ packed form
11340h55310j341340n51817P54553O48172Q20185L787134O778394M244517k947694
11331A1336794o891574l279239K756502M323215J416837j709324l449688m534771
11323c1248m033303p70920K955534L727742K165897J615944K407116J757199o06323
11314I187638j252120J218299L109960P57864l865078n586057k885276N68413
11306A253643J281480K07439K06582J054134j56505l628196n177174k018596K357687
11297d619506K683770j83514n56246K865310M484571N69188m604459n200073k269805
11288f830764o93210p19492J193304M456137M206584l8426k145345J336319N041700
11279E806807K378906m410912p016733k288956M308936O491259M014226N53854
$$ plain form
11271 9837387 8184563 5463220 2504107 13525 -2099447 -4413421 -6348244 -6204964
11263 -6204964 -3838912 -1802948 -2105355 -2965757 -1178802 2810511 5140135 4249092 3085028
11254 3085028 3922361 4097125 51403 -6433914 -10029176 -9219523 -7863339 -8941758 -10555797
11245 -10555797 -9644256 -6512650 -3533072 -1757499 -1111846 -1931378 -3713827 -3906089 -827477
11236 -827477 3123816 4180297 2771590 3209427 7230562 10832700 9256013 3160676
11228 3160676 -2263928 -3442766 -1709445 -653218 -1957929 -4487066 -6263372 -6160545
11220 -6160545 -4030451 -515117 2738469 3671523 1799127 -644509 -723881 1860056 4519448
11211 4519448 5191203 4726515 4990857 5718828 4841141 1640918 -1938326 -3477836 -2537983
$$ packed form
11271I837387j652824k721343k959113k490582k112972k313974j934823J43280
11263f204964K366052K035964l02407q60402J786955L989313K329624q91043j164064
11254C085028Q37333J74764m045722o485317l595262Q09653J356184j078419j614039
11245a0555797R11541L131606K979578J775573O45653q19532j782449j92262L078612
11236h27477L951293J056481j408707M37837M021135L602138j576687o095337
11228C160676n424604j178838J733321J056227j304711k529137j776306J02827
11220f160545K130094L515334L253586R33054j872396k443636p9372K583937K659392
11211D519448O71755m64688K64342P27971q77687l200223l579244j539510R39853
$$ plain form
11202 -2537983 -483786 1302257 2368335 2837767 2848927 2355679 1119683 -1053606 -3740279
11193 -3740279 -5631717 -5408929 -3240017 -1059053 -820667 -2581278 -4767386 -6060627
11185 -6060627 -6155528 -4855887 -1965522 1311767 2457684 534621 -2123514 -2762726 -1759273
11176 -1759273 -1220813 -881617 1546722 5595560 6881161 2613140 -3862312 -6333567
11168 -6333567 -2589560 3748182 7549227 6773458 3328511 926684 1994416 5561386
11160 5561386 8122865 7101713 3176174 -1016928 -3566263 -4194722 -3674367 -3237595 -3639793
11151 -3639793 -4077886 -3145477 -1451184 -1556353 -4182189 -6404164 -5330638 -1757051 1854470
11142 1854470 4980320 7795347 8248772 4329858 -1547491 -4572101 -3979278 -3407951 -4420254
$$ packed form
11202b537983K054197J786043J066078M69432J1160m93248j235996k173289k686673
11193c740279j891438K22788K168912K180964K38386j760611k186108j293241
11185f060627r4901J299641K890365L277289J145917j923063k658135o39212J003453
11176a759273N38460L39196K428339M048838J285601m268021o475452k471255
11168f333567L744007O337742L801045p75769l444947k401827J067732L566970
11160E561386K561479j021152l925539m193102k549335o28459N20355M36772m02198
11151c639793m38093R32409J694293j05169k625836k221975J073526L573587L611521
11142A854470L125850K815027M53425l918914n877349l024610N92823N71327j012303
$$ plain form
11133 -4420254 -4232803 -1400872 896265 162676 -781778 1543288 4902347 4372367 240722
11124 240722 -2098302 -128263 2506337 1955433 -375240 -477993 2721655 6791578 9032330
11115 9032330 8123602 3929999 -1837671 -5470833 -4477806 -1199182 -759334 -4484339 -7658267
11106 -7658267 -5628824 -201982 2940624 2194331 1563320 3656688 5343971 3102555
11098 3102555 -600238 -554858 3157402 5084623 2170636 -2980991 -7206400 -10280544
11090 -10280544 -11591445 -8391176 -882418 5109457 5196133 3147133 5300167 10364025
11082 10364025 10951331 4824420 -1723264 -3033911 -965352 -38213 -469515 354224 2813299
11073 2813299 5254520 7079644 8277689 7622396 4608884 1883303 2558517 5929544
$$ packed form
11133d420254J87451K831931K297137p33589r44454K325066L359059n29980m131645
11124B40722k339024J970039K634600n50904k330673j02753L199648M069923K240752
11115I032330r08728m193603n767670l633162R93027L278624M39848l725005l173928
11106g658267K029443N426842L142606p46293o31011K093368J687283k241416
11098C102555l702793M5380L712260J927221k913987n151627m225409l074144
11090a0280544j310901L200269P508758N991875Q6676k049000K153034N063858
11082A0364025N87306o126911o547684j310647K068559R27139m31302Q23739K459075
11073B813299K441221J825124J198045o55293l013512k725581O75214L371027
$$ plain form
11065 5929544 8635363 9165823 8384502 6655102 3956618 2292203 3922812 6731960
11057 6731960 5428080 -1070634 -7066445 -7279829 -3598550 -1498960 -2034346 -1491814 1762893
11048 1762893 4546127 4130665 2692655 3936177 7336408 8764123 6214677 2078125
11040 2078125 -675896 -2064426 -3607619 -5231279 -5571007 -4382001 -2820737 -1806436
11032 -1806436 -1605703 -2441329 -3825159 -3928400 -1726799 670689 356959 -1850557 -2229487
11023 -2229487 72719 1495198 -364029 -3003410 -3022974 -865351 1137307 2692041
11015 2692041 4246082 4145998 950030 -3140042 -5141973 -6127275 -8807491 -11480577
11007 -11480577 -9690358 -3965016 -418958 -2266014 -5638675 -5971625 -4149731 -3514794
$$ packed form
11065E929544K705819N30460p81321j729400k698484j664415J630609K809148
11057F731960j303880o498714n995811k13384L681279K099590n35386N42532L254707
11048A762893K783234m15462j438010J243522L400231J427715k549446m136552
11040B078125k754021j388530j543193j623660l39728J189006J561264J014301
11032a806436K00733q35626j383830j03241K201601K397488l13730k207516l78930
11023b229487K302206J422479j859227k639381j9564K157623K002658J554734
11015B692041J554041j00084l195968m090072k001931r85302k680216k673086
11007a1480577J790219N725342L546058j847056l372661l32950J821894O34937
$$ plain form
10999 -3514794 -4435983 -5119515 -5156019 -5204673 -5145163 -5024427 -5807952 -6953476 -5602000 -744223
10989 -744223 4124513 5317942 3723503 2331016 1451995 85684 -191565 2581657 5830092
10980 5830092 4804945 -4935 -2628099 151112 4658104 6265801 5584861 5959037
10972 5959037 7690079 8185180 6425918 4077864 2448393 929992 -1167710 -3195755
10964 -3195755 -4316589 -4681707 -4514389 -3051684 233918 3742687 4692046 2467397 -264587
10955 -264587 -761957 520698 1134372 110323 -1548687 -3058788 -4173368 -3660275 -372184
10946 -372184 3707229 4552279 1519222 -1145193 -64738 2577423 2521427 -514160 -3084462
10937 -3084462 -2909153 -729167 1766020 3193340 2256566 -1170178 -4817427 -5803948 -3571056
$$ packed form
10999c514794r21189o83532l6504m8654N9510J20736p83525j145524J351476M857777
10989g44223M868736J193429j594439j392487q79021j366311k77249K773222L248435
10980E830092j025147m809880k623164K779211M506992J607697o80940L74176
10972E959037J731042M95101j759262k348054j629471j518401k097702k028045
10964c195755j120834l65118J67318J462705L285602L508769R49359k224649k731984
10955b64587m97370J282655O13674j024049j659010j510101j114580N13093L288091
10946c72184M079413Q45050l033057k664415J080455K642161n5996l035587k570302
10937c084462J75309K179986K495187J427320r36774l426744l647249r86521K232892
$$ plain form
10928 -3571056 140600 3292996 4130324 1402826 -3585618 -6442372 -4150280 546684
10920 546684 2148254 -504044 -3227027 -2871967 -1522617 -2936383 -7053165 -9978354
10912 -9978354 -8596670 -3821349 706510 2466976 2132394 1693925 1464475 388558 -1214972
10903 -1214972 -1693052 -1171594 -1770884 -3636732 -3778421 -605085 3344153 5299088 5802786
10894 5802786 5928262 4435568 960678 -1438732 -907744 -591696 -3240119 -5586199 -3869609
10885 -3869609 -1607486 -4511113 -9858139 -9458310 -2761597 1962454 897128 211675
10877 211675 4963852 10490596 9995941 4581894 80448 -1576716 -2315172 -2676740 -1977497
10868 -1977497 -1503299 -2949328 -5153322 -5920422 -5433302 -4796332 -3312150 -498996 1287512
$$ packed form
10928c571056L711656L152396Q37328k727498m988444k856754K292092M696964
10920E46684J601570k652298k722983L55060J349350j413766m116782k925189
10912i978354J381684M775321M527859J760466l34582m38469k29450j075917j603530
10903a214972m78080N21458n99290j865848j41689L173336L949238J954935N03698
10894E802786J25476j492694l474890k399410N30988L16048k648423k346080J716590
10885c869609K262123k903627n347026L99829O696713M724051j065326o85453
10877B11675M752177N526744m94655n414047m501446j657164p38456l61568O99243
10868a977497M74198j446029k203994p67100M87120O36970J484182K813154J786508
$$ plain form
10859 1287512 -160052 -3035304 -4249436 -4495466 -6687499 -10300505 -11374263 -8304532
10851 -8304532 -4113667 -2094299 -1905132 -1321554 -77405 -233882 -2945183 -5942768 -5245336
10842 -5245336 169144 6263841 7867569 4359811 -67592 -1502775 267780 3371470
10834 3371470 6536706 9361857 11549853 12774269 12656485 11049637 8952926 7873419
10826 7873419 7116106 3851130 -2037788 -5906308 -4406262 -665131 956854 2084842
10818 2084842 6190977 9970163 6908403 -1489199 -6732088 -6043021 -5020298 -6173657
10810 -6173657 -4686216 915322 3716363 -314935 -4632988 -2487664 2428317 3129283
10802 3129283 613295 -91936 329801 -1712834 -4392479 -3509539 -694315 -399528 -1448403
$$ packed form
10859A287512j447564k875252j214132k46030k192033l613006j073758L069731
10851h304532M190865K019368J89167N83578J244149j56477k711301k997585O97432
10842e245336N414480O094697J603728l507758m427403j435183J770555L103690
10834C371470L165236K825151K187996J224416j17784j606848k096711j079507
10826G873419p57313l264976n888918l868520J500046L741131J621985J127988
10818B084842M106135L779186l061760q397602n242889O89067J022723j153359
10810f173657J487441N601538K801041m031298m318053K145324M915981P00966
10802C129283k515988p05231M21737k042635k679645Q82940K815224K94787j048875
$$ plain form
10793 -1448403 264593 2995698 1572230 -2865187 -3997140 -686146 1878706 1553939
10785 1553939 1941013 4649198 6032244 3652549 243157 -793696 614244 2923596
10777 2923596 4739139 4373420 1432544 -1268860 -1119483 -168173 -1992580 -5484928 -6686140
10768 -6686140 -5418817 -4525018 -3768926 -787912 2652007 2143890 -1640115 -3513353 -2458157
10759 -2458157 -2805632 -5863599 -7524567 -5840885 -3861001 -2634731 1413596 8744056
10751 8744056 13050925 9891290 3608624 949747 2147420 2981039 2000343 904080
10743 904080 378063 -13930 434904 2269452 3761474 3270837 2472238 4314100 8466221
10734 8466221 11129460 9200642 3450052 -1993442 -2971769 741163 4584246 3744023
$$ packed form
10793a448403J712996K731105j423468m437417j131953L310994K564852l24767
10785A553939L87074K708185J383046k379695l409392j036853J407940K309352
10777B923596J815543l65719k940876k701404J49377R51310j824407l492348j201212
10768f686140J267323Q93799P56092K981014L439919n08117l784005j873238J055196
10759b458157l47475l057967j660968J683682J979884J226270M048327P330460
10751H744056M306869l159635o282666k658877J197673Q33619r80696j096263
10743I04080n26017l91993M48834J834548J492022m90637p98599J841862M152121
10734H466221K663239j928818n750590n443494r78327L712932L843083q40223
$$ plain form
10726 3744023 -1382601 -5816594 -5800311 -2032972 2412044 4928561 4367671 1795621 311473
10717 311473 1880706 4650818 5499314 4252488 2902858 2183926 2066565 3751543 7098517
10708 7098517 8020358 3608449 -1588337 -456789 6050664 9624595 6276876 735591
10700 735591 -1954730 -2556551 -3250061 -3428474 -2825464 -3344746 -4694984 -3305830 1255767
10691 1255767 3850154 1346952 -2148599 -1817221 387204 -447323 -4129764 -6167365
10683 -6167365 -4799372 -2704196 -2313860 -2872099 -2335351 -350345 871904 -1400232 -6575867
10674 -6575867 -9920106 -8132778 -4704280 -5643374 -10282485 -11604054 -6621274 -790464
10666 -790464 213671 -2110426 -3171831 -2260202 -1557657 -1615967 -1722015 -2342813 -3895007
$$ packed form
10726C744023n126624m433993J6283L767339M445016K516517n60890k572050j484148
10717C11473J569233K770112Q48496j246826j349630p18932j17361J684978L346974
10708G098517R21841m411909n196786J131548O507453L573931l347719n541285
10700G35591k690321o01821o93510j78413O03010n19282j350238J389154M561597
10691A255767K594387k503202l495551L31378K204425q34527l682441k037601
10683f167365J367993K095176L90336n58239N36748J985006J222249k272136n175635
10674f575867l344239J787328L428498r39094m639111j321569M982780N830810
10666g90464J004135k324097j061405R11629P02545n8310j06048o20798j552194
$$ plain form
10657 -3895007 -5081682 -5103761 -5430181 -7000758 -7916734 -6351200 -3720457 -2607343 -3209180
10648 -3209180 -3820600 -3394884 -2198344 -1292782 -2029791 -4333527 -5492633 -3152217 719815
10639 719815 2103617 973399 1063116 3369150 4433595 2071384 -1603632 -4085272 -5128183
10630 -5128183 -4388469 -990393 3179835 4364287 2577474 1701154 2702060 2136474 -855343
10621 -855343 -2008733 831209 3601301 2615528 123130 -501349 -356858 -1703289 -3313039
10612 -3313039 -3475238 -4071877 -7306059 -11107430 -11746199 -9059860 -6094490 -5302847 -7051956
10603 -7051956 -9896844 -11261747 -10275796 -9861956 -12301658 -13473229 -7353858 3549572
10595 3549572 9401811 6330231 1124524 17213 605849 -899345 -2122449 -239533
$$ packed form
10657c895007j186675k2079l26420j570577r15976J565534K630743J113114o01837
10648c209180o11420M25716J196540R05562p37009k303736j159106K340416L872032
10639G19815J383802j130218Q9717K306034J064445k362211l675016k481640j042911
10630e128183P39714L398076M170228J184452j786813q76320J000906n65586k991817
10621h55343j153390K839942K770092r85773k492398o24479J44491j346431j609750
10612c313039j62199n96639l234182l801371o38769K686339K965370P91643j749109
10603g051956k844888j364903R85951M13840k439702j171571O119371J0903430
10595C549572N852239l071580n205707j107311N88636j505194j223104J882916
$$ plain form
10587 -239533 1064479 -2670850 -8373063 -9587239 -6005397 -2832223 -2523798 -2393623 251862
10578 251862 4296133 6195022 3924332 133378 375535 5758683 9627659 6297670
10570 6297670 417047 490791 5350538 6523350 2957971 1904628 4316480 2340587
10562 2340587 -5103076 -7402270 827532 9756739 9022765 2094266 -2113366 -2431780
10554 -2431780 -1766509 859872 5587302 6888988 2278904 -1352327 1540141 5315049
10546 5315049 2424546 -4504448 -8320826 -8396791 -7794472 -5834209 -1390716 2463596 3859370
10537 3859370 5518921 7311306 4219371 -2501293 -2949018 5294429 10332048 4177218
10529 4177218 -4053404 -3355016 2616162 5440248 6580713 9835911 10479354 4819623
$$ packed form
10587b39533J304012l735329n702213j214176L581842L173174L08425J30175K645485
10578B51862M044271J898889k270690l790954K42157N383148L868976l329989
10570F297670n880623P3744M859747J172812l565379j053343K411852j975893
10562B340587p443663k299194Q229802Q929207p33974o928499m207632l18414
10554b431780O65271K626381M727430J301686m610084l631231K892468L774908
10546E315049k890503o928994l816378p5965O02319J960263M443493L854312J395774
10537C859370J659551J792385l091935o720664m47725Q243447N037619o154830
10529D177218q230622O98388N971178K824086J140465L255198O43443n659731
$$ plain form
10521 4819623 -123224 1112879 1941739 -2255383 -2903400 5250120 10709213 3988353
10513 3988353 -4620069 -2979914 1977328 -517784 -4349875 -803201 2325945 -2938991
10505 -2938991 -6055861 1892311 7838393 1062151 -3231136 7309224 14036436 1533842
10497 1533842 -7043935 9692954 24664221 7869385 -10936618 8792654 34679803
10490 34679803 14737567 -429061 97635212 286551667 386719410 286115660 95665237
10483 95665237 -2285397 16829641 41229472 15509972 -7981006 7090123 21807981
10476 21807981 5556033 -11527163 -2100881 10460761 2020550 -8409643 907954
10469 907954 13367670 6837380 -6985829 -7427079 -1092566 -4093396 -10755903 -7320802
$$ packed form
10521D819623m942847J236103Q28860m197122o48017Q153520N459093o720860
10513C988353q608422J640155M957242k495112l832091L546674L129146n264936
10505b938991l116870P948172N946082o776242m293287J0540360O727212j2502594
10497A533842q577777J6736889J4971267j6794836j8806003J9729272K5887149
10490C4679803j9942236j5166628R8064273J88916455J00167743j00603750j90450423
10483I5665237r7950634J9115038K4399831k5719500k3490978J5071129J4717858
10476B1807981j6251948j7083196R426282J2561642q440211j0430193R317597
10469I07954J2459716o530290j3823209m41250O334513l000830o662507L435101
$$ plain form
10461 -7320802 903821 533321 -5623127 -6228662 -1804099 311319 1033603 4335796 6594069
10452 6594069 4173552 2307798 5249884 7285144 3577297 -288918 837092 1838619
10444 1838619 -2193360 -6166309 -5009619 -3081722 -4332447 -3580902 2767402 7489244
10436 7489244 4033736 -2189151 -3772726 -3287662 -5373533 -6100762 -1077288 4012764
10428 4012764 2188155 -2455468 -2119329 1133558 230425 -3633017 -3594725 665846 3578167
10419 3578167 3892309 4930701 6590614 5486134 1734234 -1532838 -3979774 -7056950
10411 -7056950 -8966889 -6870201 -2659385 -730514 -1145744 -303619 2454330 3756901
10403 3756901 1493468 -2534146 -5286407 -5557582 -4737887 -5397413 -7842277 -8418409 -4201218
$$ packed form
10461g320802Q224623l70500o156448o05535M424563K115418P22284L302193K258273
10452F594069k420517j865754K942086K035260l707847l866215J126010J001527
10444A838619m031979l972949J156690J927897j250725P51545O348304M721842
10436G489244l455508o222887j583575M85064k085871p27229N023474N090052
10428D012764j824609m643623L36139L252887r03133l863442L8292M260571K912321
10419C578167L14142J038392J659913j104480l751900l267072k446936l077176
10411g056950j909939K096688M210816J928871m15230Q42125K757949J302571
10403C756901k263433m027614k752261k71175Q19695o59526k444864n76132M217191
$$ plain form
10394 -4201218 1322145 2061419 -1295547 -1899631 2306868 5372657 3449549 696711
10386 696711 1197190 2098152 62261 -1738268 606846 3932917 2673511 -2120240 -4775821
10377 -4775821 -3536494 -1287847 419059 2598577 5009920 5770398 4591104 3060065
10369 3060065 1955613 595048 -1717524 -5081282 -8752529 -10706102 -9273434 -5730467
10361 -5730467 -2875573 -988228 1447076 3148184 1033257 -3354096 -4047761 461056
10353 461056 3983027 1568609 -3171775 -3758334 51192 3214503 2699981 -177583 -2835643
10344 -2835643 -3651091 -2577280 -1662467 -3182324 -5873654 -5600096 -1215582 3224769 3809761
10335 3809761 1300977 -1435789 -3336020 -4324504 -3494091 -615867 2337961 2947792 526334
$$ packed form
10394d201218N523363P39274l356966o04084M206499L065789j923108k752838
10386F96711N00479R00962k035891j800529K345114L326071j259406m793751k655581
10377d775821J239327K248647J706906K179518K411343P60478j179294j531039
10369C060065j104452j360565k312572l363758l671247j953573J432668L542967
10361e730467K854894J887345K435304J701108k114927m387353o93665M508817
10353D61056L521971k414418m740384n86559L809526L163311n14522k877564k658060
10344b835643q15448J073811R14813j519857k691330K73558M384514M440351N84992
10335C809761k508784k736766j900231r88484Q30413K878224K953828O09831k421458
$$ plain form
10326 526334 -3622272 -6488696 -4921092 309323 3490759 838998 -3473732 -3238898
10318 -3238898 -127988 -807675 -5384125 -7190714 -4540186 -3503979 -6676086 -8330703
10310 -8330703 -4905846 -1926581 -4858560 -9901115 -10045421 -5069647 237394 3492226
10302 3492226 5129191 5043728 3367443 1588626 -163273 -3278081 -6025098 -3983533
10294 -3983533 2370292 6610120 6011862 5472574 7927605 8503394 3791160 -566941 1144165
10285 1144165 4567783 2469238 -2939766 -3814106 528278 3455333 1955359 -247164
10277 -247164 76220 1974544 3650161 4068302 1758208 -3254903 -7073441 -5675694 -124569
10268 -124569 5310899 8416672 9203713 7529470 4391113 2966618 4510468 5841668
$$ packed form
10326E26334m148606k866424J567604N230415L181436k651761m312730K34834
10318c238898L110910o79687m576450j806589K650528J036207l172107j654617
10310h330703L424857K979265k931979n042555j44306M975774N307041L254832
10302C492226J636965q5463j676285j778817j751899l114808k747017K041565
10294c983533O353825M239828n98258n39288K455031N75789m712234m358101J711106
10285A144165L423618k098545n409004q74340M342384K927055j499974k202523
10277b47164L23384J898324J675617M18141k310094n013111l818538J397747N551125
10268a24569N435468L105773P87041j674243l138357j424495J543850J331200
$$ plain form
10260 5841668 4404503 2512698 2823207 3420540 1698299 -765215 -1753208 -2716752 -4688431
10251 -4688431 -4333789 391490 4986076 4744786 2054492 1140649 259786 -3555047 -6458897
10242 -6458897 -3031185 3806036 6833539 5841803 6041105 7428860 5196105 -371347
10234 -371347 -3677966 -3182233 -2257851 -1065427 3392375 8979819 9554942 5376019 3194057
10225 3194057 4496251 3177506 -2523114 -5410254 -970911 4856686 4938640 1057197
10217 1057197 -845316 151812 1215636 1783570 2864651 3473188 2379144 976923 771377
10208 771377 419729 -1532262 -3299216 -2205822 1517860 5572394 8317971 8971193 7275752
10199 7275752 4502874 2581967 1192402 -1618847 -5054517 -5257847 -1056125 3291496
$$ packed form
10260E841668j437165j891805L10509N97333j722241k463514r87993r63544j971679
10251d688431L54642M725279M594586k41290k690294r13843q80863l814833k903850
10242f458897L427712O837221L027503r91736J99302J387755k232755n567452
10234c71347l306619M95733R24382J192424M457802N587444N75123m178923k181962
10225C194057J302194j318745n700620k887140M439343N827597Q1954l881443
10217A057197j902513R97128J063824N67934J081081O08537j094044j402221k05546
10208G71377l51648j951991j766954J093394L723682M054534K745577O53222j695441
10199G275752k772878j920907j389565k811249l435670k03330M201722M347621
$$ plain form
10191 3291496 3411578 338693 -1613164 -619915 1181109 945030 -1652913 -4142847 -4071772
10182 -4071772 -2374606 -2550028 -5349721 -6831136 -4230019 -704326 -140187 -366756 2588936
10173 2588936 5976426 3663723 -2830510 -5072721 -514884 3802845 2818056 590204
10165 590204 1985980 4689890 4664875 3296856 3375271 3165223 331785 -2692654 -3048858
10156 -3048858 -2966043 -4905351 -5267485 85339 7184999 8398870 3644619 -296347 -562668
10147 -562668 -605159 -1863285 -992911 2953322 5682646 4611349 2525014 1493859 -758183
10138 -758183 -4748832 -5629849 -1029574 2685576 -1035527 -7569740 -6473838 2893624
10130 2893624 9678398 7021483 1157845 865868 4563317 4528766 -144684 -2694903 100969
$$ packed form
10191C291496J20082l072885j951857R93249J801024k36079k597943k489934P1075
10182d071772J697166j75422k799693j481415K601117L525693N64139k26569K955692
10173B588936L387490k312703o494233k242211M557837M317729r84789k227852
10165E90204J395776K703910k5015j368019P8415k10048k833438l024439l56204
10156c048858Q2815j939308l62134N352824P099660J213871m754251l940966k66321
10147e62668m2491j258126Q70374L946233K729324j071297k086335j031155k252042
10138g58183l990649q81017M600275L715150l721103o534213J095902R367462
10130B893624O784774k656915n863638k91977L697449l4551m673450k550219K795872
$$ plain form
10121 100969 3207629 1475868 -3217143 -5851441 -5152299 -3297088 -1615303 6187
10113 6187 1064539 722393 -656554 -2192927 -3734724 -4917648 -4393801 -1707144 1334202
10104 1334202 2689979 2167921 337104 -2553843 -5025380 -4335077 -472897 2175875
10096 2175875 250620 -3440434 -3674420 -236962 2235655 1088982 -1473443 -2288329
10088 -2288329 -583977 2894070 7043813 9976985 9872460 7125046 4114297 2592110
10080 2592110 2504802 2943606 2879408 1733959 589919 1488555 3922710 4111258 277876
10071 277876 -3616381 -3026351 91070 -138965 -4579965 -7567712 -4910686 803382 4272171
10062 4272171 3630677 1057362 -427241 436233 2185123 1922316 -1042400 -3457845 -2067601
$$ packed form
10121A00969L106660j731761m693011k634298O99142J855211J681785J621490
10113F187J058352l42146j378947j536373j541797j182924N23847K686657L041346
10104A334202J355777n22058j830817k890947k471537O90303L862180K648772
10096B175875j925255l691054k33986L437458K472617j146673k562425q14886
10088b288329J704352L478047M149743K933172j04525k747414l010749j522187
10080B592110q7308M38804o4198j145449j144040Q98636K434155J88548l833382
10071B77876l894257N90030L117421k30035m441000k987747K657026N714068L468789
10062D272171o41494k573315j484603Q63474J748890k62807k964716k415445J390244
$$ plain form
10053 -2067601 1658647 3462485 2204553 650979 708896 1207651 596527 -1087742 -3098267
10044 -3098267 -4221620 -2504123 2353748 6842804 7171751 4490508 3049408 3741796
10036 3741796 3827421 2999473 4549974 9020667 11386411 7320532 -811312 -6751756 -7101879
10027 -7101879 -3463340 389303 1903321 1395747 1072014 1842823 1999573 466451 -516522
10018 -516522 1144358 3114003 1947631 -610542 280036 4500574 6493061 3566508
10010 3566508 -648962 -2499515 -2914163 -3573205 -3282848 -1130071 576413 -415806 -2967404
10001 -2967404 -4948318 -6241594 -7186493 -6774795 -4602768 -2208367 -641415 854478
9993 854478 2282054 1976616 50924 -311600 2614162 5795039 5205508 1149702 -2275855
$$ packed form
10053b067601L726248J803838j257932j553574N7917M98755o11124j684269k010525
10044c098267j123353J717497M857871M489056L28947k681243j441100O92388
10036C741796Q5625q27948J550501M470693K365744m065879q131844n940444l50123
10027g101879L638539L852643J514018n07574l23733P70809J56750j533122r82973
10018e16522J660880J969645j166372k558173Q90578M220538J992487k926553
10010C566508m215470j850553m14648o59042K90357K152777J706484r92219k551598
10001b967404j980914j293276r44899M11698K172027K394401J566952J495893
9993H54478J427576l05438j925692l62524K925762L180877n89531m055806l425557
$$ plain form
9984 -2275855 -1815300 2120231 6004280 6031662 2016788 -1513784 -240893 4246115 6420148
9975 6420148 4116506 530696 -846627 430291 3350310 6312896 6508029 2849274
9967 2849274 -636854 708127 4642812 4935296 1663657 1196751 4853696 6064207 1805699
9958 1805699 -1642591 922797 5383599 6306808 5849631 7518676 7616397 1581112 -5967335
9949 -5967335 -6784046 -1603546 1772203 1043950 1078504 3704233 4801886 2621641 1061125
9940 1061125 2513070 4070088 3281213 1904366 1324678 -413970 -3807299 -4768376 -257170
9931 -257170 6238297 8891082 7209059 5751288 7167838 9093542 8273608 4922916 1598632
9922 1598632 -483409 -1887673 -2225325 454838 6315072 11651570 12357419 8575601 3845669
$$ packed form
9984b275855M60555L935531L884049K7382m014874l530572J272891M487008K174033
9975F420148k303642l585810j377323J276918K920019K962586J95133l658755
9967B849274l486128J344981L934685K92484l271639m66906L656945J210511m258508
9958A805699l448290K565388M460802R23209m57177J669045R7721o035285p548447
9949e967335q16711N180500L375749p28253L4554K625729J097653k180245j560516
9940A061125J451945J557018p88875j376847n79688j738648l393329r61077M511206
9931b57170O495467K652785j682023j457771J416550J925704q19934l350692l324284
9922A598632k082041j404264l37652K680163N860234N336498P05849l781818m729932
$$ plain form
9913 3845669 596158 -978330 -577818 2140937 5297165 6094532 4671279 3444726 2863835
9904 2863835 1660512 853119 2479744 4350950 2170209 -2183750 -1521505 5065873 8814436
9895 8814436 3740269 -4204675 -5975745 -1756015 1895321 2599731 2946021 3792634 3392943
9886 3392943 1625106 122927 -163222 1870231 7455794 13670845 13997447 7596103 2422972
9877 2422972 3823951 6923822 7418419 11340490 22472311 27310256 9173003 -24205244
9869 -24205244 -44211377 -36089798 -15564037 -4965174 -6317728 -7333034 -3184205 214855
9861 214855 -658999 -2267615 -1663206 -396603 -121367 22167 861247 1810545 2335168
9852 2335168 2234241 991015 -887488 -858692 2805025 7699672 9129098 5432292 127128
$$ packed form
9913C845669l249511j574488M00512K718755L156228P97367j423253j226553n80891
9904B863835j203323q07393J626625J871206k180741m353959O62245O587378L748563
9895H814436n074167p944944j771070M219730L651336P04410L46290Q46613l99691
9886C392943j767837j502179k86149K033453N585563O215051L26602o401344n173131
9877B422972J400979L099871M94597L922071J1131821M837945j8137253l3378247
9869b4205244k0006133Q121579K0525761J0598863j352554j015306M148829L399060
9861B14855q73854j608616O04409J266603K75236J43534Q39080R49298N24623
9852B335168j00927j243226j878503K8796L663717M894647J429426l696806n305164
$$ plain form
9843 127128 -1656883 1350654 4872375 3793742 -1074575 -3138861 1263377 7077952
9835 7077952 7187318 2535524 212909 2409171 3696957 357142 -3754327 -3363798 1017502
9826 1017502 5120555 6337356 4282334 -484526 -5213935 -5539826 -616834 4527314
9818 4527314 4673958 676238 -2363515 -1511523 1553111 3084357 571726 -5083142 -9439452
9809 -9439452 -8165113 -1813165 4676686 7651943 7694392 6784036 5777580 5532690 7056837
9800 7056837 9101513 8840671 6379780 5144247 6145392 5756518 1708909 -2403840 -2030669
9791 -2030669 1672615 3660511 1687687 -1979990 -4269916 -4001814 -1743748 908259
9783 908259 2401115 2582328 2123846 679818 -2208655 -4610264 -4102240 -2485321 -4105379
$$ packed form
9843A27128j784011L007537L521721j078633m868317k064286M402238N814575
9835G077952J09366m651794k322615K196262J287786l339815m111469L90529M381300
9826A017502M103053J216801k055022m766860m729409l25891M922992N144148
9818D527314J46644l997720l039753Q51992L064634J531246k512631n654868m356310
9809i439452J274339O351948O489851K975257M2449r10356j006456k44890J524147
9800G056837K044676k60842k460891j235533J001145l88874m047609m112749L73171
9791b030669L703284J987896j972824l667677k289926K68102K258066K652007
9783I08259J492856J81213m58482j444028k888473k401609N08024J616919j620058
$$ plain form
9774 -4105379 -8246410 -8545913 -2811950 1969043 -965113 -8044193 -10270748 -5361014
9766 -5361014 873420 3632161 3769890 3629705 3392792 2345606 97115 -3875921 -8800570
9757 -8800570 -10977124 -7252331 -455397 2287127 -2105032 -8758374 -10697036 -6650220
9749 -6650220 -1578531 -474889 -2922190 -4054426 -829267 3607109 3628259 -1018259 -4169333
9740 -4169333 -1348631 4349053 6967466 5308733 2390791 -246874 -3222209 -5456175
9732 -5456175 -4316322 -14759 3694655 3958868 1443445 -1665012 -3799054 -4124487 -3031142
9723 -3031142 -2670130 -4749271 -7812711 -8918812 -7776503 -6754475 -6936817 -6821570 -5124430
9714 -5124430 -2396166 481723 3181295 5011995 5151824 4009428 2652268 1184776
$$ packed form
9774d105379m141031k99503N733963M780993k934156p079080k226555M909734
9766e361014O234434K758741J37729j40185k36913j047186k248491l973036m924649
9757h800570k176554L724793O796934K742524m392159o653342j938662M046816
9749f650220N071689J103642k447301j132236L225159M436376K1150m646518l151074
9740d169333K820702N697684K618413j658733k917942k637665k975335k233966
9732e456175J139853M301563L709414K64213k515423l108457k134042l25433J093345
9723c031142L61012k079141l063440j106101J142309J022028j82342J15247J697140
9714e124430K728264K877889K699572J830700J39829j142396j357160j467492
$$ plain form
9706 1184776 -472502 -1041811 365368 1783493 719574 -1622407 -1854377 155349 1155865
9697 1155865 -16125 -901764 -76242 763199 547260 540549 678482 -1540387 -6174154
9688 -6174154 -8958062 -7289064 -4306652 -3550156 -3252101 -311807 3296853 3518177 1514140
9679 1514140 1973609 4872588 5096668 987159 -2698577 -2533245 -1822220 -4670336 -8694100
9670 -8694100 -8367549 -3575927 -85148 -1748521 -6205618 -9139107 -9607528 -9378800 -9061975
9661 -9061975 -7368827 -3858008 -451659 601690 -545452 -1630459 -1190275 -191220 -261077
9652 -261077 -1217778 -1605208 -1302278 -1815132 -3395364 -3637335 -680230 3015885 2352457
9643 2352457 -4289904 -12090835 -14224849 -8806540 -426692 4980656 5572895 3627637
$$ packed form
9706A184776j657278n69309J407179J418125j063919k341981k31970K009726J000516
9697A155865j171990q85639Q25522Q39441k15939o711J37933k218869m633767
9688f174154k783908J668998K982412P56496K98055K940294L608660K21324k004037
9679A514140M59469K898979K24080m109509l685736J65332P11025k848116m023764
9670h694100L26551M791622L490779j663373m457097k933489m68421K28728L16825
9661i061975J693148L510819L406349J053349j147142j085007M40184R99055o9857
9652b61077r56701l87430L02930n12854j580232k41971K957105L696115o63428
9643B352457o642361p800931k134014N418309Q379848N407348N92239j945258
$$ plain form
9635 3627637 1682297 343446 -483995 -401452 435253 671650 -267488 -693895 952228
9626 952228 3164643 3321223 2056591 2474975 4645384 4642510 801340 -2731281 -1824625
9617 -1824625 1130158 674758 -3488887 -6361227 -5213536 -2607579 -1312396 -728215 73563
9608 73563 -119813 -1572403 -1401136 2297293 6387145 6253854 2365244 63957 2793935
9599 2793935 7967995 10295954 7899094 4225305 3963519 7474180 10283949 8798362
9591 8798362 4978444 3191875 3675447 2608453 -1489713 -5421549 -6250306 -4751802 -2587219
9582 -2587219 81719 2376953 2170715 107896 53582 2771784 3629934 229031 -2338888
9573 -2338888 1220900 7924436 11045574 9713329 7704075 5709975 2060054 -1051999
$$ packed form
9635C627637j945340j338851q27441Q2543Q36705K36397r39138m26407J646123
9626I52228K212415J56580j264632M18384K170409k874l841170l532621R06656
9617a824625K954783m55400m163645k872340J147691K605957J295183N84181Q01778
9608G3563j93376j452590J71267L698429M089852j33291l888610k301287K729978
9599B793935N174060K327959k396860l673789k61786L510661K809769j485587
9591H798362l819918j786569M83572j066994m098166l931836q28757J498504K164583
9582b587219K668938K295234k06238k062819n4314K718202Q58150l400903k567919
9573b338888L559788O703536L121138j332245k009254j994100l649921l112053
$$ plain form
9565 -1051999 -193436 1316237 -3491440 -13596443 -19794369 -17825270 -13582967 -12468164
9557 -12468164 -11533767 -6565916 -5171 3634084 4783991 5740744 5190056 1627241 -1431014
9548 -1431014 297124 4801397 6549134 4583645 2647146 2460977 2037868 389887 -673280
9539 -673280 24119 1245063 1617214 1259934 938418 1463695 3580578 6698370 8458387
9530 8458387 7412242 5308020 4853583 6077579 6786323 5806221 3934990 2342406 1574525
9521 1574525 1471413 944302 -1133826 -3845976 -4471473 -1866871 1968782 4625398 5605099
9512 5605099 5011530 2548894 -636027 -1776708 -119904 1667397 1605977 1324332 2848331
9503 2848331 5262584 6844044 7585679 7119820 3515736 -2547357 -5705167 -2243686 3891955
$$ packed form
9565a051999Q58563J509673m807677j0105003o197926J969099M242303J114803
9557a2468164R34397M967851O560745L639255J149907R56753n50688l562815l058255
9548a431014J728138M504273J747737j965489j936499j86169m23109j647981j063167
9539f73280O97399J220944L72151l57280l21516N25277K116883L117792J760017
9530H458387j046145k104222m54437J223996P08744r80102j871231j592584p67881
9521A574525j03112n27111k078128k712150o25497K604602L835653K656616R79701
9512E605099n93569k462636l184921j140681J656804J787301o1420k81645J523999
9503B848331K414253J581460P41635m65859l604084o063093l157810L461481O135641
$$ plain form
9494 3891955 5741488 2212126 -1762201 -2417752 -543229 1113714 229606 -4019258 -9006873
9485 -9006873 -9564479 -4302197 1064157 569644 -4009767 -6291340 -4150101 -627939 1891926
9476 1891926 2981799 1324047 -3584047 -7927364 -7544546 -4554309 -4250005 -6440278 -6362689
9467 -6362689 -3465696 -1981394 -2646457 -1550203 1744656 2765316 619995 -42956 1808483
9458 1808483 791675 -4508929 -6612415 -462597 7446703 8367084 4007096 2121595
9450 2121595 3771990 3678139 1011434 1041160 5687500 9706750 8216010 3055496 -245474
9441 -245474 1428197 6773100 11571185 11749576 7152768 2229939 1134367 3006859 4166699
9432 4166699 3385755 2074526 785258 -766970 -1131838 1417419 5001665 5483826 2022013
$$ packed form
9494C891955J849533l529362l974327o55551J874523J656943q84108m248864m987615
9485i006873n57606N262282N366354m94513m579411k281573K141239L522162K519865
9476A891926J089873j657752m908094m343317L82818K990237L04304k190273P7589
9467f362689K896993J484302o65063J096254L294859J020660k145321o62951J851439
9458A808483j016808n300604k103486O149818P909300R20381m359988j885501
9450B121595J650395r3851k666705K9726M646340M019250j490740n160514l300970
9441b45474J673671N344903M798085J78391m596808m922829j095572J872492J159840
9432D166699p80944j311229j289268j552228l64868K549257L584246M82161l461813
$$ plain form
9423 2022013 -2101736 -4526625 -6132065 -7490528 -6636824 -2359783 2787570 5010868
9415 5010868 3561000 912660 -540813 -734241 -1068922 -1896591 -1320552 2515707 7753750
9406 7753750 9532667 6076748 2023294 2729048 6715036 7705633 3770689 -68276 674651
9397 674651 4271650 6869036 8331987 10353366 11436043 8434064 2419541 -1364275
9389 -1364275 -284320 2386269 2582584 1063563 1379187 3961510 5442726 3737352 955474
9380 955474 267519 1944970 3896583 4506901 3288604 178399 -3571990 -4792061 -1434257
9371 -1434257 3978218 6712941 5861601 5021198 6202892 6513512 2932823 -2668888 -6361028
9362 -6361028 -7804203 -9388056 -10919152 -9294865 -3813969 1718098 3532727 2115694
$$ packed form
9423B022013m123749k424889j605440j358463Q53704M277041N147353K223298
9415E010868j449868k648340j453473j93428l34681q27669N76039L836259N238043
9406G753750J778917l455919m053454P05754L985988R90597l934944l838965P42927
9397F74651L596999K597386J462951K021379J082677l001979o014523l783816
9389a364275J079955K670589J96315j519021L15624K582323J481216j705374k781878
9380I55474o87955J677451J951613O10318j218297l110205l750389j220071L357804
9371a434257N412475K734723q51340q40403J181694L10620l580689n601711l692140
9362f361028j443175j583853j531096J624287N480896N532067J814629j417033
$$ plain form
9354 2115694 445007 -132998 -587730 -1797396 -3028818 -2718470 -104484 3772816 6468952
9345 6468952 5923913 2211465 -2500537 -5700206 -6399986 -5834222 -6290195 -8361856 -9430631
9336 -9430631 -6465646 -607186 3398504 3439531 2832246 4587133 6012096 3169188 -1525363
9327 -1525363 -1835652 2536171 4888243 1735599 -1897815 -769945 2196865 944652
9319 944652 -3832481 -5951809 -3501866 -1261613 -2840745 -5653437 -5599029 -2704621 424974
9310 424974 2816267 4869733 5758275 4153754 1018317 -834049 -289774 636924 -388437
9301 -388437 -2804514 -3727758 -1584212 1775343 3321273 2680782 2234217 3145979 3392618
9292 3392618 1271298 -1107078 -644420 1582833 1616428 -985508 -2042718 813753 4543836
$$ packed form
9354B115694j670687n78005m54732j209666j231422L10348K613986L877300K696136
9345F468952n45039l712448m712002l199669o99780N65764m55973k071661j068775
9336i430631K964985N858460M005690M1027o07285J754887J424963k842908m694551
9327a525363l10289M371823K352072l152644l633414J127870K966810j252213
9319I44652m777133k119328K449943K240253j579132k812692N4408K894408L129595
9310D24974K391293K053466Q88542j604521l135437j852366N44275R26698j025361
9301c88437k416077r23244K143546L359555J545930o40491m46565R11762K46639
9292C392618k121320k378376M62658K227253L3595k601936j057210K856471L730083
$$ plain form
9283 4543836 5765157 5746751 6962453 7662860 4385424 -1718717 -5764877 -5894082 -4753340
9274 -4753340 -4199235 -3193383 -1918601 -3160719 -7190781 -9314096 -5855879 286732
9266 286732 3516269 2689760 744680 -971854 -3542510 -6137295 -5402349 -513888 4384458
9257 4384458 4707701 550137 -4186656 -6349460 -5779099 -3952329 -1898535 406522 3091114
9248 3091114 5203641 5184733 3005473 809467 124748 -620728 -3711737 -7740829 -8410289
9239 -8410289 -4479531 -285455 -586161 -4721410 -8004880 -7794453 -5897424 -5255781 -6341268
9230 -6341268 -7342030 -6608156 -4274116 -2077774 -1830888 -3626695 -5592526 -5826227 -4203216
9221 -4203216 -1631121 1740282 6080115 9959558 10998529 9187337 7623396 8398383
$$ packed form
9283D543836J221321j8406J215702P00407l277436o104141m046160j29205J140742
9274d753340N54105J005852J274782j242118m030062k123315L458217O142611
9266B86732L229537q26509j945080j716534k570656k594785P34946M888461M898346
9257D384458L23243m157564m736793k162804N70361J826770K053794K305057K684592
9248C091114K112527j8908k179260k196006o84719p45476l091009m029092o69460
9239h410289L930758M194076l00706m135249l283470K10427J897029O41643j085487
9230f341268j000762P33874K334040K196342K46886j795807j965831k33701J623011
9221d203216K572095L371403M339833L879443J038971j811192j563941P74987
$$ plain form
9213 8398383 9311067 6891913 1716996 -2104847 -2631972 -2192113 -3007052 -3959740 -3648306
9204 -3648306 -3646539 -5577083 -7161732 -5210085 -1389758 -521318 -3124934 -4274188 -997152
9195 -997152 3526676 5095744 3748193 1283175 -2517303 -7448298 -9905380 -7025058
9187 -7025058 -1904956 -90771 -2067938 -3812383 -3851354 -4493198 -5874665 -4396046 1019302
9178 1019302 5798341 5734730 2727221 1464313 2897374 4122987 3101013 521081 -2186069
9169 -2186069 -4152795 -4549922 -2571035 1744236 7193927 11597791 12443962 8872263 3526643
9160 3526643 820162 2454739 5866624 7527602 6199294 2727507 -1018833 -2367660
9152 -2367660 185285 4000389 4253731 545947 -1749849 820949 4392375 3891736 1272099
$$ packed form
9213H398383R12684k419154n174917l821843n27125M39859q14939r52688L11434
9204c648306J767j930544j584649J951647L820327Q68440k603616j149254L277036
9195i97152M523828J569068j347551k465018l800478m930995k457082K880322
9187g025058N120102J814185j977167j744445l8971o41844j381467J478619N415348
9178A019302M779039o3611l007509j262908J433061J225613j021974k579932k707150
9169b186069j966726l97127J978887M315271N449691M403864Q46171l571699n345620
9160C526643k706481J634577L411885J660978j328308l471787l746340j348827
9152b367660K552945L815104K53342l707784k295796K570798L571426n00639k619637
$$ plain form
9143 1272099 2166524 6133574 6693516 1411822 -4318556 -5691572 -5163904 -6976765 -9157948
9134 -9157948 -6066880 2817981 11419672 14418946 12464210 9343120 7048713 5358194
9126 5358194 4350703 4966110 7158344 9036021 8659013 6347844 4513626 4955965 6802238
9117 6802238 7626338 6222890 3530654 1204490 474749 2203782 6184829 9733182 8994487
9108 8994487 3399570 -2464791 -3507787 39424 3578561 4408576 4297676 5431290 6745635
9099 6745635 6000407 3468126 1482454 1514062 3460479 6646434 9586261 9893751 6789824
9090 6789824 2954898 1446372 1472976 97251 -2441672 -2858148 -567725 948717 35887
9081 35887 -172937 2533881 4741456 2618672 -1067643 -346716 4884133 8552006 7206455
$$ packed form
9143A272099Q94425L967050N59942n281694n730378j373016N27668j812861k181183
9134i157948L091068Q884861Q601691K999274j954736l121090k294407j690519
9126E358194j007491O15407K192234J877677l77008k311169j834218M42339J846273
9117F802238Q24100j403448k692236k326164p29741J729033L981047L548353p38695
9108H994487n594917n864361j042996L547211L539137Q30015j10900J133614J314345
9099F745635p45228k532281j985672L1608J946417L185955K939827L07490l103927
9090F789824l834926j508526K6604j375725k538923m16476K290423J516442r12830
9081C5887k08824K706818K207575k122784l686315P20927N230849L667873j345551
$$ plain form
9072 7206455 3974412 2526643 1873571 -328353 -3025511 -3633983 -2372091 -1505522 -1491893
9063 -1491893 -714743 1423409 3457223 3912664 2782049 927789 -722373 -1376859 -926960
9054 -926960 -590618 -2217336 -6315371 -10770320 -12033253 -8451076 -2701922 178440 -1811642
9045 -1811642 -5229604 -5607659 -3186126 -1949896 -3581354 -5396254 -4761276 -2649502 -1462898
9036 -1462898 -1582448 -1702179 -1019239 244805 1241926 666247 -1787455 -3520727 -1011092
9027 -1011092 5007599 8949020 7136941 2989584 2632455 6707700 9651974 6910199
9019 6910199 303087 -4422081 -4033427 -1172117 -1326531 -6151293 -10581008 -8687566 -2116744
9010 -2116744 1007556 -2999258 -7739949 -5424999 2270646 7037765 5616122 2831145
$$ packed form
9072G206455l232043j447769o53072k201924k697158o08472J261892Q66569J3629
9063a491893P77150K138152K033814M55441j130615j854260j650162o54486M49899
9054i26960L36342j626718m098035m454949j262933L582177N749154K880362j990082
9045a811642l417962l78055K421533J236230j631458j814900O34978K111774J186604
9036a462898j19550j19731O82940J264044R97121n75679k453702j733272K509635
9027a011092O018691L941421j812079m147357l57129M075245K944274k741775
9019F910199o607112m725168L88654K861310j54414m824762m429715J893442O570822
9010b116744L124300m006814m740691K314950P695645M767119j421643k784977
$$ plain form
9002 2831145 3199300 5395734 6616276 7192614 7864559 6500534 1486928 -4011430 -5168470
8993 -5168470 -1888655 1239099 949402 -1703141 -4279723 -5872029 -6296252 -4980769 -2271097
8984 -2271097 -230194 -479839 -2182656 -3479669 -3908675 -3848705 -2622400 577763 4277393
8975 4277393 5769205 4790882 3615527 3050428 1475656 -984963 -1099467 2083066 4131709
8966 4131709 1493017 -2291981 -1913222 536006 -1481781 -7510173 -9385712 -3617876
8958 -3617876 2975776 3513414 276425 -1108022 -823956 -2028068 -3461606 -2068679 -52214
8949 -52214 -1906155 -5983708 -6456972 -3289668 -2757820 -6934471 -9748017 -6191940 377081
8940 377081 3612510 2382208 26150 -1098151 -709705 1227469 3997869 5355415 3956846
$$ packed form
9002B831145L68155K196434J220542N76338O71945j364025n013606n498358j157040
8993e168470L279815L127754k89697k652543k576582j592306m24223J315483K709672
8984b271097K040903k49645j702817j297013m29006N9970J226305L200163L699630
8975D277393J491812r78323j175355n65099j574772k460619j14504L182533K048643
8966D131709k638692l784998L78759K449228k017787o028392j875539N767836
8958c617876O593652N37638l236989j384447K84066j204112j433538J392927K016465
8949e2214j853941m077553m73264L167304N31848m176651k813546L556077O569021
8940C77081L235429j230302k356058j124301L88446J937174K770400J357546j398569
$$ plain form
8931 3956846 1409717 -17461 -259760 -292369 128599 1488600 2841440 3365355 4312006
8922 4312006 6955049 9421824 8256206 3316201 -1070112 -816732 3142609 5821018
8914 5821018 3759202 -1099874 -3669845 -1611152 2111241 3012296 195936 -3383520
8906 -3383520 -4562452 -2313585 2392109 6903429 7803826 3956813 -1557114 -4639268
8898 -4639268 -4793422 -4245596 -3482114 -1197954 1685447 2281303 785044 862799 3310261
8889 3310261 3732566 -601901 -5542172 -5668137 -2255406 -1010535 -3405661 -5101760 -3024160
8880 -3024160 240647 467800 -2572900 -5110525 -3586878 2056358 8350100 11129707
8872 11129707 9191879 5208194 2379640 845867 -1246113 -3814393 -4369780 -2021418
$$ packed form
8931C956846k547129j427178k42299l2609M20968J360001J352840N23915R46651
8922D312006K643043K466775j165618m940005m386313K53380L959341K678409
8914E821018k061816m859076k569971K058693L722393R01055k816360l579456
8906c383520j178932K248867M705694M511320R00397l847013n513927l082154
8898d639268j54154N47826P63482K284160K883401N95856j496259P7755K447462
8889C310261M22305m334467m940271j25965L412731J244871k395126j696099K077600
8880c024160L264807K27153l040700k537625J523647N643236O293742K779607
8872A1129707j937828l983685k828554j533773k091980k568280n55387K348362
$$ plain form
8864 -2021418 288197 -648452 -3647344 -4355620 -1290901 1634476 250864 -3738305 -4598459
8855 -4598459 -452600 4004715 4259419 2351753 3366961 7681825 10872712 10584719 9048302
8846 9048302 8353421 7557814 5812680 4317684 3244912 599378 -3371878 -4569185 -1320051
8837 -1320051 1357871 -1524583 -6651484 -6590242 -1058220 2263702 -1160605 -6814781 -8693731
8828 -8693731 -7472368 -7088515 -7134830 -4174871 987641 3185015 824443 -992052 2202227
8819 2202227 7410461 8284650 3949227 -405041 -1037429 509941 1679991 2738977 4288639
8810 4288639 4555976 2371472 355493 1523330 4300729 4584211 1765073 -979839 -1799564
8801 -1799564 -1773914 -1578995 -449251 1077030 950008 -1175119 -3666879 -6078098 -8999027
$$ packed form
8864b021418K309615r36649k998892p08276L064719K925377j383612l989169q60154
8855d598459M145859M457315K54704j907666J015208M314864L190887k87993j536417
8846I048302o94881p95607j745134j494996j072772k645534l971256j197307L249134
8837a320051K677922k882454n126901O1242N532022L321922l424307n654176j878950
8828h693731J221363L83853m6315K959959N162512K197374k360572j816495L194279
8819B202227N208234Q74189m335423m354268o32388J547370J170050J058986J549662
8810D288639K67337k184504k015979J167837K777399K83482k819138k744912q19725
8801a799564K5650J94919J129744J526281j27022k125127k491760k411219k920929
$$ plain form
8792 -8999027 -10648535 -8040916 -2402511 1159261 709926 -465791 -309415 -1021262 -3269276
8783 -3269276 -3314713 179155 2006995 -1840060 -7041822 -7327256 -3970620 -2591861 -3795351
8774 -3795351 -3903246 -2608281 -2641434 -3263300 -1407774 1347751 301680 -3859744 -5499982
8765 -5499982 -3746261 -4126993 -8610687 -11573726 -9046480 -5266482 -5675299 -8921803 -10567457
8756 -10567457 -10195032 -9905554 -9394842 -7484304 -5801073 -6299119 -7330320 -6466604 -5163396
8747 -5163396 -6255807 -8546231 -8421955 -5762140 -3783023 -3519789 -2751157 -502655 1380587
8738 1380587 1846454 2322734 3641300 4167719 2534570 182256 -400853 1238674 3393797
8729 3393797 4429401 4274285 3929938 3873081 3165475 765486 -2202344 -2869623 -297462
$$ packed form
8792h999027j649508K607619N638405L561772m49335j175717J56376p11847k248014
8783c269276m5437L493868J827840l847055n201762k85434L356636J378759j203490
8774c795351j07895J294965l3153o21866J855526K755525j046071m161424j640238
8765e499982J753721l80732m483694k963039K527246L779998m08817l246504j645654
8756a0567457L72425K89478N10712J910538J683231m98046j031201Q63716J303208
8747e163396j092411k290424J24276K659815J979117K63234P68632K248502J883242
8738A380587M65867M76280J318566N26419j633149k352314n83109J639527K155123
8729C393797J035604j55116l44347n6857p07606k399989k967830o67279K572161
$$ plain form
8720 -297462 2543114 2012750 -1801747 -5511675 -6526834 -5026086 -2509915 -508222 -506795
8711 -506795 -2799758 -4908557 -3320602 2030035 6702123 6746156 3590133 1895579 2960179
8702 2960179 2787429 -2206101 -9644900 -13720994 -12367149 -8975386 -6763872 -4856878
8694 -4856878 -1696392 969108 910928 -34303 1392086 3745738 2312066 -3062069 -6578399
8685 -6578399 -4557409 -372916 1241603 853417 1875830 4480392 5856835 4799836
8677 4799836 2630858 738678 -30897 1138646 3530127 4332226 2237961 13871 640669
8668 640669 2596862 2217796 -850601 -4105988 -6511797 -8219729 -7245017 -1378870 6683622
8659 6683622 10955154 9646040 6877373 6248273 7031011 7736319 8725957 9294627 6563369
$$ packed form
8720b97462K840576n30364l814497l709928j015159J500748K516171K001693J427
8711e06795k292963k108799J587955N350637M672088M4033l156023j694554J064600
8702B960179j72750m993530p438799m076094J353845L391763K211514J906994
8694d856878L160486K665500n8180r45231J426389K353652j433672n374135l516330
8685f578399K020990M184493J614519l88186J022413K604562J376443j056999
8677D799836k168978j892180p69575J169543K391481Q02099k094265k224090O26798
8668F40669J956193l79066l068397l255387k405809j707932R74712N866147Q062492
8659F683622M271532j309114k768667o29100P82738P05308R89638N68670k731258
$$ plain form
8650 6563369 147603 -5551909 -6650404 -4433703 -1970171 811797 5157409 9111664
8642 9111664 9262713 5798509 2384271 1533420 2773797 4641166 5827314 5033970 2369132
8633 2369132 440204 1550565 4265403 5333190 4559722 4742333 6633219 7249369 4437425
8624 4437425 463050 -933452 560050 2005717 1614362 850587 1658881 3108767 2406461
8615 2406461 -791871 -2832095 -344999 4806141 7208078 4768156 1341769 1184790
8607 1184790 3167545 2925882 -747451 -4562401 -5278440 -2865853 979021 4874989 7484755
8598 7484755 7351470 4556545 1587819 1291057 4064371 7467667 8467342 6172627 2682789
8589 2682789 857693 824361 -426831 -4869338 -9720741 -9830873 -3879282 3622010 7284776
$$ packed form
8650F563369o415766n699512j098495K216701K463532K781968M345612L954255
8642I111664J51049l464204l414238q50851J240377J867369J186148p93344k664838
8633B369132j928928J110361K714838J067787p73468J82611J890886O16150k811944
8624D437425l974375j396502J493502J445667l91355p63775Q08294J449886p02306
8615B406461l198332k040224K487096N151140K401937k439922l426387j56979
8607A184790J982755k41663l673333l814950p16039K412587L844874L895968K609766
8598G484755j33285k794925k968726k96762K773314L403296R99675k294715l489838
8589B682789j825096l3332j251192m442507m851403j10132N951591P501292L662766
$$ plain form
8580 7284776 6505454 5091757 6003180 7925905 7520457 4154619 976856 868564 2801429
8571 2801429 3825734 3603882 4275153 6018799 6231730 4219387 3116608 4888738 6797531
8562 6797531 6071771 5020627 7169596 10616752 10402254 6285197 2745683 1646929 538220
8553 538220 -1439889 -2042886 -1669607 -4302341 -9902880 -11813594 -5922615 2488718 5831453
8544 5831453 3969718 1642849 -111565 -3530987 -7460736 -8057374 -5624697 -4386092
8536 -4386092 -5011469 -3330733 2208781 7331911 8377402 7193937 6847737 6527483 4120359
8527 4120359 785254 -760600 -672139 -1337939 -3372442 -5124633 -5637962 -5687736 -6028774
8518 -6028774 -6426917 -6337587 -5229638 -2576533 1224544 4290041 4812625 2962632 341183
$$ packed form
8580G284776p79322j413697R11423J922725m05448l365838l177763j08292J932865
8571B801429J024305k21852O71271J743646K12931k012343j102779J772130J908793
8562F797531p25760j051144K148969L447156k14498m117057l539514j098754j108709
8553E38220j978109o02997L73279k632734n600539j910714N890979Q411333L342735
8544E831453j861735k326869j754414l419422l929749n96638K432677J238605
8536d386092o25377J680736N539514N123130J045491j183465l46200l20254k407124
8527D120359l335105j545854Q8461o65800k034503j752191n13329m9774l41038
8518f028774l98143Q9330J107949K653105L801077L065497N22584j849993k621449
$$ plain form
8509 341183 -1958356 -3681712 -4289477 -2882822 499374 4209019 5894927 4223713 328914
8500 328914 -2502528 -1971037 -146802 -1903627 -8468828 -14312612 -13157729 -6119928 -360966
8491 -360966 538011 691520 4380519 8499247 7098862 1347680 -1063230 2812661 6287743
8482 6287743 2566846 -5393424 -9383790 -7397857 -4738247 -4714904 -4511836 -1369516 2769864
8473 2769864 5189897 6260148 6491750 4162685 -436043 -2451410 1128105 5710770
8465 5710770 5012508 268418 -2281855 -1316078 -1099820 -2681675 -1754095 3068599 6557357
8456 6557357 4674459 702537 -246462 1451171 2163000 1049894 -371298 -1991398 -4137999
8447 -4137999 -4887389 -2616922 157647 -400866 -3705325 -5729954 -5183743 -4793833 -6397767
$$ packed form
8509C41183k299539j723356o07765J406655L382196L709645J685908j671214l894799
8500C28914k831442N31491J824235j756825o565201n843784J154883P037801N758962
8491c60966Q98977J53509L688999M118728j400385n751182k410910L875891L475082
8482F287743l720897p960270l990366J985933K659610K3343K03068L142320M139380
8473B769864K420033J070251K31602k329065m598728k015367L579515M582665
8465E710770o98262m744090k550273R65777K16258j581855R27580M822694L488758
8456F557357j882898l971922r48999J697633P11829j113106j421192j620100k146601
8447d137999p49390K270467K774569n58513l304459k024629N46211L89910j603934
$$ plain form
8438 -6397767 -8418887 -8816372 -7423203 -4667228 -916997 1959318 1200908 -3180029 -7444443
8429 -7444443 -8278737 -6168112 -3379032 -568555 2610123 5018114 4872963 2925828 2329067
8420 2329067 4479972 6897565 6745035 4972521 4508270 5013989 3005907 -1691514 -3543478
8411 -3543478 1126544 6984171 5475106 -2951830 -8489616 -5318461 632696 880889
8403 880889 -3633560 -5258254 -1348445 2987449 3191035 549713 -1819237 -3612987 -5841881
8394 -5841881 -7744889 -7501515 -4596125 -239345 3546725 4949387 3800204 2043358
8386 2043358 1404024 1056410 -483497 -1843093 -73026 4431876 7355494 5775239 1528477
8377 1528477 -1780548 -2701646 -1622535 945208 3790004 4580333 2262127 -1160044 -3082464
$$ packed form
8438f397767k021120l97485J393169K755975L750231K876315p58410m380937m264414
8429g444443q34294K110625K789080K810477L178678K407991j45151j947135n96761
8420B329067K150905K417593j52530j772514m64251N05719k008082m697421j851964
8411c543478M670022N857627j509065q426936n537786L171155N951157K48193
8403H80889m514449j624694L909809M335894K03586k641322k368950j793750k228894
8394e841881j903008K43374K905390M356780L786070J402662j149183j756846
8386B043358o39334l47614j539907j359596J770067M504902K923618j580255m246762
8377A528477l309025r21098J079111K567743K844796P90329k318206l422171j922420
$$ plain form
8368 -3082464 -3661345 -4851886 -6709184 -6831532 -3913163 -190497 900623 -1025141 -2721851
8359 -2721851 -1407227 1721619 3426872 3124507 3231472 4548953 4383656 1133860 -2037987
8350 -2037987 -1250315 2247612 3953832 2756193 1642428 2008673 1481136 -1734388 -5956166
8341 -5956166 -8736062 -9464227 -8222040 -5073726 -1672078 -539979 -1420078 -1297685 644164
8332 644164 1373351 -986446 -3862187 -4192736 -2598256 -1099537 369039 2328457 3349201
8323 3349201 2457638 1755592 3536687 6710236 8974465 10455216 12111605 12672994 10653293
8314 10653293 7632220 6034991 5265241 3453988 1274923 416238 184856 -434833 481053
8305 481053 4307567 7236450 4834645 -212625 -1366511 1337333 1235394 -3859063 -7811038
$$ packed form
8368c082464n78881j190541j857298j22348K918369L722666J091120j925764j696710
8359b721851J314624L128846J705253l02365J06965J317481j65297l249796l171847
8350b037987P87672L497927J706220j197639j113765L66245n27537l215524m221778
8341e956166k779896p28165J242187L148314L401648J132099q80099J22393J941849
8332F44164P29187k359797k875741l30549J594480J498719J468576J959418J020744
8323C349201q91563p02046J781095L173549K264229J480751J656389N61389k019701
8314A0653293l021073j597229p69750j811253k179065q58685k31382o19689R15886
8305D81053L826514K928883k401805n047270j153886K703844j01939n094457l951975
$$ plain form
8296 -7811038 -5737557 -797358 1899116 2440170 3423889 5082466 6920877 9707150 12099774
8287 12099774 9969878 3262597 -1247342 942578 4731863 3072195 -2080082 -3401054
8279 -3401054 134584 2797526 1817853 46169 -679257 -1568338 -1906438 918529 5339678
8270 5339678 6324895 3687793 2868025 5321255 5421345 506915 -3108639 447503 7006519
8261 7006519 8627046 5189436 2810973 3573623 4101873 3141057 3411641 5389842 5434310
8252 5434310 1859643 -1919764 -2442212 -794922 -159814 -1603976 -4094138 -6297004 -6670478
8243 -6670478 -3837041 1300586 5170567 4774326 589779 -4395838 -7455696 -7401432 -4492996
8234 -4492996 -204074 3455352 5123233 4720378 3235653 2059790 1715564 941757 -1505618
$$ packed form
8296g811038K073481M940199K696474N41054R83719J658577J838411K786273K392624
8287A2099774k129896o707281m509939K189920L789285j659668n152277j320972
8279c401054L535638K662942r79673j771684p25426q89081l38100K824967M421149
8270E339678R85217k637102q19768K453230J00090m914430l615554L556142O559016
8261G006519J620527l437610k378463P62650N28250r60816K70584J978201M4468
8252E434310l574667l779407n22448J647290O35108j444162k490162k202866l73474
8243f670478K833437N137627L869981l96241m184547m985617l059858N4264K908436
8234d492996M288922L659426J667881m02855j484725j175863l44226p73807k447375
$$ plain form
8225 -1505618 -3637592 -1409864 5137920 9936405 8373226 4089398 3742042 6954721
8217 6954721 7350900 2997454 -831211 -463757 1228664 1409006 2514725 6588347 9578283
8208 9578283 6823905 616556 -3433667 -4995636 -8006009 -12558218 -14013542 -10366322
8200 -10366322 -5143667 -1978316 -747236 -352680 -1276617 -3477024 -4927393 -4389384 -3457926
8191 -3457926 -3998868 -5100269 -4098491 264242 6432786 10908779 10537777 5470557 37823
8182 37823 -984181 2568925 6241783 6158905 2799173 -519576 -1339717 104972 1499096
8173 1499096 656579 -1961151 -3224395 -801015 4113093 8671499 11557176 12388518 9738283
8164 9738283 2992173 -4688412 -8768155 -8491087 -6450621 -3662723 774801 5237974
$$ packed form
8225a505618k131974K227728O547784M798485j563179m283828l47356L212679
8217F954721L96179m353446l828665L67454J692421J80342J105719M073622K989936
8208I578283k754378o207349m050223j561969l010373m552209j455324L647220
8200a0366322N222655L165351J231080L94556r23937k200407j450369N38009R31458
8191c457926n40942j101401J001778M362733O168544M475993l71002n067220n432734
8182C7823j022004L553106L672858q2878l359732l318749q20141J444689J394124
8173A499096q42517k617730j263244K423380M914108M558406K885677Q31342k650235
8164I738283o746110p680585m079743K77068K040466K787898M437524M463173
$$ plain form
8156 5237974 5921267 2999547 1520298 3740612 5159798 1548744 -4134907 -6205873
8148 -6205873 -4572420 -3671883 -4998624 -5971368 -5741506 -6920162 -10363950 -12409958 -9537131
8139 -9537131 -3225378 1988377 3722700 3107365 1976798 825726 -326163 -654568 795140
8130 795140 3600784 6146930 7385684 7450887 6353267 3649431 360339 -725968 1170256
8121 1170256 2375520 -710934 -5629547 -6497411 -2689191 -153113 -2514965 -5597636
8113 -5597636 -4007097 651334 2526584 207086 -2002375 -772161 2364715 4183146
8105 4183146 3784822 2630294 2396174 3374955 4190277 3432227 1997730 2302620 4310281
8096 4310281 4653477 1423344 -2752818 -4965258 -6699348 -10677334 -15198213 -16059474 -12910494
$$ packed form
8156E237974O83293k921720j479249K220314J419186l611054n683651k070966
8148f205873J633453R00537j326741r72744K29862j178656l443788k046008K872827
8139i537131O311753N213755J734323o15335j130567j151072j151889l28405J449708
8130G95140K805644K546146J238754O5203j097620k703836l289092j086307J896224
8121A170256J205264l086454m918613q67864L808220K536078k361852l082671
8113e597636J590539M658431J875250k319498k209461J230214L136876J818431
8105D183146l98324j154528k34120R78781Q15322p58050j434497L04890K007661
8096D310281L43196l230133m176162k212440j734090l977986m520879q61261L148980
$$ plain form
8087 -12910494 -9105740 -5880901 -1564743 3351353 5545830 4448387 3695416 5107177
8079 5107177 5605030 2677194 -1050146 -1987890 -1190970 -2087280 -4744206 -6132794 -4934562
8070 -4934562 -2761502 -1192579 -453248 -674103 -1839036 -2579201 -1431626 500781 296807
8061 296807 -2871330 -6305231 -6879488 -4248420 -457607 2375476 3315660 2636586 1587613
8052 1587613 1646379 3170990 4863957 4988743 3012922 -177169 -3311126 -5397776 -5577658
8043 -5577658 -3345743 485625 3715375 4606174 3633541 2581141 2200041 1932374 1722235
8034 1722235 2300045 3220626 2568894 -223593 -2958419 -3574298 -2950453 -2971601 -3192613
8025 -3192613 -1793593 1029176 3178695 3783527 3759221 3406794 1997183 17005 -606386
$$ packed form
8087a2910494L804754L224839M316158M916096K194477j097443p52971J411761
8079E107177M97853k927836l727340r37744P96920q96310k656926j388588J198232
8070d934562K173060J568923P39331k20855j164933p40165J147575J932407k03974
8061B96807l168137l433901n74257K631068L790813K833083R40184o79074j048973
8052A587613N8766J524611J692967J24786j975821l190091l133957k086650j79882
8043e577658K231915L831368L229750Q90799r72633j052400l81100k67667k10139
8034A722235N77810R20581o51732k792487k734826o15879O23845k1148k21012
8025c192613J399020K822769K149519O04832k4306l52427j409611j980178o23391
$$ plain form
8016 -606386 781950 2610787 3539639 4146847 5480346 7313679 8309084 6921946 2559311
8007 2559311 -2669794 -4330879 -335527 5387170 6950468 3878577 888836 597083
7999 597083 1046025 1096513 2742659 5769886 5621658 491763 -4256163 -3706862 -1247538
7990 -1247538 -2687299 -5878191 -3888039 2826253 5843226 1565839 -3243243 -1939750
7982 -1939750 2592062 3667856 842673 -1387688 -1545391 -1848483 -2562422 -1396742 1614773
7973 1614773 3559506 3525100 3640700 4229824 2289446 -3067243 -7421231 -6526025 -2470515
7964 -2470515 -708412 -2216476 -2477849 1526504 6756204 8149507 5088663 1641339
7956 1641339 1027192 1926245 1054542 -1755505 -2822035 444672 5330895 6600834 3256151
$$ packed form
8016f06386J388336J828837R28852O07208J333499J833333R95405j387138m362635
8007B559311n229105j661085L995352N722697J563298l071891k989741k91753
7999E97083M48942N0488J646146L027227j48228n129895m747926N49301K459324
7990a247538j439761l190892J990152O714292L016973m277387m809082J303493
7982a939750M531812J075794k825183k230361j57703l03092p13939J165680L011515
7973A614773J944733l4406J15600N89124j940378n356689m353988Q95206M055510
7964b470515J762103j508064k61373M004353N229700J393303l060844l447324
7956A641339o14147Q99053q71703k810047j066530L266707M886223J269939l344683
$$ plain form
7947 3256151 -35018 794847 4161881 6143200 6370675 7145037 8230622 7080989 4244547
7938 4244547 3788103 6863087 9157029 7200130 3414586 1679986 1202780 -1097251 -4534756
7929 -4534756 -5693895 -4285401 -3368557 -4103871 -4630828 -4366808 -5239697 -7802597 -9856915
7920 -9856915 -10105679 -9843657 -9745921 -8191710 -4455068 -856227 11416 -1869389 -4931182
7911 -4931182 -7469572 -7194303 -2350704 5050504 9765326 8883074 4657307 582358 -2414754
7902 -2414754 -4310263 -4053088 -1986863 -1166621 -3066242 -4428017 -1695414 3503922 6616070
7893 6616070 5986371 3099102 -986964 -5562989 -8225720 -7145415 -4536930 -3979667 -5067974
7884 -5067974 -4617744 -2262934 -391138 891689 3652369 6795055 6256534 1884959 -1027710
$$ packed form
7947C256151l291169Q29865L367034J981319K27475P74362J085585j149633k836442
7938D244547m56444L074984K293942j956899l785544j734600m77206k300031l437505
7929d534756j159139J408494R16844p35314n26957K64020q72889k562900k054318
7920i856915k48764K62022R7736J554211L736642L598841Q67643j880805l061793
7911d931182k538390K75269M843599P401208M714822q82252m225767m074949k997112
7902b414754j895509K57175K066225Q20242j899621j361775K732603N199336L112148
7893F616070o29699k887269m086066m576025k662731J080305K608485N57263j088307
7884e067974M50230K354810J871796J282827K760680L142686n38521m371575k912669
$$ plain form
7875 -1027710 626260 3226199 2460842 -171588 -580146 1408549 2885111 3087776 3696682
7866 3696682 5030790 5638722 5196441 4688561 4012473 2244140 40086 -1107214 -2001483
7857 -2001483 -5024912 -9578161 -11237843 -7166390 -208349 4470791 5370120 4946656 4773341
7848 4773341 3369013 -413996 -4421091 -5780503 -5126668 -5495499 -7169891 -6738796 -2577408
$$ packed form
7875a027710J653970K599939p65357k632430m08558J988695J476562K02665O08906
7866C696682J334108O07932m42281n07880o76088j768333k204054j147300q94269
7857b001483l023429m553249j659682M071453O958041M679140Q99329m23464j73315
7848D773341j404328l783009m007095j359412O53835l68831j674392M31095M161388
$$ [...]
##END NTUPLES=NMR SPECTRUM
##END=
