##TITLE=31Pdec_SR46
 CDCl3, 24 sc
 12.03.2021
##JCAMPDX= 6.0         $$ Bruker NMR JCAMP-DX V2.0
##DATA TYPE= NMR SPECTRUM
##DATA CLASS= NTUPLES
##ORIGIN= UXNMR, Bruker Analytische Messtechnik GmbH
##OWNER= root
$$ XWIN-NMR		Version 3.5
$$ Fri Mar 12 12:47:30 2021 Russian Standard Time (UT+4h)  she@DPX200
##.OBSERVE FREQUENCY= 81.013821
##.OBSERVE NUCLEUS= ^31P
##.ACQUISITION MODE= SIMULTANEOUS
##.ACQUISITION SCHEME= undefined
##.AVERAGES= 24
##.DIGITISER RES= 16
##SPECTROMETER/DATA SYSTEM= spect
##.PULSE SEQUENCE= zgpg30
##.SOLVENT NAME= CDCl3
##.SHIFT REFERENCE= (INTERNAL, CDCl3, 0, 248.564)
##AUDIT TRAIL= $$ (NUMBER, WHEN, WHO, WHERE, WHAT)
$$ ##TITLE= Audit trail, XWIN-NMR		Version 3.5
$$ ##JCAMPDX= 5.01
$$ ##ORIGIN= Bruker BioSpin GmbH
$$ ##OWNER= she
$$ F:/spectra/data/she/nmr/P31/1/pdata/1/auditp.txt
$$ ##AUDIT TRAIL=  $$ (NUMBER, WHEN, WHO, WHERE, WHAT)
(   1,<2021-03-12 12:46:04.25 +0400>,<she>,<DPX200>,
      <created by zg, POWCHK disabled, PULCHK disabled
       configuration hash MD5:
       00 E9 B6 7A A2 85 ED C7 34 08 36 98 17 FE 4E 26
       data hash MD5: 32K
       8D A1 A0 00 E4 AA 20 A9 54 97 31 BE C8 30 59 10>)
(   2,<2021-03-12 12:46:16.71 +0400>,<she>,<DPX200>,
      <Start of raw data processing
       efp BC_mod = 2 LB = 1 FT_mod = 6 PKNL = 1 PHC0 = -4490.344 PHC1 = 700.4012 SI = 64K 
       data hash MD5: 64K
       E1 F4 2D CE 6E 18 22 54 69 08 8A 4A AB C8 D0 E8>)
(   3,<2021-03-12 12:47:01.06 +0400>,<she>,<DPX200>,
      <pk PHC0 = 205.8447 PHC1 = -88.20001 
       data hash MD5: 64K
       16 8D 0E F4 08 60 8A 61 9E 55 51 2C 78 9C 0D D0>)
$$ ##END=
$$ 
$$ hash MD5
$$ BC C4 2D 23 1D F0 1B 21 DC 04 A3 2B 87 5E 6E 27
##$RELAX= 
##$RELAX= 
##$RELAX= 
##$RELAX= 
##$RELAX= 
##$RELAX= 
##$RELAX= 
##$RELAX= 
$$ Bruker specific parameters
$$ --------------------------
##$DU= <F:/spectra>
##$EXPNO= 1
##$NAME= <P31>
##$PROCNO= 1
##$TYPE= <nmr>
##$USER= <she>
##$AMP= (0..31)
100 100 100 100 100 100 100 100 100 100 100 100 100 100 100 100 100 100 
100 100 100 100 100 100 100 100 100 100 100 100 100 100 
##$AQSEQ= 0
##$AQ_mod= 1
##$AUNM= <au_zg>
##$AUTOPOS= <>
##$BF1= 81.014009
##$BF2= 200.13
##$BF3= 200.13
##$BF4= 200.13
##$BF5= 200.13
##$BF6= 200.13
##$BF7= 200.13
##$BF8= 200.13
##$BYTORDA= 1
##$CFDGTYP= 0
##$CFRGTYP= 5
##$CHEMSTR= <none>
##$CNST= (0..31)
1 1 145 1 1 1 1 1 1 1 1 1 1 1 1 1 1 1 1 1 1 1 1 1 1 1 1 1 1 1 1 1 
##$CPDPRG= <waltz16>
##$CPDPRG1= <>
##$CPDPRG2= <waltz16>
##$CPDPRG3= <>
##$CPDPRG4= <mlev>
##$CPDPRG5= <mlev>
##$CPDPRG6= <mlev>
##$CPDPRG7= <mlev>
##$CPDPRG8= <mlev>
##$CPDPRGB= <>
##$CPDPRGT= <>
##$D= (0..31)
0 1 0 0 0 0 0 0 0 0 0 0.03 2e-05 3e-06 0 0 0 0 0 0 0 0 0 0 0 0 0 0 0 0 
0 0 
##$DATE= 1615538763
##$DBL= (0..7)
120 120 120 11 120 120 24 19 
##$DBP= (0..7)
150 150 150 150 150 150 150 150 
##$DBP07= 0
##$DBPNAM0= <>
##$DBPNAM1= <>
##$DBPNAM2= <>
##$DBPNAM3= <>
##$DBPNAM4= <>
##$DBPNAM5= <>
##$DBPNAM6= <>
##$DBPNAM7= <>
##$DBPOAL= (0..7)
0.5 0.5 0.5 0.5 0.5 0.5 0.5 0.5 
##$DBPOFFS= (0..7)
$$ [...]
##$SUBNAM2= <"">
##$SUBNAM3= <"">
##$SUBNAM4= <"">
##$SUBNAM5= <"">
##$SUBNAM6= <"">
##$SUBNAM7= <"">
##$SUBNAM8= <"">
##$SUBNAM9= <"">
##$SW= 501.771253377433
##$SWIBOX= (0..15)
0 1 3 0 0 0 0 0 0 0 0 0 0 0 0 0 
##$SW_h= 40650.406504065
##$TD= 32768
##$TD0= 1
##$TE= 0
##$TE2= 300
##$TE3= 300
##$TEG= 300
##$TL= (0..7)
0 120 53 12 22 120 120 120 
##$TP= (0..7)
150 150 150 150 150 150 150 150 
##$TP07= 0
##$TPNAME0= <>
##$TPNAME1= <>
##$TPNAME2= <>
##$TPNAME3= <>
##$TPNAME4= <>
##$TPNAME5= <>
##$TPNAME6= <>
##$TPNAME7= <>
##$TPOAL= (0..7)
0.5 0.5 0.5 0.5 0.5 0.5 0.5 0.5 
##$TPOFFS= (0..7)
0 0 0 0 0 0 0 0 
##$TUNHIN= 0
##$TUNHOUT= 0
##$TUNXOUT= 0
##$USERA1= <user>
##$USERA2= <user>
##$USERA3= <user>
##$USERA4= <user>
##$USERA5= <user>
##$V9= 5
##$VALIST= <valist>
##$VCLIST= <CCCCCCCCCCCCCCC>
##$VD= 0
##$VDLIST= <DDDDDDDDDDDDDDD>
##$VPLIST= <PPPPPPPPPPPPPPP>
##$VTLIST= <TTTTTTTTTTTTTTT>
##$WBST= 1024
##$WBSW= 4
##$XGAIN= (0..3)
0 0 0 0 
##$XL= 0
##$YL= 0
##$YMAX_a= 6380
##$YMIN_a= -4120
##$ZGOPTNS= <>
##$ZL1= 120
##$ZL2= 120
##$ZL3= 120
##$ZL4= 120
##$ABSF1= 0
##$ABSF2= 0
##$ABSG= 0
##$ABSL= 0
##$ALPHA= 0
##$AQORDER= 0
##$ASSFAC= 0
##$ASSFACI= 0
##$ASSFACX= 0
##$ASSWID= 0
##$AUNMP= <proc_1d>
##$AZFE= 0.1
##$AZFW= 0.5
##$BCFW= 0
##$BC_mod= 2
##$BYTORDP= 0
##$COROFFS= 0
##$CY= -3
##$DATMOD= 1
##$DC= 0
##$DFILT= <>
##$DTYPP= 0
##$F1P= 0
##$F2P= 0
##$FCOR= 1
##$FTSIZE= 65536
##$FT_mod= 6
##$GAMMA= 0
##$GB= 0
##$INTBC= 1
##$INTSCL= 5.30512e-09
##$ISEN= 30
##$LB= 1
##$LEV0= 0
##$LPBIN= 0
##$MAXI= 10000
##$MC2= 0
##$MEAN= 0
##$ME_mod= 0
##$MI= 50
##$NCOEF= 0
##$NC_proc= -6
##$NLEV= 6
##$NOISF1= 182.463
##$NOISF2= 159.3651
##$NSP= 0
##$NTH_PI= 0
##$NZP= 0
##$OFFSET= 248.5645
##$PC= 4
##$PHC0= -4284.5
##$PHC1= 612.2012
##$PH_mod= 1
##$PKNL= yes
##$PPARMOD= 0
##$PSCAL= 0
##$PSIGN= 0
##$REVERSE= no
##$SF= 81.014009
##$SI= 65536
##$SIGF1= 159.3651
##$SIGF2= -187.1042
##$SINO= 113.3802
##$SIOLD= 16384
##$SREGLST= <1H.CDCl3>
##$SSB= 0
##$STSI= 65536
##$STSR= 0
##$SW_p= 40650.406504065
##$SYMM= 0
##$S_DEV= 0
##$TDeff= 32768
##$TDoff= 0
##$TI= <>
##$TILT= no
##$TM1= 0
##$TM2= 0
##$TOPLEV= 0
##$USERP1= <user>
##$USERP2= <user>
##$USERP3= <user>
##$USERP4= <user>
##$USERP5= <user>
##$WDW= 1
##$XDIM= 65536
##$YMAX_p= 309930178
##$YMIN_p= -14654045
$$ End of Bruker specific parameters
$$ ---------------------------------
##NTUPLES= NMR SPECTRUM
##VAR_NAME=  FREQUENCY,     SPECTRUM/REAL,   SPECTRUM/IMAG
##SYMBOL=    X,             R,               I
##VAR_TYPE=  INDEPENDENT,   DEPENDENT,       DEPENDENT
##VAR_FORM=  AFFN,          ASDF,            ASDF
##VAR_DIM=   65536,         65536,           65536
##UNITS=     HZ,            ARBITRARY UNITS, ARBITRARY UNITS
##FACTOR=    0.620285442955139, 1,           1
##FIRST=     20137.2065510759, 0,            0
##LAST=      -20513.1999529892, 0,           0
##MIN=       -20513.1999529892, -14654045,   0
##MAX=       20137.2065510759, 309930178,    0
$$ Real data points
##PAGE= N=1
##DATA TABLE= (X++(R..R)), XYDATA
$$ [...]
40151d469747J793280K209736J534860O12485P83779P74519j716840m855730l681033
$$ -4469747 -2676467 -466731 1068129 1680614 2464393 3238912 1522072 -3333658 -7014691
40142g014691K105775O058422L555174j641786l058429m01355J536832O11348
$$ -7014691 -4908916 1149506 4704680 3062894 4465 -396890 1139942 1751290
40134A751290o70681j37119J044857P21530j464953l972291m540045j926536K196061
$$ 1751290 1080609 943490 1988347 2709877 1244924 -2727367 -7267412 -9193948 -6997887
40125f997887M039990J926946j353605j998344K13272K527944L122967K293148
$$ -6997887 -2957897 -1030951 -2384556 -4382900 -4169628 -1641684 1481283 3774431
40117C774431P50381r81967j953460j519241m85103j40266n70127r96701r99550
$$ 3774431 4524812 3542845 1589385 70144 -414959 -555225 -1125352 -2122053 -3121603
40108c121603l88665R81461K154760J324009j406563l088535j555071J467058
$$ -3121603 -3510268 -2528807 -374047 949962 -456601 -3545136 -5100207 -3633149
40100c633149K786968J873130N00028k85949n42585q3890P89387M15682j807923
$$ -3633149 -846181 1026949 1526977 1241028 698443 614553 1403940 1819622 11699
40091A1699l354153j771448J180298J876316M43282K72962K171821L055590J185027
$$ 11699 -3342454 -5113902 -3933604 -2057288 -1614006 -1341044 830777 3886367 5071394
40082E071394j101299j346425m34435k26868m18499Q6132O79005J73828q88888
$$ 5071394 3970095 2623670 2189235 1962367 1543868 1630000 2309005 2482833 1593945
40073A593945j031122r1980Q38545J030706M43554p97220k103671k313135r81655
$$ 1593945 562823 470843 1309388 2340094 2783648 1986428 -117243 -2430378 -3412033
40064c412033P44977J442173J015519K54656m32818r02744o71704L56697J076708
$$ -3412033 -2667056 -1224883 -209364 45292 -387526 -1290270 -1961974 -1605277 -528569
40055e28569M06428q85222r31691N19644J502270N51447j124351j327751k9147
$$ -528569 -122141 -1007363 -1939054 -1419410 82860 634307 -490044 -1817795 -1846942
40046a846942P25256P7319k43656J233050K955674K300909l91042j994471j002041
$$ -1846942 -1121686 -1044367 -1288023 -54973 2900701 5201610 4810568 2816097 1814056
40037A814056N23068L61229n73325j01534J516085J949724L12785j742944k456318
$$ 1814056 2337124 2698353 2125028 2023494 3539579 5489303 5802088 4059144 1602826
40028A602826j786291n69515O36818J317060Q16875p53898k087042j894292l34198
$$ 1602826 -183465 -752980 -116162 1200898 2017773 1263875 -823167 -2717459 -3051657
40019c051657J213070J652186J135334N72533M88392N89402L91942p8413m08386
$$ -3051657 -1838587 -186401 948933 1521466 2009858 2599260 2991202 2912789 2504403
40010B504403l23183J43589O66321O27665k85414j200166p45906P90221J292545
$$ 2504403 2181220 2324809 2991130 3618795 3333381 2133215 1387309 2177530 3470075
40001C470075j52035j585269j156504o6669j71364l75518J202586K771156R25500
$$ 3470075 3318040 1732771 576267 509598 338234 -37284 1165302 3936458 4861958
39992D861958l154862m369100j261430J848397J684354J65615k60385n21783j342753
$$ 4861958 1707096 -2662004 -3923434 -2075037 -390683 -225068 -485453 -1007236 -2349989
39983b349989n71600K264181L186514j66616l748740l101943l33586J67633o63483
$$ -2349989 -2921589 -657408 2529106 2362490 -1386250 -4488193 -4821779 -4654146 -5317629
39974e317629N93700K478222J132823j874182j581069J572830K433199K67068
$$ -5317629 -4723929 -2245707 -1112884 -2987066 -4568135 -2995305 -562106 -295038
39966b95038m42549J216099R44917k043952k607811J160861L792225J401912j918701
$$ -295038 -737587 478512 1423429 -620523 -3228334 -2067473 1724752 3126664 1207963
39957A207963j438331M50330n83616k746996j538569K098330L254544Q08334j742278
$$ 1207963 -230368 219962 -363654 -3110650 -4649219 -2550889 703655 1511989 -230289
39948b30289k099105j179006o1890J070430J439865M03833q55509r48429n23174
$$ -230289 -2329394 -3508400 -3570290 -2499860 -1059995 -656162 -1511671 -2460100 -2983274
39939b983274n74256k21134J193788J818105K13974j429378m93784J547200J655319
$$ -2983274 -3557530 -3778664 -2584876 -766771 -552797 -1982175 -2475959 -928759 726560
39930G26560N23839R68907K340128J418124j566868k741320p87761J239241J166645
$$ 726560 1250399 2219306 4559434 5977558 4410690 1669370 881609 2120850 3287495
39921C287495M85914N83555K45997j170105j607167K77074K292894J764683o07960
$$ 3287495 3773409 4356964 4602961 3432856 1825689 2102763 4395657 6160340 5552380
39912E552380k152658j937510j086386n72775m59403n10100k48006Q17717K106653
$$ 5552380 3399722 1462212 375826 -196949 -656352 -1166452 -1414458 -596741 1509912
39903A509912K144987P13236m07445Q0440R56721K76607j713079k911570k156324
$$ 1509912 3654899 4368135 3960690 4041130 4997851 5274458 3561379 649809 -1506515
39894a506515m04765P33759O94159J56626J32069Q93470J632298J332611l1058
$$ -1506515 -1911280 -1177521 -483362 -326736 -194667 698803 2331101 3663712 3632654
39885C632654j503202k166966j633780N0032K004569K447690N26159j858871j832529
$$ 3632654 2129452 -37514 -1671294 -1621262 383307 2830997 3357156 1498285 -334244
39876c34244N37361K039790P51210j390126j689914l82119O01347Q12752R66358
$$ -334244 203117 2242907 2994117 1603991 -85923 -468042 133305 946057 1912415
39867A912415P86976k09375p55856M51832J726141L73957k464281k773723q2748
$$ 1912415 2699391 2490016 1734160 2185992 3912133 4286090 1821809 -951914 -1034662
39858a034662J275924r38181k954802j009269K506219L100928J386332J070320
$$ -1034662 241262 -696919 -3651721 -4660990 -2154771 946157 2332489 3402809
39850C402809J805811R9072l292332l429421L22327K273155o39899l763373k314636
$$ 3402809 5208620 5307692 2015360 -1414061 -1091734 1181421 541522 -3221851 -5536487
39841e536487J108822J468921l90848j17526K181502K460733K9145j458365k37955
$$ -5536487 -4427665 -2958744 -3349592 -3467118 -1285616 1175117 1204262 -254103 -492058
39832d92058J391093J605728J307161J086790J721j610272j685938Q4330J446174
$$ -492058 899035 2504763 3811924 4898714 4900435 3290163 1604225 1688555 3134729
39823C134729J167324N19982M64857K85191k82328m18237k78530q35860j412013
$$ 3134729 4302053 4822035 5286892 5572083 5289755 4871518 4592988 3757128 2345115
39814B345115n32790O76385k97568k497727k202531P57574K167102L45222j142500
$$ 2345115 1812325 2488710 2191142 -306585 -2509116 -1751542 415560 760782 -381718
39805c81718J9984P83669j515577l900425k532681Q97235K183569J230171R86883
$$ -381718 -361734 421935 -1093642 -4994067 -7526748 -6629513 -4445944 -3215773 -2228890
39796b228890J809213J527399p9141j101264j069995j059196q85811L91793J743259
$$ -2228890 -419677 1107722 1028581 -72683 -1142678 -2201874 -3087685 -2695892 -952633
39787i52633J208159o22309j115526N25299K407271K813461J763007R541j594997
$$ -952633 255526 -366783 -1482309 -957010 1450261 4263722 6026729 6036270 4441273
39778D441273k111650j436248n89272m9325P81688J435141J15050k669904l126794
$$ 4441273 2329623 893375 304103 254778 1036466 2471607 2586657 -83247 -3210041
39769c210041M11781L899145K956006n93108j756941k2454Q22877n61639j554264
$$ -3210041 -2798260 1100885 4056891 3463783 1706842 1684388 2507265 1945626 391362
39760C91362q18206l37796j299441j888703n35332J666462K957352K939448J853542
$$ 391362 -426844 -764640 -2064081 -3952784 -4488116 -2821654 135698 3075146 4928688
39751D928688J2108j561245j920762j760406k216936k407045n55299K594499M075907
$$ 4928688 4940796 3379551 1458789 -301617 -2518553 -4925598 -5480897 -2886398 1189509
39742A189509K577067k09334k122506k321005q10294J535912K730950J677549
$$ 1189509 3766576 3557242 1434736 -886269 -1696563 -160651 2570299 4247848
39734D247848L9182m1451P07013J58698j340770j680392q64844p75281j400895
$$ 4247848 4287030 4245579 4952592 5111290 3770520 2090128 1225284 450003 -950892
39725i50892q77305P02983J127719Q0620k02318J028693J705560O20801o36093
$$ -950892 -1828197 -1125214 2505 83125 -119193 909500 2615060 3235861 2599768
39716B599768n78107L6526J23443j6290K5359j96312p69329r62682n13308R9154
$$ 2599768 2021661 2058187 2181630 2165340 2190699 1994387 1225058 262376 -250932 -151778
39706a51778O66675J038186M43193j155316j944669o96108Q16632L94114r23947
$$ -151778 514897 1553083 1996276 840960 -1103709 -1799817 -983185 -589071 -1513018
39697a513018p77884L75276N69138L47090J425221K584223J382352r94059j303440
$$ -1513018 -2290902 -1915626 -1346488 -999398 425823 3010046 4392398 3398339 2094899
39688B094899J88798O56453K13365R16213J281957j658935n297465l840042J742161
$$ 2094899 2283697 2940150 3153515 4069728 5351685 3692750 -1604715 -5444757 -3702596
39679c702596M023263Q33248j522384P55570L131659J637716n29231j53182m9775
$$ -3702596 320667 1153915 -368469 387101 3518760 5156476 4627245 4474063 4424288
39670D424288k250971k490110J728864M363556J14934n326185l356303L539795
$$ 4424288 2173317 -316793 1412071 5775627 5890561 564376 -2791927 747868
39662G47868N543341O99954l382592k304237j16819p75217k262552j482241R30888
$$ 747868 6291209 6991163 3608571 1304334 1187515 412298 -1850254 -3332495 -2401607
39653b401607K844553L307259J814503j251992l101231j356659J700958J817571
$$ -2401607 442946 3750205 5564708 4312716 1211485 -145174 1555784 3373355
39645C373355p00536j650350J95015J747821J187692j2183r46803k326128l220323
$$ 3373355 2672819 1022469 1217484 2965305 4152997 4140814 3194011 867883 -2352440
39636b352440j629378J106351J390402m68049l85394K248253L080083K79435k157292
$$ -2352440 -3981818 -2875467 -1485065 -1953114 -2338508 -90255 2989828 3269263 1111971
39627A111971j185400N34996k0334r97919K35804J852449Q78352j377160j681054
$$ 1111971 -73429 461567 441233 -556686 -320882 1531567 2409919 1032759 -648295
39618f48295l05481J94280k16696L20681J456892J247583O2682L166Q17102J58176
$$ -648295 -953776 -759496 -976192 -655511 801381 2048964 2111646 2114812 2931914 3090090
39608C090090j989158k727361p73826J566343K025283J260646P51808J85261j203581
$$ 3090090 1100932 -1626429 -2400255 -833912 1191371 2452017 3203825 3389086 2185505
39599B185505k412664j967715n38332j52456j002568r76461J150742L610233L756279
$$ 2185505 -227159 -2194874 -2733206 -2885662 -3888230 -4864691 -3713949 -103716 3652563
39590C652563J398569j133716j865708r98376Q2801N11859K78530l41779j089668
$$ 3652563 5051132 3917416 2051708 1053332 1136133 1647992 1926522 1584743 495075
39581D95075j695351j820626j042151P31070K503860K626678Q88924o25110j83956
$$ 495075 -1200276 -3020902 -4063053 -3331983 -828123 1798555 2687479 2062369 1878413
39572A878413Q75882J08105j947731k367096n89446N97288l37699j327828n19508
$$ 1878413 2754295 2862400 914669 -1452427 -2041873 -1444585 -1782284 -3110112 -3629620
39563c629620P41501Q62639Q85517J708005J380980j342911l324177j148930K861003
$$ -3629620 -2888119 -2025480 -1139963 568042 1949022 606111 -2718066 -3866996 -1005993
39554a005993L436063K08656k135460j432306o32161j770820k295674J42477L121104
$$ -1005993 2430070 2638726 503266 -929040 -1561201 -3332021 -5627695 -5485218 -2364114
39545b364114K923667J28956j503342l88417J526939K224986J924866J633110
$$ -2364114 559553 688509 -814833 -1203250 323689 2548675 4473541 6106651
39537F106651J199501j98708k287880l395150k290544Q1015J492267J053573m2124
$$ 6106651 7306152 7107444 4819564 1424414 -866130 -785115 707152 1760725 1718601
39528A718601n55480o08224n48782r5747M35904j09314j434749j296476R45016
$$ 1718601 1163121 554897 6115 -89632 346272 236958 -1197791 -2494267 -1549251
39519a549251K532138J438153q5610P11571J988827K23767l291358l803936n66817
$$ -1549251 982887 2421040 2335430 3047001 5035828 5259595 1968237 -1835699 -2402516
39510b402516K062963J506858J03085J67037N75646J74716K99462J445315J267895
$$ -2402516 -339553 1167305 1270390 1437427 2013073 2187789 2487251 3932566 5200461
39501E200461j229633k908416j129902J691113J693974n59139j541549m19318
$$ 5200461 3970828 1062412 -67490 1623623 3317597 2758458 1216909 797591
39493G97591N74919M38633K78495J82687j137436l094996k885312L53124L548484
$$ 797591 1372510 1811143 2089638 2272325 1134889 -1960107 -4845419 -4492295 -943811
39484i43811L515373J017948p74009p02281l70008p97256o64933J086418K682092
$$ -943811 2571562 3589510 2815501 2113220 1743212 945956 281023 1367441 4049533
39475D049533J629951j253547k428429o11192J364866Q83416p47477j001980l13300
$$ 4049533 5679484 4425937 1997508 1386316 2751182 3634598 2887121 1885141 1571841
39466A571841n94657j254374l26317J265123N74374k163367l213914j119773J000191
$$ 1571841 977184 -277190 -603507 661616 1235990 -927377 -4141291 -5261064 -4260873
39457d260873N20855p53311j106K007208K423587P15660r56301q47256O95061
$$ -4260873 -3740018 -4493329 -4494435 -2487227 -63640 652020 -304281 -1151537 -456476
39448d56476K025793J613068n08897k151441j157672J460419K431150P31256j164773
$$ -456476 1569317 3182385 2673488 522047 -635625 824794 3255944 3987200 2822427
39439B822427j324060q63001j007777n81370J308197K578750J016583j926399
$$ 2822427 1498367 635366 -372411 -953781 354416 2933166 3949749 2023350
39431B023350l010027j672140J0099Q26662J257342J403099O45889o95448j344610
$$ 2023350 -986677 -2658817 -2648718 -1822056 -564714 838385 1484274 788826 -555784
39422e55784p50790N10156J617388J695575O4378k346560l003147r10629J391627
$$ -555784 -1306574 -796418 820970 2516545 2580923 234363 -2768784 -3679413 -2287786
39413b287786R94569j262064k175169q98012M02562L83357K50777J103486J895068
$$ -2287786 -1293217 -2555281 -4730450 -5628462 -5225900 -4842543 -4591766 -3488280 -1593212
39404a593212J183193n57573j464187m38563J759502L163603K391779K65647q41588
$$ -1593212 -410019 -967592 -2431779 -2870342 -1110840 2052763 4444542 4710189 3868601
39395C868601J7626R14904j66553k045682j872281M60481J890710O55894j174879
$$ 3868601 3886227 4801131 4634578 2588896 716615 1177096 3067806 3723700 2548821
39386B548821r71519N06143M73080j477394k665417j259960J097465J780237Q98584
$$ 2548821 1577302 2083445 2556525 1079131 -1586286 -2846246 -1748781 31456 930040
39377I30040O54690J500171J296006r95216k986595k043674O77820J708151R3730
$$ 930040 1584730 3084901 4380907 3385691 399096 -1644578 -966758 741393 835123
39368H35123j697005j579019j40761J148916J649765R14640j215771k968022j592091
$$ 835123 -861882 -2440901 -2581662 -1432746 217019 1131659 -84112 -3052134 -4644225
39359d644225K555582N157654L115587j246160l309992k010261j42676J66079
$$ -4644225 -2088643 3069011 6184598 4938438 1628446 -381815 -524491 -358412
39351c58412l31329j97181N26101R30630P32626N52677J102312K102281K064463
$$ -358412 -689741 -886922 -360821 569809 1302435 1855112 2957424 5059705 7124168
39342G124168k0077k671559l060265p78494J221840O15606j087556j029952P64193
$$ 7124168 7104091 4432532 1372267 593773 1815613 2431219 1343663 313711 1077904
39333A077904J825619J006173m53827j225078j149551l13755J138548K084981
$$ 1077904 2903523 3909696 3455869 2230791 1081240 767485 1906033 3991014
39325C991014J175823r71237j900096m20582J627234J672258l34966k075572j961468
$$ 3991014 5166837 4195600 2295504 1874922 3502156 5174414 4839448 2763876 802408
39316H02408q96211n60400r53715p91651J03922N06550J78053N77017K044528
$$ 802408 -93803 -654203 -1607918 -2399569 -2295647 -1789097 -1611044 -1034027 1010501
39307A010501K336653j4153k699286k731161r99193l34110l42992J408162L660072
$$ 1010501 3347154 3333001 633715 -2097446 -3096639 -3430749 -3773741 -2365579 1294493
39298A294493K342353j996491l429954L02100L543941J318007k764470k344788
$$ 1294493 3636846 1640355 -1789599 -1487499 2056442 3374449 609979 -1734809
39290a734809J678088L117778L91753j935723j113407K38847m17831j515420q35900
$$ -1734809 -56721 3061057 3452810 1517087 403680 642527 224696 -1290724 -2126624
39281b126624P10304J160990Q63127J384326K499050K408513O00939j057847o20867
$$ -2126624 -1416320 -255330 607797 1992123 4491173 6899686 7500625 6442778 5821911
39272E821911J153294J398377r35980l063503k085244L55347K73135k151920k512067
$$ 5821911 6975205 8373582 7437602 4374099 2288855 2644202 2917337 765417 -1746650
39263a746650M77129K400041L11154k299918j401381J080124J346947M89672J545564
$$ -1746650 -1269521 1130520 1441674 -858244 -2259625 -1179501 167446 657118 2202682
39254B202682K908503J105813j938397j316513K191829K870035n50458l174024
$$ 2202682 5111185 6216998 4278601 2962088 5153917 8023952 7473494 4299470
39246D299470k380311j176880j549972j094764J243255K198610J31666j510492
$$ 4299470 1919159 742279 -807693 -1902457 -659202 1539408 1671074 160582
39238A60582j98936J175214l29963k355424j566692N51470Q40415K29137J514567
$$ 160582 -38354 1136860 806897 -1548527 -3115219 -2563749 -1723334 -1494197 20370
39229B0370L685568L264592K4090k800009l201506j878280J15474K014345K435275
$$ 20370 3705938 6970530 6994620 4194611 993105 -885175 -769701 1244644 3679919
39220C679919P97639r82189p90325M81981M79355q21023j415855n91011N35192
$$ 3679919 4477558 3495369 2705044 3187025 3666380 2845357 1429502 838491 1373683
39211A373683J130521J122925L38469q26387r51828J69369L60240j477877k595171
$$ 1373683 2504204 3627129 3965598 3139211 2187383 2356752 2716992 1239115 -1356056
39202a356056l25371K874241K417682j284595l280573j654969J64964k79606p00922
$$ -1356056 -1681427 1192814 3610496 2325901 -954672 -2609641 -2444677 -2724283 -3425205
39193c425205J030475K459087O52364k270478k016123J041817K324662J57192
$$ -3425205 -2394730 64357 716721 -1553757 -3569880 -2528063 -203401 -46209
39185d6209j791368l44837K412772K532549L1582j600025p07127O76879M22466
$$ -46209 -1837577 -2182414 230358 2762907 2794489 1194464 487337 1164216 1586682
39176A586682q19960j285888o70075K91380J307183K067747J506080o61851k461605
$$ 1586682 766722 -519166 -1189241 -897861 409322 2477069 3983149 3321298 859693
39167H59693j720149P26440J846425M66266j361029j399372M6635J095114O66301
$$ 859693 -860456 -134016 1712409 2178675 817646 -581726 -535091 560023 1226324
39158A226324p65741j878473j575015j18505Q45230L27895l47619O23427K460132
$$ 1226324 460583 -1417890 -2992905 -3111410 -2266180 -1938285 -2285904 -1662477 797655
39149G97655K575297M46233j512009j421779j39337P46033R64183O32339n82399
$$ 797655 3372952 3819185 2307176 885397 746060 1492093 2456276 3088615 2506216
39140B506216k009353j660545R07761L030187K135389o70643k125722j073773
$$ 2506216 496863 -1163682 -255921 2774266 4909655 4239012 2113290 1039517
39132A039517O52324J113092K50495r56883j840606k146141j648887k24832J719872
$$ 1039517 1691841 2804933 3055428 2098545 257939 -1888202 -3537089 -3761921 -2042049
39123b042049L041148K563919M98050j329583j474540n80609m3879K38212J124174
$$ -2042049 999099 3563018 4061068 2731485 1256945 676336 632457 870669 1994843
39114A994843J921265J085346r47063k018781j488518q09632o50662o2727J002325
$$ 1994843 3916108 5001454 4054391 2035610 547092 -262540 -913202 -975929 26396
39105B6396J101147j0833p83090o86631p36804n61920J479035M133694L388213
$$ 26396 1127543 1116710 333620 -353011 -1089815 -1651735 -172700 3960994 7349207
39096G349207j122247m053864j788486J994582K079948m58735r89980P88533J174386
$$ 7349207 6226960 2173096 384610 2379192 4459140 4000405 3010425 3798958 4973344
39087D973344p04466j859012j035142l54378q21072o22696R69458J766385K32013
$$ 4973344 4268878 2409866 1374724 1020346 199274 -423422 546036 2312421 2544434
39078B544434j991603k546695j196693P61890K063637J872386L59610q62115n54837
$$ 2544434 552831 -1993864 -3190557 -2428667 -365030 1507356 1866966 1004851 450014
39069D50014J20186o49740k093960j901565j01451J052198R90323J362556K296029
$$ 450014 570200 -79540 -2173500 -4075065 -4176516 -3124318 -2133995 -771439 1524590
39060A524590J626341j005216k581427j064757J333148J367424p14970k003406
$$ 1524590 3150931 2145715 -435712 -1500469 -167321 1200103 485133 -1518273
39052a518273r82249J110423K234804J527798j54594r64981J4770J369876R74805
$$ -1518273 -2500522 -1390099 844705 2372503 2217909 1252928 1267698 2637574 3612379
39043C612379q95173j692828k52737J471364J199934o55929j859157j171955O29602
$$ 3612379 2717206 1024378 771641 2243005 3442939 2787010 927853 -244102 385500
39034C85500J889502J654224N61016R6949M81421J44108j541079k379716m77621
$$ 385500 2275002 3929226 4490242 4587191 5068612 5212720 3671641 1291925 814304
39025H14304J951492J166059k188018l579235j371310J008334Q99655J92246J056933
$$ 814304 2765796 3931855 1743837 -1835398 -3206708 -2198374 -1298719 -1106473 -49540
39016d9540J854261M97904j350822j188129k15123r40815k225420j122228J610756
$$ -49540 1804721 2302625 951803 -236326 -451449 -1392264 -3617684 -4739912 -3129156
39007c129156K491297J275300J113869K439794J707129k185432m866522k753838
$$ -3129156 -637859 637441 1751310 4191104 5898233 3712801 -1153721 -3907559
38999c907559J283422K130490k07701j459698L8058J521823Q76522l20918r3220
$$ -3907559 -2624137 -493647 -701348 -2161046 -2122988 -601165 275357 -45561 -138781
38990a38781O00419r5824j437234j050742J254753K826850J640197j030230k185356
$$ -138781 461638 365814 -1071420 -2122162 -867409 1959441 3599638 2569408 384052
38981C84052o96814J459112J600248m91055k353498j972508l74275q2778j376983
$$ 384052 -312762 1146350 2746598 2255543 -97955 -2070463 -2444738 -2527516 -3904499
38972c904499j813090L4377K232916K297237Q08522J86553Q35484R78302K1252
$$ -3904499 -5717589 -5683212 -3450296 -1153059 -344537 -157984 677500 1655802 1677054
38963A677054n23566J17356N79313k86106j527861j567537j61637J725227K650581
$$ 1677054 1153488 1270844 1850157 1564051 36190 -1531347 -1692984 32243 2682824
38954B682824J201942k267430m371463j906229L109019M836781J331358k630261
$$ 2682824 3884766 1617336 -2754127 -4660356 -1551337 3285444 4616802 1986541
38946A986541k467081M5265O00288q81259j354725k16710O16946Q18231J601067
$$ 1986541 -480540 -435275 165013 -716246 -2070971 -2287681 -1670735 -852504 748563
38937G48563K407735J604905j31189q72106j119666k481172l500199j393470K368915
$$ 748563 3156298 4761203 4630014 3757908 2638242 157070 -3343129 -4736599 -2367684
38928b367684L160835K82103j933981r74732P23734Q17555M06050M84802l31874
$$ -2367684 793151 1075254 -858727 -1833459 -1109725 -292170 113880 598682 266808
38919B66808k223422k576570n20898R90644K33059k77354J299924K478891J199117
$$ 266808 -1956614 -4533184 -5054082 -4063438 -3830379 -4107733 -2807809 -328918 870199
38910H70199N429J267391K176505m43408l665557k584528J405107K578703q1118
$$ 870199 875628 2143019 4319524 3876116 210559 -2373969 -968862 1609841 1528723
38901A528723j942524o80293P03752k21491j580341j158479M982Q2075n55278
$$ 1528723 -413801 -1094094 -390342 -611833 -2192174 -3350653 -3345671 -3263596 -3818874
38892c818874p04011l71410K8504O40362J303988J392561J086495J132535J146116
$$ -3818874 -4522885 -4894295 -4865791 -4225429 -2921441 -1528880 -442385 690150 1836266
38883A836266R1340j467368j788467q20821l75296j107136j579005p78767N42911
$$ 1836266 1927606 460238 -1328229 -2149050 -2524346 -3631482 -5210487 -5989254 -5446343
38874e446343J484887J991546J977637J352496R01136J164881Q74721j061535
$$ -5446343 -3961456 -1969910 7727 1360223 2261359 3426240 4300961 3239426
38866C239426k714172j552310P71630K17409k782548l040482J288232N079268
$$ 3239426 525254 -1027056 -255426 -38017 -2820565 -5861047 -4572815 506453
38858E06453L506837j092168l172527j659340K28921N56871P8646n24471j138139
$$ 506453 4013290 2921122 -251405 -1910745 -1681824 -1124953 -1046307 -1570778 -2708917
38849b708917q09023R62472K296629J252808p93783j135234j88633n10569j912518
$$ -2708917 -3517940 -2555468 -258839 993969 200186 -935048 -1123681 -1634250 -3546768
38840c546768j478454J241322K945195J662853l13710l42614O56726M76379m89962
$$ -3546768 -5025222 -3783900 -838705 824148 510438 167824 824550 1300929 810967
38831H10967l30253P96465R03955m50372j427209p05217Q59121J820839J851034
$$ 810967 480714 1277179 2181134 1730762 303553 -401664 457457 2278296 4129330
38822D129330J163400m07043k577148l726708k379983N07145K176909J383219
$$ 4129330 5292730 4885687 2308539 -1418169 -3798152 -3291007 -1114098 269121
38814B69121k52512r11861j078981j867329k230544l91085K414287K672046k38005
$$ 269121 16609 -895252 -1974233 -3841562 -6072106 -6463191 -4048904 -1376858 -1614863
38805a614863k527578j227971J620832K291590Q42780L51621J809665K859956
$$ -1614863 -4142441 -5370412 -3749580 -1457990 -615210 -263589 1546076 4406032
38797D406032J513904j360360l514781l474271j242096J505355K246946L77901
$$ 4406032 5919936 4559576 1044795 -2429476 -3671572 -2166217 80729 458630
38789D58630j392059l90955J993498K197713j71437j993693j596086o35592m66095
$$ 458630 -933429 -1324384 669114 2866827 2695390 701697 -894389 -1529981 -1996076
38780a996076j32510Q65827J218534P55158J369669L058706K556772j381223m682606
$$ -1996076 -2128586 -1262759 -44225 710933 2080602 5139308 7696080 6314857 1632251
38771A632251l434449J81314J511125O44856J158756L038565K339249j828572
$$ 1632251 -1802198 -1620884 -109759 535097 1693853 4732418 7071667 5243095
38763E243095n026859l754857m8805K105106J823835P23948k05524q44229p22784
$$ 5243095 216236 -3538621 -3587426 -1482320 341515 1065463 859939 15710 -707074
38754g07074L70227J473446J545996P90855Q6119j01671K32513P21408N15454
$$ -707074 -336847 1136599 2682595 3473450 3559569 3457898 3690411 4411819 4927273
38745D927273q37014k316281k399069r64721R61940K715444L607244K202003j436342
$$ 4927273 4090259 1773978 -625091 -1589812 -627872 2087572 5694816 7896819 6460477
38736F460477l891682k293343P13993K51936k871164l003771P95839K476010j039734
$$ 6460477 2568795 275452 989445 1241381 -1629783 -4633554 -3837715 -1361705 -2401439
38727b401439m065102j085659M040215M145762L0514j552083J072362K911394
$$ -2401439 -6466541 -7552200 -3511985 633777 664291 -887792 184570 3095964
38719C095964J161486j336204k095817k142767j887608L45651L721308M052812
$$ 3095964 4257450 2921246 825429 -1317338 -3204946 -2859295 862013 4914825
38711D914825P0685l895509m080367k143481j232064j037636O3934J225737R97529
$$ 4914825 4985510 1090001 -2990366 -5133847 -6365911 -7403547 -7339613 -6113876 -5116347
38702e116347N43042J603915L045041K523998K67328j502880j782694j143718
$$ -5116347 -4573305 -2969390 75651 2599649 2866977 1364097 -418597 -1562315
38694a562315n0960J059786J178881J48817m92115J48464N97397m37344j419336
$$ -1562315 -1613275 -553489 625392 774209 282094 430558 1027955 590611 -828725
38685h28725k64874K002977K466583M76077j721434k141928r64175M06058O74687
$$ -828725 -1093599 909378 3375961 3852038 2130604 -11324 -975499 -569441 105246
38676A05246m98674j865605j552833M41058J962226J815435J331213J575524J306061
$$ 105246 -393428 -2259033 -3811866 -3370808 -1408582 406853 1738066 3313590 4619651
38667D619651l25132j381451j09511J714341J416678k98046r22975m43021m99547
$$ 4619651 4294519 2913068 2803557 4517898 5934576 5636530 4713555 4270534 3770987
38658C770987o30036O05788J675869j84471l430934l230377J089550M218530K341150
$$ 3770987 3140951 3746739 5422608 5238137 1807203 -1423174 -333624 3884906 6226056
38649F226056j571289k514661l28819J210802J27598j884885k375044p05344J814886
$$ 6226056 4654767 2140106 1811287 3022089 3149687 1264802 -1110242 -1815586 -700
38640g00K982322J438390j726486l785217l304165j298935P29927K306891L024642
$$ -700 2981622 4420012 2693526 -1091691 -4395856 -5694791 -4964864 -2657973 366669
38631C66669K031331l35209j945592j293727N27860J378358O75034m83969r43376
$$ 366669 2398000 2062791 117199 -1176528 -648668 729690 1404724 920755 -22621
38622b2621m11539N68715J083256Q89959Q91476J558757J489817n28713k535759
$$ -22621 -434160 134555 1217811 2107770 2999246 4558003 6047820 5519107 2983348
38613B983348j396993J960588K831155l95521l218105j443014K438295K888651
$$ 2983348 1586355 3546943 6378098 5982577 2764472 1321458 3759753 6648404
38605F648404o33105l366495k333812K00888Q70881m38921j637416j527230l85018
$$ 6648404 6015299 2648804 314992 515880 1386761 947840 -689576 -2216806 -2601824
38596b601824J089096K045690J601099j36447j562537j052042J019034K315810
$$ -2601824 -1512728 532962 2134061 1997614 435077 -616965 402069 2717879
38588B717879R91615k013130l660099k197512O80228J912831Q65205l22828k6454
$$ 2717879 3709494 1696364 -1963735 -4161247 -3481019 -1568188 -702983 -1025811 -1052265
38579a052265J027434J625224J836065J916575J198088n29542j937681j964743
$$ -1052265 -24831 1600393 3436458 5353033 6551121 6021579 4083898 2119155
38571B119155j469521j550620j484538j88626J328049J150778m46992j200830
$$ 2119155 649634 -900986 -2385524 -2574150 -1246101 -95323 -542315 -1743145
38563a743145m7127J628814J968443N08037j758460k977243j599536J622513L408574
$$ -1743145 -1790272 -161458 1806985 2315022 556562 -2420681 -4020217 -2397704 1010870
38554A010870J459551k259935l654637j593967J241169K487115K583955K561372
$$ 1010870 2470421 210486 -3444151 -5038118 -3796949 -1309834 1274121 3835493
38546C835493J805542m27471k838696l253289j491390K53926M4086j474441j812697
$$ 3835493 5641035 5213564 2374868 -878421 -2369811 -2115885 -2071799 -3546240 -5358937
38537e358937K28633K695255K691604L16283j271171k86918J241145R13809l30820
$$ -5358937 -5130304 -2435049 256555 572838 -698333 -985251 255894 1169703 838883
38528H38883l54968K02630o36036j976109j111991J552192K645390J255722J97622
$$ 838883 483915 686545 50509 -1925600 -3037591 -1485399 1159991 2415713 2613335
38519B613335Q85450R89900j063072l055365k780240j501034r38699J0818K374762
$$ 2613335 3498785 4488685 3425613 370248 -2409992 -3911026 -4849725 -4838907 -2464145
38510b464145L797258J928102j059261j377822M96935J008302m58825j077524
$$ -2464145 1333113 3261215 2201954 824132 1321067 2329369 1870544 793020
38502G93020J89874J130093N19331l0006N90544J154461P36721K02170q9208j217629
$$ 793020 982894 2112987 2632318 2602312 3192856 4347317 5084038 5286208 5197000 3979371
38492C979371l040988l303906r70728J871289K906660K198320O31413j680481
$$ 3979371 938383 -2365523 -3336251 -1464962 1441698 3640018 4271431 2590950
38484B590950l747957l158488L97638L257708K219283q31212j627891M14758K002116
$$ 2590950 -1157007 -4315495 -3917857 -660149 1559134 727922 -899969 -485211 1516905
38475A516905J183470m33702r08060o20439q17686j437495j436073k86412J406127
$$ 1516905 2700375 2266673 1358613 738174 -79512 -1517007 -2953080 -3239492 -1833365
38466a833365K252751J211427r86827k139664j186101L56760P20862M61030R75104
$$ -1833365 419386 1630813 643986 -1495678 -2681779 -2325019 -1604157 -1143127 -168023
38457a68023J658101R65772m28953l80836R66188J110003o62605j908593q09721
$$ -168023 1490078 2455850 2026897 1646061 2612249 3722252 3059647 1151054 341333
38448C41333J184740J805550R41499k05749j084587j507826j059969j49658j09038
$$ 341333 1526073 3331623 4273122 4067373 2982786 1474960 414991 265333 156295
38439A56295r82365q79418J073697K875558K416291N05799p13995r16318j106573
$$ 156295 -826070 -1705488 -631791 2243767 4660058 5165857 4451862 3535544 2428971
38430B428971j267202p17829P7466J92342j2789K17530K71072n97695j190960
$$ 2428971 1161769 443940 521406 713748 700959 918489 1189561 591866 -599094
38421e99094N0042K091807K543330J344194M38240R6532j232966l158094k860576
$$ -599094 -549052 1542755 4086085 5430279 5868519 5965051 4732085 1573991 -1286585
38412a286585M07691L284977K536287q18842l316108l214875j265311J058322
$$ -1286585 -878894 2406083 4942370 4123528 807420 -2407455 -3672766 -2614444
38404b614444K373844J731677j94904j219029l04862Q80044L76864j215562j844227
$$ -2614444 -240600 1491077 1296173 77144 -227718 652326 1029190 -186372 -2030599
38395b030599j038497j38214R195k0909M97369J427111K041142J605025l5443
$$ -2030599 -3069096 -3207310 -3198115 -3219024 -2721655 -1294544 746598 2351623 2316180
38386B316180j873355k283255q32920R64318J336452J55447j317475j848782r40533
$$ 2316180 442825 -1840430 -2673350 -1709032 -372580 -217133 -1534608 -3383390 -4323923
38377d323923R31280K253585J728387J27998m22215M11419N74636p92601j427264
$$ -4323923 -3392643 -1139058 589329 717327 295112 706531 1281167 488566 -938698
38368i38698M19661K491411J599516j147203j690070P24894K276661L58955k592037
$$ -938698 -519037 1972374 3571890 2424687 734617 1459511 3736172 4095127 1503090
38359A503090k821093m59871J227220N15911j033637j151732M85722K362011K875352
$$ 1503090 -1318003 -1777874 -550654 -34743 -1068380 -2220112 -1734390 627621 3502973
38350C502973J693602j40499j227599j081559m19708j96040n24694o92341j69334
$$ 3502973 5196575 5056076 3828477 2746918 2327210 2131170 1606476 914135 744801
38341G44801N76671N54807l53454r68866l58580O92054Q00733K26302M42982J467260
$$ 744801 1321472 1876279 1522825 553959 195379 887433 1688166 1914468 2357450 3824710
38331C824710J523138o8538j639928j755855j081623n37912K31033J062800M24786
$$ 3824710 5347848 5279310 3639382 1883527 801904 263992 495025 1557825 1982611
38322A982611j548358j795942J000049L069495P16200l361694l670186l60326
$$ 1982611 434253 -1361689 -361640 2707855 3424055 62361 -3607825 -3968151
38314c968151J471574L90057K59195K382731K559100j296127m483255k598117
$$ -3968151 -2496577 -2106520 -1847325 535406 3094506 1798379 -2684876 -5282993
38306e282993J417002K121075j30112r78092L95550J026226J11718j50546O39790
$$ -5282993 -3865991 -1744916 -1875028 -2853120 -2457570 -1431344 -1319626 -1470172 -830382
38297h30382L40957j240229j444355O81128K619318K399642J178342M73657k72386
$$ -830382 -489425 -1729654 -3174009 -2492881 126437 2526079 3704421 4178078 3905692
38288C905692j738394k749191k080183m89248O34811J203015J594450J249041
$$ 3905692 2167298 -581893 -2662076 -3151324 -2516513 -1313498 280952 1529993
38280A529993l27632k028120k100006l29863J686868K279710J203139l01507o60725
$$ 1529993 1202361 -825759 -2925765 -3255628 -1568760 710950 1914089 1612582 951857
38271I51857M40977J530785R29116j097988k418602j437100J089708K801135K056201
$$ 951857 1392834 2923619 3852735 2754747 336145 -1100955 -11247 2789888 4846089
38262D846089m06327k071709j369799K87148K72359j394078j857565J12532J882408
$$ 4846089 4439762 2368053 998254 1285402 1557761 163683 -1693882 -1581350 301058
38253C01058J037991o49042k49123J256186P74397j158720r98485J423594J970596
$$ 301058 1339049 690007 440884 1697070 2471467 1312747 314262 1737856 3708452
38244C708452r98096l466660j944878J063483J236684q11453j053362J281013
$$ 3708452 2710356 -756304 -2701182 -1637699 -401015 -1212468 -2265830 -984817
38236i84817K785737J408996q16214j383098p57376p13533j141629m51143J479138
$$ -984817 1800920 3209916 2393702 1010604 253228 -460305 -1601934 -2053077 -573939
38227e73939K533514J111712j347526j869564P1516J618220M72510j744731j885272
$$ -573939 1959575 3071287 1723761 -145803 -74287 1543933 2016443 271712 -1613560
38218a613560R9248J416821Q05284k25328n91630r85732j352640j92182K307052
$$ -1613560 -1514312 -97491 707793 482465 -109165 -1094897 -2447537 -2639719 -332667
38209c32667L418047J876154k7531k30146N6476o61933j038187L02088J399889
$$ -332667 3085380 4961534 4934003 4703857 4760333 4098400 3060213 3362301 4762190
38200D762190j03823k670523l128910j632914o51737m24718N66220J664222R20755
$$ 4762190 4658367 1987844 -1141066 -2773980 -3425717 -3850435 -3284215 -1619993 -699238
38191f99238o30603q4396J961553J777468j126779k695482q31892J252041M51119
$$ -699238 -1329841 -1414237 547316 2324784 1198005 -1497477 -2329369 -1077328 -626209
38182f26209j371156q75115J401355K381092J147489n98229j445344j222447p8258
$$ -626209 -1997365 -2872480 -1471125 909967 2057456 1459227 13883 -1208564 -1286822
38173a286822J376782J861693Q69893n93374j680560k581751k791270p70897K957935
$$ -1286822 89960 1951653 2821546 2228172 547612 -2034139 -4825409 -5596306 -2638371
38164b638371M769746K507976q47001j113058R38436R27519k173690m250764k074691
$$ -2638371 2131375 4639351 3792350 2679292 3617728 4545247 2371557 -1879207 -3953898
38155c953898K010540L291032P53075k084353j823783R48098K811850J707043
$$ -3953898 -1943358 1347674 2100749 16396 -1807387 -859289 1952561 3659604
38147C659604q94786k163849j378630j52198L51064O93962J325338J321146R5490
$$ 3659604 2764818 600969 -777661 -929859 -578795 115167 1440505 2761651 2857141
38138B857141j073767p04389O28497J097762J06145j194767j421608j90861J592880
$$ 2857141 1783374 1078985 1707482 2805244 2911389 1716622 295014 104153 1697033
38129A697033K172751O04497j593457j843566q7019R27306k00980j429639q47036
$$ 1697033 3869784 4474281 2880824 1037258 950239 1877545 1676565 246926 -600110
38120f00110K52395K03775L32624K171882L370612O00807m372475n954948k270608
$$ -600110 -347715 -143940 188684 2360566 5731178 6331985 1959510 -3995438 -6266046
38111f266046K502604M050140K560324M39332j106764j627577n89519J132693
$$ -6266046 -3763442 286698 2847022 3286354 2179590 552013 -37506 1095187
38103A095187J306280m49715j703514r36307J61856j77197q46783k18433P76939
$$ 1095187 2401467 1951752 248238 -688069 -526213 -703410 -1550193 -1768626 -991687
38094i91687M90471k96059J66030J262482R87004n11852j076537K4968J203975
$$ -991687 -501216 -797275 -631245 631237 1618241 1106389 29852 54820 1258795
38085A258795J138890K79076l72804l77920K84778J142894J160828l8865j274512
$$ 1258795 2397685 2676761 2303957 1926037 2210815 3353709 4514537 4475672 3201160
38076C201160j345152q01469p46784p42718K11971J369093J140949j24441o64026
$$ 3201160 1856008 1054539 307755 -434963 -222992 1146101 2287050 2162609 1498583
38067A498583l50422o18294j320525n82879J596526K592848J258167j3683Q28735
$$ 1498583 1148161 529867 -790658 -1373537 222989 2815837 4074004 4060321 4889056
38058D889056J990455O53762k429617l888248k428637j38612O38513k48600j424585
$$ 4889056 6879511 7533273 5103656 1215408 -1213229 -1351841 -713328 -961928 -2386513
38049b386513j563858k44109J697228K768973K468339J723818J121488k2286j772607
$$ -2386513 -3950371 -4194480 -2497252 271721 2740060 4463878 5585366 5563080 3790473
38040C790473k450703j180646Q9459m99124j340996j8431J956471J102358j767173
$$ 3790473 1339770 159124 248583 -250541 -1591537 -1609968 346503 1448861 -318312
38031c18312j978404J467358L692557J482611j536716p53983K150308K301572
$$ -318312 -2296716 -829358 2863199 4345810 2809094 2055111 4205419 6506991
38023F506991n16571k133001r51469L07942j67479q08124k61801L31791l3430
$$ 6506991 5990420 3857419 2905950 3213892 3046413 2238289 1976488 2308279 2274849
38014B274849m11862o1833J67267j88680k02071M13768N65638J2004q1818K97375
$$ 2274849 1862987 1801154 1968421 1779741 1577670 1991438 2557076 2569080 2487262 2784637
38004B784637l52748j749655j305199J362752K634636J42998l061543k758248
$$ 2784637 2431889 682234 -622965 739787 3374423 3517421 455878 -2302370
37996b302370L23520K138857J397263K88182J43288P6280l27359k68124K20839
$$ -2302370 -1978850 160007 1557270 1845452 1988740 2065020 1737661 1469537 1690376
37987A690376K71620K31082J075831J919186R59155j041188j286149N57876J468018
$$ 1690376 1961996 2193078 3268909 5188095 6147250 5106062 3819913 4377789 5845807
37978E845807k91938k406617j952442M90222J878657N86277k057474l340093j696292
$$ 5845807 5553869 3147252 1194810 1685032 3563689 4149966 2092492 -1247601 -2943893
37969b943893J583421L231273J646504q86476j232628K00865N81214n29645q31920
$$ -2943893 -1360472 1870801 3517305 2630829 1398201 1599066 2180280 1650635 818715
37960H18715J89524K35670j312892j719432L81072K070037O08299k038821k207886
$$ 818715 1008239 1243909 -68983 -1788415 -1407343 662694 1270993 -767828 -2975714
37951b975714K8483J590233J159047K38368K30426R48635J564596J218607n67691
$$ -2975714 -2947231 -1356998 -197951 40417 270843 1219478 2784074 4002681 3434990
37942C434990k625228k557665k0348K039700J323825m64535n46215N45682M55188
$$ 3434990 809762 -1747903 -1768251 271449 1595274 1130739 584524 1130206 1585394
37933A585394p09305r91882m16853n91163j086633N0430K255895K624337N99158
$$ 1585394 876089 -115793 -532646 -1123809 -2210442 -2160012 95883 2720220 3319378
37924C319378r60276k32679J178136J345653O41832O0710n08957j079852q79153
$$ 3319378 2359102 2126423 3304559 4650212 5292044 5352754 4843797 3763945 2884792
37915B884792K7622M70388K82607M48910O62348m67751k094875j409579J452214
$$ 2884792 2912414 3382802 3665409 4114319 4776667 4308916 2214041 804462 2256676
37906B256676K441368l32002l183835k468026k13895k98986j826090j103154J514556
$$ 2256676 4698044 4366042 1182207 -1285819 -1499714 -1798700 -3624790 -4727944 -3213388
37897c213388K056819j66047j275398P24616K835943K132839K9741q02752n86385
$$ -3213388 -1156569 -1322616 -2598014 -1873398 962545 3095384 3125125 2322373 1735988
37888A735988q43214j181905n76900J3428o56388j109845R15820M079799M326813
$$ 1735988 892774 -289131 -866031 -852603 -1508991 -2618836 -1703016 2376783 6703596
37879F703596O15184l179216l303424p73135P20867q5511j116928m40845J379185
$$ 6703596 7318780 4139564 836140 63005 783872 698361 -418567 -859412 519773
37870E19773K598856K477534J530543M53374m96986j280638j663711j232369m7467
$$ 519773 3118629 5596163 7126706 7580080 7083094 5802456 4138745 2906376 2858909
37861B858909P99851P9499j675616k148824k14497J967053J565430p73408j736997
$$ 2858909 3658760 3738259 2062643 -86181 -300678 1666375 3231805 2458397 721400
37852G21400l32074P93319l2638o36302J092605L088285K089519j010393k386315
$$ 721400 389326 1182645 1150007 513705 1606310 4694595 6784114 5773721 3387406
37843C387406r53458P94739J211645J056131O19394q35015k259841j389383J011463
$$ 3387406 2433948 3228687 4440332 5496463 6115857 5280842 3021001 1631618 2643081
37834B643081J540209m9911r106K677326L842147J372548l81015K249179N609006
$$ 2643081 4183290 4133379 4124273 6801599 10643746 12016294 11635279 13884458 19493464
37825A9493464M734273J686652J452847L328610L778288M433911Q574929J2860903
$$ 19493464 24227737 25914389 27367236 30695846 34474134 38908045 47482974 60343877
37817F0343877J3499765J8134791L6340190N6173680M8168633L236129m7309319
$$ 60343877 73843642 91978433 128318623 184492303 232660936 235897065 188587746
37810A88587746o4504824m5980621k2001209j3671649j3948418r719146k741754
$$ 188587746 124082922 78102301 56101092 42429443 28481025 18761879 16020125
37803A6020125p86586k482460k002121k41961j263648l190283j582854J952770
$$ 16020125 15233539 12751079 10748958 10506997 9243349 6053066 4470212 6422982
37795F422982K443100p561j520024j759759l087321m274829j979834K416331L922130
$$ 6422982 8866082 8858521 7338497 5578738 2491417 -1783412 -3763246 -1346915 2575215
37786B575215J680734k52817J08621N55981j20272k90838L03775l95345k344569
$$ 2575215 4255949 4003132 4111753 4667734 4547462 4256624 4560399 4165054 1820485
37777A820485k728394r52863J97834l34831k31839J202321J173514j233205k421322
$$ 1820485 -907909 -1860772 -1662938 -1997769 -2229608 -1027287 146227 -1086978 -3508300
37768c508300L086K887846K326734m84647j741372p47305L65201N58466K41916
$$ -3508300 -3505214 -617368 1709366 1224719 -516653 -1263958 -898757 -340291 -98375
37759i8375n98012j625671j103288J532381L581449K435338m06670j569231p22566
$$ -98375 -696387 -2322058 -3425346 -1892965 1688484 4123822 3717152 2147921 1425355
37750A425355k09866p79425q86282J59472J190652J286171O83579j86413p66613
$$ 1425355 1215489 436064 -450218 -290746 899906 2186077 2869656 2683243 1916630
37741A916630j12359J611617K298407N66000j802050k278285j279311r18581j236704
$$ 1916630 1804271 3415888 5714295 6280295 4478245 2199960 920649 2068 -1234636
37732a234636o40782O93488J036795M03890N80770J865810K575075J855033M46867
$$ -1234636 -1875418 -1181930 -145135 258755 839525 2705335 5280410 7135443 7582310
37723G582310j179452k835681l137114r83680J727570K011949K25783p51745m47215
$$ 7582310 6402858 3567177 430063 -553617 1173953 3185902 3411685 2659940 2212725
37714B212725q92777j805308m71954K596424L024735l20494k546274j90796L041542
$$ 2212725 1319948 -485360 -957314 1639110 4663845 4343351 1797077 1606281 4647823
37705D647823K102293j563602k840193r51456N15641O3314l49919J55741K12449
$$ 4647823 6750116 5186514 2346321 1394865 1910506 1973820 1623901 1779642 1992091
37696A992091l15026K8388P35470m14490k719330k391133J289052L589591P85637
$$ 1992091 1677065 1705453 2440923 2026433 -692897 -3084030 -1794978 1794613 2580250
37687B580250m059450n081994j447042K307077K863804J553516Q66795O80685
$$ 2580250 -1479200 -6561194 -8008236 -5701159 -2837355 -1283839 -417044 263641
37679B63641l93764j829717j641837L73955J853825J002911q03903q55741J043655
$$ 263641 -130123 -1959840 -3601677 -3227722 -1373897 -370986 -1174889 -2030630 -986975
37670i86975K204961Q49173j253668j090246J510964L538994K467641q60207l338662
$$ -986975 1217986 2067159 813491 -276755 1234209 4773203 7240844 6380637 3041975
37661C041975k955873o70689Q90019L80722r41696j153877l27501n3446n52225
$$ 3041975 86102 -584587 305432 686154 -255542 -1409419 -1736920 -1790366 -2342591
37652b342591k08572J417143K312624J209620o2392L63647R61640m02638j810376
$$ -2342591 -2551163 -1134020 1178604 2388224 2325832 2689479 3651119 3248481 1438105
37643A438105K81179M315387M376399r72584n459269l670984J261147K739514
$$ 1438105 1719284 6034671 10411070 9438486 3979217 308233 1569380 4308894
37635D308894L72411p10157J304648K569836N32481k043802j959425l46659O0433
$$ 4308894 4681305 3971148 5275796 7845632 8378113 6334311 4374886 4028227 4088660
37626D088660o74270q48659l92878j82687J73166J170421J509550J09025j218219
$$ 4088660 3414390 2565731 2172853 1990166 2163332 3333753 4843303 4952328 3734109
37617C734109p2712K372067K671387L20927j482490o82727R11390P02862j177637
$$ 3734109 3661397 6033464 8704851 9025778 7543288 6860561 7771951 8474813 7297176
37608G297176k612440k185761k46835J574376J591374p1659j108560m0943J163022
$$ 7297176 4684736 2498975 2252140 3826516 5417890 5346231 4237671 4196728 5359750
37599E359750j36826k604948k469175L55235J762793P363j570740l44370J301592
$$ 5359750 5222924 2617976 148801 504036 2266829 2274192 703452 359082 1660674
37590A660674M86922j112049n94231Q30083K69406j342861r63513P88098N65023
$$ 1660674 2147596 1035547 441316 1271399 1540805 197944 -765569 22529 587552
37581E87552j574291j944784N28682K507113J722729J27351J5801O11737M37349
$$ 587552 -986739 -2931523 -2402841 104272 1827001 1954352 1970153 2581890 3019239
37572C019239Q1486M63164O64670l72929j675184j628865l55790P74657J057053
$$ 3019239 3100725 3563889 4228559 3855630 2180446 551581 195791 970448 2027501
37563B027501P56710K95916l0187n8167J69951P12759J728626K548466J783085
$$ 2027501 2784211 3080127 3049940 2991773 3161724 3874483 5603109 8151575 9934660
37554I934660m49733j788620q96632J82773n80502j295713Q04680L848008L350409
$$ 9934660 9484927 7696307 6799675 6982448 6401946 5106233 5910913 9758921 13109330
37545A3109330o78860l393751k262682K9356O94976L45457O9954o50640j477821
$$ 13109330 12430470 9036719 6774037 6803393 7498369 7843826 7913780 7263140 5785319
37536E785319p05134J161998J297280m82264r43669P59866J296013o89691j657259
$$ 5785319 5080185 6242183 7539463 7057199 6113530 6873396 8169409 7479718 5822459
37527E822459O75956L098331K297968J34607j03981J258498K420828L387234M045220
$$ 5822459 6498415 9596746 11894714 12029321 11925340 13183838 15604666 18991900 23037120
37518B3037120L143689J843439L299292O357308O205119L948876O857500J5160512
$$ 23037120 26180809 28024248 31323540 37680848 43885967 47834843 54692343 69852855
37510F9852855K0020678K1536618L4136664N9858454O9744129L4780780k9396835
$$ 69852855 89873533 111410151 145546815 205405269 275149398 309930178 280533343
37503B80533343p2959682o9509442m1423602k2285929j7082987j2350887n620902
$$ 280533343 207573661 138064219 96640617 74354688 57271701 44920814 39299912
37496C9299912m512274p455646n496841O75712K004906k300309l794673k79810
$$ 39299912 34787638 27331992 21835151 22510863 24515769 22215460 18420787 18140977
37488A8140977R62230k995408n472234k023837K344934K069303p17480j378070
$$ 18140977 19103207 16107799 10635565 8611728 10956662 13025965 12308485 10930415
37480A0930415j46232K07094l67647l28776J33014L3549l89861o85464j161486
$$ 10930415 10784183 10991277 10623630 10294854 10427868 10461417 10071556 9386092 8224606
37471H224606j544855q27526O32096J100257K32712m43648k95832m35648j312016
$$ 8224606 6679751 5852225 6484321 7584578 7817290 7373642 7077810 6642162 5330146
37462E330146j760344r72283N11556J873003K313971Q71022j914741l095378p75576
$$ 5330146 3569802 2597519 3109075 4982078 7296049 8167071 6252330 3156952 2381376
37453B381376K483384K731989J00785k103336k568075k341200j225817J475954
$$ 2381376 4864760 7596749 7697534 5594198 3026123 684923 -540894 935060
37445I35060L349462J301997k471422k594263R21381K250634p89001l200493j203336
$$ 935060 4284522 5586519 3115097 520834 1442215 3692849 2903848 -296645 -1499981
37436a499981J932567J972441J87681m10688m94060j490481j490553R65204K678021
$$ -1499981 432586 2405027 2592708 2182020 1687960 197479 -1293074 -327870 2350151
37427B350151N98074k307922j495739J481914J593662j303544k812880j631839
$$ 2350151 2948225 640303 -855436 626478 2220140 916596 -1896284 -3528123
37419c528123p01399r30219K13048L052298M114263J726907j309386k220741j481358
$$ -3528123 -4229522 -5159741 -4946693 -1894395 2219868 3946775 2637389 416648 -1064710
37410a064710k11104J646772L014207J563338k070521l663986j300500J543269
$$ -1064710 -1275814 370958 3385165 4948503 2877982 -786004 -2086504 -543235
37402e43235J358842k82225j22245J209233Q60041r94972j668419p90583o91911
$$ -543235 815607 533382 411137 1620370 2480411 1485439 -182980 -973563 -1665474
37393a665474j964376k160570K38806L277302M162816K577015K19337j483402
$$ -1665474 -3629850 -5790420 -5551614 -2274312 1888504 4465519 4684856 3201454
37385C201454k043990j400551m6982Q36536N10648k07748J00640J297628J449083
$$ 3201454 1157464 -243087 -290069 546467 1057115 849367 950007 2247635 3696718
37376C696718o15474l188054l312180n34571K256422K367616N27146n42759J16830
$$ 3696718 3081244 -106810 -3418990 -3953561 -1697139 670477 1197623 654864 771694
37367G71694R39048M69379q74000j822009j691965n60259Q74994J471602P66488
$$ 771694 1710742 2180121 1306121 -515888 -2207853 -2768112 -1893118 -421516 344972
37358C44972j21940R4244Q44076P01732J01572P60733K234660J820240j092078
$$ 344972 223032 317276 1161352 1863084 1964656 2725389 4960049 6780289 5688211
37349E688211l293338k145215O21719J661893O01032n95678j152682j516816j097651
$$ 5688211 2394873 249658 871377 2533270 3134302 2538624 1385942 -130874 -1228525
37340a228525Q35036K616866J845144m86096q47123J291328K168316o04642m121676
$$ -1228525 -393489 2223377 4068521 3582425 2735302 4026630 6194946 5590304 1468628
37331A468628m209425j197830J059605P12302l92309l49074J05486n21796j619991
$$ 1468628 -2740797 -3938627 -2879022 -2166720 -2559029 -2908103 -2802617 -3324413 -4944404
37322d944404j109618J407514L484079K546127p00375k717606j408691J161833
$$ -4944404 -6054022 -4646508 -1162429 1383698 683323 -2034283 -3442974 -2281141
37314b281141J540573l91947j450303N1927J859660J312441o77496j263252n1086
$$ -2281141 -740568 -1132515 -2582818 -2530891 -671231 641210 -36286 -1299538 -1350624
37305a350624P33431J71337q885J235496K083723P36223j333229j400064J91452
$$ -1350624 -617193 -445856 -454741 780755 2864478 3600701 2267472 867408 1058860
37296A058860N36645r70122j320338J214592L540676J771079k692502m445467
$$ 1058860 1595505 625383 -694955 519637 4060313 5831392 3138890 -1306577
37288a306577j401804K404461K511372j77099j437161J89466K058924J677173
$$ -1306577 -2708381 -303920 2207452 2030353 593192 782658 2841582 4518755
37280D518755k35613j489168j430127j089522j195546j201192l55617Q91321J150591
$$ 4518755 4283142 2793974 1363847 274325 -921221 -2122413 -2478030 -1586709 -436118
37271d36118p3761j386680j136341K43430P71667o9473m34685R75817K593962
$$ -436118 -509879 -1896559 -3032900 -2789470 -2017803 -2087276 -2521961 -1546144 1047818
37262A047818K005669o12372k607544k039798L87995K295268J749790r93283l229472
$$ 1047818 3053487 2441115 -166429 -2206227 -1818232 477036 2226826 1233543 -1995929
37253a995929k259914J123209K998163J290793j361062j526777N6282J54121j609568
$$ -1995929 -4255843 -3132634 -134471 1156322 -204740 -1731517 -1675235 -1521114 -3130682
37244c130682k375786o95631J609353K504555J932397N79451j035296j893607
$$ -3130682 -5506468 -6202099 -4592746 -2088191 -155794 423657 -611639 -2505246
37236b505246j283126m27308q53226j342248L63154K927635K500555r06897k563416
$$ -2505246 -3788372 -4215680 -5068906 -6411154 -6048000 -3120365 -619810 -1526707 -4090123
37227d090123k20410K269707J221020j129761p95099J410277J810514M9702j058792
$$ -4090123 -4310533 -2040826 -819806 -1949567 -2744666 -1334389 476125 525827 -532965
37218e32965m52405M44954R38537J342783R27839q61367k020200m74635J903475
$$ -532965 -985370 -540416 398121 1740904 2668743 1807376 -212824 -687459 1216016
37209A216016J715605k69881l20256J637213J651483j265727k994784j052003
$$ 1216016 2931621 2661740 2341484 3978697 5630180 4364453 1369669 317666
37201C17666J346390Q43120o46912J82987K069788J515384j031911j939483m41473
$$ 317666 1664056 2507176 1860264 2043251 4113039 5628423 4596512 2657029 2215556
37192B215556M36378r01490k375191k037891p62238K12967J432422K980284K641248
$$ 2215556 2651934 1750444 -624747 -2662638 -3424876 -3211909 -1779487 1200797 3842045
37183C842045q87601m471625l540882J498983M940524K884126j817003l567270
$$ 3842045 2954444 -1517181 -5058063 -3559080 1381444 4265570 2448567 -1118703
37175a118703j199745J421595J233710m83388r85055j2990P50954O87321P03523
$$ -1118703 -2318448 -896853 336857 -146531 -1131586 -1144576 -393622 293699 997222
37166I97222J139923R83857m30405k041346k157596o32531P77077N82516m01461
$$ 997222 2137145 3121002 2690597 649251 -1508345 -2140876 -1363799 -781283 -1182744
37157a182744k13195J088814J128656r59911k406698p21873J931140J634616r18775
$$ -1182744 -1395939 -307125 821531 -138380 -2545078 -3266951 -1335811 298805 -619970
37148f19970j242717J501190K722408j45997l114888j793728J825544K872491
$$ -619970 -1862687 -361497 2360911 2214914 -899974 -2693702 -868158 2004333
37140B004333R38455o66316r01653j409351k165343j517977n7929O7924n13364
$$ 2004333 2942788 2276472 1374819 -34532 -2199875 -3717852 -3775781 -3707857 -4221221
37131d221221P35512L012105K548968j012727l334560j946477K83628L04713n04329
$$ -4221221 -3485709 -473604 2075364 1062637 -2271923 -4218400 -3934772 -3630059 -4134388
37122d134388M06027K157167K246251P54000j90021J46284M79913m25683k445097
$$ -4134388 -3728361 -1571194 675057 1429057 1239036 1385320 1865233 1439550 -1005547
37113a005547m037404l077590P38108M221920L778250M22437j244411L53413J780021
$$ -1005547 -5042951 -8120541 -7382433 -3160513 617737 1040174 -204237 149176 1929197
37104A929197M56475j483935j422080m51741l45365Q9725J917884K529052l82908
$$ 1929197 2385672 901737 -520343 -972084 -1317449 -1227724 690160 3219212 2836304
37095B836304l779177l125115M12883J814021K66984k31105J562113J855207j184989
$$ 2836304 -942873 -4067988 -3655105 -1841084 -1574100 -1805205 -243092 1612115 427126
37086D27126l494052j362954K387932K523724p93975k590895n33984K217477K105255
$$ 427126 -3066926 -4429880 -2041948 481776 -312199 -2903094 -3437078 -1219601 885654
37077H85654j16217j341145p16178r6247o02561r44938J68173J547887J060494
$$ 885654 769437 -571708 -1287886 -1384133 -1986694 -2931632 -2763459 -1215572 -155078
37068a55078r27867j608466K58532K197937J340125j330062k163518O322K251311
$$ -155078 -1082945 -2691411 -2432879 -234942 1105183 -224879 -2388397 -2382075 -130764
37059a30764J847481O9529j32771J143561J060172j064177k215980m68236J386602
$$ -130764 1716717 1786246 1653475 2797036 3857208 2793031 577051 108815 1495417
37050A495417j70632l459813l526363L27387L223236K019386l30171j81319R45543
$$ 1495417 1324785 -2135028 -5661391 -5334004 -2110768 -91382 -421553 -602872 342671
37041C42671k86371k782839k795089k79350J289511P26765K00990P42890J132734
$$ 342671 56300 -2726539 -5521628 -5800978 -4511467 -3784702 -3583712 -2840822 -1708088
37032a708088J311870K441478L307127J348462k146653k835574l18218R10404
$$ -1708088 -396218 2045260 5352387 6700849 4554196 1718622 1400404 2310808
37024B310808r22048j906844L78767K408171J021877j010427k17922J352880K52274
$$ 2310808 1388760 -518084 -139317 2268854 3290731 2280304 2062382 3415262 3667536
37015C667536j861299j341185Q19350J099758j61482j05261Q05335o6543j966297
$$ 3667536 1806237 465052 1284402 2384160 2222678 2117417 2922752 2856209 889912
37006H89912j983410p70030j268513k479667o14461L561176M793225J661352j138994
$$ 889912 -1093498 -1863528 -3132041 -5611708 -6226169 -2664993 2128232 3789584 2650590
36997B650590m99689P06181o42362k725972k389821o7698J898058K737607K409320
$$ 2650590 2150901 2857082 2214720 -511252 -2901073 -2968771 -1070713 1666894 4076214
36988D076214K11942l056689m144446j346103K531523L662659J876406l54875
$$ 4076214 4288156 1231467 -2912979 -4259082 -1727559 1935100 3811506 3456631
36980C456631j699718k267046j715895J60243J759807J108327j173058k294972
$$ 3456631 1756913 -510133 -2226028 -2065785 -305978 802349 -370709 -2665681
36972b665681q79985J347662J912748O84723j90711O39319J660277N52842k056639
$$ -2665681 -3545666 -2198004 -285256 399467 208756 848075 2508352 3061194 1004555
36963A004555k911622q10679J413276J192784k0707J24799N03549j009809k634826
$$ 1004555 -1907067 -2717746 -1304470 -111686 -132393 -7594 495955 -513854 -3148680
36954c148680r95780K609484L453590R07459o80446M95946R28059j442878l156588
$$ -3148680 -4144460 -1534976 1918614 2826073 2145627 2641573 3569632 2126754 -1029834
36945a029834j190968J696482J624025j83694k65878R04992L82081j574106k021175
$$ -1029834 -2220802 -524320 1099705 916011 650133 1555125 1937206 363100 -1658075
36936a658075n57528L43143j28647j83996Q59454J484436J056567Q72044J387278
$$ -1658075 -2215603 -1872460 -2001107 -2185103 -1325649 158787 1215354 2087398 3474676
36927C474676J149680n07640k006362j915048r67623n17321m67723j2879O46007
$$ 3474676 4624356 4116716 2110354 195306 -772317 -1289638 -1757361 -1770240 -1124233
36918a124233O60261M8975l39113k22834k03789m74005j75546J154332K131041
$$ -1124233 -463972 -414997 -754110 -976944 -1180733 -1654738 -1830284 -675952 1455089
36909A455089R23969j790217k942697j058993J438868J496204l49636j186720
$$ 1455089 2379058 588841 -2353856 -3412849 -1973981 -477777 -827413 -2014133
36901b014133k24888O07095K42008k26214j57507n10775j520724j665099r5024
$$ -2014133 -2239021 -1631926 -1389918 -1616132 -1773639 -2284414 -3805138 -5470237 -5565261
36892e565261J845904K534256J851665M60931r45267j359409m33223J98078j005605
$$ -5565261 -3719357 -1185101 666564 1127495 182228 -1177181 -1610404 -1412326 -2417931
36883b417931k276687o93098K426491K524933r33934l007196r73471J500111Q61359
$$ -2417931 -4694618 -5387716 -2961225 -436292 -1370226 -4377422 -5350893 -3850782 -2989423
36874b989423o01733L24900J671471L46558j383854M27752L841954L630124o3102
$$ -2989423 -3591156 -3266256 -1594785 -1248227 -2632081 -2204329 1637625 5267749 5204647
36865E204647k209780j396964j190629k759110k811742k60931J329135J58831
$$ 5204647 2994867 1597903 407274 -2351836 -5163578 -5424509 -4095374 -3936543
36857c936543o51630R36817K063867N13889q55285O66272K270513K86153l108986
$$ -3936543 -4588173 -3651356 -1587489 -1073600 -1928885 -1262613 1007900 1294053 -1814933
36848a814933l028043M57684K887387K298412P08442m39513j526440j763097K63698
$$ -1814933 -4842976 -4385292 -1497905 800507 1508949 1069436 -457004 -2220101 -1956403
36839a956403K718453J891445j600192k637838O52470L523998J730805k035796
$$ -1956403 762050 2653495 1053303 -1584535 -932065 2591933 4322738 2286942
36831B286942k647937l64796M81482j168605k062519o20207Q10717O15054O09666
$$ 2286942 -360995 -725791 -244309 -1412914 -3475433 -4095640 -3284923 -2669869 -2060203
36822b060203K153051L029268R89463k004080k254612K04361J736617M38513j408930
$$ -2060203 92848 3122116 4111579 2107499 -147113 57248 1793865 2232378 823448
36813H23448q45051J793001L488741K202219r39899k888742j887295N51947J288039
$$ 823448 -21603 1771398 5260139 7462358 6522459 3633717 1746422 2298369 3586408
36804C586408o71863k937124k881687r34689M47385K07024m67330k78656P35840
$$ 3586408 2914545 -22579 -2904266 -3838955 -3391570 -3184546 -3651876 -3930532 -3194692
36795c194692J807006K219162J554404J62134q56105j005061j133075j806061
$$ -3194692 -1387686 831476 2385880 2548014 1691909 686848 -446227 -2252288
36787b252288j939197n59376J085908J159674J76957R3949J082236J623058J307769
$$ -2252288 -4191485 -4750861 -3664953 -2505279 -2328322 -2234373 -1152137 470921 1778690
36778A778690R13165J44675j675157k953253j387258J666452K306228K60154l96751
$$ 1778690 2691855 2836530 1161373 -1791880 -3179138 -1512686 793542 1053696 656945
36769F56945J783395K620155q30976m677104l624465J046512L600174K046441
$$ 656945 2440340 5060495 4229519 -447585 -4072050 -3025538 574636 2621077
36761B621077m04505j061608m56711L88681J261082J095999j181906l661978k967155
$$ 2621077 2216572 1154964 698253 1086934 2348016 3444015 2262109 -1399869 -4367024
36752d367024M04057J963291j34350k031204q1262L392245L573778K60254k314525
$$ -4367024 -3962967 -1999676 -2134026 -4165230 -4246492 -854247 2719531 2979785 665260
36743F65260j880954n41159m73769p43075J69543J391413J338824N07153K41959
$$ 665260 -1215694 -1756853 -2230622 -2973697 -2804154 -1412741 -73917 433236 675195
36734F75195L7154j331946k802505k130855J36957R78559k78651p46873J122778
$$ 675195 712349 -619597 -3422102 -5552957 -5416000 -4437441 -4716092 -5462965 -4340187
36725d340187K749551J673846l96101n70215P25387J330977J150655R95125j31517
$$ -4340187 -1590636 83210 -312891 -883106 -157719 1173258 2323913 3319038 3187521
36716C187521k720745l894368j380590J583112O21751k091722q45362L653426
$$ 3187521 466776 -3427592 -4808182 -3225070 -2603319 -4695041 -5540403 -1886977
36708a886977M612574K13305l253570j665804Q41118j43026j912995l60267K382442
$$ -1886977 2725597 2938902 -314668 -1980472 -1139354 -1282380 -3195375 -3555642 -1173200
36699a173200J886685r44410k004567q76998k08127m00741J08238J021280J015189
$$ -1173200 713485 -230925 -2235492 -3112490 -3320617 -3721358 -3613120 -2591840 -1576651
36690a576651P17254R99595M09711j846168k876311l70106K637706K017251p85241
$$ -1576651 -859397 140198 549909 -1296259 -4172570 -4542676 -1904970 112281 -672960
36681f72960j423080J47397O77972Q4520Q95288K307802J003100k300604l126083
$$ -672960 -2096040 -1948643 -1270671 -1186151 -290863 2016939 3020039 719435 -2406648
36672b406648n97430J071026m74402k330645j432727J137299K525862J610417
$$ -2406648 -3004078 -1933052 -2407454 -4738099 -6170826 -5033527 -2507665 -897248
36664h97248q20464k754819j866948J502316L192075M54965l093564k168579J931202
$$ -897248 -1717712 -4472531 -6339479 -4837163 -1645088 -1190123 -4283687 -6452266 -4521064
36655d521064L203767L49211j796790n13708J265438Q69473l61000r21320j549363
$$ -4521064 -1317297 -968086 -2764876 -3278584 -2013146 -1143673 -1504673 -2425993 -3975356
36646c975356k001823l18054K865321L912756J843445j42087k77796n46633j837017
$$ -3975356 -5977179 -6295233 -3429912 482844 2326289 2184202 1906406 1359773 -477244
36637d77244j998443o77333p31438k481216k060722J616011L794705J392484j656950
$$ -477244 -2475687 -3153020 -3884458 -6365674 -8426396 -6810385 -3015680 -1623196 -3280146
36628c280146p92627K096280K595534P98676l23212l08349l88447l8135J414235
$$ -3280146 -4072773 -1976493 619041 1417717 1094505 786156 397709 359574 1773809
36619A773809K151094O51660j266600j579549j509237k477041k662824l53251
$$ 1773809 3924903 4576563 3309963 1730414 221177 -2255864 -4918688 -5271939
36611e271939K219876K271046Q64947J59279o02973k250961k268039R20751L415215
$$ -5271939 -3052063 -781017 83930 243209 -359764 -2610725 -4878764 -3958013 -542798
36602e42798J103871l140287l385743K73552K652024J998399J229760J391134
$$ -542798 561073 -2579214 -5964957 -5691405 -3039381 -1040982 188778 1579912
36594A579912L65492j644865j474031J142357K475939Q92871q54749q09868o01690
$$ 1579912 1945404 300539 -1173492 -31135 2444804 3337675 2482926 1673058 1071368
36585A071368j380661j395883K33764J219466j5016j386831n56337J347166J807020
$$ 1071368 -309293 -1705176 -1471412 -251946 -266962 -1653793 -2210130 -862964 944056
36576I44056P08544j62190Q625M90257L88861n28461j630971j642259q5989J525413
$$ 944056 1652600 1490410 1499035 1989292 2378153 1849692 218721 -1423538 -1509527 15886
36566A5886J379174K8022m60268J92168K63036q01675j466491q60553j05368r4543
$$ 15886 1395060 1423082 962814 1154982 1418018 616343 -850148 -1710701 -1816069 -1910612
36556a910612r5005M36149N50384m69144j558752j237941M81186K397656L456095
$$ -1910612 -2005617 -1569468 -1019084 -1488228 -3046980 -4284921 -3803735 -1406079 2050016
36547B050016L126162J312933j313416l241998k951904j82141L230242M141013
$$ 2050016 5176178 6489111 5175695 1933697 -1018207 -1200348 2029894 6170907
36539F170907J068046l393395m795363k079932J327533K378354J707262P85491
$$ 6170907 7238953 3845558 -949805 -3029737 -1702204 676150 2383412 3168903
36531C168903q27766k817148k177629K132248N511066L517636r17205j694286
$$ 3168903 2341137 -476011 -2653640 -521392 4989674 8507310 7590105 5895819
36523E895819O73850J89674l999095n557049j368999L075315K338246q56803j008486
$$ 5895819 6569669 6759343 2760248 -2796801 -4165800 -1090485 1247761 390958 -617528
36514f17528J250326J308775j201188k191002r4469K056668J718803l5608j170718
$$ -617528 632798 1941573 740385 -1450617 -1545086 511582 2230385 2194777 1024059
36505A024059j332903r22318Q8247J343510J699914N49076j279969k311446j629193
$$ 1024059 -308844 -1231162 -1142915 200595 1900509 2449585 1169616 -1141830 -2771023
36496b771023M41512K253054K058255J46386j034626M8636J754740J546933l27273
$$ -2771023 -2329511 -76457 1981798 2128184 1093558 1142194 2896934 4443867 4116594
36487D116594j407276q46709l35488q72442r87751N51726K137122J424278r15118
$$ 4116594 2709318 1862609 1527121 654679 -333072 218654 2355776 3780054 2864936
36478B864936j830651k73235J260548M12154j678245k268199r51264L63269O91698
$$ 2864936 1034285 761050 2021598 2433752 755507 -1512692 -2463956 -2100687 -1408989
36469a408989Q10578R42500J95319j097529j054999N82696J495721O41167M42499
$$ -1408989 -598411 344089 539408 -558121 -1613120 -1030424 465297 1106464 1548963
36460A548963K651869M451636K196959k492003m424698k145634N13156N38990
$$ 1548963 4200832 8652468 10849427 8357424 3932726 1787092 2300248 2839238
36452B839238n88931n92400j45937p94395j825437j655152n51839J62928K50210
$$ 2839238 2250307 1657907 1511970 717575 -1107862 -2763014 -3314853 -3151925 -2901715
36443b901715N7393p38755k018417k164950k38383J839828J584737k46415o41785
$$ -2901715 -2844322 -3583077 -5601494 -7766444 -8004827 -6164999 -4580262 -4826677 -5468462
36434e468462J047982K132836Q21094j068371j090868R0309J59476p38323o4537
$$ -5468462 -4420480 -2287644 -1466550 -2534921 -3625789 -3535480 -3376004 -4114327 -4178864
36425d178864K694815M257283J741587k982404n228681l131367O85267K905366
$$ -4178864 -1484049 2773234 4514821 1532417 -3696264 -6827631 -6142364 -3236998
36417c236998K860071J683224K96759o16837l09826Q86399J241392j68347j856400
$$ -3236998 -376927 1306297 1603056 986219 676393 1562792 2804184 2635837 779437
36408G79437j871607n27698K26429m29875j441543j559087n87154Q64889J996778
$$ 779437 -1092170 -1619868 -1393439 -1823314 -3264857 -4823944 -5411098 -4546209 -2549431
36399b549431K317695K002146J453990N63475p02389j224455J7450J570737P55503
$$ -2549431 -231736 1770410 3224400 3787875 3085486 1861031 1878481 3449218 4204721
36390D204721k129058l585123k041446j66845k90462p68287M52479J800902J083565
$$ 4204721 2075663 -1509460 -3550906 -3717751 -4008213 -4776500 -4324021 -2523119 -1439554
36381a439554j97928M40674J681152P79959j069903o36096J319220J116252j262953
$$ -1439554 -1637482 -1196808 484344 1264303 194400 -441696 877524 1993776 730823
36372G30823k025199j81223R90705n6900p73579M26673J460845P76575m240L75789
$$ 730823 -1294376 -1475599 -484894 -541794 -1315373 -888700 572145 1348720 1344480 1720269
36362A720269N44752k38368l31508P42386P16511j244008k404411q83976J221937
$$ 1720269 2265021 2026653 1695145 2437531 3154042 1910034 -494377 -1378353 -156416
36353a56416J583064J104848J113220N09743j387279k412764j053812O05078M82805
$$ -156416 1426648 2531496 3644716 4154459 2767180 354416 -699396 -94318 388487
36344C88487K7159R53723J602199J70295j414618q42234J87989p26676j677704
$$ 388487 415646 1369369 2971568 3141863 1727245 885011 1073000 346324 -1331380
36335a331380K81037L033314K146901j565553k972489p29695J161241L22078q29132
$$ -1331380 -1050343 1982971 4129872 2564319 -408170 -1137865 23376 345454 -483678
36326d83678r8898J039437P75862j91452q57141j532031j813193l27790K066699
$$ -483678 -582576 456861 1232723 1041271 184130 -1347901 -3161094 -3488884 -1422185
36317a422185K337582J40290j039356M26118J384930n51602k391364n81718K666898
$$ -1422185 915397 1055687 16331 442449 1827379 1275777 -1115587 -1697305 969593
36308I69593K644386k61003j450607J73972Q18220j269192k687435p68905J854200
$$ 969593 3613979 3352976 1902369 2076341 2894561 1625369 -1062066 -1830971 23229
36299B3229J677546q8271j30175J167633Q15929j147480j627898k2013N78814
$$ 23229 1700775 1612504 1482329 2649962 3465891 2318411 690513 668500 1247314
36290A247314j234714k573711r49118J707986K206884O82340o45081j121871j237147
$$ 1247314 12600 -2561111 -3510229 -1802243 404641 1086981 441900 -679971 -1917118
36281a917118m30747J541953K538155O47608k196620k604354q32637R2286l51206
$$ -1917118 -2347865 -805912 1732243 2379851 183231 -2421123 -3253760 -3161474 -3512680
36272c512680J42495J883591K373292R19636j59458j6875p18588k616194k609661
$$ -3512680 -3370185 -1486594 886698 1806334 1646876 1630001 911413 -1704781 -4314442
36263d314442N04325K950357J508940j209812q74292J724481K248444j67501j843179
$$ -4314442 -3810117 -859760 649180 -560632 -1434924 289557 2538001 2370500 527321
36254E27321m65947J631497J168564j535945l189567j730905J213190K270472
$$ 527321 61374 1692871 2861435 1325490 -1864077 -3594982 -2381792 -111320
36246a11320M27881j721928j558949M980M20162k19823J85708J387899R09190
$$ -111320 316561 -1405367 -2964316 -2959336 -2539174 -2758997 -2573289 -1185390 -276200
36237b76200j144299j588384L64454J466408J50969n42781J488691L198304J340077
$$ -276200 -1420499 -3008883 -2644429 -1178021 -1027052 -1569833 -81142 3117162 4457239
36228D457239k000345k895864j566650o84037l91183N59303J030636m98832k036144
$$ 4457239 2456894 -438970 -2005620 -2689657 -3080840 -2521537 -1490901 -1989733 -4025877
36219d025877q13692J631988J739808j14645o69597M13579P04316L8027L14867
$$ -4025877 -4839569 -3207581 -1467773 -1582418 -2252015 -1838436 -1134120 -1096093 -781226
36210g81226Q86222n69167k768925j912459J586111K948282N81580j600421r45423
$$ -781226 104996 -464171 -3233096 -5145555 -3559444 -611162 -29582 -1630003 -2575426
36201b575426Q0494r15378j937233m49703K183045L120612K091897N03578r97376
$$ -2575426 -2494932 -3410310 -5347543 -5797246 -3614201 -493589 1598308 2101886 1104510
36192A104510j919427j272358N38062J397351O51382J87114R28854J031543p01989
$$ 1104510 -814917 -2087275 -1549213 -151862 499520 686634 1615488 2647031 1945042
36183A945042k403640k172298r26522j19309Q34839K485190L086950J127090j711736
$$ 1945042 -458598 -2630896 -3557418 -3676727 -2841888 -356698 2730252 3857342 2145606
36174B145606k700149j729894n54276J90624R09660J266203P55741R9838J04540
$$ 2145606 -554543 -2284437 -2838713 -2648089 -1738429 -472226 283515 383353 487893
36165D87893J19328n50621q58532L32609J831059J551410k49356j280548n13658
$$ 487893 607221 56600 -801932 -469323 1361736 2913146 2663790 1383242 869584
36156H69584O84108P52519k05036r93653p75794K38307J047577Q70378O5218l81429
$$ 869584 1553692 2306211 2101175 1107522 331728 570035 1617612 2487990 2553208 2171779
36146B171779k98952m40597j039025j289929n76959P11097J744716J744792J74284
$$ 2171779 1872827 1432230 393205 -896724 -1473683 -762586 982130 2726922 2901206
36137B901206k238739l095146q65028K362516K968992O94570j214880j065861
$$ 2901206 662467 -2432679 -3297707 -935191 2033801 2728371 1513491 447630
36129D47630p19904j464077j350231J082136L332456K266498r46473k413567j032067
$$ 447630 -272274 -1736351 -3086582 -2004446 1328010 3594508 2648035 234468 -797599
36120g97599N93243M33030n16285n00320L86379Q30965L89889p2758J88232O32704
$$ -797599 -204356 228674 -287611 -787931 -401552 429413 819302 746544 934776 1567480
36110A567480K26502p54464q26243K17732M31465j163412k193783k72233K520757
$$ 1567480 1793982 1039518 213275 431007 862472 -300940 -2494723 -2766956 -246199
36101b46199K086082j156324k379264L10175K954936J936548q79029j739052m16590
$$ -246199 1839883 683559 -1695705 -1385530 1569406 3505954 2626925 887873 471283
36092D71283R12934J474063J527271M98195j494352k247264o04029R27360j95722
$$ 471283 1384217 2858280 4385551 4883746 3389394 1142130 538101 1465461 1269739
36083A269739k120050j301680J717346L005097J137218j142553j248716K15471
$$ 1269739 -850311 -2151991 -434645 2570452 3707670 2565117 1316401 1531872
36075A531872J169848N52459j255829k854806k648666n44499J540615J962876
$$ 1531872 2701720 3254179 1998350 -856456 -3505122 -4049621 -2509006 -546130
36067e46130J286268Q09037M85473j95860o65432l00146K94863N24066P81377
$$ -546130 740138 1549175 2034648 1838788 1173356 873210 1168073 1692139 2473516
36058B473516R03404j61505j662046r79277J641304J912695j734750m139784q33219
$$ 2473516 3376920 3215415 1553369 574092 2215396 4128091 2393341 -1746443 -2579662
36049b579662M086557L649104r60430k393917Q27354K299075j176538m311904
$$ -2579662 1506895 5155999 4195569 1801652 2629006 4928081 3751543 -560361
36041e60361k301097J518184J532904j428133k358768p9198J917597J253372p02487
$$ -560361 -2861458 -1343274 189630 -1238503 -3597271 -3676469 -1758872 -505500 -1207987
36032a207987j657782j067135P9464N29131j01146q35278n83215J19829k9246
$$ -1207987 -2865769 -3932904 -3853440 -3324309 -3425455 -4260733 -4843948 -4724119 -4753365
36023d753365o72713k68973R85656J200310O4148o10580j40817N6374n65105o55891
$$ -4753365 -5426078 -5695051 -4709395 -3509085 -3444937 -4055517 -4196334 -4139960 -4705065 -5360956
36013e360956K88168J142036J791917L197368M135886J967688k146041l403225
$$ -5360956 -5072788 -3930752 -2138835 1058533 5194419 7162107 5016066 1612841
36005A612841p09650J063367r57786k598712K32662M149665L581610k16413j745452
$$ 1612841 903191 1966558 1008772 -1589940 -1357278 2792387 6373997 6157584 4412132
35996D412132l70715j86826k036041k396937l09961Q62760l51289j136648J66017
$$ 4412132 4041417 3854591 1818550 -578387 -888348 -25588 -376877 -1513525 -1347508
35987a347508J166196O9011j077515k12836J200130R76782k87452q31447n03054
$$ -1347508 -181312 -112301 -1189816 -1402652 -202522 774260 486808 -344639 -847693
35978h47693P0721R65929J869285J523455j70770j450815j399433j203071j461309
$$ -847693 -776972 188957 2058242 3581697 3410927 1960112 560679 -642392 -2103701
35969b103701p72435J351708K737064J792964J51627k34891l60395j796510l047754
$$ -2103701 -2876136 -1524428 1212636 3005600 3157227 2922336 2561941 765431 -2282323
35960b282323j558068J786404L426485K022979k39284j194615j047371r04276
$$ -2282323 -3840391 -2053987 1372498 3395477 3156193 1961578 914207 9931
35952I931j022769j051780o68676K67393J296082J407023M15342m59421m56817
$$ 9931 -1012838 -2064618 -2733294 -2465901 -1169819 237204 652546 193125 -263692
35943b63692n64082j464762j650974J86650K160022J505461q13058j189527R46661
$$ -263692 -827774 -2292536 -3943510 -3756860 -1596838 -91377 -904435 -2093962 -1147301
35934a147301K154682N52102j220132m77758J166057P22430j096866j080986J138528
$$ -1147301 1007381 1559483 339351 -138407 1027650 1750080 653214 -427772 710756
35925G10756K314761M99545k028549k025532L32521K054150J516956J92143k3124
$$ 710756 3025517 3525062 1496513 -529019 -196498 1857652 3374608 3566751 3543627
35916C543627M69739J36572q36479q33050J37112l3474k044084l415638k013199
$$ 3543627 4013366 4149938 3313459 2480409 2617521 2584047 539963 -2875675 -4888874
35907d888874N31841J352023P71006J101872K035109J058588j524108k093820
$$ -4888874 -4357033 -3005010 -2234004 -1132132 902977 1961565 437457 -1656363
35899a656363O31725L205561K598622M23060l89376k02403j004849k375197k356525
$$ -1656363 -1024638 2180923 4779545 5202605 4813229 4610826 3605977 1230780 -1125745
35890a125745r56951J63255M87339N78701K86564n32889o66744N54107J303847
$$ -1125745 -2082696 -1919441 -1432102 -853401 -566837 -1099726 -1766470 -1212363 91484
35881I1484M5058j087825Q54269M287583M508348M24581l831610m562192k475594
$$ 91484 136542 -951283 -97014 4190569 8698917 9123498 5291888 729696 -1745898
35872a745898k54262Q15708Q12515L51645O17130J993684K458392p48l357652
$$ -1745898 -2000160 -1184452 -371937 -20292 596838 2590522 5048914 5048166 1690514
35863A690514l355576J85301K674643J455473p59349r00552j5687j70134m92648
$$ 1690514 -1665062 -1479761 1194882 2650355 1891006 990454 974767 804633 311985
35854C11985M21774J073493m01172k441234k356165p14269M507k54198L66466
$$ 311985 733759 1807252 1406080 -1035154 -3391319 -4105588 -4101081 -4355279 -3988813
35845c988813J729228J780063J75404j209102j310976q57869m35891J25907O05504
$$ -3988813 -2259585 -479522 -304118 -1513220 -2824196 -3682065 -4117956 -3992049 -3386545
35836c386545O36768P41850J282844J168718l21955j431913j63233K193235K537175
$$ -3386545 -2749777 -2007927 -725083 443635 121680 -1310233 -1473466 719769 3256944
35827C256944M36790j663350k291605k090305j378343K89200J979804J869000
$$ 3256944 3693734 2030384 -261221 -2351526 -3729869 -3440669 -1460865 408135
35819D08135L19832l59918L19771M25826o69312j056254J95843J280502Q05388
$$ 408135 727967 368049 687820 1113646 444334 -611920 -416077 864425 1669813
35810A669813j8367O1580J10369q09781j462917n27476R13842J022614o1699r87870
$$ 1669813 1651446 1713026 1823395 1013614 -449303 -976779 -62937 959677 897978 -89892
35800h9892j393662j532477r05208Q26375K445142K484737J287665K50979k70816
$$ -89892 -1483554 -3016031 -3921239 -3094864 -649722 1835015 3122680 3373659 3102843
35791C102843p98647j159691p35444J18845M42662K66157M68443J122349J248797
$$ 3102843 2304196 1144505 409061 527906 970568 1236725 1705168 2827517 4076314
35782D076314L44207q70649j440002j155070l63862N88758J449859J889406J514223
$$ 4076314 4420521 3549872 2109870 954800 590938 1179696 2629555 4518961 6033184
35773F033184K02403j445785k245517j537763j14072N40903m7498r47761j071191
$$ 6033184 6235587 4789802 2544285 1006522 892450 1433353 1385855 438094 -633097
35764f33097j85888J200172K213932K003531O04765p23349r42489o97182j132958
$$ -633097 -818985 381187 2595119 4598650 5203415 4480066 3537577 2840395 1707437
35755A707437j688958q84201P57015Q56004j041507k148958m31262J982366J594581
$$ 1707437 18479 -865722 -108707 747297 -294210 -2443168 -2874430 -892064 702517
35746G02517j330614k968314j219979J544092J953824J05732j124308m00654O18372
$$ 702517 -628097 -3596411 -4816390 -3272298 -1318474 -1212742 -2337050 -2737704 -2119332
35737b119332N16820N54652K081418L196488J044394k984500m020705o72856K432098
$$ -2119332 -1602512 -1047860 1033558 4230046 5274440 2289940 -1730765 -2403621 28477
35728B8477J250124j870704k197138L09160J915375J207101p0268r99776j878167
$$ 28477 1278601 -592103 -2789241 -2480081 -564706 642395 572127 -427649 -2305816
35719b305816j492323J307135L823139K289972j658516k581138L86682K421467
$$ -2305816 -3798139 -2491004 1332135 3622107 1963591 -617547 -230865 2190602
35711B190602J143180l16660p1409p28765l010351k715188J744891M841627K176714
$$ 2190602 3333782 3017122 2945713 2216948 -793403 -3508591 -1763700 3077927 5254641
35702E254641k092747j983096Q38753R56266j258438j361458M98638J97076k371467
$$ 5254641 3161894 1178798 2017551 2973817 1715379 353921 852559 1049635 -1321832
35693a321832l095834j044726N48430O80228J644618L369378K831909r633j420295
$$ -1321832 -4417666 -5462392 -4913962 -4233734 -2589116 780262 3612171 3602538 2182243
35684B182243j39740Q67903M1443n36210K50033O52775M1808M818M20487o23097
$$ 2182243 2042503 2910406 2951849 2415639 2665672 3318447 3360255 3365073 3785560 3162463
35674C162463k087064o49052K729629K949875p40702k834182o95120J080045r49825
$$ 3162463 1075399 426347 3155976 6105851 5365149 2530967 1835847 2915892 1966067
35665A966067k983974j139876J433564N51822j192042N49865L274054J601674
$$ 1966067 -1017907 -2157783 -724219 -172397 -1364439 -814574 2459480 4061154
35657D061154k948917l945880m46681K085594J072924j04339P41740R62670j260555
$$ 4061154 1112237 -2833643 -3280324 -1194730 -121806 -226145 515595 1478265 217710
35648B17710l036760j497054J493505K301827N86311j080337q93391P26454K157450
$$ 217710 -2819050 -4316104 -2822599 -520772 65539 -1014798 -1908189 -1181735 975715
35639I75715J924415K073j766655j611926j52747N52653m7476o74143n17953L9798
$$ 975715 2900130 2902203 1135548 -476378 -629125 -76472 -123948 -798091 -1316044 -1276246
35629a276246Q19183J964536K681190J784865k95302j700901j461482k83623P83922
$$ -1276246 -457063 1507473 4188663 5973528 5678226 3977325 2515843 2232220 3016142
35620C016142J133760M51692q36516j485238j041574o52956r98441q64757M93289
$$ 3016142 4149902 4601594 3765078 2279840 1238266 585310 -413131 -1277888 -784599
35611g84599J362465L22900p98332K71872K043067J359606j382311k830884j805551
$$ -784599 577866 900766 102434 374306 2417373 3776979 2394668 -436216 -2241767
35602b241767j36297J042047J999343J922575j23390k000245o81119K336156K489930
$$ -2241767 -2378064 -1336017 663326 2585901 2462511 462266 -218853 2117303 4607233
35593D607233o11562k449387r61493O64229J51743l16153Q45279J173112j014709
$$ 4607233 3995671 1546284 584791 1249020 1400763 1084610 1929889 3103001 2088292
35584B088292k866014j635449Q11333J580007J119464O82532o13001k566697k008542
$$ 2088292 -777722 -2413171 -1601838 -21831 1097633 1780165 1167164 -1399533 -3408075
35575c408075J608103L154929m53365l897459j265607L681234L009506k245462
$$ -3408075 -1799972 1354957 901592 -2995867 -4261474 -580240 2429266 183804
35567A83804l635278O03996K758282j193641m904558k378432K497372L051894
$$ 183804 -3451474 -2847478 -89196 -1282837 -6187395 -8565827 -6068455 -3016561
35559c016561M68651L75993K722999K476104j193011l383789j442979J375329
$$ -3016561 -2547910 -2171917 551082 3027186 1834175 -1549614 -2992593 -1617264
35551a617264J700497P39340Q89448J414157N45600o23711J51324J872366J204228
$$ -1617264 83233 822573 1712021 3126178 3671778 3048067 3199391 5071757 6275985
35542F275985k097059m014277j910456J399023J615125r12025k200403q75148
$$ 6275985 4178926 164649 -1745807 -346784 1268341 356316 -1844087 -2719235
35534b719235L62371j73240n12784Q70152J896987N61086j110072k48111J785374
$$ -2719235 -2356864 -2530104 -3042888 -2172736 -275749 285337 -824735 -1072846 712528
35525G12528J480728q98885j685569K35747J981531J614652O15670L40182l44570
$$ 712528 2193256 1294371 -391198 -155451 1826080 3440732 4056402 4396584 4052014
35516D052014k105451k889685r48574J983314K805289J057010j017232j510981
$$ 4052014 1946563 -943122 -1891696 91618 2896907 3953917 2936685 1425704
35508A425704n24684O20196Q54105L43520K05938Q14558R98334j1151r35441o34062
$$ 1425704 901020 1521216 2375321 2718841 2924779 3739337 4737671 4726520 3791079 3157017
35498C157017o14093k460808l943284j751470K300379K749724j079247l407888
$$ 3157017 2542924 82116 -3861168 -5612638 -3312259 -562535 -1641782 -5049670
35490e049670p43412K986155L175479J415350J305391J775188j515k308456j533348
$$ -5049670 -5793082 -2806927 368552 1783902 3089293 4864481 4862966 2554510 1021162
35481A021162R72161Q46932j594963j866995P35780J960406J65924j015023N72382
$$ 1021162 1993323 2840255 1245292 -621703 114077 2074483 2240407 1225384 1797766
35472A797766J786484r2424k604844k442785o35182J83298M10280J553064K347953
$$ 1797766 3584250 3491826 886982 -1555803 -2190985 -2007687 -1597407 -44343 2303610
35463B303610R17126j111420q17164R32908Q20518j153619j589619L91805J475272
$$ 2303610 3220736 2109316 1292152 2225060 3045578 1891959 302340 694145 2169417
35454B169417k79425k070529r18916J441079J405815o64942j094692J189342L002992
$$ 2169417 1889992 -180537 -1099453 341626 1747441 1082499 -12193 1177149 4180141
35445D180141J934743j15879k83442P43507K28638j893654k881452j582963n409
$$ 4180141 6114884 5999005 5715563 6459070 6687708 4794054 1912602 329639 324230
35436C24230J35893k88814j62143j83827q52140p48476Q41220J675208j64016
$$ 324230 460123 171309 9166 -174661 -1026801 -1775277 -934057 741151 577135
35427E77135k402365j480614J690045K802410P60313r49432j78308P60731l75235
$$ 577135 -1825230 -3305844 -1615799 1186611 1946924 997492 819184 1579915 1204680
35418A204680j830632j089469P89449J098881j32292o12606M81496J765680J907243
$$ 1204680 -625952 -1715421 -925972 172909 40617 -571989 -90493 1675187 3582430
35409C582430O56106j578731l502066l317702j004165R79566Q97741J17990M21284
$$ 3582430 4238536 2659805 -842261 -4159963 -5164128 -4184562 -3286821 -3168831 -2747547
35400b747547Q92555J23121m30043J174624L012112J536125k303124l665801j046192
$$ -2747547 -1854992 -1731871 -2161914 -987290 2024822 3560947 1257823 -2407978 -3454170
35391c454170J493813P07842j257437q99585J331847K478342J481605l87932j764639
$$ -3454170 -1960357 -1252515 -2509952 -3409537 -2077690 400652 1882257 1494325 -270314
35382b70314j773538q7888J787880J242703j566715k834849l81257K633610K241009
$$ -270314 -2043852 -2131740 -343860 898843 -667872 -3502721 -3883978 -1250368 990641
35373I90641l63592j139428K18478M48610j245413j989033m66435R64995O08130
$$ 990641 627049 -512379 -293901 154709 -1090704 -3079737 -3546172 -2581177 -1973047
35364a973047J01345J020792J976652J165705o32829j592243j401677o35168N50121
$$ -1973047 -1871702 -850910 1125742 2291447 1658618 66375 -1335302 -1970470 -1420349
35355a420349J564076J155325m61180j197467k64579M37780k99073p74486L10669
$$ -1420349 143727 1299052 837872 -359595 -624174 -186394 -485467 -1259953 -949284
35346i49284R93721n81571k332194j397126P06403K84232k210957k599199K88103
$$ -949284 44437 -537134 -2869328 -4266454 -3560051 -3275819 -5486776 -8085975 -7797872
35337g797872K748571K065548K18964J1766Q52356P08557k14010k72419O23473
$$ -7797872 -5049301 -2983753 -2764789 -2753023 -1900667 -1192110 -1406120 -1678539 -1055066
35328a055066J035940K69936r33667j490109q43359O57821J751336J441381M29630
$$ -1055066 -19126 250810 -682857 -2172966 -3016325 -2358504 -607168 834213 1263843
35319A263843K71629J008228J115442P000j153526j500463j435385j071022J74739
$$ 1263843 1535472 2543700 3659142 3666142 2512616 1012153 -423232 -1494254 -1319515
35310a319515J683619J606317j58861j211114k87862N83939o04488k475927k473866
$$ -1319515 364104 1970421 1811560 600446 312584 896523 292035 -2183892 -4657758
35301d657758p76485M93442Q11156J428947K567755K782203J181992j325420l056708
$$ -4657758 -5434243 -4940801 -4129645 -2700698 -132943 2649260 3831252 2505832 -550876
35292e50876k850482p73723J629270K493135J720203Q73825N11197n40430k336410
$$ -550876 -3401358 -4175081 -2545811 -52676 1667527 2541352 3052549 2512119 175709
35283A75709k655603m68968J768126J651667M73711N21247Q96329l78790j856507
$$ 175709 -2479894 -2948862 -1180736 470931 944642 1465889 2362218 1983428 126921
35274A26921o70134J837793J372147k144158l545696j11159M065640L949562M22604
$$ 126921 -543213 1294580 2666727 522569 -3023127 -3134286 931354 4880916 5303520
35265E303520j894776j390505n54300j264740k181376j260233J205581L034637
$$ 5303520 3408744 2018239 1463939 199199 -1982177 -3242410 -2036829 997808
35257I97808K789050J134374l64872j205502k011026k739088k132963J81485K249891
$$ 997808 3786858 4921232 4556360 3350858 1339832 -1399256 -3532219 -3350734 -1100843
35248a100843J958942p9169j446613j186663l99049K9620L30294N21468O8464
$$ -1100843 858099 778930 -667683 -1854346 -2253395 -2223775 -1893481 -1372013 -1303549
35239a303549q27088j118074l95386O43451J171719P31331o83229j932900j191812
$$ -1303549 -2130637 -3248711 -3644097 -3000646 -1828927 -1097596 -1780825 -3713725 -4905537
35230d905537J336629K541616M47439k327309k082435K99358R31249o21058q99410
$$ -4905537 -3568908 -1027292 -579853 -2907162 -4989597 -4690239 -3758990 -4380048 -5279458
35221e279458J247883K683963J435919k16369p2913M53760l73581j167419j35818
$$ -5279458 -4031575 -1347612 88307 -128062 -200975 252785 -120796 -1288215 -1424033
35212a424033J445185J437498M11272K00336O23231L17251n57133q93243p41082
$$ -1424033 21152 1458650 1869922 2070258 2693489 3010740 2453607 1560364 819282
35203H19282o99673m04254L94215N17422q30018k132783j524398L21011J234607
$$ 819282 119609 -284645 109570 626992 -203026 -2335809 -3860207 -3539196 -2304589
35194b304589O70049j2302L14832J594328L023018L276969J326580j874687l725187
$$ -2304589 -1634540 -1646842 -1332010 262318 3285336 6562305 7888885 6014198 2289011
35185B289011l013708j203515J61276J308848K309682J740761p66466k810220
$$ 2289011 -724697 -1928212 -1766936 -458088 1851594 3592355 2825889 15669
35177A5669k319140n19591M13592O92513J371107J466850k43329k061032j428621
$$ 15669 -2303471 -2823062 -2409470 -1716957 -345850 1121000 877671 -1183361 -2611982
35168b611982P16144J052285r65690k313038j040053J140130J699220N59603n21228
$$ -2611982 -1895838 -843553 -1809243 -4122281 -5162334 -4022204 -2322984 -1763381 -2284609
35159b284609m98681p452j71166q65214n75659J355365K963704J946300n49603
$$ -2284609 -2783290 -2790742 -2961908 -3827122 -4402781 -3047416 -83712 1862588 1312985
35150A312985j093548P26193J488262m24496k090027j091336L90650m00498j954093
$$ 1312985 219437 945630 2433892 2009396 -80631 -1171967 -781317 -1181815 -3135908
35141c135908j396462M09807O58125n73408j177176q91186n66827N48597K890897
$$ -3135908 -4532370 -4122563 -3464438 -4037846 -5215022 -6106208 -6673035 -6124438 -3233541
35132c233541L878884J368677j990491k300503n42134l59866j473237p83702J197890
$$ -3233541 645343 2014020 23529 -2276974 -2819108 -3178974 -4652211 -5435913 -4238023
35123d238023J035036r77819r34274J617302K628335M43363j776305j685210o92181
$$ -4238023 -3202987 -4180806 -5115080 -3497778 -869443 -426080 -2202385 -3887595 -4579776
35114d579776j08243P07200J270425k9540j878605j051025J672290K081920r3705
$$ -4579776 -4688019 -3980819 -2710394 -2739934 -4618539 -5669564 -3997274 -1915354 -2009059
35105b009059n84829J353557J214476k108300l212815O81861M459188L477045
$$ -2009059 -2593888 -1240331 -25855 -2134155 -5346970 -4665109 -205921 3271124
35097C271124P23330M20892O72679j457477l162403j100279J367389m08360l564184
$$ 3271124 3994454 4415346 5088025 3630548 468145 -632134 735255 326895 -3237289
35088c237289k185454K345202L601713Q63714o09257P11826P52500j894178l361704
$$ -3237289 -5422743 -3077541 524172 1387886 778629 1490455 2242955 348777 -3012927
35079c012927j562749P04897J317214J578522J861877K92496k395656k373948
$$ -3012927 -4575676 -3870779 -2553565 -975043 886834 1179330 -1216326 -3590274
35071c590274P20060K273221L04816r97758J339531L596342J682955j710562j630624
$$ -3590274 -2870214 -596993 -292177 -1289935 49596 3645938 5328893 3618331 1987707
35062A987707R31140J198405j130138j822991K95848J475735l78162k249714j207457
$$ 1987707 2918847 4117252 2987114 1164123 1459971 2935706 2557544 307830 -899627
35053h99627Q16447L62161j923655k302427L45702K898719K457066N8694j317396
$$ -899627 -83180 278981 -1644674 -3947101 -3601399 -702680 1754386 1813080 495684
35044D95684r06955m71054j022663j323364j76054J467100J876496R55312l1263
$$ 495684 -411271 -882325 -1904988 -3228352 -3404406 -1937306 -60810 894502 863239
35035H63239l98371l56703L2741P04158P46769o07277k189683j832172N35605
$$ 863239 464868 108165 140906 845064 1591833 984556 -1205127 -3037299 -2501694
35026b501694K355439J734103j26309p90582K05553J247057J105450K15250m32797
$$ -2501694 -146255 1587848 1461539 670957 876510 2123567 3229017 3444267 3011470
35017C011470n93174o09462o24423m93658k59910j90367k67701j00179L67660
$$ 3011470 2418296 1808834 1184411 690753 430843 240476 -27225 -127404 240256
35008B40256M65600l41398j476057j837140j236575m39988J83372J030834K060873
$$ 240256 705856 364458 -1111599 -2948739 -4185314 -4625302 -4441930 -3411096 -1350223
34999a350223K313832J256609k08595p99556m08597j7279l87578j207523j350446
$$ -1350223 963609 2220218 2011623 1212067 803470 786191 398613 -808910 -2159356
34990b159356m5272J871539K375265P54501r89000o73080P53004N17096j580548
$$ -2159356 -2204628 -333089 2042176 2796677 1807677 1134597 1887601 2404697 824149
34981H24149k681412j248595P63008J194985N85535K70450n3387r96547j715748
$$ 824149 -1857263 -3105858 -2342850 -1147865 -562330 -291880 -345267 -1341814 -3057562
34972c057562j392370o73024N4242J662376L658075L195986n16501l395923j732912
$$ -3057562 -4449932 -5122956 -5068714 -3406338 251737 3447723 2931222 -464701 -2197613
34963b197613J779754J677899j846885l159335J24778L675012L150897J16010
$$ -2197613 -417859 1260040 -586845 -3746180 -3621402 53610 3204507 3320517
34955C320517j198537L3393J213990N78649j043299j916306j144133P59319K063703
$$ 3320517 2121980 2155373 3369363 3948012 2904713 988407 -155726 603593 2667296
34946B667296J293806q12940j773512m62205J339890J364539j76200j142556l53268
$$ 2667296 3961102 3148162 1374650 912445 2252335 3616874 3440674 2298118 1944850
34937A944850J211785J926785J314996Q6863j052339k008574k650506k308069
$$ 1944850 3156635 5083420 6398416 6485279 5432940 3424366 773860 -1534209
34929a534209p73140N83575K4495k075456l331892k333264j35968J623882K420411
$$ -1534209 -2307349 -1723774 -1699279 -3774735 -7106627 -9439891 -9575859 -7951977 -5531566
34920e531566K071118L74981j446320j169177J137328K496157J352642l4939L50732
$$ -5531566 -3460448 -3085467 -4531787 -5700964 -4563636 -2067479 -714837 -749776 -399044
34911c99044P57906p58846k070172l92513K191079J472694j842648k977223o60392
$$ -399044 358862 -399984 -2470156 -2862669 -671590 801104 -1041544 -4018767 -4679159
34902d679159J277196M55089q37590l36760P04633O50858L90880R72890J362784
$$ -4679159 -3401963 -2946874 -3784464 -4121224 -3416591 -2765733 -2374853 -1401963 -39179
34893c9179N89942l68739m89717j78612L33392J506316K371911Q74621k340259
$$ -39179 550763 182024 -307693 -486305 -152913 1353403 3725314 4599935 2259676
34884B259676l604702j407465J149933J071850l37534l93040N94830P03583M4451
$$ 2259676 -1345026 -2752491 -1602558 -530708 -868242 -1261282 -666452 37131 81582
34875H1582Q6890P40581P11086j66418r85724j319787j195429n26141K67809L43215
$$ 81582 168472 909053 1620139 1453721 467997 -851790 -2047219 -2573360 -2305551 -1962336
34865a962336K2810O01673J784818J613627J5880l63757J413585K272554k29977
$$ -1962336 -1939526 -1337853 446965 2060592 2076472 1712715 3126300 5398854 5168877
34856E168877l497751l283618K18972K827257J963760r07066k873246k458605
$$ 5168877 1671126 -1612492 -1393520 1433737 3397497 2490431 -382815 -2841420
34848b841420l64223J162625L97677j493315j565694O19383K100369J197974K29780
$$ -2841420 -3205643 -2043018 -1645341 -3138656 -4704350 -4084967 -1984598 -786624 -556844
$$ [...]
##END NTUPLES=NMR SPECTRUM
##END=
