##TITLE=31Pdec_SR43
 CDCl3, 24 sc
 9.03.2021
##JCAMPDX= 6.0         $$ Bruker NMR JCAMP-DX V2.0
##DATA TYPE= NMR SPECTRUM
##DATA CLASS= NTUPLES
##ORIGIN= UXNMR, Bruker Analytische Messtechnik GmbH
##OWNER= root
$$ XWIN-NMR		Version 3.5
$$ Tue Mar  9 13:49:10 2021 Russian Standard Time (UT+4h)  she@DPX200
##.OBSERVE FREQUENCY= 81.013821
##.OBSERVE NUCLEUS= ^31P
##.ACQUISITION MODE= SIMULTANEOUS
##.ACQUISITION SCHEME= undefined
##.AVERAGES= 24
##.DIGITISER RES= 16
##SPECTROMETER/DATA SYSTEM= spect
##.PULSE SEQUENCE= zgpg30
##.SOLVENT NAME= CDCl3
##.SHIFT REFERENCE= (INTERNAL, CDCl3, 0, 248.564)
##AUDIT TRAIL= $$ (NUMBER, WHEN, WHO, WHERE, WHAT)
$$ ##TITLE= Audit trail, XWIN-NMR		Version 3.5
$$ ##JCAMPDX= 5.01
$$ ##ORIGIN= Bruker BioSpin GmbH
$$ ##OWNER= she
$$ F:/spectra/data/she/nmr/P31/1/pdata/1/auditp.txt
$$ ##AUDIT TRAIL=  $$ (NUMBER, WHEN, WHO, WHERE, WHAT)
(   1,<2021-03-09 13:48:16.00 +0400>,<she>,<DPX200>,
      <created by zg, POWCHK disabled, PULCHK disabled
       configuration hash MD5:
       00 E9 B6 7A A2 85 ED C7 34 08 36 98 17 FE 4E 26
       data hash MD5: 32K
       2E 2A FC A7 B7 BE 1F B3 71 38 A7 74 39 0E C7 84>)
(   2,<2021-03-09 13:48:18.59 +0400>,<she>,<DPX200>,
      <Start of raw data processing
       efp BC_mod = 2 LB = 1 FT_mod = 6 PKNL = 1 PHC0 = -3240.924 PHC1 = -159.7993 SI = 64K 
       data hash MD5: 64K
       98 11 D9 0C 6E 4F 94 B1 26 82 8A C6 94 A5 16 D5>)
(   3,<2021-03-09 13:48:49.04 +0400>,<she>,<DPX200>,
      <pk PHC0 = -166.5445 PHC1 = 401.3999 
       data hash MD5: 64K
       9C 0B 41 5E B5 40 FF 54 9F 52 A9 7D 40 95 3E A7>)
(   4,<2021-03-09 13:48:52.25 +0400>,<she>,<DPX200>,
      <abs ABSG = 5 
       data hash MD5: 64K
       3E D0 3F E2 D7 4D 84 F1 44 8E F8 76 11 C0 7A B3>)
$$ ##END=
$$ 
$$ hash MD5
$$ 9A 8A A1 79 A5 B9 A5 ED BE 28 7E 06 2A 0F D6 0E
##$RELAX= 
##$RELAX= 
##$RELAX= 
##$RELAX= 
##$RELAX= 
##$RELAX= 
##$RELAX= 
##$RELAX= 
$$ Bruker specific parameters
$$ --------------------------
##$DU= <F:/spectra>
##$EXPNO= 1
##$NAME= <P31>
##$PROCNO= 1
##$TYPE= <nmr>
##$USER= <she>
##$AMP= (0..31)
100 100 100 100 100 100 100 100 100 100 100 100 100 100 100 100 100 100 
100 100 100 100 100 100 100 100 100 100 100 100 100 100 
##$AQSEQ= 0
##$AQ_mod= 1
##$AUNM= <au_zg>
##$AUTOPOS= <>
##$BF1= 81.014009
##$BF2= 200.13
##$BF3= 200.13
##$BF4= 200.13
##$BF5= 200.13
##$BF6= 200.13
##$BF7= 200.13
##$BF8= 200.13
##$BYTORDA= 1
##$CFDGTYP= 0
##$CFRGTYP= 5
##$CHEMSTR= <none>
##$CNST= (0..31)
1 1 145 1 1 1 1 1 1 1 1 1 1 1 1 1 1 1 1 1 1 1 1 1 1 1 1 1 1 1 1 1 
##$CPDPRG= <waltz16>
##$CPDPRG1= <>
##$CPDPRG2= <waltz16>
##$CPDPRG3= <>
##$CPDPRG4= <mlev>
##$CPDPRG5= <mlev>
##$CPDPRG6= <mlev>
##$CPDPRG7= <mlev>
##$CPDPRG8= <mlev>
##$CPDPRGB= <>
##$CPDPRGT= <>
##$D= (0..31)
0 1 0 0 0 0 0 0 0 0 0 0.03 2e-05 3e-06 0 0 0 0 0 0 0 0 0 0 0 0 0 0 0 0 
0 0 
##$DATE= 1615283295
##$DBL= (0..7)
120 120 120 11 120 120 24 19 
##$DBP= (0..7)
150 150 150 150 150 150 150 150 
##$DBP07= 0
##$DBPNAM0= <>
##$DBPNAM1= <>
##$DBPNAM2= <>
$$ [...]
##$SUBNAM3= <"">
##$SUBNAM4= <"">
##$SUBNAM5= <"">
##$SUBNAM6= <"">
##$SUBNAM7= <"">
##$SUBNAM8= <"">
##$SUBNAM9= <"">
##$SW= 501.771253377433
##$SWIBOX= (0..15)
0 1 3 0 0 0 0 0 0 0 0 0 0 0 0 0 
##$SW_h= 40650.406504065
##$TD= 32768
##$TD0= 1
##$TE= 0
##$TE2= 300
##$TE3= 300
##$TEG= 300
##$TL= (0..7)
0 120 53 12 22 120 120 120 
##$TP= (0..7)
150 150 150 150 150 150 150 150 
##$TP07= 0
##$TPNAME0= <>
##$TPNAME1= <>
##$TPNAME2= <>
##$TPNAME3= <>
##$TPNAME4= <>
##$TPNAME5= <>
##$TPNAME6= <>
##$TPNAME7= <>
##$TPOAL= (0..7)
0.5 0.5 0.5 0.5 0.5 0.5 0.5 0.5 
##$TPOFFS= (0..7)
0 0 0 0 0 0 0 0 
##$TUNHIN= 0
##$TUNHOUT= 0
##$TUNXOUT= 0
##$USERA1= <user>
##$USERA2= <user>
##$USERA3= <user>
##$USERA4= <user>
##$USERA5= <user>
##$V9= 5
##$VALIST= <valist>
##$VCLIST= <CCCCCCCCCCCCCCC>
##$VD= 0
##$VDLIST= <DDDDDDDDDDDDDDD>
##$VPLIST= <PPPPPPPPPPPPPPP>
##$VTLIST= <TTTTTTTTTTTTTTT>
##$WBST= 1024
##$WBSW= 4
##$XGAIN= (0..3)
0 0 0 0 
##$XL= 0
##$YL= 0
##$YMAX_a= 2461
##$YMIN_a= -2231
##$ZGOPTNS= <>
##$ZL1= 120
##$ZL2= 120
##$ZL3= 120
##$ZL4= 120
##$ABSF1= 248.5645
##$ABSF2= -253.2056
##$ABSG= 5
##$ABSL= 3
##$ALPHA= 0
##$AQORDER= 0
##$ASSFAC= 0
##$ASSFACI= 0
##$ASSFACX= 0
##$ASSWID= 0
##$AUNMP= <proc_1d>
##$AZFE= 0.1
##$AZFW= 0.5
##$BCFW= 0
##$BC_mod= 2
##$BYTORDP= 0
##$COROFFS= 0
##$CY= -3
##$DATMOD= 1
##$DC= 0
##$DFILT= <>
##$DTYPP= 0
##$F1P= 0
##$F2P= 0
##$FCOR= 1
##$FTSIZE= 65536
##$FT_mod= 6
##$GAMMA= 0
##$GB= 0
##$INTBC= 1
##$INTSCL= 5.30512e-09
##$ISEN= 30
##$LB= 1
##$LEV0= 0
##$LPBIN= 0
##$MAXI= 10000
##$MC2= 0
##$MEAN= 0
##$ME_mod= 0
##$MI= 50
##$NCOEF= 0
##$NC_proc= -7
##$NLEV= 6
##$NOISF1= 182.463
##$NOISF2= 159.3651
##$NSP= 0
##$NTH_PI= 0
##$NZP= 0
##$OFFSET= 248.5645
##$PC= 4
##$PHC0= -3407.469
##$PHC1= 241.6006
##$PH_mod= 1
##$PKNL= yes
##$PPARMOD= 0
##$PSCAL= 0
##$PSIGN= 0
##$REVERSE= no
##$SF= 81.014009
##$SI= 65536
##$SIGF1= 159.3651
##$SIGF2= -187.1042
##$SINO= 113.3802
##$SIOLD= 16384
##$SREGLST= <1H.CDCl3>
##$SSB= 0
##$STSI= 65536
##$STSR= 0
##$SW_p= 40650.406504065
##$SYMM= 0
##$S_DEV= 0
##$TDeff= 32768
##$TDoff= 0
##$TI= <>
##$TILT= no
##$TM1= 0
##$TM2= 0
##$TOPLEV= 0
##$USERP1= <user>
##$USERP2= <user>
##$USERP3= <user>
##$USERP4= <user>
##$USERP5= <user>
##$WDW= 1
##$XDIM= 65536
##$YMAX_p= 292485545
##$YMIN_p= -36759976
$$ End of Bruker specific parameters
$$ ---------------------------------
##NTUPLES= NMR SPECTRUM
##VAR_NAME=  FREQUENCY,     SPECTRUM/REAL,   SPECTRUM/IMAG
##SYMBOL=    X,             R,               I
##VAR_TYPE=  INDEPENDENT,   DEPENDENT,       DEPENDENT
##VAR_FORM=  AFFN,          ASDF,            ASDF
##VAR_DIM=   65536,         65536,           65536
##UNITS=     HZ,            ARBITRARY UNITS, ARBITRARY UNITS
##FACTOR=    0.620285442955139, 1,           1
##FIRST=     20137.2065510759, 0,            0
##LAST=      -20513.1999529892, 0,           0
##MIN=       -20513.1999529892, -36759976,   0
##MAX=       20137.2065510759, 292485545,    0
$$ Real data points
##PAGE= N=1
##DATA TABLE= (X++(R..R)), XYDATA
$$ [...]
##PAGE= N=2
##DATA TABLE= (X++(I..I)), XYDATA
13016B489890m97915k221646o14685J126301P40363k42917j141992k624677k480988
13007e468266J522033M886511J279460n766492o061871J252946N872493K931571
12999D48385k67555J489693K413068j976712m846433K09294O668395N167552r89242
12990H316445j969802J988901K203592k906612n824277l275631o68853j419177
12982c555414j277414L201218P802645O642395L90058n238602o315903l328066
12974a679083R06409L714046L997073K517940O45732r74498k188563k793697k868585
12965A276774k502887j081958J287869K084862n43110l270120j126635L843230
12957c1975L866703k361660o061388j425641M840754L712486k401786m337973
$$ plain form
13016 2489890 1991975 -229671 -844356 281945 1022308 779391 -362601 -2987278 -5468266
13007 -5468266 -3946233 940278 2219738 -3546754 -9608625 -8355679 -2483186 448385
12999 448385 180830 1670523 4083591 2106879 -2739554 -2530260 4138135 9305687 8316445
12990 8316445 6346643 8335544 10539136 7632524 1808247 -1467384 -2136237 -3555414
12982 -3555414 -4832828 -1631610 6171035 12813430 13203488 7964886 1648983 -1679083
12974 -1679083 -772674 2941372 6938445 9456385 10102117 9127619 6939056 4145359 1276774
12965 1276774 -1226113 -2308071 -1020202 1064660 521550 -2748570 -3875205 -31975
12957 -31975 3834728 1473068 -4588320 -6013961 -1173207 2539279 137493 -4200480
12949d200480m36704K759897J822675j11589m63169k76575k22222K48297J29482
12940g50388j402007j908689K79420J580994r98634l065151J14970L506584l47954
12931b990855o563385l259571Q396702J3334163M842508n680085o841011k689773
12923a451307k143139l844616j637921K867248L764360J520419N95662O24623
12915B95329j104663k133579J208116N328638L921955j161449k678969k54930
12907C420448m36426m555138o124421k201609J522381N40858j128199J655545
12899g306561O186454O173456J458151k308445k228222j208699k172859l429298
12891d836023j764383K271980M828571L873141J303837n70539k039543l723506
$$ plain form
12949 -4200480 -4637184 -1877287 -54612 -166201 -629370 -905945 -1128167 -879870 -750388
12940 -750388 -2152395 -4061084 -3781664 -2200670 -3199304 -6264455 -6149485 -2642901 -2990855
12931 -2990855 -9554240 -12813811 -4417109 8917054 13759562 8079477 1238466 -1451307
12923 -1451307 -3594446 -7439062 -9076983 -6209735 -2445375 -924956 -329294 295329
12915 295329 -809334 -2942913 -1734797 3593841 7515796 6354347 3675378 3420448
12907 3420448 2984022 -1571116 -7695537 -9897146 -8374765 -7833907 -8962106 -7306561
12899 -7306561 -1120107 5053349 6511500 4203055 1974833 766134 -1406725 -4836023
12891 -4836023 -6600406 -4328426 500145 4373286 5677123 5106584 3067041 -656465
12883f56465l893767j373654P97172q55302l791175k362268K701005M172288n98244
12874e860410n252069m265101n21496J442091L017000O150015O671911J093366
12866B475307m791548l336178K279184K713031k268006l977545L5110K428929
12858d441716k49642j487760L014573O890452L332335l812118o274438l104201
12850f132515N84861K110972J986778m2600l343969l845953O51164N142545L439207
12841E50490k632658o041349m596209j851139M73934L863795O988250N506458
12833B261572n03221m862978l360636J146372L790275L610590K121777j66213
12825D037538k920945m397038l343319q60407J275335K526676K849465J979919
$$ plain form
12883 -656465 -4550232 -5923886 -5126714 -5982016 -9773191 -12135459 -9434454 -5262166 -5860410
12874 -5860410 -11112479 -15377580 -15899076 -14456985 -11439985 -5289970 1381941 2475307
12866 2475307 -2316241 -5652419 -3373235 -660204 -2928210 -6905755 -6870645 -4441716
12858 -4441716 -4691358 -6179118 -3164545 3725907 7058242 3246124 -3028314 -6132515
12850 -6132515 -5547654 -3436682 -1449904 -1492504 -4836473 -8682426 -8031262 -2888717 550490
12841 550490 -2082168 -8123517 -12719726 -14570865 -14096931 -10233136 -3244886 2261572
12833 2261572 1758351 -3104627 -6465263 -5318891 -1528616 2081974 4203751 4037538
12825 4037538 1116593 -3280445 -6623764 -7484171 -6208836 -3682160 -832695 1147224
12817A147224L85846q84737j744977k496654j988241P60883L391168K513392o16544
12808D67360j258008J218773K155765k91275j794103K52427J553583j439465m234000
12799c368943j341249L553688K498571l782137o308621j270451M821198N124155
12791g3789R43606k368766k530809m62466K225554L094062Q5627m563869n254447
12782h905297m05251M573540M348349L80674k284923j834329l5576J676696K998172
12773E12055L192939J656174q08647k925924l885846k584833J548195N850065
12765B554178N762660P89142l920733m044025j176219O39446L00584p39231j117658
12756i51856L24783L709906N609651J791712n311757p353900j611754M228482
$$ plain form
12817 1147224 1533070 648333 -1096644 -3593298 -5581539 -4820656 -1429488 1083904 467360
12808 467360 -790648 428125 2583890 2292615 498512 750939 2304522 865057 -3368943
12799 -3368943 -4710192 -1156504 1342067 -2440070 -8748691 -10019142 -5197944 -73789
12791 -73789 869817 -1498949 -4029758 -4492224 -2266670 827392 913019 -3650850 -8905297
12782 -8905297 -9310548 -4737008 -388659 -7985 -2292908 -4127237 -4162813 -2486117 512055
12773 512055 3704994 5361168 4552521 1626597 -2259249 -4844082 -3295887 2554178
12765 2554178 8316838 9105980 5185247 1141222 -34997 604449 905033 165802 -951856
12756 -951856 -627073 3082833 8692484 10484196 5172439 -2181461 -3793215 435267
12748D35267L343955n36623p49301J346757Q48751p91684M20525J719669j648242
12739D389074n535351j961985O506513Q996619K914620l079169l679948l052114
12731E498259m161615l473977N8080J480643l57100J82481M061733L862779k674812
12722D476471o371117j357186M332925K018543l313447k558431J826335J594302
12714F48395k121562j919758J874152K689386M64636R39845L721512K671004k172011
12705F795599m084114j490153J28861r91391m62152K440608K636578p25427j789621
12696B458788J385979L001750J5528k450303o62565J238928m02277j808162O67452
12687C445118L084361R86795k111901r51603J681241k13374m522265l506150L301758
$$ plain form
12748 435267 3779222 3242599 2493298 3840055 4688806 3897122 4317647 6037316 4389074
12739 4389074 -1146277 -3108262 3398251 12394870 15309490 12230321 8550373 5498259
12731 5498259 1336644 -2137333 -2079253 -598610 -955710 -773229 3288504 7151283 4476471
12722 4476471 -1894646 -3251832 1081093 3099636 -213811 -2772242 -945907 648395
12714 648395 -1473167 -3392925 -1518773 1170613 1635249 2575094 6296606 8967610 6795599
12705 6795599 2711485 1221332 1350193 358802 -103350 2337258 4973836 4248409 2458788
12696 2458788 3844767 6846517 6862045 4411742 3749177 4988105 4585828 2777666 3445118
12687 3445118 6529479 7516274 5404373 4452770 6134011 5920637 1398372 -2107778 1193980
12678A193980P187827K763043m432971n926860j304854K583068J178391k656506
12670E85118l192695P89914M823499M530778O27461k927762m030089l485561k250775
12661d530112n92776N29212L39218K56569J882360L378979J637427k106589l232179
12652b437891p16602J537343J205192L55029M34706j60316j525640r10367J384792
12643h33754P25188l661564n415115q45048M044381K632410j659078j486367K041200
12634d457747K142323j215363j552125K107943L382019O3569j829894J377622
12626A8347M717563L129979q01122k631262l333015n137444n504854j733845K597625
12617h678028K672483O93557J806944M215449J771108m225923m978867K037670
$$ plain form
12678 1193980 8381807 11144850 6711879 785019 -519835 2063233 3241624 585118
12670 585118 -2607577 -1817663 3005836 7536614 8164075 5236313 1206224 -2279337 -4530112
12661 -4530112 -5122888 -4593676 -4254458 -3997889 -2115529 1263450 2900877 794288 -2437891
12652 -2437891 -3154493 -1617150 -411958 -56929 377777 217461 -1308179 -2218546 -833754
12643 -833754 -108566 -3770130 -9185245 -10030293 -5985912 -3353502 -5012580 -6498947 -4457747
12634 -4457747 -2315424 -3530787 -5082912 -2974969 407050 470619 -1359275 18347
12626 18347 4735910 7865889 7064767 4433505 1100490 -4036954 -9541808 -11275653 -8678028
12617 -8678028 -6005545 -5311988 -3505044 710405 2481513 -1744410 -6723277 -4685607
12609d685607P840528M928344j642224k574627J471114K000483l308338p081357
12601c051684l605457L215557O012100L076913j836254m986626m470208K35961
12593e409698O466293Q289674K747792m824672o191631p95618L634213J888345
12585E804698k178413k501602R3875K16234l008269m601018j561757K846471M418780
12576d71001L731791L641487L829962J658087k684403n624591m900701j799870
12568b619239J539977M042283M451139J672408k318852l364339r12705M79908
12560B970580j990258m666626l246434K57780J349003Q45782K590913N336792
12552C447532M261967N8621j416890N79967J61937m017156m887458J066538O209337
$$ plain form
12609 -4685607 3154921 8083265 6441041 3866414 5337528 7338011 4029673 -3051684
12601 -3051684 -6657141 -3441584 2570516 5647429 3811175 -1175451 -5645659 -5409698
12593 -5409698 1056595 9346269 12094061 7269389 1077758 282140 3916353 5804698
12585 5804698 3626285 1124683 1218558 1434792 -1573477 -6174495 -7736252 -4889781 -471001
12576 -471001 3260790 6902277 10732239 12390326 9705923 4081332 -819369 -2619239
12568 -2619239 -1079262 2963021 7414160 9086568 6767716 3403377 2490672 2970580
12560 2970580 980322 -3686304 -6932738 -6674958 -5325955 -4480173 -1889260 3447532
12552 3447532 7709499 7768120 6351230 6931197 7093134 3075978 -1811480 -744942 5464395
12543E464395K966103m043695n199802k93156K952200J498113o62646r60877o18090
12534A102545N39409L547109M981528L68186o712799p248097n828N900997M152093
12525F625143o69453j635246O79046J479104l97705k642042l751060l251181o66123
12516d229517K746629M053602K560183O37162n80827k291657l776222k279110
12508c159757J117797J373582k165663l533327K11236L550215J472335k315718
12500c449300k069048O07321Q87278l83748N49493K291781R57284j599893l42918
12491b551750L549194L893253k35926l166554j990646Q6413P83155J899538L546304
12482E812981K177801k554665n033426j614763L453258M073758M75540k636468
$$ plain form
12543 5464395 8430498 4386803 -812999 -1106155 1846045 3344158 2681512 1720635 1102545
12534 1102545 1641954 5189063 10170591 10538777 3825978 -3422119 -3427947 2473050 6625143
12525 6625143 5955690 4320444 4999490 6478594 6080889 3438847 -312213 -3563394 -4229517
12516 -4229517 -1482888 2570714 5130897 5768059 5187232 2895575 -880647 -3159757
12508 -3159757 -2041960 -668378 -2834041 -6367368 -6156132 -2605917 -1133582 -3449300
12500 -3449300 -5518348 -4911027 -4023749 -4407497 -3858004 -1566223 -608939 -2208832 -2551750
12491 -2551750 997444 4890697 4654771 1488217 -502429 -416016 367139 2266677 5812981
12482 5812981 7990782 5436117 402691 -1212072 2241186 6314944 6790484 4154016
12474D154016l096853k389745j721464p77406M29835J235614J394476Q28233p21387
12465f64681k432388k284037J15058K090649J375131k32891P46845L934281M813669
12456G461636Q59811m359537n258092j391113K078216J490609n63784J79680K608198
12447C105624J782256k982968o293855m280832K62586K680826K450397J376330
12439a899636k72919j873522m11625M612216P392104K945343m304708n864203
12431C23050j612564P14530j810032l605765j128031J417379N06048l12080K348697
12422c158768M642780K034387k189141j951863J664931K667641p502k008605j666152
12413B7708j608684k505135j834413M34442J112857m7244N57178L304153L397524
$$ plain form
12474 4154016 1057163 -1332582 -3054046 -3831452 -3401617 -2166003 -771527 56706 -664681
12465 -664681 -3097069 -5381106 -5266048 -3175399 -1800268 -2033159 -1286314 2647967 7461636
12456 7461636 8321447 3961910 -1296182 -2687295 -609079 881530 317746 497426 3105624
12447 3105624 4887880 1904912 -4388943 -8669775 -8407189 -5726363 -3275966 -1899636
12439 -1899636 -2172555 -4046077 -4457702 154514 7546618 10491961 6187253 323050
12431 323050 -1289514 -574984 -2385016 -5990781 -7118812 -5701433 -5195385 -5507465 -3158768
12422 -3158768 1484012 3518399 1329258 -622605 1042326 3709967 3702465 1693860 27708
12413 27708 -1580976 -4086111 -5920524 -5486082 -4373225 -4420469 -3863291 -559138 2838386
12404B838386r53163l971421m31096N801297O559813L76918o204167p251060l252962
12395f487455J274498K649708O11490j588122l60793L102510L000548k859848
12387f57464p853404m607585L646531O542266J330283l476176j476619K342932
12379d209236P57058l728209l391091K104289N681319L986267R01151k78762j108598
12370G14188k862507l257108q02916K285107L732295L647175J903018k067179
12362C292073n294366k947681L365613N319364j18318m979571k316999K548815
12354a131070Q52137m755858m368259K870881P730241N961509L179036K737139
12346A3075756J11284o020751p892305j283898N002709J836703n037403l721939
$$ plain form
12404 2838386 1885223 -2086198 -2517294 3284003 9843816 10220734 4016567 -3234493 -6487455
12395 -6487455 -5212957 -2563249 -1951759 -3539881 -3900674 -798164 2202384 -657464
12387 -657464 -8510868 -13118453 -9471922 -2929656 -1599373 -5075549 -6552168 -4209236
12379 -4209236 -3452178 -7180387 -10571478 -8467189 -2785870 1200397 2101548 1822786 714188
12370 714188 -2148319 -5405427 -6208343 -3923236 -190941 3456234 5359252 3292073
12362 3292073 -2002293 -4949974 -1584361 3735003 3616685 -1362886 -3679885 -1131070
12354 -1131070 -278933 -5034791 -9403050 -6532169 1198072 7159581 10338617 13075756
12346 13075756 13187040 7166289 -726016 -2009914 2992795 4829498 -207905 -3929844
12338c929844M399298O652894n71729o456455l389531J873030N82959l981835
12330d821213l137277K807248N798351K736077j266620j590188O16672K197751
12322C340801J804244n18836l385731l751949m46911K671134J512604j385240
12314a59884m95199K882130J796223m224200o459076k32296O734811N336080j506443
12305C672146m077384n84329J883387l56608k743740j006183K357442K732842
12297A877573j14923k794972k719784k25033J853442O79872k510993k358332L218759
12288c094391P729128L781084n162493p876630j000627O135683N304020N83938
12280F399712L09932L599257K503581m749275j0111559o365684L428758R401190
$$ plain form
12338 -3929844 469454 7122348 6550619 94164 -3295367 -1422337 -839378 -4821213
12330 -4821213 -7958490 -5151242 647109 3383186 2116566 526378 1143050 3340801
12322 3340801 5145045 4626209 1240478 -2511471 -2958382 -287248 1225356 -159884
12314 -159884 -655083 2227047 4023270 -200930 -6660006 -6892302 -157491 5178589 3672146
12305 3672146 -405238 -989567 893820 537212 -2206528 -3212711 -855269 1877573
12297 1877573 1762650 -1032322 -3752106 -3977139 -2123697 -1443825 -3954818 -6313150 -3094391
12288 -3094391 4634737 8415821 3253328 -4623302 -5623929 511754 5815774 6399712
12280 6399712 6709644 10308901 12812482 8063207 -2048352 -8414036 -4985278 4415912
12272D415912N787192l202678q169816m735959J881454L564929p28289m647915
12264e835170l616752n2063J736513J548527J540224J837135J193040m5546n10510
12255b204602j721Q65981J726858J776038j5964k679524l502097j786886J61964
12246e659953R21919J691345K812142K290547j71437j490006j24169J076884p0329
12237A276943j015901Q17627K735813O51052m119716o300085l528015J632436
12229g849846N297534N275492K063617j085973j072861P43885K27764k505775
12221A093837k582891J098588K933571q3668k599683L8044L158758M92324m641357
12212a092477m490100L77256K720964J013105P10375L478830M266291N22593l511641
$$ plain form
12272 4415912 10203104 7000426 -1169390 -5905349 -4023895 -458966 -1187255 -5835170
12264 -5835170 -9451922 -9503985 -7767472 -6218945 -4678721 -2841586 -1648546 -1694092 -2204602
12255 -2204602 -2206323 -1340342 386516 2162554 2146590 -532934 -4035031 -5821917 -5659953
12246 -5659953 -4738034 -3046689 -234547 2056000 1884563 394557 270388 1347272 1276943
12237 1276943 261042 1078669 3814482 4465534 345818 -5954267 -9482282 -7849846
12229 -7849846 -2552312 2723180 4786797 3700824 2627963 3371848 3599612 1093837
12221 1093837 -1489054 -390466 2543105 2459437 -140246 -102202 3056556 3548880 -1092477
12212 -1092477 -5582577 -5205321 -2484357 -1471252 -760877 2717953 6984244 7506837 3995196
12203C995196l966461k333037r94542O27659K950255L830266J841205j245365
12195D705176k978291k843350j663535m88688o4466J83728J471133K697475J114925
12186B134107k163739j899053K728487M921985P24157l397153n76587M576690
12178G048894L232163l148144n885045l340879j103216k53288K829399O095008
12170E474892L512277k612704l248457K059666L628255k251293p536714o079066
12162g053144j701181J042133L060449L816213l66988o579539n518233L312222
12154i988068Q278614L497087k005513j60454L419204J522993j619357j2104J957673
12145D890075j280694m554417j663059J560882k497032p379702k136519Q435668
$$ plain form
12203 3995196 28735 -2304302 -3298844 -2671185 279070 4109336 5950541 4705176
12195 4705176 1726885 -1116465 -2780000 -3268688 -3333154 -3149426 -1678293 1019182 2134107
12186 2134107 -29632 -1928685 799802 5721787 6445944 3048791 2472204 7048894
12178 7048894 10281057 7132913 1247868 -2093011 -3196227 -3449515 -620116 5474892
12170 5474892 8987169 6374465 3126008 5185674 8813929 6562636 -974078 -7053144
12162 -7053144 -8754325 -7712192 -4651743 -835530 -1202518 -7782057 -13300290 -9988068
12154 -9988068 -1709454 1787633 -217880 -378334 3040870 4563863 2944506 2932402 4890075
12145 4890075 3609381 -945036 -2608095 -1047213 -3544245 -10923947 -13060466 -4624798
12137d624798R277761j222134q597852m228870M054235O211274L053305O73724
12129D596645P49753J088769J06432k330779m697854l863832P99075M492751K788016
12120C728976j572543k875858r25613O00601J326555K775240K706825j223768
12112D540415m597447j672783M097122M168244j531761m750262k448004k50281
12104b444757j321906j673617R59059K626382R46830n88600K54043K86199k194181
12095c150548l055462N15634M208342K987287r46982j643155J748926M107226
12087D771268J550142l480590n036784j025826L315827J647506l894458m363240
12079f516155K453859O787265Q96176p979576p414497J904183P989155N288510
$$ plain form
12137 -4624798 4652963 3430829 -5167023 -9395893 -5341658 869616 3922921 4596645
12129 4596645 5346398 6435167 6541599 4210820 -487034 -4350866 -3551791 940960 3728976
12120 3728976 2156433 -719425 -1645038 -1044437 282118 3057358 5764183 4540415
12112 4540415 -57032 -1729815 2367307 6535551 5003790 253528 -2194476 -2444757
12104 -2444757 -3766663 -5440280 -4481221 -1854839 -908009 -1496609 -1242566 -956367 -3150548
12095 -3150548 -6206010 -5690376 -1482034 1505253 558271 -1084884 664042 4771268
12087 4771268 6321410 2840820 -2195964 -3221790 94037 1741543 -2152915 -6516155
12079 -6516155 -4062296 2724969 3621145 -4358431 -11772928 -9868745 -1879590 3408920
12071C408920j67106k598700k662845j266880K288815M597748P33461n742824
12063a409411n616207J192313M637224J098084r87837L391538O776759K505480
12055A1587943l881382m729577k292851j852797j373497K389601M887370J120384
12047E855194m054309l280713O38322r1891m438028m638978L71964L974192L053311
12038b610936Q45925n92671k083687k201615J116541M402364K412662k447750
12030a159167k994641Q11058K052164o71958j045964K726332L809516j088672
12022B438668m985317j941019L004001K372890j654195j713517K482438M506271
12014D510220J601058k653847n055899n582384l799538J238424O759785P592761
$$ plain form
12071 3408920 3241814 643114 -2019731 -3286611 -997796 3599952 4333413 -1409411
12063 -1409411 -7025618 -5833305 -1196081 -97997 -1085834 2305704 9082463 11587943
12055 11587943 7706561 2976984 684133 -1168664 -2542161 -152560 4734810 5855194
12047 5855194 1800885 -1479828 -841506 -933397 -5371425 -10010403 -9638439 -5664247 -2610936
12038 -2610936 -1765011 -2357682 -4441369 -6642984 -5526443 -1124079 1288583 -1159167
12030 -1159167 -4153808 -3342750 -1290586 -1962544 -3008508 -282176 3527340 2438668
12022 2438668 -2546649 -4487668 -1483667 889223 -764972 -2478489 3949 4510220
12014 4510220 6111278 3457431 -1598468 -7180852 -10980390 -9741966 -2982181 4610580
12006D610580L362644l23002J38780J454983p05812m487008m278633J170790O465040
11997G408362N532506j729104q954400r234049k253921M873716N625244K015589
11989C283943R81936L274552K066337n019646r578966m226246M921562O336600
11981B040072K66160k699267O63953J999838k511394m278159K577111Q943218
11973G001532L932286p064510r631180j762911M426900J923949k182263J55990
11965c200207N504886N099684k431268r791015r816631k380016N953173P861540
11957c199854K347852m141153n216729j574455J949372L529183M240481L504071
11949A438768M40717k017061o70351J605363j69234l843288k626964L278019N909987
$$ plain form
12006 4610580 7973224 7650222 7789002 9243985 8538173 4051165 -227468 943322 7408362
11997 7408362 12940868 11211764 2257364 -6976685 -9230606 -4356890 1268354 3283943
11989 3283943 4265879 7540431 9606768 4587122 -4991844 -9218090 -4296528 2040072
11981 2040072 2306232 -393035 270918 2270756 -240638 -4518797 -1941686 7001532
11973 7001532 10933818 3869308 -5761872 -7524783 -3097883 -1173934 -3356197 -3200207
11965 -3200207 2304679 7404363 4973095 -4817920 -14634551 -17014567 -11061394 -3199854
11957 -3199854 -852002 -4993155 -10209884 -11784339 -9834967 -6305784 -2065303 1438768
11949 1438768 1879485 -137576 -807927 797436 628202 -3215086 -5842050 -2564031 3345956
11940C345956J787384l115757l012462L80804K878502L423878J972430j699203
11932E961532m533629k140439L413598M766768N37011k492281j313040j677793
11924B521727o511897q707940k418280O350651Q300209L680094j068522l634010
11916a487968m849001k832556L157404P188993L648374l321890n361975j908362
11908e766981J202828K143394L569430M809693K352597k587531m828441l234867
11900b339878j101893O04087L288415M865423J516053m552407o385144k150841
11892f256185K683302L768672K397923R82236l9462q127J643800K359957p21545
11883F810571m733502l923072J072350L370231L61303k685786j576761Q13003
$$ plain form
11940 3345956 5133340 2017583 -994879 -614075 2264427 5688305 7660735 5961532
11932 5961532 1427903 -712536 2701062 7467830 8004841 5512560 4199520 2521727
11924 2521727 -3990170 -12698110 -15116390 -8765739 -465530 3214564 2146042 -1487968
11916 -1487968 -6336969 -9169525 -6012121 1176872 4825246 1503356 -3858619 -5766981
11908 -5766981 -4564153 -2420759 1148671 5958364 8310961 5723430 894989 -2339878
11900 -2339878 -3441771 -2837684 450731 5316154 6832207 2279800 -4105344 -6256185
11892 -6256185 -3572883 195789 2593712 3575948 3536486 3528359 5172159 7532116 6810571
11883 6810571 2077069 -1846003 -773653 2596578 2957881 272095 -1304666 -491663
11875d91663O22156o24666L43540K769652L568042J932931o52078k713462l200287
11866A554165j955758r34509k176103l845338j873066L407072O371528L764738
11858D312729o57688j755348R3163R25666m10132j402161m55647Q14773L42031
11849A807386j188363j147962J180498K854976R36267k658325k856160J266088
11841A94405M382833K203861k668230n178218m549116k656160O31250N183447
11833b455928O849033K513022l075755k640415K432627L747442j153061n331440
11825H85525l515607R18555K911880K886743L030184K178214q68924l252981k139555
11816C034034O9976r14947m637004o514786m088207L97059L194657K818508Q47804
$$ plain form
11875 -491663 130493 -494173 -150633 2619019 6187061 8119992 7467914 4754452 1554165
11866 1554165 -401593 -1336102 -3512205 -7357543 -9230609 -5823537 547991 4312729
11858 4312729 3655041 1899693 1992856 2918522 2508390 1106229 650582 1465355 1807386
11849 1807386 619023 -528939 651559 3506535 4442802 1784477 -1071683 194405
11841 194405 4577238 6781099 4112869 -1065349 -5614465 -8270625 -7639375 -2455928
11833 -2455928 4393105 6906127 3830372 1189957 3622584 7370026 6216965 885525
11825 885525 -2630082 -1711527 1200353 4087096 7117280 9295494 8426570 5173589 3034034
11816 3034034 3104010 2189063 -2447941 -8962727 -13050934 -12653875 -9459218 -6640710 -5792906
11807e792906L763J159182K379296J772432K91094j50638o0305j067071k389640
11798c854793k069593q26779p57784r67794R69128L676876L297964K90823p10225
11789i52177J282605J845135r50501k795876l68691K988540K725764p8128j620466
11780B076205j691271k464127l293086j506768K324112M023498J404648k452948
11772a579737k948550J15741K107603k54406l923260l485040N80054K324366J64152
11763f899077L8158M885871P714941K234822n273897m325658L250401O270036
11755G895597J989478j218858M33458M91962m398638p522187l960898R69360J496187
11746c824539L89092J593362K630507J420314K108952O204998O380801j579298
$$ plain form
11807 -5792906 -5789143 -4629961 -2250665 -478233 -187139 -337777 -398082 -1465153 -3854793
11798 -3854793 -5924386 -6751165 -7508949 -8476743 -7507615 -3830739 -532775 -241952 -952177
11789 -952177 330428 2175563 1225062 -1570814 -1939505 1049035 3774799 3696671 2076205
11780 2076205 384934 -2079193 -5372279 -6879047 -4554935 -531437 873211 -1579737
11772 -1579737 -4528287 -4412546 -2304943 -2559349 -6482609 -9967649 -9387595 -7063229 -6899077
11763 -6899077 -6860919 -1975048 5739893 7974715 2700818 -1624840 1625561 7895597
11755 7895597 9885075 8666217 9099675 9591637 5192999 -2329188 -6290086 -5320726 -3824539
11746 -3824539 -3435447 -1842085 788422 2208736 4317688 10522686 16903487 15324189
11738A5324189q494420m439104M634888N213995l018801p738483l673312J204002
11730i87046M24336j817101j64100K555887J104546l009122l808069M24332M894626
11721c81711M352223n91934l996944j896029K110012J624249k731593l804123
11713e315850N30750L446818N97751k114774J369222O220111M339411k051398
11705G022041m089516l36916K584923J657073K74315N2695j216878l254416k992210
11696b98889q74251j64343l26379J497146L364087J189155k407444j254124K737004
11687C461962J531316m606777n976278M95012N358620J709624m159678l682739
11679e868938J105470L074035J541235O22382R93384N09782k79376P01429K609146
$$ plain form
11738 15324189 6829769 2390665 7025553 12239548 9220747 1482264 -2191048 -987046
11730 -987046 -562710 -2379811 -2543911 11976 1116522 -1892600 -5700669 -5276337 -381711
11721 -381711 3970512 3378578 -618366 -2514395 -404383 1219866 -1511727 -5315850
11713 -5315850 -4785100 -1338282 -740531 -2855305 -1486083 4734028 9073439 7022041
11705 7022041 2932525 2595609 5180532 6837605 7111920 7164615 5947737 2693321 -298889
11696 -298889 -1173140 -1337483 -1663862 -166716 3197371 4386526 1979082 724958 3461962
11687 3461962 4993278 386501 -5589777 -5094765 263855 1973479 -2186199 -5868938
11679 -5868938 -4763468 -1689433 -148198 474184 1467568 1977350 1697974 2399403 5008549
11670E008549K804841N10284l107313n803972m392816J456083N416189J349270
11662C241115n585779m026475N387815Q597928l7847p355464j903846P360072
11654E677519N883487k879453m695826J148138K645716k494446l771292J386654
11646B900497K003740n961297j0135735j759109Q623997P124980k176402m924239
11638d303568J234632N549171K331568k459488l052270j520850j204998q85911
11630d311714R91784K400802J572199L74763Q29660J711828J297694N94393J211287
11621F672696K200615J456167j060577l183171k758060N09932M036878L494638
11613A1369118k329935p925317o288216J318673N632134J785830l727976k804036
$$ plain form
11670 5008549 7813390 8323674 5216361 -587611 -4980427 -3524344 1891845 3241115
11662 3241115 -2344664 -6371139 -983324 7614604 7576757 221293 -1682553 5677519
11654 5677519 11561006 8681553 3985727 5133865 7779581 5285135 1513843 2900497
11646 2900497 4904237 -1057060 -11192795 -12951904 -4327907 2797073 620671 -4303568
11638 -4303568 -3068936 2480235 4811803 2352315 -699955 -2220805 -3425803 -4311714
11630 -4311714 -3319930 -919128 653071 1027834 1857494 3569322 4867016 5461409 6672696
11621 6672696 8873311 10329478 9268901 6085730 3327670 3837602 7874480 11369118
11613 11369118 9039183 1113866 -5174350 -3855677 1776457 3562287 -165689 -2969725
11605b969725K339988L441264p50027l580674j768879O23339O00103O58717K000002
11596E94108Q28649m042643o484738j925513M271955M159392q75202k933934O7612
11587f340314K665508J638250k3435L11413J055421Q16858J068369K404622K871637
11578F468329J918205J695652K641572J968350j508373m933185n744958m860638
11570b355046l853825k611493j382809j327702j442111R49544M944807N843240
11562a235395K281910j207755j342154o31541j453635j045686K811391N894144
11554D071279L207337k799736n543058l415940j76378J578171J952311P65009
11546c61005j543582j793774J708855M690944K473978j936796k096611J078080
$$ plain form
11605 -2969725 -629737 2811527 2061500 -1519174 -3288053 -2664714 -2064611 -1405894 594108
11596 594108 1422757 -2619886 -9104624 -11030137 -6758182 -2598790 -3473992 -6407926 -6340314
11587 -6340314 -3674806 -2036556 -2059991 -1748578 -693157 123701 1192070 3596692 6468329
11578 6468329 8386534 10082186 12723758 14692108 13183735 8250550 2505592 -2355046
11570 -2355046 -6208871 -8820364 -10203173 -11530875 -12972986 -12023442 -7078635 -1235395
11562 -1235395 1046515 -161240 -1503394 -2134935 -3588570 -4634256 -1822865 4071279
11554 4071279 7278616 4478880 -1064178 -4480118 -4656496 -3078325 -1126014 -361005
11546 -361005 -1904587 -3698361 -1989506 2701438 5175416 3238620 1142009 2220089
11538B220089P73613l626148m747001N38675N616355M649882R95058l1232j44747
11529F244544l207493o303741l505649L779015P651463M615446o12900k825804
11521E834881k357893j832681j574613q33492k68425m42651o7045J709016L024684
11512C191781J975782J33913K55215J243752p34068n494844p282978k401390M830175
11503d282662P310303M123451P6235k112099l852947n280459l916563k16975J469856
11494f681860J73562P39994N217796P712013L350998k902173l513426k57621m05253
11485C434030l835275l622247J180687L403329o441l057636j288251J270409K00061
11476b321334j680303j74950K909823L756483K783527J749051m30330l779991
$$ plain form
11538 2220089 2993702 -632446 -5379447 -4840772 775583 5425465 6420523 6389291 6244544
11529 6244544 3037051 -3266690 -6772339 -2993324 4658139 9273585 8660685 5834881
11521 5834881 3476988 1644307 69694 -763798 -1032223 -1474874 -1541919 167097 3191781
11512 3191781 5167563 5301476 5556691 6800443 6066375 571531 -6711447 -9112837 -4282662
11503 -4282662 3027641 7151092 7227327 5115228 1262281 -4018178 -7934741 -8151716 -6681860
11494 -6681860 -6508298 -5768304 -550508 7161505 10512503 7610330 4096904 3839283 3434030
11485 3434030 -401245 -4023492 -2842805 560524 554083 -2503553 -3791804 -2521395 -2321334
11476 -2321334 -4001637 -4176587 -1266764 2489719 5273246 7022297 6591967 2811976
11468B811976m240362k21781K744711J54657l476221j786138K801816L665734
11460B454392J319339J087363K296312j94802m956398m922511K19770K794100
11452I7565K0412j843212P64436K603499j38101k525238P9254L302170J288738
11443C649523l036987k924311J202360L213315J103935j417374j612187l12949
11435a34675J007201J235991q03683l962792m310899r11943J247324j243766l705701
11426a1582943n66528M481265L395048l158141o231507j895843M098521N867404
11418e592724L895103N48516l220776m518239L29302P937540Q809822O42711o472671
11409B358584l899096L059726L791730j825390n039150k534177L01431k7539k06297
$$ plain form
11468 2811976 -1428386 -1650167 1094544 1249201 -2227020 -4013158 -1211342 2454392
11460 2454392 3773731 4861094 7157406 6962604 2006206 -2916305 -2696535 97565
11452 97565 117977 -1725235 -960799 1642700 1504599 -1020639 -941385 2360785 3649523
11443 3649523 612536 -2311775 -1109415 2103900 3207835 1790461 178274 -134675
11435 -134675 872526 2108517 1304834 -2657958 -6968857 -7880800 -6633476 -7877242 -11582943
11426 -11582943 -12149471 -7668206 -4273158 -7431299 -13662806 -15558649 -11460128 -5592724
11418 -5592724 -1697621 -1149105 -4369881 -8888120 -8558818 -621278 8188544 8831255 2358584
11409 2358584 -1540512 1519214 5310944 3485554 -1553596 -4087773 -3786342 -3813881 -4020178
11400d020178K201348L568440M50650m153513m982780j774745J462989K519231
11392d728558K792968L652960L920846J882372j458148k576876L12318L860647
11384G658529K734701k964379o396231k835626K994440L223982j196015j479865
11376A739536N181160J0068910N248170m528817q522131m821119r92785j420154
11368A952770k102052N77289L312696J877307j847145l510028k971681k408493
11360e119337r99130K761414N614273K937290k968430m682171o42847K360721
11352g38217P4492k424878O93704N988127N523498j217384o539319m947076P61707
11343b825346M080375J802585l722334o803047l580934K967991N316899J147167
$$ plain form
11400 -4020178 -1818830 1749610 2200260 -1953253 -6936033 -8710778 -7247789 -4728558
11392 -4728558 -1935590 1717370 5638216 7520588 6062440 3485564 3797882 7658529
11384 7658529 10393230 7428851 1032620 -1803006 1191434 4415416 3219401 1739536
11376 1739536 6920696 16989606 22237776 17708959 9186828 4365709 3372924 1952770
11368 1952770 -149282 428007 3740703 5618010 3770865 260837 -2710844 -5119337
11360 -5119337 -6118467 -3357053 2257220 5194510 2226080 -2456091 -3098938 -738217
11352 -738217 -663725 -3088603 -2394899 3593228 9116726 7899342 1360023 -3587053 -2825346
11343 -2825346 1255029 3057614 -664720 -7467767 -11048701 -8080710 -2763811 -1616644
11335a616644k843983j008141K073959n94391n615883m075098K831822M888448
11327e959911L17354q34826N262901Q162385R08283o423685k408710O325464N538684
11318A0887939l366903o442375o63752K373170k530060n564788L64026P155351
11310B212608M985862k386801n273322l191056k410880l634001k092830K595416
11302i195004N499688M546274K455561P03589k183090n807575o694719l144228
11294a3819504K279848N794202N421514J492770l122962m198696n56580L661682
11286c047726M049062J806491J132028K402194K344028J8273k124980k906890
11278C672480l439681l362618q97043K619559L076588j43673k704117j784064
$$ plain form
11335 -1616644 -4460627 -5468768 -3394809 -3989200 -9605083 -13680181 -10848359 -5959911
11327 -5959911 -5642557 -6477383 -1214482 6947903 7856186 1432501 -976209 5349255 10887939
11318 10887939 7521036 1078661 414909 2788079 258019 -5306769 -4942743 2212608
11310 2212608 7198470 4811669 -461653 -3652709 -6063589 -9697590 -11790420 -9195004
11302 -9195004 -3695316 850958 3306519 4010108 1827018 -3980557 -10675276 -13819504
11294 -13819504 -11539656 -5745454 -323940 1168830 -1954132 -6152828 -6709408 -3047726
11286 -3047726 1001336 2807827 3939855 6342049 8686077 8704350 6579370 3672480
11278 3672480 232799 -3129819 -4026862 -1407303 1669285 1525612 -1178505 -2962569
11270b962569L36586J133119J778598L453593L912285J344853j710351k174873
11262E111241j340117j928616k681704m79222L592118M937567J848119k727909
11254F331477n660675o311594m805685j275216K602315M310455L402018J504208
11246I7303l78807k077743k468340p13991J221587R40103n5240J299286L451023
11237A315181J965198k163586k586670J993470M581082R08668l257289j603020
11229A153034K213560J185790k848693k904100L02732m03202n161844n567505
11221a2030228J244295O919328M567365j260933k793850k87575J326273J477132
11213h38193K487030K870864n24915n514086o300308j797461K965211L653417
$$ plain form
11270 -2962569 -2625983 -1492864 285734 3739327 7651612 8996465 7286114 5111241
11262 5111241 3771124 1842508 -839196 -1318418 2273700 7211267 9059386 6331477
11254 6331477 670802 -5640792 -10446477 -11721693 -9119378 -4808923 -1406905 97303
11246 97303 -281504 -2359247 -4827587 -5541578 -4319991 -3379888 -3435128 -2135842 1315181
11237 1315181 3280379 1116793 -1469877 523593 5104675 6013343 2756054 1153034
11229 1153034 3366594 4552384 1703691 -1200409 -897677 -1300879 -6462723 -12030228
11221 -12030228 -10785933 -3866605 700760 -560173 -3354023 -3641598 -2315325 -838193
11213 -838193 1648837 4519701 3994786 -1519300 -7819608 -9617069 -6651858 -2998441
11205b998441P60817k638103l608516n25740M899864P506021M072519j900503
11197E567918m154443j533767J555016J661745l87141k203963k490545j210883
11189c196063K56376m9704j511253p09200K841355L947420q42313o297634n035313
11180a0596329J365914M820247K921346Q34024J175125M37416k927187m909644
11172f879088l195190p84620O01310L400630O935517N149743l062531q605932
11164f440161m207621M280736O359700J839404j233185j02874O64379p16100n49742
11155a05464K060579K539101j224118n014781n157363l491154k504461q44209
11147a3741870K508584M137902J081062l147442k517946K796777O370183M276494
$$ plain form
11205 -2998441 -2237624 -4875727 -8484243 -9009983 -4110119 3395902 7468421 5567918
11197 5567918 1413475 -120292 1434724 3096469 2709328 505365 -1985180 -3196063
11189 -3196063 -2939687 -2989391 -4500644 -5209844 -2368489 1578931 736618 -5561016 -10596329
11180 -10596329 -9230415 -4410168 -1488822 -654798 520327 957743 -1969444 -6879088
11172 -6879088 -10074278 -10858898 -10257588 -6856958 78559 5228302 2165771 -6440161
11164 -6440161 -10647782 -6367046 -7346 1832058 598873 495999 1160378 444278 -105464
11155 -105464 1955115 4494216 3270098 -1744683 -6902046 -10393200 -12897661 -13741870
11147 -13741870 -11233286 -7095384 -6014322 -9161764 -11679710 -8882933 -2512750 1763744
11139A763744j52879j568265N24281K277440J040667k078809m498216m662039
11131g354076k234243J866528M850493L766849n92345l481439j990829Q53501
11123d315561O09363j745743j521670K007326M446237L263770J032357J23207
11115C899286j034172l674204m969746k341905J666579K812640J192146N5824
11107b393552L89781M81241l07645q54853o28809J40477J678139L429032L012268
11098D946079n78962m076155l544522J61959K875213K997051K261966J431280
11090F473909n95817l225527l688816j143726J757826K429940J106982o13609
11082B501162j679971j418227L30642K113733J729910j024210l763212m066314
$$ plain form
11139 1763744 1610865 42600 566881 2844321 3884988 1806179 -2692037 -7354076
11131 -7354076 -9588319 -7721791 -2871298 895551 303206 -3178233 -5169062 -4315561
11123 -4315561 -3706198 -5451941 -6973611 -4966285 -520048 2743722 3776079 3899286
11115 3899286 2865114 -809090 -5778836 -8120741 -6454162 -3641522 -2449376 -2393552
11107 -2393552 -2003771 -1522530 -1830175 -2685028 -3313837 -3173360 -1495221 1933811 4946079
11098 4946079 4367117 290962 -3253560 -3091601 -216388 2780663 5042629 6473909
11090 6473909 5878092 2652565 -1036251 -2179977 -422151 2007789 3114771 2501162
11082 2501162 821191 -597036 -266394 1847339 3577249 2553039 -1210173 -5276487
11074e276487j638030J892841M191137L665041R77042j298531j480653m09188
11066F23172M79749J032898J153204j04281k373669l212229j683079j85298k18835
11057d488368N30002L433851M742421J068811l855571l915480r2596J493868r2287
11048a175349K73126L980498N663203K001585l219476n615682n712371m925075
11040h729541j948037L018979N698555L687552N46231j31737k20274k151877l143177
11031c373326J0455M126866L982487Q11445j62300J060945l83213m930894o765462
11022e622997k843244K272771L264803J075681n0155R46070J804980J187054k5092
11013B009871o89482m92367L58791J129106Q69573k89008r53975l83383M06043
$$ plain form
11074 -5276487 -6914517 -5021676 -830539 2834502 3811544 2513013 1032360 623172
11066 623172 1102921 2135819 3289023 3184742 811073 -2401156 -4084235 -4269533 -4488368
11057 -4488368 -3958366 -524515 4217906 5286717 1431146 -2484334 -2576930 -1083062 -1175349
11048 -1175349 -902223 3078275 8741478 10743063 7523587 1907905 -3804466 -8729541
11040 -8729541 -10677578 -7658599 -1960044 1727508 2273739 2142002 1921728 -230149 -3373326
11031 -3373326 -3362871 763995 4746482 5557927 5395627 6456572 6073359 1142465 -5622997
11022 -5622997 -8466241 -6193470 -2928667 -1852986 -1903141 -957071 847909 2034963 2009871
11013 2009871 1320389 828022 1186813 2315919 3185492 2896484 1942509 1559126 1965169
11004A965169L05408j66326J32863J135368J855489J776344Q60939j005534l190871
10995C668849l632676r15534K979655M075759J327108j709956j567422L59559
10987D585342K3690l080208m892784k571784J421221K763049Q72913j223023j473426
10978c575010o43322Q0124O71858J000729L68748o59913j23539K054031K584219
10969A757925q88294n209634m804796M45896M097637J861059j929217n01747M765486
10960d05685N695294k48465n185568k046500M649301N179340j298464o149356
10952A89897m027084R27186K928312K063078J201355P69626M8872m37812q65997
10943B797433k578666m143617j678608L913318N665297R04914k937849R44282
$$ plain form
11004 1965169 2270577 2104251 2237114 3372482 5227971 7004315 7865254 6859720 3668849
10995 3668849 36173 -879361 2100294 6176053 7503161 5793205 4225783 4585342
10987 4585342 4609032 1528824 -3363960 -5935744 -4514523 -1751474 -878561 -2101584 -3575010
10978 -3575010 -4218332 -4138208 -3466350 -2465621 -2096873 -2756786 -2880325 -826294 1757925
10969 1757925 869631 -4340003 -9144799 -8698903 -4601266 -2740207 -4669424 -5171171 -405685
10960 -405685 5289609 5041144 -144424 -2190924 2458377 7637717 6339253 189897
10952 189897 -3837187 -2910001 18311 2081389 3282744 4052370 4101242 3663430 2797433
10943 2797433 218767 -3924850 -5603458 -1690140 3975157 4880071 1942222 2886504
10935B886504P433735O803207m88041n352223m372328k885298l825551l244503
10927c044498P02046K962571n2716l999981l230853R68446L306338K066564l78434
10918g00517k007980k397680j224959J381185L745949L841925J358091j841042
10910B154972k872802l55640L096501K846949j278064l448552j76902L560120
10902C526582J976509j630256n72075K597317k92669p266580o434178M678241
10894c417109J2148471N113141p667701j0128824r27095P109143N648999j043519
10886F835506n467878n562482l108213o2582J653044Q52795j065998j485054l1473
10877g442335J262729Q54827q36648k084205j023087K433894N439373N143842
$$ plain form
10935 2886504 10320239 17123446 16635405 11283182 6910854 4025556 200005 -3044498
10927 -3044498 -2342452 620119 567403 -3432578 -6663431 -5694985 -2388647 -322083 -700517
10918 -700517 -2708497 -5106177 -6331136 -4949951 -1204002 2637923 3996014 2154972
10910 2154972 -717830 -1073470 2023031 4869980 3591916 143364 -33538 3526582
10902 3526582 5503091 3872835 3300760 5898077 5605408 -1661172 -8095350 -3417109
10894 -3417109 8731362 13844503 6176802 -3952022 -4879117 2230026 7879025 6835506
10886 6835506 1367628 -4194854 -7303067 -7365649 -5712605 -4859810 -5925808 -7410862 -7442335
10877 -7442335 -6179606 -5324779 -6161427 -8245632 -9268719 -6834825 -1395452 3748390
10869C748390K701684J165358K2885l163954o032328l425876K693767L746455
10861A456381j867371m661079J038553P027933L942033l738462n255329l76843
10853b434184K257591Q4337j072984J640122M297088L737758Q64611l147078o643587
10844d16326n123195K811565R044983M895564m824762p204536m46146L945869
10836B683016j38673m721105k119944L235054M032141J811262J612903K129487
10828H524141m45595l867407l235800L87685J892941K94011j221988j439187j556427
10819f67626j075901J258232L417263K099845j624375l248595j413678N11499
10811g43336j28616j812341j843339j69640J171877R77873J7074m48993n48947
$$ plain form
10869 3748390 6450074 7615432 7638317 4474363 -1557965 -4983841 -2290074 1456381
10861 1456381 -410990 -5072069 -4033516 2994417 6936450 3197988 -2057341 -2434184
10853 -2434184 -176593 -92256 -1165240 474882 4771970 8509728 9374339 6227261 -416326
10844 -416326 -5539521 -2727956 6317027 11212591 6387829 -816707 -1262853 2683016
10836 2683016 2544343 -2176762 -4296706 -1061652 2970489 4781751 6394654 8524141
10828 8524141 8078546 4211139 975339 1363024 3255965 3549976 2327988 888801 -667626
10819 -667626 -1743527 -485295 2931968 5031813 3407438 158843 -1254835 -743336
10811 -743336 -871952 -2684293 -4527632 -4697272 -3525395 -2547522 -2530448 -2979441 -3528388
10802c528388j373965k377654r36025L469136O337822L278397k602230l521273
10794a254180J817803N517262J790512m386061m711167M64213L766824K199048
10786E204254J67176J098847K337577N33018k604403l173890r10421J070128R88300
10777D710586J12302J36979J003635J646740J525574Q07112k91030j713448l148744
10768D789706l685937k318558P10966L192126K587751q99318l710806k656603
10760a990673J147356L682013L259767K112890K109678J670017j015566m138669
10752F836813m751087l402288k681952k306735R5537L740661M927919L002816
10744E461684J382667J576070J002402j553657l240277k269917r91019j043319
$$ plain form
10802 -3528388 -4902353 -7280007 -8216032 -4746896 1590926 4869323 2267093 -1254180
10794 -1254180 563623 6080885 7871397 3485336 -1225831 -761618 3005206 5204254
10786 5204254 5371430 6470277 8807854 9340872 6736469 3562579 2652158 3722286 4710586
10777 4710586 4822888 4959867 5963502 7610242 9135816 9942928 9651898 7938450 4789706
10768 4789706 1103769 -1214789 -503823 2688303 5276054 4376736 665930 -1990673
10760 -1990673 -843317 2838696 6098463 8211353 10321031 11991048 10975482 6836813
10752 6836813 2085726 -1316562 -3998514 -6305249 -6209712 -2469051 2458868 5461684
10744 5461684 6844351 8420421 9422823 7869166 4628889 2358972 1367953 324634
10736C24634k68344K250852L072093M04537j708227q9589J536598r22319l882345
10727G17890j658602L409574M297219O01882j577531j16509Q13520q52540j919833
10718C715070m61356J104049J062383P53542M73568j405396l848348l292043k7921
10709a926452J109478j423581k761224P35735N431340N604622J308027k564725
10701E513220l097377k190792l074215n587029n543491K29746Q154437J0248995
10693D653494M186155k698529l041734Q05938J842158m94324j246182M81520O99749
10684E188245j537040k885140k289562j793414r30291K522220O233468N241662
10676I750148M68311k197436j526678j653567k912351j018710L364777L726979
$$ plain form
10736 324634 56290 2307142 5379235 5783772 4075545 3985956 5522554 4600235 717890
10727 717890 -940712 2468862 6766081 7367963 5790432 5673923 6487443 5634903 3715070
10718 3715070 3253714 4357763 5420146 6173688 6647256 5241860 1393512 -1898531 -1926452
10709 -1926452 -816974 -2240555 -5001779 -4266044 1165296 6769918 8077945 5513220
10701 5513220 2415843 225051 -2849164 -8436193 -13979684 -13749938 -5595501 4653494
10693 4653494 8839649 6141120 3099386 3905324 5747482 5253158 4006976 4488496 5188245
10684 5188245 3651205 766065 -1523497 -3316911 -4247202 -1724982 4508486 9750148
10676 9750148 10218459 8021023 6494345 4840778 1928427 909717 4274494 8001473
10668H001473j189948m518503k520069J73523n8909j31318K086393L094453J156608
10659F093703N0957J089262q9540m247014n127003n63843K246036j292410n098843
10650f938695l171151O72427J442748K260982O160480P334858Q12325o615266
10642A958708o000525m54599J218535o81796O5916K527942J093195k281319o83965
10633c237908M686374N853592J640842j263689o19357j127281l936939m087111
10625b091477k22928K376735P64706j553603j407155J39466J948094M086994M236349
10616H277181j03220n206350m438188J128750L290079n89042l632101q91818L173949
10607A009240K785222k32785n93818K136574M197064L520195J102406j405338
$$ plain form
10668 8001473 6811525 2293022 -227047 -53524 -112433 -243751 1842642 4937095 6093703
10659 6093703 6144660 7233922 7144382 2897368 -2229635 -2793478 -547442 -1839852 -6938695
10650 -6938695 -10109846 -9437419 -7994671 -5733689 426791 7761649 8573974 1958708
10642 1958708 -4041817 -4496416 -3277881 -3959677 -3893761 -1365819 -272624 -2553943 -3237908
10633 -3237908 1448466 7302058 8942900 7679211 7059854 5932573 1995634 -2091477
10625 -2091477 -2314405 62330 827036 -726567 -2133722 -1994256 -46162 4040832 8277181
10616 8277181 8173961 2967611 -1470577 -341827 2948252 2359210 -1272891 -2164709 1009240
10607 1009240 3794462 3561677 2967859 5104433 9301497 12821692 13924098 12518760
10599A2518760k721619k221229r15955n60796j053508p70933K30369j7043j912456
10590B575590l198552k118924M29713K413712K642571J201563n57622p97630P18419
10581C308840K172253K448511K656687L381582K654158j007924n417974p066334
10573C129799n312299k379283n56931n78467j042411Q96819N666104Q534271M959745
10564A3317347j661912l381890Q07571L801331J892692n63928m23236r85383m022007
10555H780585n115324j947543P61381k34552j213636M19239J063872p39574j73171
10546A601277L821931M369601r42821m144763n92168K798648R25197m13176K244911
10537I668637J559282n165398p032279J184274O664964N51702m487299K908594
$$ plain form
10599 12518760 9797141 7575912 6659957 6099161 5045653 4274720 4505089 4488046 2575590
10590 2575590 -622962 -2741886 -2312173 101539 2744110 3945673 3388051 2590421 3308840
10581 3308840 5481093 7929604 10586291 13967873 16622031 15614107 10196133 3129799
10573 3129799 -2182500 -4561783 -5118714 -5697181 -6739592 -5842773 -176669 8357602 13317347
10564 13317347 11655435 8273545 9081116 12882447 14775139 14211211 13787975 12802592 8780585
10555 8780585 3665261 1717718 2479099 2244547 1030911 1450150 2514022 1774448 1601277
10546 1601277 5423208 9792809 8849988 4705225 4113057 6911705 7836902 7423726 9668637
10537 9668637 11227919 6062521 -969758 214516 6879480 7431182 2943883 5852477
10529E852477R645309O19945j1650062o826078O856645O047681p140366r771841
10521f366290J960448R290211N371186K282956L698801O31454m743426o82026
10513A1443314P759359L955917p951331p482879M442044O079807m656255o623919
10505F966057L530832N285201m506266m693992P463447R298042j467790R8835
10497B1974366J4941166J2997992o781837p030842J5678133J5572765j2420861
10490E4930882m543314N5019351O9157708l3417024j57501852j50815934k1009036
10483a88179219P5494411N5339357j497176m315564K1761909J5036855j1168831
10476c7528258r481010J1662006J2472033l559533m565753P346058O196215n005247
$$ plain form
10529 5852477 15497786 16117731 4467669 -2358409 4498236 10545917 3405551 -6366290
10521 -6366290 -4405842 4884369 10255555 12538511 16237312 16868766 12125340 11443314
10513 11443314 19202673 23158590 15207259 7724380 12166424 18246231 13589976 6966057
10505 6966057 10496889 15782090 11275824 6581832 14045279 23343321 21875531 21974366
10497 21974366 36915532 49913524 43131687 36100845 51778978 67351743 54930882
10490 54930882 50387568 105406919 174564627 141147603 -16354249 -167170183 -188179219
10483 -188179219 -112684808 -57345451 -58842627 -63158191 -41396282 -26359427 -37528258
10476 -37528258 -47009268 -35347262 -22875229 -26434762 -31000515 -23654457 -17458242 -22463489
10468b2463489l055803Q210386O201277n772135n170476O406876O858631m563685
10460a3348418o964307K958198O817906o9272k136913M952706O605110j954316
10452c139306o391492N38590P086339M215020j084865j532125j000047l178190
10444d486076l917646j245725q1117j917955j466750K570567M335095J447677
10436d761930j410666j612530j478419j095308J738742M115040J048204m163539
10428g620406l685832J023039J294486k616757j024866P407954J1227866M189813
10420A0195297m837188o249928l098173k640076l625673p84354M057465M159642
10412b822988j338353n602082k955335M212667Q001534L653027m431060o923874
$$ plain form
10468 -22463489 -25519292 -17308906 -11107629 -16879764 -22050240 -15643364 -8784733 -13348418
10460 -13348418 -20312725 -17354527 -10536621 -10605893 -12742806 -7790100 -1184990 -3139306
10452 -3139306 -9530798 -8992208 -1905869 2309151 1224286 -307839 -1307886 -4486076
10444 -4486076 -8403722 -9649447 -9730564 -11648519 -13115269 -10544702 -6209607 -4761930
10436 -4761930 -6172596 -7785126 -9263545 -10358853 -8620111 -4505071 -3456867 -7620406
10428 -7620406 -11306238 -10283199 -8988713 -11605470 -12630336 -5222382 6005484 10195297
10420 10195297 5358109 -891819 -3989992 -6630068 -10255741 -11040095 -6982630 -2822988
10412 -2822988 -4161341 -9763423 -12718758 -8506091 -504557 3148470 -1282590 -8206464
10404h206464j160151M732988K650613m273397o680789k137411L457525N597264
10396f019822M981934K546381j820482n307930l856690J194218M049722K847398
10388a385271J502554K407097K836212O1575m425043p139506o006943j540478
10380a3689803K786375K867161m70304j155278L182198O234542K415628l472697
10372a302178l393350J240846K959580J102569J095308K717324K54460n535139
10364h60580o779057j692534K015974j5059k219347N69319M777645M842801J270673
10355A909835k442466m783368m479772o6903N237106M693119j928154n829409
10347g690012j263469N856224O690813J650774k069863j387419K39834n74474
$$ plain form
10404 -8206464 -9366615 -4633627 -1983014 -6256411 -12937200 -15074611 -11617086 -6019822
10396 -6019822 -1037888 1508493 -311989 -5619919 -9476609 -8282391 -4232669 -1385271
10388 -1385271 117283 2524380 5360592 5422167 997124 -6142382 -12149325 -13689803
10380 -13689803 -10903428 -8036267 -8506571 -9661849 -6479651 -245109 2170519 -1302178
10372 -1302178 -4695528 -3454682 -495102 607467 1702775 4420099 4674559 -860580
10364 -860580 -7639637 -9332171 -7316197 -7331256 -9550603 -8981284 -4203639 639162 1909835
10355 1909835 -532631 -5315999 -9795771 -9862674 -4625568 67551 -1860603 -7690012
10347 -7690012 -8953481 -3097257 3593556 5244330 3174467 1787048 2026882 1452408
10339A452408l011996m164576k506502M84234J420393r89071l387532j775666
10331a2478308K648474N144378M021471J367148j485255l870355k728733L384984
10323c996196Q195332M055798n362328q190409j819899L021421q12387o407940
10315a1316608n070424N96451L556924M056354N603874N839729J044027m839002
10307e28675n096127j018005R48544K15421J442788M603775M520251J44485l664980
10298A567477m215216l700921l084039l20454L599047L581464j455616m875438
10290h903696r12664O667051R083655M074571j560847j477272J895052J513435
10282A0379285l540208o367413k821259J425356o38207n679324m538521L011405
$$ plain form
10339 1452408 -1559588 -5724164 -8230666 -7746432 -6326039 -7315110 -10702642 -12478308
10331 -12478308 -9829834 -4685456 -663985 703163 -782092 -4652447 -7381180 -3996196
10323 -3996196 4199136 8254934 2892606 -5297803 -7117702 -4096281 -4908668 -11316608
10315 -11316608 -16387032 -15790581 -12233657 -8177303 -2573429 3266300 4310327 -528675
10307 -528675 -5624802 -6642807 -5694263 -5478842 -4036054 567721 5087972 5232457 1567477
10298 1567477 -2647739 -6348660 -9432699 -9753153 -6154106 -2572642 -4028258 -8903696
10290 -8903696 -9816360 -3149309 5934346 10008917 8448070 6970798 8865850 10379285
10282 10379285 6839077 471664 -2349595 -924239 -1562446 -7241770 -11780291 -8768886
10274h768886P237935L471429j442209j413770k96498k626173m008578N44001
10266g302749N668947L391430k934680l509159J732755L342496j512801m511625
10258e635386k02435N357523M534087p80016l350470j002047K181850K390465
10250C493571M8384j665989n18565J914384J537917k526068n409024k974757J416970
10241d683177J575146j844381k672666L69693J912366k80390j202824K544983
10233d281250O164361L586352l283919p033502m138820J834246N144676L486495
10225A478639n68528k622242j494437l24783r93912j45092M859117Q757119M485662
10216A3431543m429817o660111P0904M624792n93877p707661n825618K195929
$$ plain form
10274 -8768886 -1530951 1940478 498269 -915501 -1211999 -3838172 -7846750 -7302749
10266 -7302749 -1633802 1757628 -1177052 -4686211 -2953456 389040 -1123761 -5635386
10258 -5635386 -5837821 -480298 4053789 3273773 -76697 -1078744 1103106 3493571
10250 3493571 3541955 1875966 1357401 3271785 4809702 2283634 -3125390 -6100147 -4683177
10241 -4683177 -3108031 -4952412 -7625078 -7255385 -5343019 -5623409 -6826233 -4281250
10233 -4281250 1883111 5469463 2185544 -4847958 -8986778 -7152532 -2007856 1478639
10225 1478639 910111 -1712131 -3206568 -3531351 -4525263 -4670355 188762 8945881 13431543
10216 13431543 9001726 2341615 2412519 7037311 6443434 -1264227 -7089845 -4893916
10208d893916N127024O97223k986616j552017K91998j547069m105759l311719
10200a2280851k7673K738057L965580L655779J779387P6132J003213L194277K154302
10191F258203k403285m425581j29452N162803L594698l967749q486428m482459
10183h879250L326412O568464L035878k421973m752256l468250j065649M38093
10175g218531M10274r00803k125389j281338J699172L917055K991849O71717L34714
10166a501280J648668J372847n28324l04653K469490K414568l238537q266299
10158e933520n287103K763035N910678J315198l055771o23652M586317M864103
10150D539285l4057l964480l826460k254922j604205n88320J766824L004095Q96398
$$ plain form
10208 -4893916 233108 930331 -2056285 -3608302 -3316304 -4863373 -8969132 -12280851
10200 -12280851 -12308524 -9570467 -5604887 -1949108 -169721 -93589 909624 4103901 6258203
10191 6258203 3854918 -570663 -700115 4462688 8057386 4089637 -4396791 -8879250
10183 -8879250 -5552838 1015626 4051504 1629531 -3122725 -6590975 -7656624 -7218531
10175 -7218531 -6808257 -7709060 -9834449 -11115787 -9416615 -5499560 -2507711 -1835994 -1501280
10166 -1501280 147388 1520235 991911 687258 3156748 5571316 2332779 -5933520
10158 -5933520 -11220623 -8457588 -2546910 -1231712 -4287483 -4911135 -324818 4539285
10150 4539285 4505228 540748 -3285712 -5540634 -7144839 -7733159 -5966335 -2962240 -2065842
10141b065842k082689j298301L426553O698367M123983k110751o108238n343539
10133d760457k339655R8057J903880L210089K392258q83499l393439k345279L03183
10124e814862R61452J28291Q42489K612325J929766j139416k160331O05626L227040
10115A192380K234499o89039k536895l210017l091379o93604L662928N761327
10107B630200L257531L7359L43934K035631Q71125j840215k106668j012932k373784
10098A842181m477797k372988K162739J958665l070543m265109J609974N838164
10090g74714J245643n835206n144992J767555M730901Q11367k598289l99133L073350
10081c123518J880567k742278m844065j605224L873835O054942K336967l849737
$$ plain form
10141 -2065842 -4148531 -5446832 -2020279 4678088 8802071 6691320 583082 -4760457
10133 -4760457 -7100112 -7002055 -5098175 -1888086 504172 -379327 -3772766 -6118045 -5814862
10124 -5814862 -4853410 -4725119 -3882630 -1270305 659461 -479955 -2640286 -2034660 1192380
10115 1192380 3426879 2737840 200945 -3009072 -6100451 -6794055 -3131127 2630200
10107 2630200 5887731 5925090 6269024 8304655 9175780 7335565 5228897 4215965 1842181
10098 1842181 -2635616 -5008604 -2845865 -887200 -3957743 -8222852 -6612878 -774714
10090 -774714 470929 -5364277 -10509269 -8741714 -4010813 -3199446 -5797735 -6196868 -3123518
10081 -3123518 -1242951 -3985229 -8829294 -10434518 -6560683 -505741 1831226 -2018511
10073b018511n881732j514715L914093M328906Q33476r73921L54852J232505m5057
10064B29896j043106k73551O15174P43361J358186K152889R62760j513508j633231
10055A598870P48820R85264k529517m465558n22710N039496M851401j224181o068756
10046a586871m485179J448888N782998M849956L49806k467935o86357K191854
10038E397160P44948l926959n107425j029830J649382j615263n496215l169023
10030a2553225K803796N091135L272833K812795M479129L304835j938368n950310
10022A322620m858868p35930K949943M724072L284232j627903n582329l139067
10014c663230L236198M579612j811941p676060n354399K086255O685066O072944
$$ plain form
10073 -2018511 -7900243 -9414958 -5500865 -1171959 -338483 -1312404 -957552 274953 229896
10064 229896 -813210 -1086761 -471587 271774 1629960 3782849 4745609 3232101 1598870
10055 1598870 2347690 3332954 803437 -3662121 -4184831 854665 5706066 4481885 -1586871
10046 -1586871 -6072050 -4623162 1159836 6009792 6359598 3891663 3205306 5397160
10038 5397160 6142108 2215149 -2892276 -3922106 -2272724 -3887987 -9384202 -12553225
10030 -12553225 -9749429 -4658294 -1385461 1427334 5906463 9211298 7272930 1322620
10022 1322620 -3536248 -4272178 -1322235 3401837 6686069 5058166 -524163 -3663230
10014 -3663230 -427032 4152580 2340639 -5335421 -10689820 -8603565 -1918499 4154445
10006D154445L036206p22471m485844n405467j490724L797522M836910R15214
9998D635791l557508m737953k302585J597921L575464J322763k699470k827410
9990d992987J620247L750058r10940o189981l612707M217428O783768J170531
9982A835417m271576l021825J112025J938628K70578L49877K000244K100913Q56505
9973C170786J041277K423542J901653j067194l369805l068576j851055j585055
9965b404427j366024J66399J674621Q57387j421122j477614K019584N484266M795064
9956H328134P46002k315055k432132j538414j130717k57516J056483M28864k395189
9947D90460l494186p59528J558448r27998m804198l251583L024811O192654L038898
$$ plain form
10006 4154445 7190651 6468180 1982336 -3423131 -4913855 -1116333 3720577 4635791
9998 4635791 1078283 -3659670 -5962255 -4364334 -788870 533893 -2165577 -4992987
9990 -4992987 -3372740 377318 -533622 -6723603 -10336310 -6118882 664886 1835417
9982 1835417 -2436159 -5457984 -4345959 -2407331 -2136753 -1786876 213368 2314281 3170786
9973 3170786 4212063 6635605 8537258 7470064 4100259 1031683 -819372 -2404427
9965 -2404427 -3770451 -3604052 -1929431 -1072044 -2493166 -3970780 -1951196 3533070 8328134
9956 8328134 9074136 6759081 4326949 2788535 1657818 1400302 2456785 2885649 490460
9947 490460 -3003726 -3763254 -2204806 -3132804 -7937002 -11188585 -8163774 -1971120 1067778
9938A067778o42764L69986L128822K317299j428630l776574l733887l449971l235135
9929i383076j626229P02544J474906Q65380J159708K368593J872977q59130k568871
9920e993198q56152J909417J622962j728036l737381j517986K002956J678831
9912f618587k624085n279001k518245K187656L274242J179850P90818K993732
9904f613620L471264N86115j474595J00577J798148j58228l255054k851032M81813
9895g914612K713721K914987L029098K986327J198406j162967j261435N94345
9887C097870J561458J039601P23000Q30604O18906J435678M286635N548650J044700
9878B0187102o072442q019966l450925Q13828L29308j558731j035537K57831m7738
$$ plain form
9938 1067778 425014 795000 3923822 6241121 4812491 1035917 -2697970 -6147941 -9383076
9929 -9383076 -11009305 -10306761 -8831855 -7966475 -6806767 -4438174 -2565197 -3424327 -5993198
9920 -5993198 -6849350 -4939933 -3316971 -5045007 -8782388 -10300374 -8297418 -6618587
9912 -6618587 -9242672 -14521673 -17039918 -14852262 -11578020 -10398170 -9607352 -6613620
9904 -6613620 -3142356 -2556241 -4030836 -3930259 -2132111 -2290339 -5545393 -8396425 -7914612
9895 -7914612 -5200891 -2285904 743194 3729521 4927927 3764960 2503525 3097870
9887 3097870 4659328 5698929 6421929 7252533 7871439 9307117 13593752 19142402 20187102
9878 20187102 14114660 6094694 2643769 3457597 3786905 2228174 1192637 1450468 1402730
9869A402730m94062K14518J00642j471908j463459Q62765J514892n94623l79093
9860c07598L718527M289614l091429r611680n155610M897626O876070k96060m640712
9851c321252j024646K409987L05558j079001K953619N542971J53207o838649n628803
9842f527009J283755L448884j115171m237260j309089K630590J900004j765684
9834e690980k674307J487046P565230R921840N432620k636119p033829m776582
9826A594919m97486Q78751P97370K206191K577516j536425o293466n004297Q27861
9817d449066L356091P73123j040371J72008l34656m028198n108532j024324K094175
9808i589750J62419j284973K547827N760641J408458n300517m433812K128694
$$ plain form
9869 1402730 908668 1123186 1223828 -248080 -1711539 -848774 666118 71495 -307598
9860 -307598 3410929 7700543 4609114 -5002566 -10158176 -5260550 1615520 1319460 -3321252
9851 -3321252 -4345898 -1935911 -1630353 -2709354 244265 5787236 5940443 -898206 -6527009
9842 -6527009 -5243254 -1794370 -2909541 -7146801 -8455890 -5825300 -3925296 -5690980
9834 -5690980 -8365287 -6878241 686989 10608829 16041449 13405330 6371501 1594919
9826 1594919 1097433 1976184 2773554 4979745 7557261 6020836 -272630 -5276927 -4449066
9817 -4449066 -1092975 -319852 -1360223 -1188215 -1522871 -5551069 -10659601 -11683925 -9589750
9808 -9589750 -9427331 -10712304 -8164477 -2403836 -995378 -6295895 -10729707 -8601013
9800h601013L541935k086380m888315J68772N351643L025356l032699m892261
9792a1412962j767674K003474M538605N790224L952003j127179m324180j350757
9784c698446L881113M084110q64899m268544k651430O00733J872266J860047K120581
9775B935531J888085L83510j259046k163297k898152l246553j855644N93127J086372
9766d536067j155649k814544j069896K682460N503835O351054M870364K18900
9758A0050457n943278q524083m933394N27131K255119R93372J192719K851059
9750a530898J988565j446699k675893l7054K276459J378829j34229J24680P8080
9741B1840j631925j480625K859376O550491L673781l588229p875511o721872l650035
$$ plain form
9800 -8601013 -5059078 -7145458 -12033773 -11865001 -6513358 -3488002 -6520701 -11412962
9792 -11412962 -13180636 -11177162 -6638557 -848333 3103670 1976491 -2347689 -3698446
9784 -3698446 182667 4266777 3401878 -866666 -3518096 -2917363 -1045097 814950 2935531
9775 2935531 4823616 5207126 3948080 1784783 -1113369 -4359922 -6215566 -5622439 -4536067
9766 -4536067 -5691716 -8506260 -9576156 -6893696 -1389861 4961193 9831557 10050457
9758 10050457 4107179 -4416904 -9350298 -8823167 -6568048 -5574676 -4381957 -1530898
9750 -1530898 457667 -989032 -3664925 -3701979 -1425520 -46691 -180920 -56240 21840
9741 21840 -1610085 -3090710 -231334 6319157 9992938 6404709 -1470802 -8192674 -11842709
9732a1842709q63664K343040M405622K021601k943039l829025J158671N585488
9724c964015M097061k16402j457115O22172K058409J144977p57488k339253k572420
9715c384074j64231L738668M644666J57325n735777p385792m491689p84940K029244
9706a1376600M576040N733846L391301r12187k642478k53896K900230L226779
9698D643035O86754k344543l517206j766343J579163L155363J139816k105632
9690A470407l003890j270945P97870J926011J937142J56682k719439l049113J137623
9681b617652N467917M109471j595445m609034j975029K175985L486755J948639
9673F391607p48248l140710k797993J331946M933709K690769k795659l486524
$$ plain form
9732 -11842709 -12706373 -10363333 -5957711 -3936110 -6879149 -10708174 -9549503 -3964015
9724 -3964015 133046 -83356 -1540471 -918299 1140110 2285087 1527599 -811654 -3384074
9715 -3384074 -3548305 190363 4835029 4992354 -743423 -8129215 -12620904 -13405844 -11376600
9706 -11376600 -6800560 -1066714 2324587 1412400 -1230078 -1483974 1416256 4643035
9698 4643035 5329789 2985246 -531960 -2298303 -719140 2436223 3576039 1470407
9690 1470407 -1533483 -2804428 -2006558 -80547 1856595 2013277 -706162 -3755275 -2617652
9681 -2617652 2850265 6959736 5364291 755257 -1219772 956213 4442968 6391607
9673 6391607 5643359 2502649 -295344 1036602 5970311 8661080 5865421 2378897
9665B378897J367032L175967k135516o806955l404458L222056L761024j261355
9657B96692l549787k74590L166937K633183J71446r81090o38840O3009N89529
9648A476489N18354j42074m52893m47839j886750m661310n038285r49357L600084
9639g983581L623954L41491j332622l89274K65505k29237j25738N07134J13039
9630e209329j98330J888859M569949L421294j474991m982298m136770j241133
9622g362749R51551K500648L657551L292081J399905k26568q49958j382150j912868
9613F7443j755034j622563k246556j631897J954677N117184K876238l009638n215399
9604e465545j244415L218069K986358j75158j976616j370695N33874K734517L305225
$$ plain form
9665 2378897 3745929 6921896 4786380 -2020575 -5425033 -2202977 1558047 296692
9657 296692 -3253095 -3527685 -360748 2272435 2443881 1462791 823951 886960 1476489
9648 1476489 1994843 1852769 1399876 952037 -934713 -5596023 -10634308 -11583665 -7983581
9639 -7983581 -4359627 -4018136 -5350758 -5740032 -5474527 -5703764 -5829502 -5322368 -5209329
9630 -5209329 -5407659 -3518800 1051149 4472443 2997452 -1984846 -6121616 -7362749
9622 -7362749 -6411198 -3910550 -252999 3039082 4438987 4212419 3362461 1980311 67443
9613 67443 -1687591 -3310154 -5556710 -7188607 -5233930 -116746 2759492 -250146 -5465545
9604 -5465545 -6709960 -3491891 -505533 -680691 -2657307 -4028002 -3494128 -759611 2545614
9595B545614N87170k769390j951979K012479K346436k749917o133785k709486
9587h822858K201291J458886k562279k703147R03645J862737j172966k558668
9579a1393359N63080L845529L110197L61298m56975M72089L05441j452503k569698
9570g214901j773822l81171L4794J98272K137260N517480O499804K269591l905963
9561C381344n375790q10480L243862R93684m423409n332214m36999L500512J394996
9552c864494l206927l466653J273185N077446L838315K83851r02885J41475j39946
9543i66633k222487k812270p10289J324794J847113K877790M441604K571166l115390
9534C235398n626448o04924N076918K894174l353980l245888L113632N437631
$$ plain form
9595 2545614 3132784 363394 -1588585 423894 2770330 20413 -6113372 -8822858
9587 -8822858 -6621567 -5162681 -7724960 -10428107 -9524462 -7661725 -8834691 -11393359
9579 -11393359 -10830279 -6984750 -3874553 -3513255 -3970230 -3498141 -3192700 -4645203 -7214901
9570 -7214901 -8988723 -9369894 -9335100 -9136828 -6999568 -1482088 5017716 7287307 3381344
9561 3381344 -1994446 -2804926 438936 1432620 -2990789 -8323003 -8760002 -5259490 -3864494
9552 -3864494 -7071421 -10538074 -9264889 -4187443 -349128 -65277 -968162 -826687 -966633
9543 -966633 -3189120 -6001390 -6711679 -5386885 -3539772 -661982 3779622 6350788 3235398
9534 3235398 -2391050 -2995974 2080944 4975118 1621138 -1624750 1488882 6926513
9526F926513O95827k443335N97345K579952j922226o543522m484853k02699p06999
9517e503997l141959j033901L259082K890273r47678j277711K426412M065449
9509G35970J640030q25339j402951j949160j981233R52891M431160K728255l337215
9500I92408n583967j00938O580646O443531M72942l745490k283774J050223O75744
9491D501325l163126m721096r28710L526400K596906j808646k708991N61839J567912
9482e76187j622499l052359j04106J606296n74273n64435M136924N174463k139066
9473B284758p577703j500007P812629O801859j296886l518051p9223j583996o975562
9464e632182m695985M225054N173616m322912q113085K199807J2788392R441210
$$ plain form
9526 6926513 7622340 5179005 5776350 8356302 6434076 -109446 -4594299 -4796998 -5503997
9517 -5503997 -8645956 -9679857 -6420775 -3530502 -4478180 -5755891 -3329479 735970
9509 735970 2376000 1550661 147710 -1801450 -3782683 -2829792 1601368 4329623 992408
9500 992408 -4591559 -4692497 1888149 8331680 8804622 5059132 2775358 3825581 4501325
9491 4501325 1338199 -3382897 -4311607 -785207 1811699 3053 -2705938 -2144099 -576187
9482 -576187 -2198686 -5251045 -5355151 -3748855 -4323128 -4887563 -750639 4423824 2284758
9473 2284758 -5292945 -6792952 1019677 7821536 6524650 3006599 2927376 1343380 -5632182
9464 -5632182 -10328167 -6103113 -929497 -5252409 -13365494 -11165687 1622705 11063915
9456A1063915j683394o486932l469231k15690O15428Q27359J13866r20339J406030
9447A251012N676706L805984n090006r423125k451984N609173L290766m211183
9439a542657m992109K07478K091902j95849p5594K684028K488917k50266O4898
9430D80748L089476L092879n09567k915546k840955k638523j503311K314466M709987
9421C279654O52887n928626o653232j410234K698359L127835K813056J428955
9413H654l365684p168229k953171N827306P834946R61822m416908j817806K692441
9404b396629K208927o10580l14061K060674K310383K05040j471566j174405J014853
9395A832636L742173L884705k37127m869086m784294r39302J214192K58111o38622
$$ plain form
9456 11063915 9380521 2893589 -575642 -791332 -175904 651455 765321 -155018 1251012
9447 1251012 6927718 10733702 5643696 -3779429 -6231413 -622240 2668526 -1542657
9439 -1542657 -6534766 -6327288 -4235386 -4431235 -4506829 -1822801 666116 415850 480748
9430 480748 3570224 6663103 6153536 3237990 397035 -2241488 -3744799 -1430333 3279654
9421 3279654 3932541 -1996085 -8649317 -10059551 -7361192 -4233357 -1420301 8654
9413 8654 -3357030 -10525259 -13478430 -7651124 183822 1145644 -3271264 -5089070 -2396629
9404 -2396629 -187702 -798282 -1112343 948331 3258714 3463754 1992188 817783 1832636
9395 1832636 5574809 9459514 9222387 4353301 -430993 -1370295 -156103 102008 -536614
9386e36614o67185j559656j673202J849649N443187K754666l886918n457101o01879
9377d335053K493237L67833r12197J607288K163044j648539k795213K323400N721421
9368D985221R63684n078657l208554L308597N116574J510808j512088k746152
9360C339433m808713n554409j025552N209247N495491j07229m098994k930889
9352d481615j49564J342269K415863K975665J235849j593451k009147p8653Q34454
9343D91670Q4582k043N45791l56698j558446k1689K415592M27621n550958q279097
9333a1803675m181474J384200K509496Q21054J017070K757122K164432q97051
9325f228826k062352J087985N254126N206089L0692n345543n195379M24041N287982
$$ plain form
9386 -536614 -1203799 -2763455 -4436657 -2587008 2856179 5610845 1723927 -3733174 -4335053
9377 -4335053 -1841816 -1473983 -2386180 -778892 1384152 -264387 -3059600 -736200 4985221
9368 4985221 5948905 870248 -2338306 970291 6086865 7597673 6085585 3339433
9360 3339433 -1469280 -7023689 -8049241 -2839994 2655497 2548268 -1550726 -4481615
9352 -4481615 -4631179 -3288910 -873047 2102618 3338467 1745016 -264131 -342784 491670
9343 491670 576252 574209 1120000 763302 -795144 -816833 1598759 2026380 -3524578 -11803675
9333 -11803675 -15985149 -14600949 -12091453 -11270399 -10253329 -7496207 -5331775 -6228826
9325 -6228826 -8291178 -7203193 -1949067 3257022 3287714 -2057829 -7253208 -6829167 -1541185
9316a541185M362045M1783j489274R70585K482728P4730k481268q21102K456505
9307D055547J101513m804383p415098j816744N872281N702841k320871p462545
9299g087459k761692N332338O258966J7386m190049k059193J109076P46486l8205
9290b672346K331374M543922K123552k175215k377365R62689J721521j985004
9282B473128n139066l553822P93033L556189L366108J806643P24743Q82964J561585
9273F471505R60890j561207l936667l857663k108626j068954o48791J059693L196609
9264a493211K165047k294745m710074p42220N672139O254633m50202o097768l256263
9255d952664M148058N894036j73356n238212k800980J974637J414780k058962
$$ plain form
9316 -1541185 2820860 2862643 1373369 2343954 4826682 4901412 2420144 1599042 4055547
9307 4055547 5157060 352677 -7062421 -8879165 -3006884 2695957 375086 -7087459
9299 -7087459 -9849151 -4516813 1742153 1759539 -2430510 -4489703 -3380627 -2634141 -2672346
9290 -2672346 -340972 4202950 6326502 4151287 1773922 2736611 4458132 2473128
9282 2473128 -2665938 -6219760 -5426727 -1870538 1495570 3302213 4026956 4909920 6471505
9273 6471505 7432395 5871188 1934521 -1923142 -4031768 -5100722 -5749513 -4689820 -1493211
9264 -1493211 671836 -1622909 -6332983 -7075203 -1403064 4851569 4401367 -1696401 -4952664
9255 -4952664 -804606 5089430 4916074 -322138 -3123118 -1148481 266299 -1792663
9247a792663q52804L795003L283614l098881n587498L37063O169254L978600j438609
9238D793079j606776K026161K546089k3244m82134J121186N48471j434781m89127
9229F998924J837313l42883o088298p399765j820413L389898K549441o87847q06716
9220b370346Q38395k49124l683600m920084j824527L094822N921704M782221J094120
9211B683581j620554j147835J170330K660442K629654J711812j08962k110447
9203E868021j835405Q89948J508181l067515q282380p573749k070505J694895
9195a2868509J996075K561659M143730L613028J532056K172969M899764M028684
9187A2079456q78791l286334r73206j14936m021731o564886k509057L305796L796664
$$ plain form
9247 -1792663 -2645467 1149536 4433150 1334269 -4253229 -3916166 2253088 6231688 4793079
9238 4793079 3186303 5212464 7758553 7735309 7253175 8374361 8922832 7488051 6998924
9229 6998924 8836237 8493354 2405056 -4994709 -6815122 -3425224 -875783 -1563630 -2370346
9220 -2370346 -1531951 -1781075 -5464675 -10384759 -12209286 -9114464 -3192760 1589461 2683581
9211 2683581 1063027 -84808 1085522 3745964 6375618 8087430 7978468 5868021
9203 5868021 4032616 4922564 6430745 3363230 -4919150 -12492899 -14563404 -12868509
9195 -12868509 -10872434 -8310775 -4167045 -554017 978039 3151008 8050772 12079456
9187 12079456 11200665 7914331 6941125 6826189 2804458 -3760428 -6269485 -2963689 832975
9178H32975L35725j342923p11793q33710j307250J99503K334538K203289P19560
9169B429914M81704Q22946r8118j019832k54758J92780j923777m321789l696767
9160g387697j170130M95068J940297M379854N046482J256634l727090m762312
9152c928894k380223o21588R0421J811161L187125J360019j777680j693316J385129
9143b567846L071806J831991j44887j732795k948057j934322K141165M911027
9135B628082J934581l582071m826204j518739J013516J175385J662460K069241
9127E56251l95746l394893j687959L049177L873935N07474k39817K870095L071963
9118H210480j606348l976955k50147L383339J872753q08079p37573j397436n143075
$$ plain form
9178 832975 1168700 -174223 -886016 -1719726 -3026976 -2827473 -492935 1710354 2429914
9169 2429914 2911618 3734564 3636446 2616614 2361856 2554636 630859 -3690930 -7387697
9160 -7387697 -8557827 -8062759 -6122462 -1742608 3303874 4560508 833418 -3928894
9152 -3928894 -6309117 -6930705 -6840284 -5029123 -1841998 -481979 -2259659 -3952975 -2567846
9143 -2567846 503960 2335951 2191064 458269 -2489788 -4424110 -2282945 2628082
9135 2628082 4562663 980592 -3845612 -5364351 -4350835 -3175450 -1512990 556251
9127 556251 160505 -3234388 -4922347 -1873170 2000765 2508239 2268422 5138517 8210480
9118 8210480 6604132 2627177 2377030 5760369 7633122 6825043 6087470 4690034 -453041
9109d53041o535695k009020K301544P86170j736917N26153L075878p4630l689731
9100g809289K73083P261978O575220n25130l052224J133946L048227q59897l587989
9091B457925j330598L44354k097086l891109j773771Q2600j000377o32626L770391
9082d070297P004456M808161R51151j77530p28970l195783m330308j810024l1315
9073a580459k147876l096918J436143N555376K027751m710597m854190J184928
9065f185842M406861K287705J008730L019721L480018O46125m68392K181042L354869
9056A3730837k09062m154351m385530l411611m122141l855072j73212L074704
9048c505438J565550j906054j717143J828033L710777J869529j375704l556803
$$ plain form
9109 -453041 -6988736 -8997756 -6696212 -5910042 -7646959 -7120806 -4044928 -4119558 -7809289
9100 -7809289 -7536206 -274228 6300992 5775862 2723638 3857584 6905811 6045914 2457925
9091 2457925 1127327 1471681 -625405 -4516514 -6290285 -6207685 -7208062 -7840688 -4070297
9082 -4070297 2934159 7742320 8693471 8515941 7786971 4591188 260880 -1549144 -1580459
9073 -1580459 -3728335 -6825253 -5389110 166266 2194017 -2516580 -7370770 -6185842
9065 -6185842 -1778981 508724 1517454 4537175 8017193 8663318 8194926 10375968 13730837
9056 13730837 13521775 9367424 4981894 1570283 -2551858 -6406930 -6580142 -3505438
9048 -3505438 -1939888 -3845942 -5563085 -3735052 -24275 1845254 469550 -3087253
9040c087253l214718Q90008P055796R456217M769580k074486m146947k372918
9032G275279k738127n342139m323748Q83996K972592j332518m616629K84563Q477190
9023A540459R343324J537610n847323o364513l304546k194670k444543l25500
9015h059702L637208N097185K468093j041677k160260j081446M97211J900460
9007A257072K477455P07227l158989n420981l106167J152271K040193p84422k067000
8998f903341R91950M385912L633446P45724P95830L785798M649598R35632l707631
8989I312918m582733j540626J619807J562166j550146m449306m176777j534995
8981e339692J70653M37079K565865P088897Q109357J224509p638922q208263j93463
$$ plain form
9040 -3087253 -6301971 -5411963 1643833 11100050 15869630 13795144 9648197 7275279
9032 7275279 4537152 -804987 -5128735 -4244739 -1272147 -2604665 -7221294 -6936731 1540459
9023 1540459 10883783 12421393 6574070 209557 -3094989 -5289659 -7734202 -8059702
9015 -8059702 -4422494 674691 3142784 2101107 -59153 -1140599 -643388 1257072
9007 1257072 3734527 4441754 1282765 -4138216 -7244383 -6092112 -4051919 -4836341 -6903341
8998 -6903341 -5911391 -1525479 2107967 2853691 3649521 7435319 12084917 13020549 9312918
8989 9312918 4730185 3189559 4809366 6371532 4821386 372080 -3804697 -5339692
8981 -5339692 -5169039 -4731960 -2166095 4922802 13032159 14256668 6617746 -1590517 -1783980
8972a783980N642623K231916m903290o645011k122220K841842M416477K927828
8964B606185l68303l811259m716116k304822L51244M22032p15355l83507J244142
8955g675759K874771M661060N556069K126965n228746q979771l736241M438783
8947e962869N535703K49507j535364L529530P400700L603941l483198o293085
8939C044865m102444p06894K241124M332708L346215j264791m848555k880997
8931h38769K120804L857899J097953j427128n53605J295886N91650j983464k676363
8922A484863q7753K337686M25801m399843n534952m0511N715517L804351l594481
8913A10678o632122j943249L080114K343855l75755N59408L098575K419769j14204
$$ plain form
8972 -1783980 3858643 6090559 1187269 -5457742 -7579962 -4738120 -321643 2606185
8964 2606185 2237882 -1573377 -6289493 -8594315 -8243071 -7821039 -8536394 -8919901 -7675759
8955 -7675759 -4800988 -139928 5416141 7543106 2314360 -6665411 -10401652 -5962869
8947 -5962869 -427166 -177659 -1713023 1816507 9217207 12821148 9337950 3044865
8939 3044865 -1057579 -1764473 476651 4809359 8155574 6890783 2042228 -838769
8931 -838769 1282035 5139934 6237887 4810759 4257154 5553040 6144690 4161226 1484863
8922 1484863 1397110 3734796 4160597 -239246 -5774198 -5814709 -99192 3705159 110678
8913 110678 -6521444 -8464693 -5384579 -3040724 -3416479 -2857071 241504 2661273 2547069
8904B547069l60819K97207k025341n153604l491537K167070N278418L426817K43774
8895B929054k051155m402244n300314j628564L907583M433512k34019k637897
8887d984044L8800J629346j298034k659165K120422O713798L684954k875190l797936
8878a427049O19151K328623p54662k662691n78883J115250n48599k326928j139364
8869e375152R92531J250536M67841O78209J889587L077770L234479Q37162l949774
8860C103189o612425k944591L239519L327769l494402p735887l049101M547875
8852i618054O079830K420941R01833L218841M423479K128021n72570j188661p46494
8843G047166l35726P254j067838m434696o411934k471287M385007N590899p71357
$$ plain form
8904 2547069 2186250 2483457 458116 -4695488 -8187025 -6019955 -741537 2685280 2929054
8895 2929054 877899 -3524345 -8824659 -10453223 -6545640 -2112128 -2346147 -4984044
8887 -4984044 -4945244 -3315898 -4613932 -7273097 -5152675 1561123 5246077 2370887 -1427049
8878 -1427049 -807898 1520725 766063 -1896628 -2475511 -1360261 -1908860 -4235788 -5375152
8869 -5375152 -4382621 -3132085 -2664244 -1986035 -96448 2981322 6215801 7052963 3103189
8860 3103189 -3509236 -6453827 -3214308 113461 -3380941 -11116828 -14165929 -9618054
8852 -9618054 -3538224 -1117283 -215450 3003391 7426870 9554891 8982321 7793660 7047166
8843 7047166 6711440 6718694 5650856 1216160 -5195774 -7667061 -3282054 2308845 1537488
8834A537488o471228n047232n82825K62547j068268R05946N238597N997197K183178
8825B955400j355134k329103l061647l768604j213892L998105N777364J614102
8817B616591k675759j566179J935790J822045j292500k133276L07034K119736
8809A133482J517433M37068o23513l372604o499232n412505O96089O292356O629930
8800G98504L471664R55236l73167j864301k496437q14064J020966p3220k437900
8791a812719j666959J830438K530618j458930m409074j119455M777419N566805
8783D238143O07058k934335q69349K162181N03867l458882l141823J701350M448025
8774C256235J818787j451113o09732J728009N87614k789811l137429j28036J057606
$$ plain form
8834 1537488 -4933740 -9980972 -10563797 -10301250 -11369518 -10463572 -5224975 772222 2955400
8825 2955400 1600266 -728837 -3790484 -7559088 -8772980 -4774875 1002489 2616591
8817 2616591 -59168 -1625347 310443 2132488 839988 -1293288 -986254 1133482
8809 1133482 2650915 3087983 2464470 -908134 -7407366 -12819871 -12123782 -5831426 798504
8800 798504 4270168 5225404 4852237 2987936 491499 -322565 698401 625181 -1812719
8791 -1812719 -3479678 -1649240 881378 -577552 -4986626 -6106081 -1328662 4238143
8783 4238143 4845201 1910866 1041517 3203698 3707565 248683 -2893140 -1191790 3256235
8774 3256235 5075022 3623909 3014177 4742186 5329800 2539989 -597440 -725476 332130
8765C32130j604022l529508p81251L801801M768066J326946k595331l653802j744877
8756c679848J364344L660610L679846J425189j512729l316353l124784j260925
8748b764650N57628K4744k693262l647818Q4197N045009M985904k63099m382090
8739c053437l689325j169754J32158J469856L217861J919885k833038m698410
8731h704204J72591N497667L610012k561002m300646n73773K071089J013306j17361
8722c892321R6894r17691k650044j237304K643601L760825J473604P20286K421307
8713B419157J627678k506927l985909n09857K224742Q80623J28322K921540M200920
8704G400289N71022k503486n73308J101882k667518o392320l134121K443652J585336
$$ plain form
8765 332130 -1271892 -4801400 -5582651 -1780850 2987216 4314162 1718831 -1934971 -3679848
8756 -3679848 -2315504 1345106 5024952 6450141 4937412 1621059 -1503725 -2764650
8748 -2764650 -2207022 -2182278 -4875540 -8523358 -8439161 -3394152 1591752 1328653 -3053437
8739 -3053437 -6742762 -7912516 -7780358 -6310502 -3092641 -1172756 -4005794 -8704204
8731 -8704204 -8531613 -3033946 576066 -1984936 -6285582 -6859355 -4788266 -3774960 -3892321
8722 -3892321 -3795427 -4713118 -7363162 -8600466 -5956865 -2196040 -722436 -2150 2419157
8713 2419157 4046835 1539908 -2446001 -2955858 -731116 149507 277829 3199369 7400289
8704 7400289 7971311 5467825 4894517 5996399 3328881 -3063439 -6197560 -3753908 -2168572
8695b168572l257241k799716K946493N471872K898072J817255M176653M377880
8687A3462696O91488j715360j212274k488498o233354o387086j256887K350433
8679b788842L44912k251848o53590K344539L039456K789119K594806j81501m676116
8670E60935m457612J684564N337905J387626l294604j831505Q05841k205636n698229
8661g710715r91565P387626P221353j530387o006597j96289O934045N900948j016968
8652I991451n937777n676953j865279K747174M613314J462238l325332l619239
8644a610403L55542J716391k280026n781915l818805L23189J578951J144688K652960
8635e719428M880982M221074J405932L5011K45349q68030l529276m839821l839505
$$ plain form
8695 -2168572 -5425813 -8225529 -5279036 192836 3090908 4908163 9084816 13462696
8687 13462696 14154184 12438824 11226550 8738052 2504698 -3882388 -5139275 -2788842
8679 -2788842 -2443930 -4695778 -5349368 -3004829 34627 2823746 5418552 5237051 560935
8670 560935 -3896677 -2212113 3125792 4513418 1218814 -612691 193150 -2012486 -7710715
8661 -7710715 -8702280 -1314654 5906699 4376312 -1630285 -1826574 5107471 11008419 9991451
8652 9991451 4053674 -1623279 -3488558 -741384 3871930 5334168 2008836 -1610403
8644 -1610403 -1254861 461530 -1818496 -7600411 -11419216 -11096027 -9517076 -8372388 -5719428
8635 -5719428 -838446 3382628 4788560 4823571 5068920 4200890 671614 -4168207 -8007712
8626h007712k671441k196460k95205L972318P359518N939553N51332l456219k373802
8617a178118J441842K729996J40117k579584k495708j270194j171952q82323J147359
8608d118565K302233j78329l062951j166979L676090M659154R40267j188040O26676
8599B489556R32217l036279n326239j211838M052502L447455o19322j336540O62923
8590E4435o30862n150374o463175k510130J699337K902587L466627M776115L867901
8581B012461l86827l654172k357040Q56440J348552j180941l656231m036314k035200
8572a3089272J894398N608251N756319K038579j127509j46050K321534Q75085
8564D131335m550360p849981m688871J759584N042374L609764J733301K267419
$$ plain form
8626 -8007712 -10679153 -12875613 -13170818 -9198500 -1838982 4100571 4651903 1195684 -1178118
8617 -1178118 263724 2993720 3133837 554253 -1941455 -3211649 -4383601 -5265924 -4118565
8608 -4118565 -1816332 -1994661 -5057612 -6224591 -2548501 2110653 3050920 1862880 2489556
8599 2489556 3421773 385494 -4940745 -6152583 -2100081 1347374 728052 -608488 54435
8590 54435 -576427 -5726801 -12189976 -14700106 -13000769 -10098182 -6631555 -1855440 2012461
8581 2012461 1625634 -2028538 -4385578 -3529138 -2180586 -3361527 -7017758 -11054072 -13089272
8572 -13089272 -11194874 -5586623 169696 2208275 1080766 934716 3256250 4131335
8564 4131335 -419025 -8269006 -12957877 -11198293 -6155919 -2546155 -812854 1454565
8556A454565K200770j858714o569149n376622J290082N404559K773234j060401
8548a741676j64724K509338J237068k079500j509168K173346L172671J324072
8540D921427J577552L305518N14628n865300o814804k3794M736221P37995n098569
8531b009126m214487L2155J87370j660193P30138M415268J822133m519235m714822
8522i930799J709676M487147l69646m390491j259399L430092K749127n14816l99846
8513d488955J849821J473819r34711j477556j28650O30296J221663K962964L582075
8504D690766Q80953j781958j95920K751813J058400l799597m299573P36063L466563
8495C507510p10758n753026m341262J231855L349737M24300k292901j516956L76103
$$ plain form
8556 1454565 3655335 1796621 -4772528 -10149150 -8859068 -3454509 -681275 -1741676
8548 -1741676 -1906400 602938 1840006 -239494 -1748662 424684 3597355 4921427
8540 4921427 6498979 9804497 10319125 4453825 -2360979 -2384773 2351448 3089443 -2009126
8531 -2009126 -6223613 -6191458 -6004088 -7664281 -6934143 -2518875 -696742 -5215977 -9930799
8522 -9930799 -8221123 -3733976 -4103622 -8494113 -9753512 -6323420 -3574293 -4089109 -4488955
8513 -4488955 -2639134 -1165315 -2100026 -3577582 -3706232 -3075936 -1854273 1108691 4690766
8504 4690766 5571719 3789761 3593841 6345654 7404054 3604457 -695116 40947 3507510
8495 3507510 2796752 -2956274 -7297536 -6065681 -2715944 -2291644 -4584545 -6101501 -5725398
8486e725398N53240k29951L49J411919K938282L427902J674758k014731l949382
8477a913012l84579N978925O994601m28081q489488p735618L26341N523383L015985
8468B888457j509697j869101M4242m15426k012582k28752M164824N381922J291253
8459G735140l340762l423963L76350L576103L158058m58785m673445o596182m973233
8450h620719j185252K110146L149992J552265j784034l982838j711002M024468
8442f446974O971641L267503k238596k311923J788920K392133k076815m692053
8434c346164j976460K33308k584859m964753n58085O091292N933659R1356j899903
8425b980609K165337L545676k695756q669074n273895L732589P027916J991347
$$ plain form
8486 -5725398 -5172158 -5402109 -5401760 -3989841 -1051559 2376343 4051101 2036370 -1913012
8477 -1913012 -2297591 3681334 10675935 10247854 1758366 -5977252 -5650911 -127528 2888457
8468 2888457 1378760 -490341 -446099 -861525 -2874107 -3102859 1061965 6443887 7735140
8459 7735140 4394378 970415 1346765 4922868 8080926 7622141 2948696 -3647486 -8620719
8450 -8620719 -9805971 -7695825 -4545833 -2993568 -4777602 -8760440 -10471442 -6446974
8442 -6446974 524667 3792170 1553574 -758349 1030571 3422704 1345889 -3346164
8434 -3346164 -5322624 -5089316 -7674175 -12638928 -13197013 -7105721 -1172062 -1080706 -2980609
8425 -2980609 -815272 2730404 34648 -8634426 -13908321 -10175732 -3147816 -1156469
8417a156469k372419Q74590O976282O911613j8691n984197n541647j772067l86912
8408b469917j769253k067499o405J469560K14365k043829k633951j156360J454973
8399i008316M497686O578987N636889K010694n85987L96093K496079J628386j912764
8390A1737747l841496j903135J288719J902922n92505l271964l078900L609K673081
8381D918078J637103k343068m807921k863125J197683K911331J188814r34066
8373I04829o24278J331188J803541n78145l122180j906647K377045L547082k043583
8364A688852q310492n703399M955332J1449153O048520l763798n828374K94267
8356H30061M631093J810780l196100m323060k122305j78436N97889J057402R47540
$$ plain form
8417 -1156469 -3528888 -2654298 4321984 11233597 11214906 5230709 -310938 -2083005 -2469917
8408 -2469917 -4239170 -6306669 -6313074 -4843514 -4629149 -6672978 -9306929 -10463289 -9008316
8399 -9008316 -4510630 2068357 7705246 9715940 9129953 9526046 12022125 13650511 11737747
8390 11737747 7896251 5993116 7281835 9184757 8592252 5320288 2241388 2244997 4918078
8381 4918078 6555181 4212113 -595808 -3458933 -2261250 650081 1838895 904829
8373 904829 280551 1611739 3415280 2837135 -285045 -2191692 185353 3732435 1688852
8364 1688852 -6621640 -12325039 -7369707 4079446 10127966 6364168 535794 830061
8356 830061 5461154 7271934 4075834 -247226 -2369531 -2547967 -1950078 -892676 54864
8347E4864K4177k42845J319735L109301K371553r82172l589503k352071J336895
8338A049934K452910j341187n828760n557256j575241Q36833J255975L919385
8330d787407P635142N063309l855710p549185M60673R356127O190962l987449
8322H526462o445868k89052J927860l227104m621981L184590R884658O364263
8314A5303828j287958l248861r28650j033608k902818j680020J556415K002865
8306G781193l38243j912984k123017k229135j200158J571024L001772J058686
8298E609138j195144j164781j429284l630568l519409J290684M573458O32225
8290A166319m997447l314063L597022N806962R93125l459282k986291q17772P8906
$$ plain form
8347 54864 79041 -163804 1155931 4265232 6636785 5654613 2065110 -286961 1049934
8338 1049934 3502844 2161657 -3667103 -9224359 -10799600 -9962767 -8706792 -4787407
8330 -4787407 2847735 7911044 4055334 -3493851 -3033178 6322949 12513911 8526462
8322 8526462 2080594 1791542 3719402 492298 -4129683 -945093 8939565 15303828
8314 15303828 14015870 10767009 9838359 8804751 5901933 4221913 5778328 7781193
8306 7781193 7442950 5529966 3406949 1177814 -22344 1548680 4550452 5609138
8298 5609138 4413994 3249213 1819929 -1810639 -5330048 -4039364 534094 1166319
8290 1166319 -3831128 -7145191 -3548169 2258793 3251918 -207364 -3193655 -4011427 -3932521
8281c932521J226425L230477L517577J377141n10643p32280m03090K04739J302942
8272E280767P70698k735109n263314k536800K121712K168424j207457r79045L351814
8263I71690M614225J65603m105344m095054k762765k236085K47383M501374M463590
8254A764617j357302m627903P21532P894716O627702j697621o680312l871639
8246a226210R03253J526999j006230k301701q24968J468057K260947J198774j44934
8237A853987k80686L50869K93357o59406j636713k337091k345427j57715L812443
8228a106382M846104n20745p325863o638400K158926R683162Q760111K407777
8220A2264690k479835l444870j639233J533744L409616P87441m736775o816278
$$ plain form
8281 -3932521 -2706096 524381 4041958 5419099 4908456 4176176 3773086 3977825 5280767
8272 5280767 6051465 3316356 -1946958 -4483758 -2362046 -193622 -1401079 -2380124 971690
8263 971690 5585915 5751518 1646174 -2448880 -5211645 -7447730 -7200347 -2698973 1764617
8254 1764617 407315 -4220588 -3499056 4395660 11023362 9325741 2645429 -1226210
8246 -1226210 -322957 1204042 197812 -2103889 -2928857 -1460800 800147 1998921 1853987
8237 1853987 1573301 1924170 2217527 1558121 -78592 -2415683 -4761110 -4918825 -1106382
8228 -1106382 3739722 3218977 -4106886 -10745286 -8586360 1096802 9856913 12264690
8220 12264690 9784855 6339985 4700752 6234496 9644112 10431553 5694778 -1121500
8212a121500l002951J482983J784256k02473j049209j493095k415058j077947
8204g094994L174750N084043J468875k291395o24044K529797M24058m426195m186552
8195e941657R70172L253049J56527k490636j140741N94010j84055o15660J850878
8186c548113M507742M088951J776655K22183p36424k317530l551483k580746M24112
8177a714653L412846M419696K782916k88205k325947k115719j068233q16184r23726
8168A362791p54682j325718k553707j314971L750690P799324N185981j965936
8160A0183772n848494l202461J537422L331283J917995l67695j757608j286981
8152D507233N44749J163985q22088k653233j474687L34033j026988l370777j553902
$$ plain form
8212 -1121500 -4124451 -2641468 -857212 -1059685 -2108894 -3601989 -6017047 -7094994
8204 -7094994 -3920244 1163799 2632674 341279 -282765 2247032 2671090 -1755105 -5941657
8195 -5941657 -4971485 -1718436 -1561909 -4052545 -5193286 -4599276 -4783331 -5398991 -3548113
8186 -3548113 959629 5048580 6825235 7047418 6310994 3993464 441981 -2138765 -1714653
8177 -1714653 1698193 6117889 8900805 8612600 6286653 4170934 3102701 2286517 1362791
8168 1362791 608109 -717609 -3271316 -4586287 -835597 6963727 12149708 10183772
8160 10183772 4335278 1132817 2670239 6001522 7919517 7551822 5794214 4507233
8152 4507233 5051982 6215967 5393879 2740646 1265959 1599992 573004 -2797773 -4351675
8143d351675K896665K941394k373678n461212j795384L442037L927988Q60163
8135H6298j247531j761558k177544j841940j74425O19937o51494j152164J249253
8126g051168L749698L067155O43429n86345j058447j978623j501556J622541L845571
8117G52255J663369j910636j354981K675824M339595J326479k719603m186154
8109E86148l147002j019276J190438K038563O27516j368549j538633j47633R88042
8100a790386J750353K560117J707022j763789l863448J45292P385217Q912721
8092A5043099J244156q396435j0745711m880223K479126N238573K973688m85229
8084B471044j233136J247768L679500K567398j698278n321075n447834k724450
$$ plain form
8143 -4351675 -1455010 1486384 -887294 -6348506 -8143890 -4701853 -773865 86298
8135 86298 -1161233 -2922791 -5100335 -6942275 -7116700 -6496763 -7148257 -8300421 -7051168
8126 -7051168 -3301470 -234315 409114 -177231 -1235678 -3214301 -4715857 -3093316 752255
8117 752255 2415624 504988 -849993 1825831 6165426 7491905 4772302 586148
8109 586148 -2560854 -3580130 -2389692 -351129 276387 -1092162 -2630795 -2778428 -1790386
8100 -1790386 -40033 2520084 4227106 2463317 -1400131 -1254839 6130378 15043099
8092 15043099 16287255 7890820 -2854891 -7735114 -5255988 -17415 2956273 2471044
8084 2471044 1237908 2485676 6165176 8732574 7034296 1713221 -3734613 -6459063
8076f459063J41148R92041m8416k60480K943992P498592P258671o5329p999963
8067D001193q474287k046748L872525N477657N260125M870220K381841j942762
8059A3399764l907319k128098o91133k039570k880551p35854J156177j5761j039531
8050A118124J288721L442097R31772l254650l206181j0388O78918j091815k11778
8041c15180L299727L585337n73156l154700j201200L98831j837328l513708l66069
8032c677446L669250K810105r61214j558329J257167K621873J261810M32319Q82282
8023F737817l77940l676501n055871k600219N63610J377412O90164K13619k60626
8014b388535n65613Q95337L353338K730392k094829n497920k049159M954036O930731
$$ plain form
8076 -6459063 -6317915 -5325874 -5374290 -5634770 -2690778 4807814 12066485 12001156 4001193
8067 4001193 -4473094 -6519842 -2647317 2830340 8090465 12960685 15342526 13399764
8059 13399764 9492445 7364347 6673214 4633644 1753093 1017239 2173416 2157655 1118124
8050 1118124 2406845 5848942 6780714 3526064 319883 309495 988413 -103402 -315180
8041 -315180 2984547 6569884 5996728 2842028 1640828 2039659 202331 -3311377 -3677446
8032 -3677446 -8196 2801909 1840695 282366 1539533 4161406 5423216 5855535 6737817
8023 6737817 6359877 2683376 -2372495 -4972714 -4409104 -3031692 -2341528 -2127909 -2388535
8014 -2388535 -2954148 -2058811 1294527 4024919 1930090 -3567830 -5616989 -662953 6267778
8005F267778J409488m878046n183116q37736J989827O39065j975341k378697o86574
7996e633352O17153K27324o61936n9584K338048M334154L126536j401283n489490
7987b602430m875000N2003L865648K407217j672915k224692J970737N619678M727791
7978G268037J937946J253296J250640j574076n177557m063747J333626M057792
7970F285957J019992k404507j347190R54159n27491l548397k363556K321677M237980
7961D628624J528588r73132k32439M50691k196786n474562m741234n11052K108301
7952e413001K03758l223470k761974K852407Q331181P255349J83636n221458l854402
7943a647974L84806J235645m90877O3628K116279O08571l375747k763106L066141
$$ plain form
8005 6267778 7677266 2799220 -2383896 -3221632 -1231805 -592740 -2568081 -4946778 -5633352
7996 -5633352 -5016199 -4788875 -5450811 -5510395 -3172347 1161807 4288343 2887060 -2602430
7987 -2602430 -7477430 -7425427 -3559779 -1152562 -2825477 -5050169 -3079432 2540246 7268037
7978 7268037 9205983 10459279 11709919 10135843 4958286 894539 2228165 6285957
7970 6285957 7305949 4901442 3554252 4508411 3980920 432523 -1931033 390644 4628624
7961 4628624 6157212 5184080 4951641 5402332 3205546 -2269016 -7010250 -7521302 -5413001
7952 -5413001 -5209243 -8432713 -11194687 -8342280 -11099 7244250 7427886 2206428 -1647974
7943 -1647974 -1263168 -27523 -518400 -454772 1661507 2270078 -1105669 -3868775 -802634
7934h02634N411172J37981m581801j137012M811458L433388l350246n501916j030676
7925b610286K441625J280370K58688K292287L709068K350295J402265J772074
7917A2896386p54591o423463q036187k323657L121436J542332j635340J597560
7909a5524O888711L891007n451076q079879j56046O573283L177480l170049k029208
7900A628699L396964K798491l453254n245429L4816L345283n46758m411455j138281
7891c590924L849414J305434o339404q179301j447150M992633M559022J211148
$$ plain form
7934 -802634 4608538 4746519 164718 -972294 3839164 7272552 3922306 -1579610 -2610286
7925 -2610286 -168661 1111709 1370397 3662684 7371752 9722047 11124312 12896386
7917 12896386 12141795 5718332 -2317855 -4641512 -1520076 22256 -1613084 -15524
7909 -15524 6873187 10764194 5313118 -2766761 -2922807 3650476 6827956 3657907 1628699
7900 1628699 5025663 7824154 4370900 -874529 -839713 2505570 1958812 -2452643 -3590924
7891 -3590924 258490 1563924 -4775480 -12954781 -14401931 -9409298 -4850276 -3639128
$$ [...]
##END NTUPLES=NMR SPECTRUM
##END=
