##TITLE=31Pdec_SR43(35)
 , 24 sc
 9.03.2021
##JCAMPDX= 6.0         $$ Bruker NMR JCAMP-DX V2.0
##DATA TYPE= NMR SPECTRUM
##DATA CLASS= NTUPLES
##ORIGIN= UXNMR, Bruker Analytische Messtechnik GmbH
##OWNER= root
$$ XWIN-NMR		Version 3.5
$$ Tue Mar  9 13:55:33 2021 Russian Standard Time (UT+4h)  she@DPX200
##.OBSERVE FREQUENCY= 81.013821
##.OBSERVE NUCLEUS= ^31P
##.ACQUISITION MODE= SIMULTANEOUS
##.ACQUISITION SCHEME= undefined
##.AVERAGES= 24
##.DIGITISER RES= 16
##SPECTROMETER/DATA SYSTEM= spect
##.PULSE SEQUENCE= zgpg30
##.SOLVENT NAME= CDCl3
##.SHIFT REFERENCE= (INTERNAL, CDCl3, 0, 248.564)
##AUDIT TRAIL= $$ (NUMBER, WHEN, WHO, WHERE, WHAT)
$$ ##TITLE= Audit trail, XWIN-NMR		Version 3.5
$$ ##JCAMPDX= 5.01
$$ ##ORIGIN= Bruker BioSpin GmbH
$$ ##OWNER= she
$$ F:/spectra/data/she/nmr/P31/1/pdata/1/auditp.txt
$$ ##AUDIT TRAIL=  $$ (NUMBER, WHEN, WHO, WHERE, WHAT)
(   1,<2021-03-09 13:54:26.31 +0400>,<she>,<DPX200>,
      <created by zg, POWCHK disabled, PULCHK disabled
       configuration hash MD5:
       00 E9 B6 7A A2 85 ED C7 34 08 36 98 17 FE 4E 26
       data hash MD5: 32K
       73 ED 9C 9D 9B 5B F6 F8 D5 52 C6 FF 6B B8 F8 B8>)
(   2,<2021-03-09 13:54:31.37 +0400>,<she>,<DPX200>,
      <Start of raw data processing
       efp BC_mod = 2 LB = 1 FT_mod = 6 PKNL = 1 PHC0 = -3407.469 PHC1 = 241.6006 SI = 64K 
       data hash MD5: 64K
       81 CB 09 2E CB F7 45 B7 E2 51 3D AF D2 95 10 23>)
(   3,<2021-03-09 13:55:09.39 +0400>,<she>,<DPX200>,
      <pk PHC0 = 51.34487 PHC1 = -94.99992 
       data hash MD5: 64K
       B9 3F 51 39 94 C8 EC 2D E2 FE 67 38 0F E3 19 D3>)
(   4,<2021-03-09 13:55:14.12 +0400>,<she>,<DPX200>,
      <abs ABSG = 5 
       data hash MD5: 64K
       E8 F3 11 34 58 70 27 87 F0 F2 56 DD D4 10 6C D7>)
$$ ##END=
$$ 
$$ hash MD5
$$ FE 7A B6 9B 31 E3 F0 06 D3 4A D1 35 E2 4C 72 63
##$RELAX= 
##$RELAX= 
##$RELAX= 
##$RELAX= 
##$RELAX= 
##$RELAX= 
##$RELAX= 
##$RELAX= 
$$ Bruker specific parameters
$$ --------------------------
##$DU= <F:/spectra>
##$EXPNO= 1
##$NAME= <P31>
##$PROCNO= 1
##$TYPE= <nmr>
##$USER= <she>
##$AMP= (0..31)
100 100 100 100 100 100 100 100 100 100 100 100 100 100 100 100 100 100 
100 100 100 100 100 100 100 100 100 100 100 100 100 100 
##$AQSEQ= 0
##$AQ_mod= 1
##$AUNM= <au_zg>
##$AUTOPOS= <>
##$BF1= 81.014009
##$BF2= 200.13
##$BF3= 200.13
##$BF4= 200.13
##$BF5= 200.13
##$BF6= 200.13
##$BF7= 200.13
##$BF8= 200.13
##$BYTORDA= 1
##$CFDGTYP= 0
##$CFRGTYP= 5
##$CHEMSTR= <none>
##$CNST= (0..31)
1 1 145 1 1 1 1 1 1 1 1 1 1 1 1 1 1 1 1 1 1 1 1 1 1 1 1 1 1 1 1 1 
##$CPDPRG= <waltz16>
##$CPDPRG1= <>
##$CPDPRG2= <waltz16>
##$CPDPRG3= <>
##$CPDPRG4= <mlev>
##$CPDPRG5= <mlev>
##$CPDPRG6= <mlev>
##$CPDPRG7= <mlev>
##$CPDPRG8= <mlev>
##$CPDPRGB= <>
##$CPDPRGT= <>
##$D= (0..31)
0 1 0 0 0 0 0 0 0 0 0 0.03 2e-05 3e-06 0 0 0 0 0 0 0 0 0 0 0 0 0 0 0 0 
0 0 
##$DATE= 1615283665
##$DBL= (0..7)
120 120 120 11 120 120 24 19 
##$DBP= (0..7)
150 150 150 150 150 150 150 150 
##$DBP07= 0
##$DBPNAM0= <>
##$DBPNAM1= <>
##$DBPNAM2= <>
$$ [...]
##$SUBNAM3= <"">
##$SUBNAM4= <"">
##$SUBNAM5= <"">
##$SUBNAM6= <"">
##$SUBNAM7= <"">
##$SUBNAM8= <"">
##$SUBNAM9= <"">
##$SW= 501.771253377433
##$SWIBOX= (0..15)
0 1 3 0 0 0 0 0 0 0 0 0 0 0 0 0 
##$SW_h= 40650.406504065
##$TD= 32768
##$TD0= 1
##$TE= 0
##$TE2= 300
##$TE3= 300
##$TEG= 300
##$TL= (0..7)
0 120 53 12 22 120 120 120 
##$TP= (0..7)
150 150 150 150 150 150 150 150 
##$TP07= 0
##$TPNAME0= <>
##$TPNAME1= <>
##$TPNAME2= <>
##$TPNAME3= <>
##$TPNAME4= <>
##$TPNAME5= <>
##$TPNAME6= <>
##$TPNAME7= <>
##$TPOAL= (0..7)
0.5 0.5 0.5 0.5 0.5 0.5 0.5 0.5 
##$TPOFFS= (0..7)
0 0 0 0 0 0 0 0 
##$TUNHIN= 0
##$TUNHOUT= 0
##$TUNXOUT= 0
##$USERA1= <user>
##$USERA2= <user>
##$USERA3= <user>
##$USERA4= <user>
##$USERA5= <user>
##$V9= 5
##$VALIST= <valist>
##$VCLIST= <CCCCCCCCCCCCCCC>
##$VD= 0
##$VDLIST= <DDDDDDDDDDDDDDD>
##$VPLIST= <PPPPPPPPPPPPPPP>
##$VTLIST= <TTTTTTTTTTTTTTT>
##$WBST= 1024
##$WBSW= 4
##$XGAIN= (0..3)
0 0 0 0 
##$XL= 0
##$YL= 0
##$YMAX_a= 11859
##$YMIN_a= -13744
##$ZGOPTNS= <>
##$ZL1= 120
##$ZL2= 120
##$ZL3= 120
##$ZL4= 120
##$ABSF1= 248.5645
##$ABSF2= -253.2056
##$ABSG= 5
##$ABSL= 3
##$ALPHA= 0
##$AQORDER= 0
##$ASSFAC= 0
##$ASSFACI= 0
##$ASSFACX= 0
##$ASSWID= 0
##$AUNMP= <proc_1d>
##$AZFE= 0.1
##$AZFW= 0.5
##$BCFW= 0
##$BC_mod= 2
##$BYTORDP= 0
##$COROFFS= 0
##$CY= -3
##$DATMOD= 1
##$DC= 0
##$DFILT= <>
##$DTYPP= 0
##$F1P= 0
##$F2P= 0
##$FCOR= 1
##$FTSIZE= 65536
##$FT_mod= 6
##$GAMMA= 0
##$GB= 0
##$INTBC= 1
##$INTSCL= 5.30512e-09
##$ISEN= 30
##$LB= 1
##$LEV0= 0
##$LPBIN= 0
##$MAXI= 10000
##$MC2= 0
##$MEAN= 0
##$ME_mod= 0
##$MI= 50
##$NCOEF= 0
##$NC_proc= -4
##$NLEV= 6
##$NOISF1= 182.463
##$NOISF2= 159.3651
##$NSP= 0
##$NTH_PI= 0
##$NZP= 0
##$OFFSET= 248.5645
##$PC= 4
##$PHC0= -3356.124
##$PHC1= 146.6007
##$PH_mod= 1
##$PKNL= yes
##$PPARMOD= 0
##$PSCAL= 0
##$PSIGN= 0
##$REVERSE= no
##$SF= 81.014009
##$SI= 65536
##$SIGF1= 159.3651
##$SIGF2= -187.1042
##$SINO= 113.3802
##$SIOLD= 16384
##$SREGLST= <1H.CDCl3>
##$SSB= 0
##$STSI= 65536
##$STSR= 0
##$SW_p= 40650.406504065
##$SYMM= 0
##$S_DEV= 0
##$TDeff= 32768
##$TDoff= 0
##$TI= <>
##$TILT= no
##$TM1= 0
##$TM2= 0
##$TOPLEV= 0
##$USERP1= <user>
##$USERP2= <user>
##$USERP3= <user>
##$USERP4= <user>
##$USERP5= <user>
##$WDW= 1
##$XDIM= 65536
##$YMAX_p= 352070910
##$YMIN_p= -24801168
$$ End of Bruker specific parameters
$$ ---------------------------------
##NTUPLES= NMR SPECTRUM
##VAR_NAME=  FREQUENCY,     SPECTRUM/REAL,   SPECTRUM/IMAG
##SYMBOL=    X,             R,               I
##VAR_TYPE=  INDEPENDENT,   DEPENDENT,       DEPENDENT
##VAR_FORM=  AFFN,          ASDF,            ASDF
##VAR_DIM=   65536,         65536,           65536
##UNITS=     HZ,            ARBITRARY UNITS, ARBITRARY UNITS
##FACTOR=    0.620285442955139, 1,           1
##FIRST=     20137.2065510759, 0,            0
##LAST=      -20513.1999529892, 0,           0
##MIN=       -20513.1999529892, -24801168,   0
##MAX=       20137.2065510759, 352070910,    0
$$ Real data points
##PAGE= N=1
##DATA TABLE= (X++(R..R)), XYDATA
$$ [...]
##PAGE= N=2
##DATA TABLE= (X++(I..I)), XYDATA
37333A580793P0313P0421j54705k44970k06170k98043l29144Q2517N98158M55344
37323A624514k23640m31007J42159N66862K04061k68426p8398L39340K04908k21214
37313A859159k11129M7996j57436o48982n70842R0208M15402Q5615j37934K43450
37303A015507O64336M98042K4825j57247n9203p0771k37886k80365o8355K68652
37293A597535M93820L48391j95761o42408l83186L87450O85634J4521q58556q80301
37283E67139q2643N88088N57256J17178k68242n11175o25920m51331L9326M76762
37273D06438M83664J66854o5965q0999j04563k54225l25162j70429J0201J1946
37263G7760K0741L08832O67188N88469L9377m02533l37199n0818J0168j06154
$$ y = [1580793, 1651106, 1721527, 1566822, 1321852, 1115682, 817639, 488495, 571012, 1169170, 1624514, 1400874, 969867, 1112026, 1678888, 1882949, 1614523, 1536125, 1875465, 2080373, 1859159, 1648030, 1696026, 1538590, 889608, 318766, 408974, 824376, 909991, 772057, 1015507, 1679843, 2177885, 2202710, 2045463, 1986260, 1915489, 1677603, 1397238, 1328883, 1597535, 2091355, 2439746, 2243985, 1601577, 1218391, 1605841, 2291475, 2305996, 1447440, 567139, 484496, 1072584, 1629840, 1747018, 1478776, 967601, 341681, -109650, -70324, 406438, 890102, 1056956, 990991, 909992, 805429, 551204, 226042, 55613, 65814, 77760, 98501, 407333, 1074521, 1662990, 1702367, 1299834, 962635, 911817, 921985, 815831]
37253H15831p7408J09446J95593Q4931j27992l92818n92265l97156K85610Q62938
37243G66710O51337p3411k85035L33762Q13593K51591p96832j007158j34532O50136
37233A170161L91863m36255p69506m09339O396J35883K24561L22297P1585m67525
37223B40121n65868R8175P46195N48614j18180k54289K40368N18091J67072k58112
37213A362187k25748M5054J20530j7702j80701l03285l05702n8173L18154N05138
37203A259752M33874K67610p768m09579m91636J37980Q54546N82871n02406r71015
37193A154229k33280N44924K98078l34123k48237K73259K12406l64584n01413
37184H01259k8270K63248N9682k9582L76098P77620N75992j40252p92837q73445
$$ y = [815831, 738423, 847869, 1043462, 1128393, 1000401, 607583, 15318, -381838, -96228, 766710, 1418047, 1344636, 1059601, 1393363, 2206956, 2458547, 1661715, 654557, 520025, 1170161, 1562024, 1125769, 356263, -53076, -46680, 89203, 313764, 636061, 707646, 240121, -325747, -227572, 518623, 1067237, 949057, 694768, 935136, 1453227, 1620299, 1362187, 1136439, 1181493, 1302023, 1284321, 1103620, 800335, 494633, 436460, 754614, 1259752, 1693626, 1961236, 1953468, 1543889, 1052253, 1190233, 2044779, 2627650, 2125244, 1154229, 920949, 1465873, 1763951, 1429828, 1181591, 1454850, 1667256, 1302672, 801259, 772989, 1036237, 1095919, 1066337, 1442435, 2220055, 2796047, 2655795, 1862958, 989513]
37174I89513k96001M34442N55296n4107n86616l78391J47494K26642k5306J6259
37164A029225K62866R2301l99489m04906K42816P11100M22480j69645m00166k89688
37154A096894k22953k54983j56977J35108M13474M29644J71935k0162K03405O12532
37144B407917N23637j94729p42961m98701L6527O9582k34031j95338J28745J65698
37134A466346j1444J30407M01476R5834o09954p04855O690N15218K42089j03427
37124A428380J27493L95057o03n99484m56756L38522P56550K98617l91545n01615
37114A394616j05570P4021k30945l91791J89658J002678R48243j4656o31380j93277
37104B041597L44814q2381q86153q26332q2642J68193j64311p9807N41616O88898
$$ y = [989513, 693512, 1127954, 1683250, 1629143, 1042527, 664136, 811630, 1038272, 1012966, 1029225, 1292091, 1384392, 984903, 579997, 822813, 1533913, 1956393, 1786748, 1386582, 1096894, 873941, 618958, 461981, 597089, 1010563, 1440207, 1612142, 1591980, 1795385, 2407917, 2931554, 2736825, 1993864, 1495163, 1531690, 1601272, 1367241, 1171903, 1300648, 1466346, 1454902, 1585309, 1986785, 2082619, 1472665, 767810, 774500, 1289718, 1531807, 1428380, 1555873, 1950930, 1950327, 1350843, 894087, 1232609, 1989159, 2287776, 1896231, 1394616, 1289046, 1363067, 1132122, 740331, 929989, 1932667, 2880910, 2866254, 2234874, 2041597, 2386411, 2304030, 1417877, 591545, 508903, 677096, 512785, 432978, 974594, 1663492]
37094A663492J32717j13897L17871M60660j45881n26136o6602K69606l41364r97492
37084F52974n63225L37976L49891l62389m82638K33394O55171J70163m57077l68030
37074A66210K52955O72585N55262J08752k73045l03932j0950K74501K85689J11415
37064A839442m12M4738J74747K18296m6866n73653q13202l30898L70401L71543
37054A254136k46755m18432K25026P20421L30888k99620l04500M4463Q7110N8774
37044A451511M81511Q90414M43499n15938p61508M742P61868P06547K09583j3075
37034C659154R8691J27269j46449n34329o64461l59011M7766k7351n80395q12912
37024H07972j93796O63760P80305J42011m22836m53431k12701N905J65043J24984
$$ y = [1663492, 1796209, 1682312, 2000183, 2460843, 2314962, 1788826, 1722224, 1991830, 1650466, 652974, 89749, 427725, 777616, 415227, -67411, 165983, 821154, 991317, 534240, 166210, 419165, 1091750, 1647012, 1755764, 1482719, 1178787, 1167837, 1442338, 1728027, 1839442, 1839030, 1883768, 2058515, 2276811, 2229945, 1656292, 843090, 512192, 882593, 1254136, 1007381, 588949, 813975, 1534396, 1865284, 1565664, 1261164, 1305627, 1392737, 1451511, 1933022, 2823436, 3266935, 2750997, 1989489, 1994231, 2756099, 3462646, 3672229, 3659154, 3757845, 3885114, 3738665, 3204336, 2539875, 2180864, 2228630, 2201279, 1620884, 807972, 614176, 1277936, 2058241, 2200252, 1777416, 1323985, 1111284, 1117189, 1282232, 1407216]
37014A407216k63035o60848n13778J00102N08411M12926J99154J64991R4212j62026
37004A287325k79594p419L29710K88574k3213j39245N3319J69283q7334m65437
36994A125969m63701N85M34690L85258K5987j21837N8553J80019M414k31405k58226
36983A140306j33435J2156J87733L08187J57285j85637k98598n4999J13289j21173
36973A125114m72633n00370j72920K98929P47361R08034N27935q7060k28756J66137
36963B311771L05458k06200o90995n40005j88340j93330j81756L19064P70259
36954A705926M86739m2712J4014K41941k99407j145836r12561L36014R56813K87092
36944A628023l60990P9124P60767M69286m09807o78138k34055M4112j55274k79426
$$ y = [1407216, 1144181, 483333, -30445, 69657, 578068, 990994, 1190148, 1355139, 1449351, 1287325, 1007731, 1000312, 1330022, 1618596, 1595383, 1456138, 1509457, 1678740, 1591406, 1125969, 662268, 662853, 1097543, 1482801, 1508788, 1386951, 1445504, 1625523, 1629937, 1398532, 1140306, 1006871, 1019027, 1206760, 1514947, 1672232, 1486595, 1187997, 1132998, 1246287, 1125114, 652481, 152111, -20809, 278120, 1025481, 1933515, 2461450, 2374390, 2145634, 2311771, 2617229, 2411029, 1720034, 1180029, 991689, 798359, 616603, 935667, 1705926, 2192665, 2149953, 2163967, 2405908, 2106501, 960665, 48104, 384118, 1340931, 1628023, 1267033, 1346157, 2106924, 2576210, 2166403, 1488265, 1254210, 1298322, 1143048, 863622]
36934H63622K5727M63621O56630N00589J2504o20414r21335n62419J27839N18547
36924A064911M59474L12940K99607K54506M0000j92865k61086k10595k08476l10164
36914A248252m05692l53122j55751J4828M0008L4733J47532K58891J50021o5024
36904I14676m1194K12299K65446m7411k93385q2537L07333L27404o1514m11867
36894A089250m51547l14518j54584P0591L43230M30529J78963j91269k78176L0979
36884G53448M04282M40346J36975j36858j43031n2671q9319j15087J14902M16441
36874A729428L34616j31861m33212k64031P396j367o0752J63876L68489N1191
36864A763773m94374m34004K77092O47535J03312n59894l27124M92063P40973
$$ y = [863622, 889349, 1352970, 2009600, 2510189, 2522693, 1902279, 980944, 418525, 546364, 1064911, 1524385, 1837325, 2136932, 2391438, 2431438, 2238573, 1977487, 1766892, 1558416, 1248252, 842560, 489438, 333687, 348515, 388523, 423256, 570788, 829679, 979700, 914676, 873482, 1085781, 1351227, 1303816, 1010431, 927894, 1235227, 1562631, 1501117, 1089250, 637703, 323185, 168601, 239192, 582422, 1012951, 1191914, 1000645, 722469, 753448, 1157730, 1598076, 1735051, 1598193, 1455162, 1402491, 1313172, 1198085, 1312987, 1729428, 2064044, 1932183, 1498971, 1234940, 1242336, 1240969, 1180217, 1344093, 1712582, 1763773, 1269399, 835395, 1112487, 1760022, 1863334, 1303440, 976316, 1468379, 2209352]
36855B209352J54392l77247l15790k07239n08012o33348M1527Q90638P61186k73703
36845A741756r10329m29092M12686O09003K21056o6145r5176k36240n42055o29357
36835G6107l80095j42751q8659J08717O40837J012700O28464k16950n15468J25649
36825A248551Q51919O70493j88168o33961k67598J89736J06715k02758j81894
36816A593035J05832L16691M30997M45341M8809o96077r26677j27072P74471N25021
36806B490371n42097r16005j38547O37587M76308j83731n52940n35850k67008
36797D68088L43893J007297R53339J06320n09516k39001J80882j33379p54644
36788A423279p00772j3828M51683L90293J98525O2435j51492k62027P7795O31260
$$ y = [2209352, 2363744, 1986497, 1670707, 1463468, 955456, 322108, 363635, 1254273, 2015459, 1741756, 831427, 402335, 815021, 1424024, 1645080, 1578935, 1483759, 1247519, 705464, 76107, -303988, -446739, -535398, -426681, 214156, 1226856, 1855320, 1638370, 1122902, 1248551, 2100470, 2770963, 2582795, 1948834, 1681236, 1870972, 1977687, 1774929, 1593035, 1698867, 2015558, 2446555, 2891896, 2940705, 2244628, 1317951, 1190879, 1965350, 2490371, 1948274, 1032269, 893722, 1531309, 2007617, 1823886, 1270946, 735096, 468088, 811981, 1819278, 2772617, 2878937, 2369421, 2130420, 2311302, 2177923, 1423279, 722507, 708679, 1160362, 1550655, 1749180, 1811615, 1660123, 1398096, 1475891, 2107151]
36778B107151P22593J55149n68923q90616o14588J01442P16441N83774k02971
36769B109452o22675k4535Q08595O99015j97710o83866l23177J38122J57458Q1968
36759B142647J89563Q9133m17637p26663l36612K52668K49884k29886l98985j7264
36749G96848L48551L02248J67559K86325L39779q3672n82655l63664M41213P30925
36739B383457N2825n94348k74760L57712J38814n89718n08525L58742N70431k45696
36729A648934o38079J98374R36875L18222o75595m60850M88079N07691m30643
36720A893008p67000N391O70223M31785J860Q1380K29016q4456m48165k83445
36710A729597J79482L55778J48690j51983l32096k75301L5280L27019K79304K8135
$$ y = [2107151, 2829744, 2984893, 2415970, 1525354, 910766, 1012208, 1728649, 2312423, 2109452, 1486777, 1462242, 2270837, 2969852, 2772142, 2088276, 1765099, 1903221, 2060679, 2142647, 2332210, 2421343, 2003706, 1277043, 940431, 1193099, 1442983, 1213097, 814112, 796848, 1145399, 1447647, 1615206, 1901531, 2241310, 2157638, 1574983, 1211319, 1652532, 2383457, 2436282, 1841934, 1567174, 1924886, 2063700, 1473982, 965457, 1324199, 1894630, 1648934, 1010855, 1209229, 2146104, 2464326, 1788731, 1327881, 1815960, 2323651, 1893008, 1126008, 1131399, 1801622, 2233407, 2235267, 2316647, 2545663, 2461207, 2013042, 1729597, 1909079, 2264857, 2413547, 2261564, 1929468, 1654167, 1689447, 2016466, 2295770, 2323905]
36700B323905m9972o219j58742l55745j66059K32256K24150j42484j75619K13840
36690A939311L07234j12938l12154R2281M05261N2606m18232k88423J60350K48521
36680B073817L9821K3415J50158M4587j88770j94554j08210k58073l70460O1219
36670A272950P34825P78350J07854l20780J04905P65762P44184O7651n26010o73699
36660C055992o18210n35797k84745R3689J89563j61092m64519j83703M44100O59859
36650B195137K12771l08501k88926J43083L81741J24101l67007o37170m65272
36641I89957P554M12910M48758J28042k53229l59334k0696O13343J009400O37687
36631C614392k89244q08292l90349K34238R3664n32323n61275J53260O71548N81490
$$ y = [2323905, 2273933, 2267714, 2108972, 1753227, 1587168, 1819424, 2043574, 1901090, 1725471, 1939311, 2246545, 2133607, 1821453, 1913734, 2318995, 2371601, 1953369, 1664946, 1825296, 2073817, 2113638, 2137053, 2287211, 2331798, 2143028, 1948474, 1840264, 1582191, 1211731, 1272950, 2007775, 2786125, 2893979, 2573199, 2678104, 3443866, 4188050, 4255701, 3729691, 3055992, 2437782, 1901985, 1617240, 1710929, 1900492, 1739400, 1274881, 1091178, 1535278, 2195137, 2407908, 2099407, 1810481, 1953564, 2335305, 2459406, 2092399, 1455229, 989957, 997511, 1410421, 1859179, 1987221, 1733992, 1374658, 1353962, 1967305, 2976705, 3614392, 3325148, 2516856, 2126507, 2360745, 2454409, 1922086, 1360811, 1514071, 2185619, 2767109]
36621B767109M86699N99538K13314q08971j335675o60911K47652K53200k18017
36612A543938j46561K82066K23176j69498r0638L53084L47281j33906l73177k52754
36602A583011k59054l13291Q4340O37141N28338p1093j27743M84659O91409o295
36592C231422p28671o44692j04957J64033Q2250n8901j45269j19258O9286J89474
36582A934717K4785o7122L30034P25788K96587o17403q01943p0424M46842K08780
36572B410641N1776N21574Q08209J94531o31299p26269l76939l49059m52245k4592
36562A426328O92637Q29513K72751k29077k33326l1944N1198O1694N4700q7797
36552B806677l50905m76274k72972J48829M73360M40110J05348j52229p9560N6943
$$ y = [2767109, 3253808, 3853346, 4066660, 3257689, 1922014, 1261103, 1508755, 1761955, 1543938, 1397377, 1679443, 1902619, 1733121, 1642483, 1995567, 2342848, 2208942, 1835765, 1583011, 1323957, 1010666, 1095006, 1732147, 2260485, 2189392, 2061649, 2546308, 3237717, 3231422, 2502751, 1858059, 1753102, 1917135, 1999385, 1940484, 1795215, 1675957, 1745243, 1934717, 1959502, 1892380, 2222414, 2948202, 3244789, 2627386, 1825443, 1755019, 2201861, 2410641, 2462417, 2983991, 3792200, 3986731, 3355432, 2629163, 2252224, 1903165, 1450920, 1426328, 2118965, 2948478, 3221229, 2992152, 2758826, 2726882, 2778080, 2839774, 2894474, 2806677, 2455772, 1979498, 1706526, 1855355, 2328715, 2768825, 2874173, 2721944, 2642384, 2699327]
36542B699327j43178n04302m44567J11808N60861N03193K21113M1189j76799n34849
36532B333796o17955o0820P18943Q96944K70837m84819o34817k13023R9481j15642
36522B192925m25926j42884N73307P55492M163q04051p01962L3908M49996L37664
36512B272632J99309J49834j10816l96297j94867K67828K13313l21497m05726
36503A673713K24104O29429J73540m49376l56301J72049K68179j55445m17466
36494A762426j54337K92179M89594M10342K73692K01720J43528N0125J1341J04172
36484C584782J62009k6221k79526k20221J9502r8525n14386m75287J59779M65838
36474B777744m8881n04928j30411L56362N2667m20581k4434P16223N89882p6414
$$ y = [2699327, 2556149, 2051847, 1607280, 1719088, 2279949, 2783142, 3004255, 3045444, 2868645, 2333796, 1715841, 1655021, 2373964, 3270908, 3541745, 3056926, 2422109, 2209086, 2308567, 2192925, 1766999, 1624115, 2197422, 2952914, 2957077, 2153026, 1451064, 1484972, 1934968, 2272632, 2471941, 2621775, 2510959, 2114662, 1919795, 2187623, 2400936, 2079439, 1673713, 1897817, 2527246, 2700786, 2251410, 1895109, 2067158, 2335337, 2179892, 1762426, 1608089, 1900268, 2389862, 2800204, 3073896, 3275616, 3419144, 3469269, 3480610, 3584782, 3746791, 3720570, 3441044, 3220823, 3240325, 3141800, 2627414, 2152127, 2311906, 2777744, 2728863, 2223935, 2093524, 2449886, 2502553, 2081972, 2057538, 2773761, 3363643, 3287229]
36464C287229j7203N60589K97812p04432q32797K37112Q90113K68758m59958l03112
36454C224111M6114j43188k74806J68785M50182O885l58429N2313M61518M93o77793
36443B956185n10748J96034M27603J32694k1028N0512l2611j64862K1034L35609
36433C390422L10031k4351l14426m67719m99690k67091J33375K22471j21263l28173
36423B033586R551N20164O78375M54461K6838m84637p34199l51770L23792N12216
36413B988377J72885J9956K43969K94369O9066P4281K05004k20066r12651o93744
36403B241446M06102Q37874L1464n77422P209O49362J30545p44260o55741n705
36393B320874P2606j69821K23267R17203P73083j19642n37074o1985M51102L21280
$$ y = [3287229, 3270026, 3830615, 4128427, 3423995, 2591198, 2828310, 3718423, 3987181, 3527223, 3224111, 3270225, 3127037, 2852231, 3021016, 3471198, 3478083, 3119654, 3171967, 3633485, 3633978, 2956185, 2445437, 2641471, 3069074, 3201768, 3180740, 3231252, 3198641, 3033779, 3054813, 3390422, 3700453, 3676102, 3361676, 2893957, 2394267, 2127176, 2260551, 2483022, 2361759, 2033586, 2043137, 2563301, 3241676, 3696137, 3722975, 3238338, 2504139, 2152369, 2476161, 2988377, 3161262, 3181218, 3425187, 3719556, 3788622, 3862903, 4067907, 3847841, 2935190, 2241446, 2647548, 3485422, 3516886, 2939464, 2946673, 3596035, 3726580, 2982320, 2326579, 2320874, 2393480, 2223659, 2446926, 3364129, 4137212, 4017570, 3480496, 3418511, 3869613, 4190893]
36383D190893j42477l21333m0926L44553K47156m97508j111385o64400M68431
36374B473004R13839L19669j62048J51303M47864R1294j78763K58036O05253Q7480
36364E006931n40068k61729M68604O22614L06006K41597L65821K37376J05826
36355F552978L30370M24138j25517p23112m89680L44614Q70420P58258K56844
36346H199313l99686q40447n74946J84684N74634M38823N19360Q79229O39580
36337I620544j51630j99869O93381J002132K22050q4496N44902j57248l402256
36328H087510o260903n274162j475837J227316J443538R34115P65241J89312p84078
36319a147948q18592K77602R61220L91347m72038o10093j48313M28488Q47358
$$ y = [4190893, 4048416, 3727083, 3686157, 4030710, 4277866, 3780358, 2668973, 2004573, 2473004, 3386843, 3706512, 3544464, 3695767, 4143631, 4234925, 4056162, 4314198, 4919451, 5006931, 4466863, 4205134, 4673738, 5296352, 5602358, 5843955, 6209776, 6447152, 6552978, 6883348, 7307486, 7181969, 6458857, 5969177, 6313791, 7184211, 7942469, 8199313, 7799627, 6959180, 6384234, 6568918, 7143552, 7582375, 8101735, 8980964, 9620544, 9468914, 9269045, 9962426, 10964558, 11186608, 11102112, 11647014, 11489766, 8087510, 1826607, -3447555, -4923392, -3696076, -2252538, -1318423, -553182, -363870, -1147948, -1966540, -1688938, -727718, -336371, -808409, -1418502, -1566815, -1138327, -290969]
36310b90969P77585K27387k3443M22114N81030l57207j277705o85607P21936J018106
36300A113227O0523n19769k5774O22816P32956M77615j30874j093852j479056
36291b42188m41061J046434J297540M72245J38791N74293N58205k44827p60873
36282B398559m75663n9216J06829L14126L97937j09974p08319m30577M54174Q25337
36272B713213N76298M52846L78061k29148q04836l22244O06155M24873o57692
36263C137526q46783K50635R96605M21265m70863n88786j79580J49041L22432
36254C191492L03255k1437k71362l1978K45316l4433m10486j98784J26813r7460
36244B800936k03282N67521J216389M97517o27592m47201M39619K33268o35747
$$ y = [-290969, 486616, 714003, 690560, 1112674, 1693704, 1336497, 58792, -626815, 95121, 1113227, 1173750, 653981, 628207, 1251023, 1983979, 2461594, 2330720, 1236868, -242188, -683249, 363185, 1660725, 2132970, 2271761, 2846054, 3404259, 3159432, 2398559, 1922896, 1863680, 1970509, 2284635, 2682572, 2572598, 1864279, 1433702, 1887876, 2713213, 3289511, 3742357, 4120418, 3891270, 3086434, 2764190, 3370345, 3795218, 3137526, 2290743, 2541378, 3537983, 3959248, 3488385, 2899599, 2720019, 2869060, 3191492, 3494747, 3473310, 3201948, 3169970, 3415286, 3380853, 2970367, 2771583, 2898396, 2800936, 2597654, 3165175, 4381564, 4879081, 4251489, 3804288, 4243907, 4477175, 3841428]
36235C841428k77713Q99901O07780j124099j659253j98174Q93361J58570p39103
36226B402698k07001P28496O49343J14673J62123M13259J98756n8251J14680K28551
36216D747327r4856l42321j77697j9983l1379J48788L52032j966n82406m89161
36206C508378P3596J50713q4079K78160Q23076L44804p13291p38334J99114N02696
36196D344833L6013K23436J085478J094379K45263K09699R90089O30797j046262
36187G813725j715533n41055L73218k33942p58414Q193O78952Q8492n21599k595
36177E189442N88016K20199j71536K20600L84075l38142o69876J92913Q28999
36168F444690R2324p79744m36786K61313J00491k53827J81959O95569L26819k71564
$$ y = [3841428, 3563715, 4463616, 5071396, 3947297, 2288044, 2089870, 2983231, 3141801, 2402698, 2195697, 2924193, 3573536, 3688209, 3850332, 4263591, 4462347, 4404096, 4518776, 4747327, 4652471, 4310150, 4132453, 4112470, 4081091, 4229879, 4581911, 4579945, 3997539, 3508378, 3581974, 3732687, 3648608, 3926768, 4749844, 5094648, 4381357, 3643023, 3842137, 4344833, 4380846, 4604282, 5689760, 6784139, 7029402, 7239101, 8229190, 8859987, 7813725, 6098192, 5557137, 5930355, 5696413, 4937999, 4946192, 5625144, 5713636, 5192037, 5189442, 5777458, 5997657, 5826121, 6046721, 6430796, 6092654, 5422778, 5615691, 6444690, 6537014, 5757270, 5320484, 5581797, 5682288, 5428461, 5610420, 6305989, 6632808, 6361244]
36158F361244j73195J34492k3673j27020K45043L17161k91141n08879K85331R45008
36148G164371M76712l36879m89866l01302k55819J5074N09754L65590m09518n56330
36138F181787J84732M58109k00617m71775J88259M90006j09772k79701N07796
36129F948824P50375k16797p03446L71783J445981R59860k05269n97117l85067
36120H369127j79854K42033O94312K20818q50599q15406M13674Q22682j67267
36111H749520o02137L77442R64764J85402k83833N22936R33847n5616p56496m3957
36101I991872N23333j31626m97791L83378Q83947L9516m30485M35639P32198o26693
36091A1303288j497778l13492J026257O73281l0673M23014Q08316j4874n64641
$$ y = [6361244, 6188049, 6322541, 6298868, 6171848, 6416891, 6734052, 6442911, 5934032, 6219363, 7164371, 7641083, 7304204, 6814338, 6513036, 6257217, 6272291, 6782045, 7147635, 6738117, 6181787, 6366519, 6824628, 6624011, 6152236, 6340495, 6830501, 6720729, 6441028, 6948824, 7699199, 7482402, 6778956, 7150739, 8596720, 9556580, 9351311, 8754194, 8369127, 8189273, 8431306, 9125618, 9346436, 8495837, 7680431, 8094105, 8916787, 8749520, 8147383, 8524825, 9489589, 9674991, 9391158, 9914094, 10847941, 10792325, 10035829, 9991872, 10515205, 10383579, 9885788, 10269166, 11153113, 11192629, 10762144, 11197783, 11929981, 11303288, 9805510, 9492018, 10518275, 11191556, 11160883, 11583897, 12392213, 12377339, 11812698]
36082A1812698L19658J122965P03250M22658R46932N45517j082539j276318P52045
36073A4266866J782717O7474j466806n03142P60402K66783o7711J225759J695627
36064A8027969j81973j409375K12884J887821J073054O7705J072432J719866Q1484
36055B2551867j016460N57420J725532N3346j308075L69871K074013J019023L5819
36046B6062356J522762K290721J93413q14551J681027L118592O51203o79785K419390
36037C6445128M377193J268272r42354K322923M835860J618982m91526L984275
36029E3418753P200043K675059o97038M983974R970726N093723J534924R804890
36021I3985054J5735689O626075L413836K5828862L8384170j3611937j09563823
$$ y = [11812698, 12132356, 13255321, 13958571, 14381229, 15328161, 15873678, 14791139, 13514821, 14266866, 16049583, 16117057, 14650251, 14147109, 14907511, 15174294, 15106583, 16332342, 18027969, 17845996, 16436621, 16649505, 18537326, 19610380, 19678085, 20750517, 22470383, 22551867, 21535407, 22092827, 23818359, 23871705, 22563630, 22933501, 25007514, 26026537, 26062356, 27585118, 29875839, 30069252, 29254701, 30935728, 34054320, 34705523, 34025738, 36445128, 40822321, 42090593, 41148239, 43471162, 48307022, 49926004, 49434478, 53418753, 60618796, 63293855, 62596817, 67580791, 77551517, 82645240, 84180164, 93985054, 109720743, 116346818, 119760654, 145589516, 183973686, 170361749, 60797926]
36014F0797926j53980453r6099906N97002M3665054K4707648K789710P775091
36007a09747928J5971496Q944441J545776N901890J0085068M882300N23167M512231
35999e7381559P569701K951419r46985K302086N368450K198186r35700J412468
35991c7461934L712515J174195j022888J482877L643165J113971j424436M10560
35983b8371975K593327J065604o29324J008136K399803K31408j785553j4501K257119
35974b1245956J301657k78844P32677J873668K96172j387718k37294J357307N38379
35965a7049952n60101N99124J782057M85558j010313o4615J246143L30494q55596
35956a5097201K27953J669927Q31832o02076j0978J179038N19103o59341k944
$$ y = [60797926, -93182527, -189282433, -188685431, -145020377, -120312729, -117523019, -109747928, -93776432, -84831991, -83286215, -77384325, -67299257, -62416957, -61893790, -57381559, -49811858, -46860439, -47807424, -45505338, -40136888, -37938702, -38874402, -37461934, -33749419, -32575224, -33598112, -32115235, -28472070, -27358099, -28782535, -28371975, -25778648, -24713044, -25342368, -24334232, -21934429, -21703021, -23488574, -23503075, -21245956, -19944299, -20223143, -19490466, -17616798, -17320626, -18708344, -18945638, -17588331, -17049952, -17610053, -17010929, -15228872, -14743314, -15753627, -15818242, -14572099, -14241605, -15097201, -14869248, -13199321, -12367489, -12969565, -12980543, -11801505, -11282402, -11941743, -11944687]
35947a1944687J222690O45910p01846n64347L10368P1651m57915K90611J167953
35938i959612M31092p67258m84090M50474K75994l11129J72673Q97577M11233
35929h883046m29689j73366M25426J14266k60885L91969R34278J20692p73525
35920h533880k05352P12643L12821n37483k57409M09447L4399n80885O016R85695
35910g653988P84976n4170j34012J72684p6244j52847P69779J407390M13295r11065
35900e434202o94493K23693n8621r87986o94417M90840O97058j14446l29851L29373
35890f573052O48410L19342J15961Q2667k92481n70067m0875O24176L15782n18025
35880e888162o28139m2300L40124M44956O23334M62718k94745o56904N2421O69299
$$ y = [-11944687, -10721997, -10076087, -10777933, -11342280, -11031912, -10960261, -11418176, -11127565, -9959612, -9528520, -10295778, -10779868, -10329394, -10053400, -10364529, -10191856, -9294279, -8883046, -9312735, -9486101, -9060675, -8946409, -9207294, -8815325, -7881047, -7760355, -8533880, -8739232, -8026589, -7713768, -8251251, -8508660, -8099213, -8064814, -8645699, -8639683, -7653988, -6869012, -6923182, -7057194, -6884510, -6960754, -7113601, -6343822, -4936432, -4523137, -5434202, -6128695, -5905002, -5963623, -6951609, -7646026, -7155186, -6458128, -6572574, -6902425, -6573052, -5924642, -5605300, -5489339, -5406672, -5699153, -6269220, -6310095, -5685919, -5370137, -5888162, -6516301, -6558601, -6218477, -5773521, -5150187, -4687469, -4982214, -5639118, -5586697, -4917398]
35870d917398P4309o66289j16346Q50756N39644n18400n51570K94599M28259j80034
35860d762470j36594N63933N00944m26908o85687K32307J008677P17576j4930
35851c003152m06285m66446l04190J01250L15781r1470n73768l27070K63687K21772
35841d269891k99661l28714J73831L52437L8913j39007m3022l5550O4609O38942
35831c847113J118389O13731m85992r60652o32877l76116m15458j21228N13950
35822d593366O60261Q4258m58945m51322j57850J46059M89335O90822M54597J3098
35812c123053j15837N6486J12771m7758k56553m80303n64757j39601N66145N94774
35802c397686k59819p86974j59395O64952N63041J28061L86755P28021J3235j081970
$$ y = [-4917398, -4843089, -5509378, -5625724, -4774968, -4235324, -4753724, -5305294, -5010695, -4582436, -4762470, -4899064, -4335131, -3834187, -4261095, -4946782, -4714475, -3705798, -2988222, -3003152, -3409437, -3875883, -4180073, -4078823, -3763042, -3854512, -4428280, -4755350, -4491663, -4269891, -4569552, -4898266, -4724435, -4371998, -4333085, -4472092, -4515114, -4550664, -4486055, -3847113, -2728724, -2114993, -2600985, -3561637, -4194514, -4570630, -4986088, -5107316, -4593366, -3933105, -3848847, -4307792, -4759114, -4916964, -4770905, -4281570, -3590748, -3136151, -3123053, -3238890, -3182404, -3069633, -3117391, -3373944, -3854247, -4419004, -4558605, -3992460, -3397686, -3657505, -4444479, -4603874, -3938922, -3375881, -3247820, -2861065, -2133044, -2119809, -3201779]
35792c201779r44902K59744Q61441L81671j11413j74826m06711p02774k38876
35783d278425O20517N16886m57372o31823L98721R58154J37818o30708l8314R16899
35773b487647O96764k90260o07012j51100L9689k91471m14511m2779L12442L54931
35763b880954L55123M49134L84387P0593k02793k11447m9491J20207K41633K42520
35753a481088K1256l17466l95574M2152O43699O30750k46048j123891r41235Q2124
35743c085321O18214J10568m08424M0510Q10726O72442k27210o67703k90741O1118
35733b365821p9129j56495J93688M04778k2714o20453o54439j62695K53509K84039
35723b925732Q6312j25013k56280k28845M655L35624N12923L30411j29591m47246
$$ y = [-3201779, -4146681, -3886937, -3025496, -2643825, -2755238, -2930064, -3336775, -4039549, -4278425, -3657908, -3141022, -3598394, -4230217, -3831496, -2873342, -2735524, -3366232, -3404546, -2487647, -1790883, -2081143, -2688155, -2839255, -2799566, -3091037, -3505548, -3548327, -3235885, -2880954, -2525831, -2076697, -1692310, -1621717, -1824510, -2035957, -2085448, -1965241, -1723608, -1481088, -1459832, -1777298, -2172872, -2130720, -1487021, -856271, -1102319, -2226210, -3167445, -3085321, -2467107, -2356539, -2764963, -2724453, -1913727, -1241285, -1468495, -2136198, -2426939, -2365821, -2444950, -2601445, -2407757, -2002979, -2025693, -2646146, -3300585, -3463280, -3209771, -2925732, -2839420, -2964433, -3220713, -3449558, -3444903, -3109279, -2596356, -2265945, -2395536, -2842782]
35713b842782k63983K11748L98838J56947j0806K09292M14568J94454j29028m1658
35703a702410K59637J60111l88943p94505o37001q4267M07764M50710j6460n07828
35693b853192l59287L50622P17877K76312k60314j46654J59981j65843p70603
35684c051101n79906M01385R67130N08512j63847j49615K96706L71657n9995m20039
35674a879113k67938K27151N40998L23915k31632n37205k76092J57831J39002
35665a803083l57123p14576m50183K65597Q83708J031789P38883K73277j30648
35656b62359l66081l36502K3128M60200M53907r2353n33757l74918r6317l34843
35646a459895o36708j33118P67774P62453j98196o82091q3518M43111M0778m61151
$$ y = [-2842782, -3106765, -2895017, -2496179, -2339232, -2350038, -2140746, -1726178, -1531724, -1660752, -1702410, -1442773, -1282662, -1671605, -2466110, -3103111, -3187378, -2779614, -2328904, -2345364, -2853192, -3212479, -2861857, -2143980, -1867668, -2127982, -2274636, -2114655, -2280498, -3051101, -3631007, -3229622, -2262492, -1753980, -1917827, -2067442, -1770736, -1399079, -1459074, -1879113, -2147051, -1919900, -1378902, -1054987, -1286619, -1823824, -2099916, -1942085, -1803083, -2160206, -2874782, -3324965, -3059368, -2175660, -1143871, -404988, -131711, -262359, -628440, -964942, -941814, -481614, -27707, -120060, -653817, -1028735, -1125052, -1459895, -2096603, -2229721, -1461947, -699494, -897690, -1579781, -1663299, -1220188, -1179410, -1640561]
35636a640561k03652J75573p5987l00929K47211P81553L17277m13703j52537O38662
35626f27093N86996k03908n21021l05711n24585j047946p38411L30577P67846
35617b283256K16123j01986M03577P50838K50491l50575l20760q6326j54924j80557
35607a857355J30990L26768J39737O7329L63988M91124J96596P4943L87225M21803
35597G43148j94255o28082k04231L56822J21966m81619m70788m5947k13310r72465
35587a988761j183223l23897P07441Q95246M02470O8772J56347K32640R6134J13455
35577h23376M35497N01233j04549p31200m78865K52045J84946p20485r73810M1682
35567b416882Q72907L11882n35041j21320Q09549M80759p20266p50886O07622
$$ y = [-1640561, -1844213, -1668640, -1744627, -2045556, -1798345, -1016792, -699515, -1113218, -1265755, -627093, -40097, -244005, -765026, -1070737, -1595322, -2643268, -3381679, -3051102, -2283256, -2067133, -2169119, -1765542, -1014704, -764213, -1114788, -1435548, -1521874, -1676798, -1857355, -1726365, -1399597, -1259860, -1192531, -828543, -337419, -140823, -65880, 321345, 743148, 548893, -79189, -283420, 73402, 195368, -286251, -757039, -802986, -1016296, -1988761, -3171984, -3495881, -2788440, -1893194, -1490724, -1421952, -1265605, -1032965, -936831, -823376, -387879, 113354, 8805, -722395, -1201260, -949215, -764269, -1484754, -2458564, -2416882, -1543975, -1232093, -1767134, -1888454, -1078905, -598146, -1318412, -2069298, -1461676]
35558a461676J324985M86139l85956j33116K18788l75474j011233n36313L67530
35549a506326M16827j65868l34519n7229J5376m3265K28900N37246L13137j55854
35539g51575k37699r7317k19774l19803J17451O68565N22104j59194n47551m98186
35529a522979m87624n12095j85768K85884L59125K10090M19044P41393L98250
35520b94680m18296n89764J63836P43549L08276n59414q48620m51722O9144L75150
35510a502541M16067J22462l67595n31541o3376N86243P55844M70426K93934L84244
35500E64167K60707l51416r45071q69519k44167K39828K92746K32312K04556q3600
35490f99457n61235m95390L71772J061721O41420k50342k90806M40413O15805
$$ y = [-1461676, -136691, 349448, -36508, -169624, 49164, -326310, -1337543, -1873856, -1506326, -1089499, -1255367, -1589886, -1647115, -1631739, -1675004, -1446104, -908858, -595721, -751575, -989274, -1086591, -1306365, -1626168, -1508717, -840152, -318048, -477242, -1024793, -1522979, -2010603, -2522698, -2708466, -2422582, -2063457, -1853367, -1434323, -692930, -294680, -712976, -1302740, -1138904, -395355, -87079, -646493, -1495113, -1946835, -1877691, -1502541, -1086474, -964012, -1331607, -1863148, -1926524, -1340281, -584437, -114011, 179923, 564167, 824874, 473458, -471613, -1341132, -1585299, -1345471, -1052725, -820413, -615857, -699457, -1260692, -1756082, -1384310, -322589, 318831, 68489, -222317, 218096, 833901]
35481H33901j39935o94114l64007N4573j43885l60258L9690M45142J04558m61139
35471f85474l53256J58160K02948j72294k62924j2653J03249J08504L17105M63807
35461a32828J60456j56307R1790L74477j94603j134519j091218J295P42176M04658
35451i34623j80489k11197j3170m2463j8243L08027N37596M05042K86144L75722
35441E12346K42364k45956m56011p0351K43107n8082m33640j91576L61742N35833
35431D39776L80606L34934L01373l8191m19825l84553j27256j43740l41238k89368
35421b87482n5485O91l7617P1142L8342m36570p65816j83103Q04273Q90564l3181
35410E758o21481j26004N48269M32250k2089N8913M09510J80830n13827p72145
$$ y = [833901, 693966, -148, -364155, -309582, -453467, -813725, -774035, -328893, -224335, -685474, -1038730, -880570, -677622, -849916, -1112840, -1125493, -1022244, -913740, -596635, -132828, 27628, -128679, -36889, 337588, 142985, -991534, -2082752, -2081457, -1339281, -934623, -1115112, -1326309, -1339479, -1381942, -1400185, -1092158, -554562, -149520, 136624, 512346, 754710, 508754, 52743, -17608, 225499, 167417, -266223, -457799, -96057, 439776, 820382, 1155316, 1456689, 1418498, 998673, 614120, 486864, 343124, 1886, -287482, -342967, -342276, -379893, -308751, -270409, -706979, -1472795, -1655898, -851625, 38939, 5758, -615723, -741727, -193458, 238792, 216703, 275616, 685126, 865956, 352129, -420016]
35400d20016l73722p632o8556j89631q1524L0398J9728J36048L91793L86298P2369
35389a04447m534L42351M54756j16955p17782n22945J31697K85254r2508j39275
35379d84388L60618N93856J34123l07631q8351K90989O2040n09179n67889k9865
35369e45677L84289L11279J22832J32097J44992n1132l19061m67020m76043l18036
35359a081480M0358L69619L46586Q7896O0763L29452L75238j00964o42891o35839
35349h51262j18810L32220L23213k3612k98255j79594K65229N59983L13431k08817
35339A13726l24945J52126O32865N59555Q7033l04372m65947m93478l44563J0032
35329c77968K86105J69212k28478n13805m71233j42563L00953N19811J96723m00036
$$ y = [-420016, -793738, -801370, -869926, -1059557, -1141081, -1110683, -1090955, -954907, -563114, -176816, -104447, -108981, 233370, 688126, 571171, -146611, -669556, -537859, -252605, -345113, -484388, -123770, 470086, 604209, 296578, 208227, 499216, 561256, 52077, -515812, -545677, -161388, 149891, 272723, 404820, 549812, 498680, 179619, -287401, -763444, -1081480, -1041122, -671503, -324917, -237021, -176258, 153194, 528432, 427468, -215423, -851262, -970072, -637852, -314639, -338251, -636506, -816100, -550871, 9112, 322543, 113726, -211219, -59093, 573772, 1133327, 1220360, 915988, 450041, -43437, -388000, -377968, -91863, 77349, -151129, -664934, -1136167, -1278730, -977777, -457966, -261243, -661279]
35319f61279m68117K49926Q86701N75699k52255m98270k4609K98058O5979j73019
35309a186m4383N6077j59522k88689j0967L11375L12391K21842K65206J39873
35299H02017l11161n53372j93956K21495M1681l68046k36503K74947L49470q7233
35289f0661k93107j2225J72968m5831j86406J05140M31671L55242O6865q3646
35279D50010j64755l29575l79821j13897K49517L88375L18199K04082M7251j45526
35269E23860j92066j9351J68620K26514K39098J84398j25219n37123n28331j6158
35259g5758L67467K44608J18467M32902O27907n023r72152j116802l32947L17242
35249c94089K45119M3438K63312M70553J06696m47722m22438J31832M08193j521
$$ y = [-661279, -1129396, -879470, 7231, 582930, 330675, -167595, -192204, 105854, 171833, -1186, -45569, 10508, -149014, -437703, -448670, -137295, 175096, 396938, 662144, 802017, 490856, -62516, -256472, -34977, 6704, -361342, -597845, -322898, 26572, -60661, -353768, -365993, -193025, -238856, -425262, -320122, 111549, 466791, 533656, 450010, 285255, -44320, -424141, -538038, -288521, 99854, 418053, 622135, 669386, 523860, 331794, 312443, 481063, 707577, 946675, 1131073, 1005854, 468731, -59600, -75758, 291709, 536317, 654784, 1087686, 1715593, 1710570, 738418, -378384, -711331, -394089, -148970, -105532, 157780, 628333, 735029, 287307, -135131, -3299, 404894, 403373]
35239D03373o02478p14706l00622J00197R8940p0438R6793O06114Q33630L78197
35229H29000k57089k95971J83354L80593J8203k81415o8201K37963J55932k8952
35219H73417J19829K85226r1160p08790o99618L2803N93126L72594j57353k39619
35209C80455J23286L29259P0139l11284k65349L33139R44460Q14041j22450r22174
35199A373522o51996L44663P95664K04973n11512m37027M2538J5167m48057m89704
35189B38231O3077M18846J17851k88499k03662J06053Q7446j67648j93348o772
35179A71575j9655k25737j41103L51404O64577L01930l75022n50575Q403O59762
35169H45559O74917P9055m62085m78732j73161j0669r6581j94638j85270j36635
$$ y = [403373, -199105, -913811, -1214433, -1114236, -1015296, -1085734, -988941, -382827, 450803, 829000, 571911, 275940, 459294, 839887, 858090, 576675, 508474, 746437, 902369, 873417, 993246, 1278472, 1187312, 478522, -221096, -188293, 404833, 777427, 620074, 380455, 503741, 833000, 903139, 591855, 326506, 659645, 1604105, 2418146, 2295696, 1373522, 721526, 1066189, 1861853, 2066826, 1555314, 1118287, 1160825, 1175992, 727935, 238231, 301308, 720154, 838005, 549506, 345844, 451897, 539343, 371695, 178347, 171575, 151920, -73817, -214920, 136484, 801061, 1102991, 727969, 177394, 185797, 845559, 1520476, 1599531, 1137446, 658714, 485553, 474884, 378303, 183665, -1605, -138240]
35159a38240K5342M57323R04147P66199l0239o67045m08316L68395O68428K13954
35149B159948l41873m71587l59381l03295j92082J01585L31156K78217J43779
35140A346467J42617Q0419k12945l79464m4266L97760J89805o12868j056134n62008
35130g10617K91353O05253L29175J28483L29080N14230K10238m02415o74771k73527
35120C46482L95612O25460K29093k43890k40905L6257l8866m95601o13738j9111
35110a9207O00868L99134l59365o26436p8392M68297L29015q9835o5497K65248
35100H23830J89476l64981o17668m1472Q41051J041529K60568p50410r47856q2670
35090C51397R79542J147870L30722n06959o06239k70282j27791r6926K12906M69220
$$ y = [-138240, -112898, 344425, 1248572, 2014771, 1984532, 1317487, 909171, 1277566, 1945994, 2159948, 1818075, 1346488, 987107, 683812, 491730, 593315, 924471, 1202688, 1346467, 1489084, 1569503, 1356558, 977094, 932828, 1330588, 1520393, 907525, -148609, -710617, -419264, 185989, 515164, 643647, 972727, 1486957, 1697195, 1294780, 620009, 346482, 742094, 1367554, 1596647, 1352757, 1111852, 1148109, 1109243, 613642, -96, -19207, 581661, 980795, 621430, -5006, -83398, 384899, 713914, 624079, 558582, 823830, 1013306, 648325, 30657, -10815, 830236, 1871765, 2132333, 1381923, 434067, 351397, 1330939, 2478809, 2809531, 2302572, 1696333, 1426051, 1298260, 1201334, 1414240, 1883460]
35080A883460r22q54072q77838J79685R77137M24858o93794q27324J93844J089364
35070A494398R24642L5872p66176j059052p78989o2978O46279Q46566N14972N1762
35060A847296k96148n06401l77836K69146R31841P40697k66381r07963l89424
35051A044827N41960O34506j18349n84928j87184L82817L18362j68593l33188
35042A530230m4203J61265N208j51073L9348L57984M00098J74508k3501j19265
35032B330599k40713l17951j44451J72665K66249Q7042J599J84905L44816K43840
35022B928600O7702J1573q8972l76997n93128m71000k16396j82186l06198k74184
35012D98814m0071J92477L15543L02645Q0311k35882k53516J46018M62898K49275
$$ y = [1883460, 1882538, 1028466, 150628, 330313, 1307450, 1732308, 1038514, 211190, 405034, 1494398, 2419040, 2454912, 1688736, 629684, -149305, -212283, 433996, 1280562, 1795534, 1847296, 1551148, 1044747, 666911, 936057, 1867898, 2608595, 2342214, 1434251, 1044827, 1586787, 2221293, 2102944, 1518016, 1330832, 1713649, 2032011, 1863418, 1530230, 1486027, 1647292, 1652500, 1501427, 1540775, 1898759, 2298857, 2473365, 2449864, 2330599, 2089886, 1771935, 1627484, 1800149, 2066398, 2153440, 2155039, 2339944, 2684760, 2928600, 2996302, 3007875, 2918903, 2541906, 1948778, 1477778, 1261382, 1079196, 772998, 498814, 458743, 651220, 966763, 1269408, 1349719, 1113837, 860321, 1006339, 1469237, 1718512]
35002A718512j77123k42034n6962j75462n72879o26303j40258L16551K79520J1555
34992C35117N779L04432N78219N81285L03531j30146n39778p58485o97628l62353
34982c80027R2456L43765K02585m5210J6175K22047N3159l10139j3286R78938
34972A160463J388298M25684p94956p62506J96578N34650r7579n60190k61848
34963A228594N6263j47751l02912Q9856M91086K45711l47457n59943k48092J91662
34953F97017M31007L83478J53389L9500K12057L43387N7386l20950j59523L79494
34943B216242M93187O8410j05608K92091N11418l5202p85959q67546k80745L15532
34933A821820N10995L44536P22k75449k57145j733K15767L13846M05953M20553
$$ y = [1718512, 1541389, 1299355, 1242393, 1066931, 494052, -132251, -272509, 44042, 323562, 335117, 340896, 645328, 1223547, 1804832, 2108363, 1978217, 1438439, 679954, -17674, -380027, -287571, 56194, 258779, 213569, 229744, 451791, 504950, 194811, 181525, 1160463, 2548761, 2974445, 2179489, 1416983, 1613561, 2148211, 2050632, 1490442, 1228594, 1284857, 1137106, 834194, 924050, 1415136, 1660847, 1313390, 753447, 505355, 697017, 1128024, 1511502, 1664891, 1704391, 1916448, 2259835, 2317221, 1996271, 1836748, 2216242, 2709429, 2777839, 2672231, 2964322, 3475740, 3440538, 2654579, 1787033, 1506288, 1821820, 2332815, 2677351, 2678073, 2402624, 2145479, 2143746, 2359513, 2673359, 3079312, 3499865]
34923C499865J84913j49709k70263k06248j47232L7266M43955N90035O9853n05231
34913C547204k40312N49039P12368N4624m71544l91070k37798l11201k14206R0631
34903C087735M1674l58936l78691R5343K88712j5492p3684L53937N00329P1426
34893C612353j51652J98400L64645n6190k99512J07080M11057M5797l13506n0250
34883C868222K71425P9260r6328K74115O25393L76845M7198K15103L80542m2603
34873E999172n53297m70932j20846o9233n3549L03793N78637L35036l796J8331
34863E963316P5133r2229k926N28410P52145K66805j74414j9951J39380j03711
34853G331958n9976O35561J124470R17028Q20770J150431Q53617j93533j89051
$$ y = [3499865, 3684778, 3535069, 3264806, 3058558, 2911326, 2948592, 3392547, 3982582, 4052435, 3547204, 3306892, 3855931, 4568299, 4622923, 4151379, 3760309, 3522511, 3211310, 2997104, 3087735, 3129409, 2770473, 2391782, 2487125, 2775837, 2760345, 2686661, 3040598, 3540927, 3612353, 3460701, 3659101, 4023746, 3967556, 3668044, 3775124, 4186181, 4231978, 3918472, 3868222, 4139647, 4218907, 4122579, 4396694, 5022087, 5398932, 5446130, 5661233, 6041775, 5999172, 5445875, 4974943, 4854097, 4784864, 4731315, 5035108, 5613745, 5948781, 5944985, 5963316, 6038449, 5946220, 5943294, 6471704, 7223849, 7490654, 7316240, 7296289, 7435669, 7331958, 7271982, 7907543, 9032013, 9949041, 10769811, 11920242, 12773859, 12580326, 12391275]
34844A2391275J301336J272453k636787p600011q482676m548849j05666J358975
34836g049950O40367J14473M10226P85926Q14050N69792K73507L22887Q41210
34827b277512J153615O45921r4849q9402M38057M99413J1992k71939j66767q5166
34817b36637p353L12303M92635J23763k52697j0567L12437k4886m55486o6624
34807A86888O17331M89897j07111K042O57590O56430q6769m71001j52524J01791
34797A894564o9311k13894q1574J79537N71771R49902P55705M7999j67798K53059
34787D119960j33812j788315k592248r38612J242980J194289l48066n87538O43468
34778H12106J021535J4601m63386K98064P80288K41387k01942L45M863l40036
$$ y = [12391275, 13692611, 14965064, 12328277, 4728266, -3754410, -8303259, -8408925, -7049950, -6409583, -6295110, -5884884, -5098958, -4284908, -3715116, -3441609, -3118722, -2277512, -1123897, -477976, -572825, -662227, -224170, 275243, 287235, 15296, -151471, -236637, -243990, 68313, 560948, 684711, 432014, 421447, 733884, 708998, 253512, 186888, 804219, 1294116, 1187005, 1189047, 1846637, 2503067, 2416298, 1945297, 1792773, 1894564, 1825253, 1611359, 1529785, 1709322, 2281093, 3230995, 3986700, 4034699, 3866901, 4119960, 3986148, 2197833, -394415, -1333027, -90047, 1104242, 756176, 168638, 812106, 1833641, 1848242, 1384856, 1682920, 2463208, 2704595, 2502653, 2502998, 2507861, 2167825]
34768B167825r5702O44914O37283j71385n25075k64497l96291o80076J47031J545442
34758C009469J467466j06830q73839n6757M42287l95816r80363j62679P44246
34749C087184M58506j54532M4405N42718N17786K92007K40641q2299p19937q22269
34739C404210j90374K77024K57684M24020P62317L66993o41885r54902k71167
34730C433920K87150K70219L56167N13413l1522p88448m03847O94658O55553n03223
34720D484040p54595L57065R57934L07035l0514O38325Q09360k34899r81584m65635
34710E086532J78787J18631J69508O51394N27203k59815k61440O43666O63582
34701G518048o28422j311368n18262J45219k21232k64405O46725R58338l9538
$$ y = [2167825, 2072123, 2717037, 3354320, 3182935, 2657860, 2393363, 1997072, 1316996, 1464027, 3009469, 4476935, 4370105, 3496266, 3439509, 3881796, 3485980, 2505617, 2342938, 3087184, 3545690, 3391158, 3435563, 3978281, 4496067, 4788074, 5028715, 4946416, 4226479, 3404210, 3213836, 3490860, 3748544, 4172564, 4934881, 5301874, 4659989, 3705087, 3433920, 3721070, 3991289, 4347456, 4860869, 4829347, 4040899, 3637052, 4331710, 4987263, 4484040, 3729445, 4086510, 5044444, 5351479, 5320965, 5959290, 6768650, 6533751, 5552167, 5086532, 5265319, 5383950, 5553458, 6204852, 6732055, 6472240, 6210800, 6854466, 7518048, 6889626, 5578258, 5059996, 5205215, 4983983, 4719578, 5366303, 6324641, 6285103]
34692F285103o69777Q3559Q13849M62712L2575J47879j78383j007531p68762N69817
34682E771041Q49166l80290p39718O81290J547540N65932j95841O50918J190452
34673I940490k2011j150667n84460J60275l70870p94651O7093O12452l94674j236298
34663F226679m38555N16291K18623o6230O75304R31129j48129o34381N25359J193254
34653H999344J6237q67526J40824J053192J95501n89730K93651J010693O6865
34644A0319051n52646O63609J510485K28434r57413k0548J034996J83803p10795
34635A1698976K37961J117433J02023q12421J88399J084184K14108k03371J307662
34626A4934954J951842n2194j473930J76700J860970O91427p12342M63740J789879
$$ y = [6285103, 5615326, 5698885, 6512734, 6975446, 7008021, 7155900, 6977517, 5969986, 5201224, 5771041, 6620207, 6239917, 5500199, 6181489, 7729029, 8294961, 8099120, 8750038, 9940490, 9918479, 8767812, 8183352, 8343627, 7972757, 7178106, 7245199, 7857651, 7462977, 6226679, 5788124, 6304415, 6523038, 6456808, 7132112, 8063241, 7915112, 7280731, 7806090, 8999344, 9015581, 8148055, 8288879, 9342071, 9537572, 8947842, 9241493, 10252186, 10319051, 9766405, 10430014, 11940499, 12168933, 11211520, 11190972, 12225968, 12409771, 11698976, 11936937, 13054370, 13156393, 12343972, 12532371, 13616555, 13830663, 13627292, 14934954, 16886796, 16834602, 15360672, 15537372, 17398342, 18089769, 17377427, 17841167, 19631046]
34617A9631046P00245k98648J069121J881094o7855j230564R96211K761054J032065
34608B6473769l37131J698873K946858L42047j176469J960801M184256J152123
34600C7245127j195893K216469N109141J649865j494305K449636O656246L615451
34592E6251737L33304M549895Q265576L674060J466426J0523862J5267213K899249
34584A03231322l461825J9748181L9003530l598141r3886525j39852033q8227456
34577a67042947K344580M1582010K0417300k512386L256247J3710408Q663599
34570g9581189J805670N857569R864206M564695k68269L091652N976020J794049
34562d6895597j364946K568446N876716K253060j575193Q04654M024846K142353
$$ y = [19631046, 20331291, 20032643, 21101764, 22982858, 22915003, 21684439, 22680650, 25441704, 26473769, 26136638, 27835511, 30782369, 31124416, 29947947, 31908748, 36093004, 37245127, 36049234, 38265703, 43374844, 45024709, 43530404, 45980040, 52636286, 56251737, 56585041, 61134936, 69400512, 73074572, 74540998, 85064860, 100332073, 103231322, 99769497, 119517678, 158521208, 154923067, 61036542, -78815491, -167042947, -164698367, -123116357, -102699057, -105211443, -101955196, -88244788, -79581189, -77775519, -71917950, -62053744, -57489049, -57757318, -54665666, -48689646, -46895597, -48260543, -45692097, -39815381, -37562321, -39137514, -38332860, -34308014, -32165661]
34554c2165661o02613R05042L059701J525041m35345Q17939K118656M10725r44894
34545b5311409Q98419K411427O63789r14580O33740K045453M13208j083366N00763
34536a9742556K079180N37618j312451k25262J455406O33713o78700L63702J848488
34527a5040862R53081o65917k49021R25987L86807q25134n49899L66500J88567
34518a4509891k79619J93017N11682l00928p52175K05484Q60400L137n89823M41434
34508a4217282J328011N29196l57570K53889R69227L09150m19264J44574O87326
34499a0772743r2320q12333m8542R32429N86574j93872r2481K60017K1060r6429
34489a0308640L46124L15566m35289m83176M46902O23647l38011m36173Q89171
$$ y = [-32165661, -32768274, -31863232, -28803531, -27278490, -27713835, -26895896, -24777240, -24366515, -25311409, -24412990, -22001563, -21337774, -22252354, -21618614, -19573161, -19159953, -20243319, -19742556, -17663376, -17125758, -18438209, -18663471, -17208065, -16574352, -17253052, -16889350, -15040862, -14087781, -14753698, -15002719, -14076732, -13689925, -14515059, -15064958, -14698458, -14509891, -14789510, -14596493, -14084811, -14385739, -15137914, -14932430, -14072030, -14068893, -14658716, -14217282, -12889271, -12360075, -12717645, -12463756, -11494529, -11185379, -11604643, -11460069, -10772743, -10865063, -11677396, -11725938, -10793509, -10206935, -10400807, -10493288, -10233271, -10212211, -10308640, -9962516, -9646950, -10082239, -10565415, -10118513, -9494866, -9832877, -10269050, -9379879]
34480i379879J318732j62575j167058p1829J169007O58669l20064j82969J72394
34471g965572j58792j6940J027041J033763o79384j562428r4722J310511M91767
34462f614756p10855l9850J037612K49279j248513j159054j25466Q067j94135
34453h797671O31011J425520N35460r73268j051002j10976K43384K53024Q36850
34444g007668J123728J14808q65094l05087N94624R3267p84351k02803R22599
34435f315977N93462n35160m39514N09025M25776m60267l76068N61455O52147
34426e385121j95990n19250r1198L1961k00395n801K97172r4073n42123J3052
34416f691766Q40625N63455k77432k05458M55724L19281l58445k75787K84884
$$ y = [-9379879, -8061147, -8223722, -9390780, -9462609, -8293602, -7634933, -7954997, -8137966, -7965572, -8124364, -8141304, -7114263, -6080500, -6759884, -8322312, -8417034, -7106523, -6614756, -7325611, -7365461, -6327849, -6078570, -7327083, -8486137, -8611603, -8603536, -8797671, -8166660, -6741140, -6205680, -7178948, -8229950, -8340926, -8097542, -7844518, -7007668, -5883940, -5769132, -6634226, -6939313, -6344689, -6251422, -7035773, -7238576, -6315977, -5722515, -6257675, -6697189, -6188164, -5762388, -6222655, -6598723, -6037268, -5385121, -5581111, -6100361, -6191559, -6159598, -6359993, -6365794, -6068622, -6162695, -6704818, -6691766, -5851141, -5287686, -5565118, -5770576, -5314852, -4995571, -5354016, -5629803, -5344919]
34407e344919M1463o31802k75786Q27456J008530J35332l38231p7997j44452o12582
34397e412988l56567O27453R46186J72930m98642l00995J41528J85743P38j79897
34387d674511l63163l29898M5608K59224j2915j30623L60758O09100j64653j057457
34377e458530q15185Q6492L66189J01245J85782M31325J05628l44014m6131M65864
34367d921335J40443n11549k64209M82138L59780m26027m46989L31624N22566
34358d733558j58075m87684K1424M54785K91495J02422K26617L06790K74949L87077
34348c313758L22293l40797r32183m68946N89331R05332L51617n5490o0395l14365
34338c317361p70972o53454j4612K60939L855j64611j75610m31692n82504L0632
$$ y = [-5344919, -5303456, -5935258, -6211044, -5383588, -4375058, -4239726, -4577957, -4655954, -4800406, -5412988, -5769555, -5142102, -4195916, -4022986, -4521628, -4822623, -4681095, -4495352, -4494614, -4674511, -5037674, -5367572, -5321964, -5062740, -5075655, -5206278, -4845520, -4236420, -4401073, -5458530, -6273715, -6187223, -5821034, -5719789, -5534007, -5102682, -4997054, -5341068, -5387199, -4921335, -4780892, -5292441, -5556650, -5074512, -4714732, -5140759, -5587748, -5256124, -4733558, -4891633, -5379317, -5357893, -4903108, -4611613, -4509191, -4282574, -3975784, -3700835, -3313758, -2991465, -3332262, -4264445, -4733391, -4144060, -3238728, -2887111, -2942601, -3002996, -3317361, -4088333, -4741787, -4756399, -4495460, -4491605, -4656216, -4831826, -5263518, -5846022, -5815390]
34328e815390Q78099Q10312k3674m44730k46756k29221m00484J0347P66944P21171
34318c973382j56479o22839k50372N4442j26594r8809L78956N30928M1951l40324
34308d562522j32066K31224L87056M73208L73903k01607p67554n04408K63189
34299d439577M07496j28190k83156J95660L85745j4142j54943K82941M50893p9853
34289c377126n32086l36212k8323j14882k21859J0673K33945J41341q154k1949
34279d254632n1038o902L48291O22208J97756n06586m33574L29707N59187o4894
34269c260477m22326Q4087N35033J62344l64697j98055K95222L35286P893j50955
34259b976645j15012j27906j19786k1295r6418m14235n39574k16602J90323L34128
$$ y = [-5815390, -4937291, -4126979, -4150653, -4595383, -4842139, -5071360, -5471844, -5461497, -4694553, -3973382, -4129861, -4752700, -5003072, -4948630, -5075224, -5174033, -4795077, -4264149, -4222198, -4562522, -4694588, -4463364, -4076308, -3603100, -3229197, -3430804, -4198358, -4702766, -4439577, -4032081, -4160271, -4443427, -4247767, -3862022, -3876164, -4031107, -3748166, -3297273, -3377126, -3909212, -4245424, -4273747, -4388629, -4610488, -4599815, -4365870, -4224529, -4232683, -4254632, -4305670, -4312572, -3964281, -3342073, -3144317, -3650903, -4084477, -3754770, -3195583, -3260477, -3682803, -3598716, -3063683, -2901339, -3266036, -3464091, -3168869, -2833583, -2825690, -2976645, -3091657, -3219563, -3339349, -3360644, -3457062, -3871297, -4410871, -4627473, -4437150, -4103022]
34249d103022L84434N20358N16044K14910j18110k52288l02584l36246j85485
34240c661989J34648L35693L37967L15298J81035l43435j032665j192566n87142
34231e513156K36360O87716O66633L14059j61171l54591L200N11112M98620J0314
34221c100904k37079O5280M30406L81429M9211j94859k30856j81890k27114m13427
34211c659803m52438L4873Q25194J111981N95011k8561j40223n9910k11598k55781
34201b241255J07632L07367j17120n16530k39347J12675j80777m75539M6099N89294
34191b607501O739q98031m92429P25719P01330p03786j317001j46586J127546
34182c604000R60911R7162j59593J3085j23782l79803k83924p5631k3099K12889
$$ y = [-4103022, -3718588, -3198230, -2682186, -2467276, -2585386, -2837674, -3140258, -3476504, -3661989, -3527341, -3191648, -2853681, -2538383, -2357348, -2700783, -3733448, -4926014, -5513156, -5276796, -4589080, -3922447, -3608388, -3769559, -4124150, -4120950, -3609838, -3111218, -3100904, -3337983, -3272703, -2842297, -2460868, -2411657, -2606516, -2837372, -3019262, -3246376, -3659803, -4112241, -4077368, -3252174, -2140193, -1545182, -1573743, -1713966, -1773876, -1985474, -2241255, -2133623, -1826256, -1943376, -2459906, -2699253, -2586578, -2767355, -3242894, -3196795, -2607501, -2600762, -3498793, -3991222, -3265503, -2564173, -3267959, -4584960, -4731546, -3604000, -2643089, -2545927, -2705520, -2692435, -2816217, -3196020, -3479944, -3555575, -3578674, -3365785]
34172c365785O70087N99350k66024r75873p26644o389L76254M43782M98516L89796
34162b362930P3383k2601J39251m6891n90912n40311L89074J000227L90131n66971
34152b138550o08444K8569L04846J23537R7726K17444L1234k86451k45303p2875
34142b548267l01021o01627k05035O39380P93731m1360p64880m06632N66731R84287
34132a884693N13445j05295j99128K2283M361j87057R912N98442P97424K14129
34122b16177m38833m18518j09885k37205m84271p7235O09237M30350n77593j079665
34112b599795n25587P4780n8948k88390J01324N90995M21499n0017k6051L72111
34102a988079M18315P462l19135k96981j61066j23884j76310k62895k95808j87455
$$ y = [-3365785, -2695698, -2096348, -2362372, -3338245, -4064889, -4071278, -3695024, -3251242, -2752726, -2362930, -2289547, -2312148, -2172897, -2219788, -2810700, -3351011, -2961937, -1961710, -1571579, -2138550, -2746994, -2718425, -2413579, -2290042, -2192316, -1974872, -1943638, -2230089, -2475392, -2548267, -2849288, -3450915, -3655950, -3016570, -2222839, -2264199, -3029079, -3435711, -2868980, -1884693, -1371248, -1476543, -1675671, -1653388, -1649027, -1836084, -1826172, -1227730, -430306, -216177, -655010, -1073528, -1183413, -1420618, -1904889, -1982124, -1372887, -942537, -1520130, -2599795, -3125382, -3050602, -3109550, -3397940, -3296616, -2705621, -2284122, -2334139, -2360190, -1988079, -1569764, -1562302, -1881437, -2178418, -2339484, -2463368, -2639678, -2902573, -3198381, -3385836]
34092c385836p2311j77320l36844j01512M93693Q02874M59661j04176k84307l026
34082b709104M00401N39436J56323n72947r06193l18591N98322P45781L5188n19098
34072b550482k85399K84329N66121M82511J44433l35375n20526n7069N02392K95010
34062a474055l79192l94242K77243M25724k74690o06302P4872O51233J38839o75597
34052b236167o67979j73516l8371l065M99907Q69429K71365o10277m38876N13909
34042b013641O53484m04849j176104n52326O01530P87232n5128o43146j89389
34033b992337O01136N71104k59378o95715j24613M70956k2307r63709p93453M50077
34023c758239J013696J40286p28021k58358P39359P81218K8916k92660K0091J50373
$$ y = [-3385836, -3458147, -3635467, -3972311, -4073823, -3580130, -2777256, -2317595, -2421771, -2706078, -2709104, -2308703, -1769267, -1612944, -2185891, -3092084, -3410675, -2812353, -2066572, -2031384, -2550482, -2835881, -2551552, -1985431, -1502920, -1358487, -1693862, -2214388, -2271457, -1769065, -1474055, -1853247, -2247489, -1970246, -1544522, -1819212, -2425514, -2350642, -1699409, -1560570, -2236167, -2904146, -3077662, -3116033, -3119098, -2619191, -1749762, -1478397, -2088674, -2527550, -2013641, -1360157, -1765006, -2941110, -3493436, -2891906, -2104674, -2159802, -2802948, -2992337, -2391201, -1820097, -2079475, -2775190, -2899803, -2428847, -2451154, -3414863, -4208316, -3758239, -2744543, -2604257, -3332278, -3590636, -2851277, -2070059, -2041143, -2333803, -2313712, -2163339]
34013b163339j11967j59259J94725M67137M37841L30837J40321l16201p44902
34004a924807o21356m2928M00286N01717M86245L56055n3559m96064n44294l07319
33994b246024k08623j72307K05912P42674P30720Q245p38072q97120n84173k21107
33984c379875J6123J47540J99393K54406M14447N92072N41423J63084l46414o40086
33974b037887m62216J23322O80257P63831L98889j8566k72065m25810m12491n0503
33964a713239M31115M63046n3766n34117n26312k27096J3217J33385J14111r5193
33954a994849k07857J57623O75003N55488j57054m76553m0557K60420j92730o64208
33944b085274l42984K54489J94758l15880l97155K4516K88354J84169P3500Q7521
$$ y = [-2163339, -2275306, -2434565, -2239840, -1772703, -1334862, -1004025, -863704, -1179905, -1924807, -2546163, -2589091, -2188805, -1687088, -1200843, -844788, -898347, -1394411, -1938705, -2246024, -2454647, -2626954, -2421042, -1678368, -947648, -939403, -1677475, -2574595, -3158768, -3379875, -3363752, -3216212, -3016819, -2762413, -2347966, -1755894, -1214471, -1051387, -1397801, -2037887, -2500103, -2376781, -1696524, -932693, -533804, -552370, -824435, -1250245, -1662736, -1713239, -1282124, -819078, -872844, -1406961, -1933273, -2160369, -2147152, -2013767, -1899656, -1994849, -2202706, -2045083, -1370080, -814592, -971646, -1448199, -1488756, -1228336, -1421066, -2085274, -2428258, -2173769, -1979011, -2294891, -2692046, -2667530, -2379176, -2195007, -2121507, -2033986]
33934b033986O0885K7125N5439r0434m58536n02157J13632P80239Q01076M58649
33924g88068L57323K55433l88980j145606j076281k63093K75106J34557p2918
33915b712527R1142K99638K14900k011j29907j77896j22967Q4613K37083J04870
33905b113062j19547j13756J3392j2857n7085J30261L14728J44336j54853j51461
33895b119904M254q6780k48419n9943K63730K13318k8346J01060M19721K21795
33885a319514m36402p13154l08836J69706K88914K76460K72090M7295k86407k10034
33875b219882K49253L67208j03346m38634q5385M59235M68685O8013j28592j3931
33865a377376K1434j37830j50263J92074N83325N52702N5230m34585m86031k48209
$$ y = [-2033986, -1973101, -1945976, -1890537, -1980971, -2439507, -2941664, -2828032, -2047793, -1246717, -788068, -430745, -175312, -564292, -1709898, -2786179, -3049272, -2774166, -2639609, -2712527, -2621385, -2321747, -2106847, -2108858, -2238765, -2416661, -2539628, -2455015, -2217932, -2113062, -2232609, -2346365, -2332973, -2345830, -2402915, -2272654, -1957926, -1813590, -1968443, -2119904, -2115650, -2202430, -2450849, -2510792, -2247062, -2033744, -2062090, -1961030, -1541309, -1319514, -1755916, -2469070, -2777906, -2608200, -2319286, -2042826, -1770736, -1723441, -2009848, -2219882, -1970629, -1603421, -1706767, -2145401, -2230786, -1771551, -1302866, -1234853, -1363445, -1377376, -1355942, -1493772, -1644035, -1451961, -868636, -315934, -260704, -695289, -1181320, -1429529]
33855a429529j66276k34910k6655M35483M97322p1326n28262k51971K62931K57063
33845a256130n7593n1203P6384k47931o50107k78794N37730N32465m38971r84920
33835b819070k71400P55197Q99371L47695n6689k25986n24367p21328l03763M94699
33825b425641Q93890O65949L00685J51056O4389j29307l17669l77581l31554j63978
33815a669761J67461M66225L73019j45696o17334n57401m2063L68892K69543j42981
33805a530096l19060j3644M16559M36117j9059m49624l92162Q57J42973k03357
33795a930496n49333l21740K78370N10109J99813j743K57800L61081k06326p61500
33785b163965l70375N34859O76388p2637n13550q0541L64871J17061k73128j38461
$$ y = [-1429529, -1595805, -1830715, -1857370, -1421887, -924565, -995891, -1524153, -1776124, -1513193, -1256130, -1313723, -1364926, -1288542, -1536473, -2186580, -2465374, -1927644, -1395179, -1834150, -2819070, -3090470, -2335273, -1435902, -1088207, -1144896, -1370882, -1895249, -2616577, -2920340, -2425641, -1531751, -865802, -565117, -414061, -349672, -478979, -796648, -1174229, -1505783, -1669761, -1502300, -1036075, -663056, -808752, -1426086, -1983487, -2025550, -1656658, -1387115, -1530096, -1849156, -1862800, -1446241, -1010124, -1029183, -1478807, -1870969, -1870112, -1727139, -1930496, -2479829, -2801569, -2523199, -2013090, -1813277, -1815020, -1557220, -1196139, -1402465, -2163965, -2534340, -1999481, -1323093, -1395730, -1909280, -1989821, -1624950, -1507889, -1781017, -1919478]
33775a919478J91507J97027J03612K00968J38016k77944m69696j23490Q5288k96646
33765b170836n43817m5611M52911J31835l54086k9328N79662L87787k15896n7678
33755a865057O26954N82635j67956l50632K75148N60474O6729l05844j19644q2829
33745g80022m63393m80761J20813M31609j5376m16820j76701J43355O7709O3841
33735a505746L75901L18175l84384q09189l63911R6336k37438o38382r0755R01277
33725b338116J083777L66589k99075m61122m11024k74293M8371L06604K19618
33716a758671R7868K97250M11022r1709p69479p29759j1240N18451M89258L09299
33706a237710K17015J5719k13799o3303L63107L78230k34070p64004n23864K34588
$$ y = [-1919478, -1727971, -1530944, -1427332, -1226364, -1088348, -1366292, -1835988, -1959478, -1874190, -2170836, -2714653, -2760264, -2307353, -2175518, -2529604, -2558932, -1979270, -1591483, -1807379, -1865057, -1238103, -655468, -823424, -1174056, -898908, -338434, -271705, -577549, -697193, -780022, -1243415, -1724176, -1603363, -1171754, -1187130, -1603950, -1780651, -1637296, -1569587, -1505746, -1129845, -811670, -1196054, -2005243, -2369154, -2272818, -2510256, -3148638, -3239393, -2338116, -1254339, -887750, -1186825, -1647947, -2058971, -2333264, -2284893, -1978289, -1758671, -1660803, -1363553, -952531, -1044240, -1813719, -2543478, -2554718, -2036267, -1547009, -1237710, -1020695, -1004976, -1218775, -1282078, -918971, -540741, -774811, -1538815, -2062679, -1828091]
33696a828091O82767L84499l28290p40113m07576L91738Q74075N97358l1424l50453
33686g55510l11562l16091l95334k11941J27260J2863o31951r40512k70359P00466
33676b992671P66581j17293p27011k46273O81122R49720M57783m054L7929L10445
33666h83722M19474K71562p8108m11062k69079M29479Q22388P1241j118665j135827
33656a882319J19774Q50088N4134q67642l75953O97778N93514m15470n56005M17693
33646a364408R09889K52135l22251L0720M10593n6793p13326o58969k29870j11969
33636a854249q3092K60813M63291K4463m94650k97294L21994N33735L36947L06974
33626d81068L98395R3029m83766o33651k34721P4659n7170k12213M0988M58077
$$ y = [-1828091, -1145324, -760825, -1089115, -1829228, -2236804, -1845066, -970991, -373633, -405057, -755510, -1067072, -1383163, -1778497, -1990438, -1863178, -1850315, -2482266, -3422778, -3693137, -2992671, -2226090, -2343383, -3070394, -3316667, -2635545, -1685825, -1228042, -1232096, -1194167, -883722, -464248, -192686, -270794, -681856, -950935, -521456, 300932, 372173, -746492, -1882319, -1762545, -912457, -858323, -1725965, -2101918, -1404140, -810626, -1226096, -1782101, -1364408, -454519, -202384, -524635, -493915, -83322, -140115, -853441, -1512410, -1742280, -1854249, -1937341, -1676528, -1213237, -1188774, -1683424, -1980718, -1658724, -1124989, -788042, -481068, -82673, 10356, -473410, -1107061, -1341782, -1267123, -1324293, -1536506, -1495518, -1037441]
33616a037441M63676o0500n44289l46632L69273O35721p3461q85521n60639O45852
33606a393961J173733L67489o45063p28178k33806j0415j9858R6110L6011m31216
33596a789154n58760K80409J212426R51087j63765o49862j67890J69243k07943
33587i24209n10027j13476M04495L29652j01399k86166j43639J33918N32717Q84193
33577B06059O87268j62753r35905r10968l17042N4487q8999l22280j79748L22265
33567a647616P63855O94838L6991p29482r30756l96934L43562O59470M28477k1257
33557g98852l36456l49069o6756L33719N83753N29574K31947j53881m88609o36466
33547a151096n15987k33122k6678j401j8740Q0385K38790K54137N0268j83587
$$ y = [-1037441, -573765, -634265, -1178554, -1525186, -1155913, -520192, -593653, -1479174, -2039813, -1393961, -220228, 147261, -497802, -1225980, -1459786, -1470201, -1490059, -1393949, -1357938, -1789154, -2347914, -2067505, -855079, 96008, -67757, -717619, -885509, -716266, -924209, -1434236, -1547712, -1143217, -813565, -914964, -1201130, -1344769, -1210851, -678134, 206059, 893327, 730574, -205331, -1116299, -1433341, -1378854, -1467853, -1790133, -1969881, -1647616, -883761, -188923, -151932, -881414, -1812170, -2209104, -1865542, -1206072, -777595, -798852, -1135308, -1484377, -1551133, -1217414, -633661, -104087, 127860, -26021, -514630, -1151096, -1667083, -1900205, -1926883, -1928284, -1947024, -1866639, -1627849, -1373712, -1323444, -1507031]
33537a507031j55286J95204N43571M82015K6000l19869j39732L49794N26561J20060
33527A21287m45415n44213p2770M46117M65887m508n00205o70593n61278l52903
33517b118594r1887J96484L68176L35793K08671Q2925r4339k67318j83054J57225
33507a405918L06405K9138k16700Q668L02393L3406m90320l77291L85118P94453
33497f30648L24833l59926m99564k14284J9314J24261J78871N1732k37552l32373
33487a575336j23813J9611l8594J09785O11857Q97025N22057j43141n68397p65075
33477a054021q28798m96388K12086O06695K98609r5472M2069L15652J45804j13497
33467i67261R4538L45859k5331n38249k48378N37598O53122K2227k56994J55370
$$ y = [-1507031, -1662317, -1467113, -923542, -441527, -415527, -735396, -875128, -525334, 1227, 121287, -324128, -868341, -941111, -494994, -29107, -33615, -533820, -1204413, -1765691, -2118594, -2210481, -2013997, -1645821, -1310028, -1101357, -1018432, -1112771, -1380089, -1563143, -1405918, -1099513, -1070375, -1287075, -1278407, -976014, -942608, -1432928, -1810219, -1425101, -630648, -305815, -665741, -1165305, -1379589, -1360275, -1236014, -1057143, -1005411, -1242963, -1575336, -1699149, -1679538, -1718132, -1608347, -996490, -99465, 422592, 279451, -288946, -1054021, -1882819, -2379207, -2167121, -1560426, -1261817, -1357289, -1315220, -999568, -853764, -967261, -872723, -526864, -552195, -1090444, -1338822, -801224, -148102, -125875, -382869, -227499]
33457b27499L17716k49341p03207l53698K10921K11751r8634j06928O9921M152
33447i24846j43967J9633K91587J63129l14283n95258m04793M8958M39831N01775
33437i18234Q7948n36253p08437j18502O58855Q11761K95526k46675m09208l63023
33427a446242l06393j13553K83584N57008L59230j12064k64703J01011M20989
33418e21133N9944p22203r20754p5301R99760J180678M46461k32460k88967j64117
33408b38092l94181p49904o70953j21500M27222O16869M32826J6311l89373m47202
33398a517977n0952M11058M39857O4424k01290p1424J46183L6918l12976m47897
33388a504076j84452J57847K18239M4909p8104o5051l2097J4758J53132K30815
$$ y = [-227499, 90217, -159124, -862331, -1216029, -1005108, -793357, -891991, -998919, -928998, -924846, -1068813, -1049180, -757593, -594464, -908747, -1504005, -1908798, -1859840, -1420009, -918234, -830286, -1366539, -2074976, -2193478, -1534623, -722862, -427336, -674011, -1083219, -1446242, -1752635, -1866188, -1582604, -1025596, -666366, -778430, -1043133, -942122, -521133, -461189, -1183392, -2104146, -2179447, -1179687, 991, 447452, 214992, -73975, -238092, -632273, -1382177, -2053130, -2174630, -1747408, -1130539, -697713, -681402, -1070775, -1517977, -1568929, -1157871, -718014, -653590, -854880, -926304, -780121, -743203, -1056179, -1504076, -1688528, -1530681, -1312442, -1267533, -1345637, -1410688, -1442785, -1428027, -1274895, -1044080]
33378a044080q757l88890l40941K59915P29322M54976j95996l76731L9093L49812
33368e22277Q6190l89655m79179j08534K97389L35966L225k85627r6373M06788
33358g52087M58406l01347j068322p74530L55115R69643M52428k77896k40760
33349a179350J99017J31385l58285m22923R7711M72265K96925k187n6043j13952
33339i35437l83413n20891k49398Q1485Q3948J3499K56661N18680K61721k50733
33329a123878j86058N24371R02896K92535o72811r46416m07055K41689N27783
33320h46944N17564K93217j58404n44495m28285N7292K47056p1919k76372J26515
33310a084775O56240N31948j39791n06257k09809J64851K7659l96067n19913k69842
$$ y = [-1044080, -1052837, -1441727, -1782668, -1522753, -793431, -338455, -534451, -911182, -872089, -522277, -436087, -825742, -1304921, -1413455, -1116066, -780100, -776875, -1062502, -1158875, -752087, -293681, -595028, -1663350, -2437880, -2082765, -1113122, -660694, -938590, -1179350, -980333, -848948, -1207233, -1630156, -1532445, -1060180, -763255, -765442, -821485, -935437, -1318850, -1839741, -2089139, -2007654, -1923706, -1910207, -1653546, -1134866, -873145, -1123878, -1309936, -785565, 117331, 409866, -262945, -1209361, -1616416, -1374727, -846944, -329380, -36163, -194567, -739062, -1167347, -1110055, -862999, -934918, -1211290, -1084775, -428535, 103413, -36378, -542635, -752444, -587593, -559934, -956001, -1475914, -1745756]
33300a745756l6772L9510K04784M88100M88889K1789m28048l06951J92478M09970
33290f72007K04802R5355L38492M70186P2746m93038n84611j86391J72199K17726
33280c64541J63597K16592K93407K46124M6840k54623n15023n14122k27083M1277
33270h67555M1197p1879l1352J26834K43294L38406L83074J27187l92743n91444
33260f94981j62338K77642J03474k24562O2776N84568L46058m74475o79348n3231
33250i14417K84196j35095l32816K64182O87946J55288m20222L3886P84337M38323
33240H45608o62493q95862P5353Q39959M45544l90574o59085m26951k49498j55571
33230a233570Q8227L21379K63275P8192J06187K38567M8944m98816q55227n14764
$$ y = [-1745756, -1782528, -1743018, -1538234, -1050134, -561245, -539456, -967504, -1274455, -1081977, -672007, -467205, -371850, -33358, 436828, 509574, 16536, -568075, -754466, -582267, -364541, -200944, 15648, 309055, 555179, 602019, 347396, -167627, -681749, -908832, -867555, -826358, -898237, -929589, -802755, -559461, -221055, 162019, 289206, -103537, -694981, -857319, -579677, -476203, -700765, -637989, -53421, 292637, -181838, -861186, -914417, -630221, -765316, -1098132, -833950, -146004, 9284, -410938, -377052, 407285, 845608, 183115, -712747, -637394, 202565, 648109, 257535, -401550, -828501, -1077999, -1233570, -1145343, -823964, -560689, -482497, -376310, -137743, -88799, -587615, -1442842, -1957606]
33220a957606L38810R74760Q91498L13857j72839l32756l83232m72586m18048
33211a218142o1143M03586O06614L60496j80221n68121m02911J31399L12614j47316
33201g63145n22217q5285O66025P05347J28167o5308K34416O5932p50818j085631
33191a472517m14750J83438j72765o99242l63981L98303O20548M28647M11486
33182a080833K89401l47169p68950j46225P66897O25906k80217m96192J84548
33173a252834N31921P4218k68996P484J83355k10727n09377j30870M40803N19490
33163f15533J92436q8504j78706j14903P0069J69347K063j52351P1795M08666
33153b35621L38073J4302k2571J34430j4699l35447l09218j26432l45428o44441
$$ y = [-1957606, -1618796, -644036, 247462, 561319, 388480, 55724, -327508, -800094, -1218142, -1279285, -875699, -269085, 91411, -88810, -656931, -1059842, -928443, -615829, -763145, -1285362, -1370647, -704622, 725, 128892, 63584, 298000, 363932, -386886, -1472517, -1887267, -1703829, -1876594, -2575836, -2939817, -2541514, -1920966, -1492319, -1080833, -791432, -1138601, -1907551, -2053776, -1286879, -660973, -941190, -1437382, -1252834, -720913, -646695, -915691, -908207, -724852, -935579, -1444956, -1575826, -1135023, -615533, -423097, -511601, -690307, -805210, -735141, -565794, -563731, -716082, -644287, -235621, 102452, 116754, 94183, 228613, 213914, -121533, -430751, -557183, -902611, -1547052]
33143a547052k54135M82129M81916j40276j63497N33737O52742j85253o29237
33134g68926P4061P03559J33557p56551n96171K69763N41649O5028k36627K8872
33124e41786M06707N31819M06463M2575m26296o19191m56283l68259n11408m25173
33114a960832O4963L94217K42375J01694K67595K28932k20299k97446M37796J061350
33104C20345O45205k48366n53443l60255l84343n13446j90804L14484L24949K9415
33094f16259J17983M93739N08281J62722l6868j07934l95504o67801m66959l7789
33084a046389J07165J37132L80403L98891k06525o45928l0935Q74005O26376m77246
33074A16949p41983K16272R26672M57494l86576o94624o63376o08613k35877M34048
$$ y = [-1547052, -1801187, -1319058, -837142, -977418, -1140915, -607178, 45564, -139689, -768926, -694865, 8694, 142251, -614300, -1210471, -940708, -399059, -334031, -570658, -541786, -135079, 396740, 803203, 845778, 419482, -199709, -655992, -1024251, -1535659, -1960832, -1895869, -1501652, -1259277, -1157583, -889988, -661056, -881355, -1178801, -741005, 320345, 965550, 717184, 163741, -196514, -580857, -1094303, -1285107, -970623, -645674, -616259, -498276, -4537, 503744, 666466, 629598, 521664, 126160, -541641, -1008600, -1046389, -939224, -802092, -421689, -22798, -229323, -875251, -906186, -32181, 594195, 116949, -625034, -408762, 517910, 975404, 588828, -105796, -769172, -1377785, -1613662, -1179614]
33064a179614P04553L99348K14976L50239R1353o51294q07389P6789R05234P84555
33054H88750L63951L91698K96825n01081j116008n63238M01445M52978r9055k7257
33044D89008N05838K73248o56549q54980M2678O96285K87971k69671m2030M53998
33034I25796L81410K1722O3962L20408J91059j84887k32898k0589j13080n28294
33024H24609o44425j65155M36759N65716K16840q5163Q9564N57843O80812J79985
33014B657385l75759k93699K09809L60061J23976K31999P57736Q01634P4072l81647
33004D165567J42378P61467N01615j8578K11020P42243P61695J028020K317064
32995A0612491K566532j201288p573959j0677577p190417q39344K404670J538956
$$ y = [-1179614, -475061, -75713, 139263, 489502, 580855, -70439, -877828, -801039, 104195, 888750, 1252701, 1644399, 1941224, 1440143, 324135, -239103, 162342, 615320, 516265, 489008, 994846, 1268094, 611545, -243435, -200757, 495528, 783499, 513828, 471798, 925796, 1307206, 1328928, 1392890, 1713298, 1904357, 1719470, 1486572, 1465983, 1352903, 824609, 180184, 15029, 451788, 1017504, 1234344, 1149181, 1238745, 1796588, 2477400, 2657385, 2281626, 1987927, 2197736, 2557797, 2681773, 2913772, 3671508, 4473142, 4547214, 4165567, 4307945, 5069412, 5571027, 5552449, 5763469, 6505712, 7267407, 8295427, 10612491, 13179023, 11977735, 4403776, -6273801, -13464218, -14303562, -11898892, -10359936]
32987a0359936J71377N34630J314207J078828N06564M55210M18300P622m292P41402
32977e136088J180593N15650m26011n84795k07735N2690M01804J082780J327645
32968a793467M55602p31780r47380k57951K70213K74548K26313K25513p7721n00451
32958b856561m22081J18528M05620J80589q0562p7746m3571r5182r167K05404
32948b674729K01613o8437k18588q0777O7477O0225Q1602J94279J45401j62083
32938b454017m38184m30448k21348K5957K69892M24188L23424j1215l21397m00690
32928c233838k36485R8211M49500N66388L80134K02016L10137M67735K68032j47727
32918h75897k27858J27963L71316J13868l11662l34263J09637N41938M98653j0538
$$ y = [-10359936, -10188559, -9653929, -8339722, -7260894, -6754330, -6299120, -5880820, -5873198, -5877490, -5136088, -3955495, -3439845, -3865856, -4450651, -4658386, -4605696, -4203892, -3121112, -1793467, -1337865, -2069645, -3017025, -3274976, -3004763, -2730215, -2503902, -2278389, -2356110, -2856561, -3278642, -3160114, -2754494, -2573905, -2654467, -2732213, -2775784, -2870966, -2880133, -2674729, -2473116, -2541553, -2760141, -2840918, -2773441, -2713216, -2631614, -2437335, -2291934, -2454017, -2892201, -3322649, -3543997, -3518040, -3248148, -2823960, -2500536, -2511751, -2833148, -3233838, -3470323, -3372112, -2922612, -2356224, -1976090, -1774074, -1463937, -996202, -728170, -875897, -1103755, -975792, -604476, -490608, -802270, -1136533, -1026896, -484958, 13695, 3157]
32908C157n08768n06870m8210K83503M5076n09199p48788m05532K24046O55387
32898a516198N73233K1235n07412m20774K21405O04823J94136m68473n16449N426
32888a809048L22141J35467j08514j02874o0617j26080j18150k4510j00765k89060
32878b282010j74865K54964M54481J99393k0617J44560K95179J1285l73193l23404
32868a814227R453J06650l1717j1667J32201k6789m44402m79743J47411Q17435
32858a595395P78518J15205m16036l40660R2743L80514L54634J95224O0792q0543
32848d55004k79534m42462m20494j93023R6523K52934J72483m6578j38456N1134
32838a402477L00451K20988j91031m54970k33332J84654L06239J36144O6878J75752
$$ y = [3157, -505611, -1012481, -1060691, -777188, -732112, -1241311, -1990099, -2395631, -2171585, -1516198, -942965, -921730, -1429142, -1849916, -1628511, -1023688, -829552, -1298025, -1814474, -1809048, -1486907, -1351440, -1459954, -1562828, -1623445, -1749525, -1867675, -1892185, -1992950, -2282010, -2456875, -2201911, -1747430, -1548037, -1568654, -1424094, -1128915, -1117630, -1490823, -1814227, -1804774, -1698124, -1729841, -1741508, -1609307, -1636096, -2080498, -2560241, -2412830, -1595395, -816877, -701672, -1117708, -1458368, -1365625, -985111, -630477, -435253, -374461, -455004, -734538, -1177000, -1597494, -1790517, -1693994, -1441060, -1268577, -1315155, -1453611, -1402477, -1102026, -881038, -1072069, -1527039, -1760371, -1575717, -1269478, -1133334, -1066456, -890704]
32828h90704J02371k99943o27783m74565j4926K43024J24732o9502l5623J64816
32818a778103K62656J61731L8012N7862R5467j22023n38108o20533M8058J051627
32808a343354J352220M58434q18611j163099l20974N60989M07987l87463o02366
32799a856237J0673M08321n3338n34132j9387R65683J004962j04322j022976p53912
32789a954665J72405P25296O66936L25996j22012n21600n06059m1576K87990J13055
32779h54234j06702J20765M60049L78895J13870J86907L84883J29360m24119n79902
32769a90228k26428J10933K04436K31248P5539n10241j078888q43717L4342N17660
32759a675344K39471l7769J93313L99933J04133k27532p4374J84470j2246l93120
$$ y = [-890704, -788333, -1088276, -1716059, -2190624, -2205550, -1962526, -1837794, -1907296, -1942919, -1778103, -1515447, -1353716, -1315704, -1257842, -1162375, -1284398, -1822506, -2443039, -2394981, -1343354, 8866, 467300, -351311, -1514410, -1835384, -1274395, -866408, -1253871, -1856237, -1845564, -1437243, -1490581, -2024713, -2044100, -1078417, -73455, -177777, -1200753, -1954665, -1782260, -1056964, -390028, -64032, -186044, -707644, -1213703, -1255279, -967289, -854234, -960936, -840171, -380122, -1227, 112643, 299550, 684433, 813793, 389674, -190228, -416656, -305723, -101287, 129961, 205500, -304741, -1383629, -2227346, -2193004, -1675344, -1435873, -1473642, -1280329, -880396, -776263, -1003795, -1078169, -893699, -905945, -1299065]
32749a299065l66512k8510J45058J82106L68273M72596R5799m34264m18948M8269
32739a235198J89483j34810j63469M13748P53927J15929q55053r16702J4600P53025
32729a064520N05503j43535k43209J40017J69945l91001p81019l48951M98419
32720a658351Q48280M66938k8372q7459J26167J11795k54507n93188n00217P80
32710a568134M92869O04341L66782Q8955n9402j60503k56426k30609r5991q5429
32700i03547k24993j40249L47108P14932L58720m25499o95417j64258L69160J68636
32690e95407l94706m37374J21330M72611J41739l15456j65438L79788M68540p9746
32680d04119m62238j31514L16978Q8352m76530l95038L29452O27366O2727m59575
$$ y = [-1299065, -1665577, -1694087, -1549029, -1366923, -998650, -526054, -430255, -864519, -1283467, -1235198, -1045715, -1180525, -1343994, -930246, -176319, -60390, -915443, -1832145, -1817545, -1064520, -559017, -702552, -945761, -805744, -635799, -1026800, -1807819, -2156770, -1658351, -810071, -343133, -371505, -458964, -332797, -221002, -475509, -1068697, -1568914, -1568134, -1075265, -470924, -104142, -15187, -74589, -235092, -491518, -722127, -818118, -903547, -1128540, -1268789, -921681, -206749, 151971, -273528, -968945, -1133203, -764043, -595407, -990113, -1427487, -1306157, -833546, -691807, -1007263, -1172701, -792913, -324373, -404119, -866357, -997871, -680893, -592541, -1069071, -1464109, -1134657, -507291, -444564, -904139]
32670i04139j71769L53250K49489j92381j20858L67436M25254p7450l73708j04113
32660e48989J79182J9695k45322j22393K89737N16163K98155k25359o59201o38685
32650a137017k30164O0324l8717j49744Q2089K85089l1071n11595m34494O7572
32640b037728K09955r3010r6933M41889Q07740M86487r4491l36957k20165L2196
32630i01017K94243K73704l05815r63600p56380L07723J029165O58500j17483
32621d80960l94284l10468l28223j65666N15713J040128N35119n31855q18010
32612i38506l5275O67604M16764k36104k87487K63950N23203N801o99049p24337
32602a043436j07698K38870j61479n87140j85995O10024O42503j33813n05908
$$ y = [-904139, -1075908, -722658, -473169, -665550, -786408, -418972, 6282, -71168, -444876, -548989, -369807, -350112, -595434, -717827, -428090, 88073, 386228, 160869, -498332, -1137017, -1367181, -1306857, -1345574, -1495318, -1413229, -1128140, -1159211, -1670806, -2105300, -2037728, -1827773, -1920783, -2017716, -1575827, -768087, -281600, -376091, -713048, -933213, -901017, -606774, -333070, -638885, -1602485, -2358865, -2051142, -1021977, -363477, -480960, -875244, -1185712, -1513935, -1679601, -1163888, -123760, 411359, -120496, -938506, -973781, -306177, 110587, -125517, -413004, -149054, 374149, 379950, -319099, -1043436, -1151134, -912264, -1073743, -1660883, -1846878, -1236854, -594351, -728164, -1234072]
32593a234072P1258O18102L06455j73182J05716O31441L44041m55057n46566J12516
32583b19348K29710p29869j625302j309793j86888N61419N73387M05064M45584
32574a856036M53333J28639l33261m33093J7089N96942O92723K07994l24365m17718
32564a267753j63951O2660J17313N0087j05433j85756R8915O10120O37032j30402
32554b77168q58374n39901N22526J046514N24201k36627m46845l06125k72777
32545h44576j85728K46168O30816L36745m55285q41272l93648K66006L27547j39900
32535a053127l71313m0472K74442m541m82618k97072N12429Q78748K13347o64405
32525a034582o66957L9244M25644J77799m1888J48289K77343m2829m20642l74841
$$ y = [-1234072, -1162814, -544712, -238257, -411439, -305723, 325718, 669759, 214702, -331864, -219348, 10362, -719507, -2344809, -3654602, -3841490, -3280071, -2706684, -2301620, -1856036, -1402703, -1274064, -1607325, -2040418, -2023329, -1426387, -733664, -525670, -850035, -1267753, -1431704, -1369044, -1251731, -1201644, -1307077, -1492833, -1393918, -783798, -146766, -277168, -1135542, -1675443, -1152917, -106403, 417798, 181171, -265674, -571799, -844576, -1030304, -784136, -153320, 183425, -271860, -1113132, -1506780, -1240774, -913227, -1053127, -1424440, -1464912, -1190470, -1195011, -1677629, -1974701, -1462272, -583524, -370177, -1034582, -1701539, -1662295, -1236651, -1058852, -1100740, -952451, -675108, -717937, -1138579, -1513420]
32515a513420j10576o6785j24754J32257O06928P34638L17971j82457l06057j59859
32505f72114j10565j71890l4666L45999N58133L10353p1656q7687J32168k7462
32495A70613o39769r32049l69527M39915N02341j80074o51270l59046J99982L31119
32485a487765N0241j64751j13133K0194P9891J20252K19509L27145L13266J01171
32475e33980k30927m80130n08043l73703k15749p9114N1110J60271K69734M38444
32465a502087N54104L53617j09952l01138J05914O11814N03060o6510k69462R4037
32455b6603K40059l51771j014335p89894J71527P89372M98568j13485k28163J46492
32445f78233L53526O7148k95727j84367L40501O90266M84408o1675n15256o91956
$$ y = [-1513420, -1623996, -1690781, -1815535, -1683278, -1076350, -341712, -23741, -206198, -512255, -672114, -782679, -954569, -989235, -643236, -85103, 225250, 153594, 65907, 198075, 170613, -469156, -1401205, -1770732, -1330817, -828476, -1008550, -1659820, -2018866, -1818884, -1487765, -1437524, -1602275, -1715408, -1695214, -1615323, -1495071, -1275562, -948417, -635151, -533980, -764907, -1245037, -1753080, -2126783, -2342532, -2421646, -2370536, -2210265, -1940531, -1502087, -947983, -594366, -704318, -1005456, -899542, -287728, 215332, 148822, -120640, -26603, 213456, -138315, -1152650, -1942544, -1771017, -981645, -483077, -596562, -824725, -678233, -324707, -257559, -553286, -737653, -397152, 293114, 777522, 715847, 200591, -491365]
32435d91365n81584j36478N02106P88255K96166n51751p92919j13929P02223P63054
32425C83778J40847l61326k57683J78195M01977J93906k27053m53526k48267J89445
32415e9707L49205l9942o25754p82660l40313K22779L59035O0345k15154j15841
32405a188007K43891M71780L16775j34237n67290o61242k91583L19942O82223
32396h07748M62433j02606m10505k06682J15241R4544j41573j11680K59641N07084
32386c41851K90814j49254l58165k33927l3808L3214K0272R8692L27894N60841
32376B14722N48582J97863k66054m93060l86356j79166j16423j92487k39992j37875
32366a050246J17197M03850M97514K70781p0775j62226J7523O5321k57993o30883
$$ y = [-491365, -1072949, -1209427, -707321, 80934, 377100, -174651, -967570, -1081499, -379276, 383778, 524625, 163299, -94384, 83811, 485788, 679694, 452641, -885, -249152, -59707, 289498, 249556, -376198, -1158858, -1499171, -1276392, -917357, -857012, -1072166, -1188007, -944116, -472336, -155561, -289798, -857088, -1518330, -1809913, -1489971, -807748, -345315, -447921, -858426, -1065108, -949867, -855323, -996896, -1108576, -848935, -341851, -51037, -200291, -558456, -792383, -826191, -792977, -772705, -674013, -346119, 214722, 763304, 961167, 695113, 202053, -184303, -363469, -479892, -672379, -912371, -1050246, -933049, -529199, -31685, 239096, 168321, 6095, 23618, 88939, -169054, -799937]
32356g99937o34054l60640j81245r3376J82921N25618M40264q9944l90812o0282
32346a461487L97819L67762O1622M0050J89776j3826m38484m20606L6690J81655
32336a059029j52319j74109M22349O96822k5117p93761l55398P79201R60035j30547
32326A68127j043041p41078J07448M63518L75449M03881M93685K61844j62671
32317C27162l55029k82620j78100o9489N5656j48k37939k30286J81787M30187
32307c58819P5181l57188j55709L56420K87159l65960o98702l34778O8917m4813
32297a528292l20786j75078L26832O74456N84762J72732k31702k62491J54044
32288f05523N44960L52056k69946n78475k78904J09437J37785Q2556L14078N38390
$$ y = [-799937, -1433991, -1794631, -1975876, -2069252, -1886331, -1360713, -920449, -1010393, -1401205, -1461487, -1063668, -695906, -634284, -594234, -404458, -418284, -856768, -1277374, -1240684, -1059029, -1211348, -1385457, -963108, -266286, -291403, -1085164, -1440562, -661361, 298674, 168127, -874914, -1615992, -1508544, -1045026, -669577, -265696, 227989, 489833, 327162, -27867, -310487, -488587, -558076, -502420, -502568, -740507, -970793, -789006, -358819, -283638, -640826, -796535, -440115, -152956, -518916, -1217618, -1552396, -1483479, -1528292, -1849078, -2024156, -1697324, -1022868, -438106, -265374, -497076, -759567, -605523, -60563, 291493, 21547, -556928, -835832, -726395, -588610, -506054, -191976, 346414]
32278C46414K56617l33770n34700j59194K17928J03544k63499l13631O6050M00330
32268b13911K36464k74906n10355j06733N41192O95636J84354l57923k94677J94821
32258I3962L77495n6129o06120o33084j57882K17267Q8108k88439l78086n2477
32248a395385K91958K76164O292j19008L5675J69850k5707m10533n25086j85820
32238a881600K26103K42006k2255J3320N08774Q14425L19709n63123q10913j67538
32228a321092M75901K95537l77485n81780o090P21624Q92639M63848m4680j26113
32218C92309K44981N65500L00506m41597r02580n57115J73948L98897j44955p95225
32208g65331p96177j59358M28244M26533L2192j05063K79046O93932N37184p3059
$$ y = [346414, 603031, 269261, -265439, -424633, -206705, -103161, -366660, -680291, -614241, -213911, 22553, -252353, -762708, -869441, -328249, 367387, 551741, 193818, -100859, 93962, 471457, 415328, -190792, -823876, -981758, -764491, -676383, -964822, -1342908, -1395385, -1103427, -827263, -820971, -939979, -904304, -734454, -760161, -1170694, -1695780, -1881600, -1655497, -1413491, -1435746, -1422426, -913652, -99227, 220482, -342641, -1153554, -1321092, -845191, -549654, -927139, -1508919, -1515009, -793385, 99254, 563102, 518422, 392309, 637290, 1202790, 1503296, 1061699, 159119, -397996, -224048, 174849, 29894, -765331, -1561508, -1720866, -1292622, -866089, -833897, -938960, -659914, 34018, 571202, 498143]
32198D98143m73338l84950j82838j73940j56168P2913K80674K14704K6696o7659
32188c45763j41647k21658n7290L58523N24692J85671j46458j3898J62757j68181
32178A36748n97930l55590L21653M78207r230k58845J44817N52538L92630l0732
32168G74266k56119l49209m40786l28202p73J09224j34975k33734P0218K46610
32158e43480j03424m39266j34332M01421L25304k57745m50629J7015M30516K58119
32148d96501j20074j47897O2228M6761k28082l49391q2335L25500M69199K31422
32138b89170j32000k69764p3560K35561L41193J34389k11647m15357l06904O2623
32128i24636M52277N77014L06032j99278n42635m04184J01810M78676M23928K26331
$$ y = [498143, 24805, -360145, -542983, -716923, -873091, -800178, -519504, -304800, -278104, -345763, -487410, -709068, -766358, -407835, 116857, 302528, 156070, 142172, 304929, 136748, -461182, -816772, -495119, -16912, -26142, -284987, -140170, 412368, 804998, 774266, 518147, 168938, -271848, -600050, -600823, -491599, -626574, -860308, -790090, -543480, -646904, -1086170, -1220502, -819081, -493777, -751522, -1202151, -1185136, -754620, -496501, -616575, -764472, -702244, -655483, -883565, -1232956, -1315291, -989791, -520592, -289170, -421170, -690934, -764494, -528933, -187740, -53351, -264998, -680355, -987259, -924636, -472359, 104655, 410687, 211409, -331226, -735410, -633600, -154924, 269004, 495335]
32118D95335K79975L35013j90495j071148j209417j68470R36051Q45391p7216
32109A75019m79113p4035J43668k77586n25598k5199N34123L75559j29241k57563
32099e39966j74938l86515n64222o0569P47458Q12949O6726m02523J0948O14163
32089A23511N96139J49881j03916j17510k07145l20201j71926J46288K86451K37487
32079F19059K81960M26409L60806j358l84266o10001p62943p75319l32161N00476
32069f77338R69463M76498m69511p41319p1859N59403K95912l78715l44707N35464
32059A53291J213357Q98509L2764m74237m34465k96922k22718Q1732O19773Q06195
32049B377279J77105r58462j833190j944691j284799j84755P41724Q12784l5156
$$ y = [495335, 775310, 1110323, 919828, -151320, -1360737, -1529207, -593156, 252235, 175019, -304094, -378129, -234461, -512047, -1037645, -1062844, -528721, -153162, -282403, -539966, -714904, -1101419, -1665641, -1726210, -978752, -165803, -99077, -501600, -490652, 123511, 719650, 869531, 765615, 648105, 440960, 120759, -51167, 95121, 381572, 619059, 901019, 1327428, 1688234, 1686876, 1302610, 692609, -70334, -845653, -1177814, -677338, 292125, 768623, 299112, -442207, -514066, 45337, 341249, -37466, -382173, 153291, 1366648, 2265157, 2297921, 1823684, 1389219, 1092297, 869579, 951311, 1571084, 2377279, 2554384, 1595922, -237268, -2181959, -3466758, -3651513, -2909789, -2097005, -2132161]
32040b132161q72783o48887M80578J214811P07647l81927p86462j76730O52740
32031a943174Q84261M47640k05597o03357m81983J01785P50070R91870O28219
32022E69734j95614j053586j314644n96025N72814J030512L91134l41014j85006
32013a121695L72480K73159k88327k21319M92297O66583q1168o69663l81886L4615
32003i24924j82743n19317k45054L07200M93326M42141M31508J25547n49344p46274
31993a367934p2491L67019l41668j139730n31407Q73535J212636K78021l92797
31984a114816j25961J89860P3110J23010L97621M8027q58589r66442J51090J066956
31974a016134O90227j61780l77920k63614m64724n28882R2940P12179N03841M1159
$$ y = [-2132161, -3004944, -3653831, -3173253, -1958442, -1250795, -1632722, -2419184, -2595914, -1943174, -1058913, -611273, -816870, -1420227, -1902210, -1800425, -1050355, -58485, 569734, 374120, -679466, -1994110, -2590135, -2017321, -986809, -595675, -936689, -1121695, -749215, -476056, -764383, -985702, -493405, 173178, 92010, -577653, -959539, -924924, -1107667, -1626984, -1872038, -1564838, -1071512, -629371, -197863, -72316, -621660, -1367934, -1440425, -1073406, -1415074, -2554804, -3086211, -2212676, -1000040, -722019, -1114816, -1240777, -1050917, -977807, -854797, -457176, -409149, -1267738, -2234180, -2083090, -1016134, -325907, -487687, -865607, -1129221, -1593945, -2122827, -2029887, -1317708, -813867, -772708]
31964g72708K68474P00989K21673q43062j082275k45358M27289K12022j62526
31955a275482P2603N57297N77960J55609k09538l10737k54060q3284J85735L56448
31945b27449K05696j97100n00187m42053j79199j34457m09912n22618m2571O53842
31935a796008P91689L23167k7967M7602K5180l60818m79253J15633P25487M80785
31925a54503k75756n23517j29748J18185r0378j70252K45168O51093M95248J8128
31915A83668j91487r7974j84087o10456q33990k97260O47536R17119M4891j005850
31905a427890r30412J95066J031469Q37369K97685J91177K22003j40826n12959
31896b37318k55307K81278K43114l00070m85473j01282J59299l1349j35616J84362
$$ y = [-772708, -504234, 196755, 418428, -424634, -1506909, -1752267, -1324978, -1112956, -1275482, -1202879, -645582, -67622, 87987, -121551, -432288, -686348, -769632, -583897, -227449, -21753, -218853, -719040, -1161093, -1340292, -1474749, -1884661, -2407279, -2449850, -1796008, -1004319, -681152, -709119, -661517, -636337, -997155, -1476408, -1360775, -635288, -154503, -430259, -953776, -1083524, -965339, -1055717, -1225969, -980801, -329708, 165540, 183668, -7819, -105793, -289880, -900336, -1734326, -2031586, -1384050, -466931, -422040, -1427890, -2358302, -2163236, -1131767, -294398, 3287, 194464, 416467, 275641, -237318, -492625, -211347, 31767, -268303, -753776, -855058, -695759, -727108, -862724, -678362]
31886f78362M24563J56753j57581Q2871N66940M90258k18758p87047o97469k93122
31876a110954j07689r2860J21934N06848O39170L55241m5356k91234m13430m14561
31866h52891j30155L34644M91432J51274k10989j96833j19419l57242n72962l06189
31856a769330J02390O9405j19808J99469P39904O23807k5467j69271L77412O35581
31846F64092J95099j55215K387m6919o42497q78174j81591N03044K26468l76949
31836f90255k37492L69606N04529K17542J49854J46969k91167o84062j98591O89126
31826b3941O64042l41675r39054l27886O68390R16584L34106l96675p02817m26980
31816e75906J53973M53869J76749k38479k22339Q6882J79006O9981J40837K84587
$$ y = [-678362, -253799, -97046, -254627, -171756, 395184, 885442, 666684, -120363, -817832, -1110954, -1218643, -1311503, -1189569, -682721, -43551, 311690, 266334, -24900, -438330, -852891, -983046, -648402, -156970, -5696, -216685, -413518, -532937, -890179, -1463141, -1769330, -1666940, -1597535, -1717343, -1517874, -777970, -154163, -179630, -348901, 28511, 664092, 859191, 703976, 706363, 659444, 16947, -861227, -1042818, -539774, -313306, -690255, -927747, -558141, -53612, 163930, 313784, 460753, 169586, -514476, -713067, -23941, 640101, 298426, -640628, -968514, -300124, 616460, 950566, 553891, -148926, -575906, -421933, 31936, 208685, -29794, -252133, -165251, 13755, 83736, 224573, 509160]
31806E09160J7515o09906r46544o32654k342M07944L40798o5649l13244J1270
31796a283652N39513L99546m42913q81342k84477M65957L73417j57373k59787
31787a531111j45159l81183m63070K99490J097126O08520o92444j076828k65194
$$ y = [509160, 526675, -83231, -1029775, -1662429, -1664771, -1256827, -916029, -981678, -1294922, -1283652, -744139, -344593, -787506, -1668848, -1953325, -1487368, -1113951, -1271324, -1531111, -1676270, -2057453, -2520523, -2221033, -1123907, -515387, -1207831, -2284659, -2549853]
$$ [...]
##END NTUPLES=NMR SPECTRUM
##END=
