##TITLE=31Pdec_SR41_oil
 CDCl3, 124 sc
 2.03.2021
##JCAMPDX= 6.0         $$ Bruker NMR JCAMP-DX V2.0
##DATA TYPE= NMR SPECTRUM
##DATA CLASS= NTUPLES
##ORIGIN= UXNMR, Bruker Analytische Messtechnik GmbH
##OWNER= root
$$ XWIN-NMR		Version 3.5
$$ Tue Mar  2 13:11:02 2021 Russian Standard Time (UT+4h)  she@DPX200
##.OBSERVE FREQUENCY= 81.013821
##.OBSERVE NUCLEUS= ^31P
##.ACQUISITION MODE= SIMULTANEOUS
##.ACQUISITION SCHEME= undefined
##.AVERAGES= 124
##.DIGITISER RES= 16
##SPECTROMETER/DATA SYSTEM= spect
##.PULSE SEQUENCE= zgpg30
##.SOLVENT NAME= CDCl3
##.SHIFT REFERENCE= (INTERNAL, CDCl3, 0, 248.564)
##AUDIT TRAIL= $$ (NUMBER, WHEN, WHO, WHERE, WHAT)
$$ ##TITLE= Audit trail, XWIN-NMR		Version 3.5
$$ ##JCAMPDX= 5.01
$$ ##ORIGIN= Bruker BioSpin GmbH
$$ ##OWNER= she
$$ F:/spectra/data/she/nmr/P31/1/pdata/1/auditp.txt
$$ ##AUDIT TRAIL=  $$ (NUMBER, WHEN, WHO, WHERE, WHAT)
(   1,<2021-03-02 13:09:46.53 +0400>,<she>,<DPX200>,
      <continue with go, POWCHK disabled, PULCHK disabled
       configuration hash MD5:
       00 E9 B6 7A A2 85 ED C7 34 08 36 98 17 FE 4E 26
       data hash MD5: 32K
       73 FB 9F AB D1 EE A2 B4 54 8B 1A 9D 79 0F A1 71>)
(   2,<2021-03-02 13:09:48.56 +0400>,<she>,<DPX200>,
      <Start of raw data processing
       efp BC_mod = 2 LB = 1 FT_mod = 6 PKNL = 1 PHC0 = -3099.732 PHC1 = 390.2027 SI = 64K 
       data hash MD5: 64K
       53 56 75 E1 66 72 81 65 58 15 6D 83 7B DD D5 91>)
(   3,<2021-03-02 13:10:25.29 +0400>,<she>,<DPX200>,
      <pk PHC0 = 161.6008 PHC1 = -383.6 
       data hash MD5: 64K
       76 34 CB 60 D9 CA 15 5C 95 77 D2 FA D0 AF 41 79>)
(   4,<2021-03-02 13:10:33.70 +0400>,<she>,<DPX200>,
      <abs ABSG = 5 
       data hash MD5: 64K
       AD C3 24 44 17 51 7E 60 0F 8F 6A E3 D4 82 2A D9>)
$$ ##END=
$$ 
$$ hash MD5
$$ DD 5B 29 50 C6 5B F6 1F 7E 3B F1 E8 C1 6F 99 88
##$RELAX= 
##$RELAX= 
##$RELAX= 
##$RELAX= 
##$RELAX= 
##$RELAX= 
##$RELAX= 
##$RELAX= 
$$ Bruker specific parameters
$$ --------------------------
##$DU= <F:/spectra>
##$EXPNO= 1
##$NAME= <P31>
##$PROCNO= 1
##$TYPE= <nmr>
##$USER= <she>
##$AMP= (0..31)
100 100 100 100 100 100 100 100 100 100 100 100 100 100 100 100 100 100 
100 100 100 100 100 100 100 100 100 100 100 100 100 100 
##$AQSEQ= 0
##$AQ_mod= 1
##$AUNM= <au_zg>
##$AUTOPOS= <>
##$BF1= 81.014009
##$BF2= 200.13
##$BF3= 200.13
##$BF4= 200.13
##$BF5= 200.13
##$BF6= 200.13
##$BF7= 200.13
##$BF8= 200.13
##$BYTORDA= 1
##$CFDGTYP= 0
##$CFRGTYP= 5
##$CHEMSTR= <none>
##$CNST= (0..31)
1 1 145 1 1 1 1 1 1 1 1 1 1 1 1 1 1 1 1 1 1 1 1 1 1 1 1 1 1 1 1 1 
##$CPDPRG= <waltz16>
##$CPDPRG1= <>
##$CPDPRG2= <waltz16>
##$CPDPRG3= <>
##$CPDPRG4= <mlev>
##$CPDPRG5= <mlev>
##$CPDPRG6= <mlev>
##$CPDPRG7= <mlev>
##$CPDPRG8= <mlev>
##$CPDPRGB= <>
##$CPDPRGT= <>
##$D= (0..31)
0 1 0 0 0 0 0 0 0 0 0 0.03 2e-05 3e-06 0 0 0 0 0 0 0 0 0 0 0 0 0 0 0 0 
0 0 
##$DATE= 1614676017
##$DBL= (0..7)
120 120 120 11 120 120 24 19 
##$DBP= (0..7)
150 150 150 150 150 150 150 150 
##$DBP07= 0
##$DBPNAM0= <>
##$DBPNAM1= <>
$$ [...]
##$SUBNAM3= <"">
##$SUBNAM4= <"">
##$SUBNAM5= <"">
##$SUBNAM6= <"">
##$SUBNAM7= <"">
##$SUBNAM8= <"">
##$SUBNAM9= <"">
##$SW= 501.771253377433
##$SWIBOX= (0..15)
0 1 3 0 0 0 0 0 0 0 0 0 0 0 0 0 
##$SW_h= 40650.406504065
##$TD= 32768
##$TD0= 1
##$TE= 0
##$TE2= 300
##$TE3= 300
##$TEG= 300
##$TL= (0..7)
0 120 53 12 22 120 120 120 
##$TP= (0..7)
150 150 150 150 150 150 150 150 
##$TP07= 0
##$TPNAME0= <>
##$TPNAME1= <>
##$TPNAME2= <>
##$TPNAME3= <>
##$TPNAME4= <>
##$TPNAME5= <>
##$TPNAME6= <>
##$TPNAME7= <>
##$TPOAL= (0..7)
0.5 0.5 0.5 0.5 0.5 0.5 0.5 0.5 
##$TPOFFS= (0..7)
0 0 0 0 0 0 0 0 
##$TUNHIN= 0
##$TUNHOUT= 0
##$TUNXOUT= 0
##$USERA1= <user>
##$USERA2= <user>
##$USERA3= <user>
##$USERA4= <user>
##$USERA5= <user>
##$V9= 5
##$VALIST= <valist>
##$VCLIST= <CCCCCCCCCCCCCCC>
##$VD= 0
##$VDLIST= <DDDDDDDDDDDDDDD>
##$VPLIST= <PPPPPPPPPPPPPPP>
##$VTLIST= <TTTTTTTTTTTTTTT>
##$WBST= 1024
##$WBSW= 4
##$XGAIN= (0..3)
0 0 0 0 
##$XL= 0
##$YL= 0
##$YMAX_a= 24555
##$YMIN_a= -7676
##$ZGOPTNS= <>
##$ZL1= 120
##$ZL2= 120
##$ZL3= 120
##$ZL4= 120
##$ABSF1= 248.5645
##$ABSF2= -253.2056
##$ABSG= 5
##$ABSL= 3
##$ALPHA= 0
##$AQORDER= 0
##$ASSFAC= 0
##$ASSFACI= 0
##$ASSFACX= 0
##$ASSWID= 0
##$AUNMP= <proc_1d>
##$AZFE= 0.1
##$AZFW= 0.5
##$BCFW= 0
##$BC_mod= 2
##$BYTORDP= 0
##$COROFFS= 0
##$CY= -3
##$DATMOD= 1
##$DC= 0
##$DFILT= <>
##$DTYPP= 0
##$F1P= 0
##$F2P= 0
##$FCOR= 1
##$FTSIZE= 65536
##$FT_mod= 6
##$GAMMA= 0
##$GB= 0
##$INTBC= 1
##$INTSCL= 5.30512e-09
##$ISEN= 30
##$LB= 1
##$LEV0= 0
##$LPBIN= 0
##$MAXI= 10000
##$MC2= 0
##$MEAN= 0
##$ME_mod= 0
##$MI= 50
##$NCOEF= 0
##$NC_proc= -6
##$NLEV= 6
##$NOISF1= 182.463
##$NOISF2= 159.3651
##$NSP= 0
##$NTH_PI= 0
##$NZP= 0
##$OFFSET= 248.5645
##$PC= 4
##$PHC0= -2938.131
##$PHC1= 6.602692
##$PH_mod= 1
##$PKNL= yes
##$PPARMOD= 0
##$PSCAL= 0
##$PSIGN= 0
##$REVERSE= no
##$SF= 81.014009
##$SI= 65536
##$SIGF1= 159.3651
##$SIGF2= -187.1042
##$SINO= 113.3802
##$SIOLD= 16384
##$SREGLST= <1H.CDCl3>
##$SSB= 0
##$STSI= 65536
##$STSR= 0
##$SW_p= 40650.406504065
##$SYMM= 0
##$S_DEV= 0
##$TDeff= 32768
##$TDoff= 0
##$TI= <>
##$TILT= no
##$TM1= 0
##$TM2= 0
##$TOPLEV= 0
##$USERP1= <user>
##$USERP2= <user>
##$USERP3= <user>
##$USERP4= <user>
##$USERP5= <user>
##$WDW= 1
##$XDIM= 65536
##$YMAX_p= 430541339
##$YMIN_p= -40337517
$$ End of Bruker specific parameters
$$ ---------------------------------
##NTUPLES= NMR SPECTRUM
##VAR_NAME=  FREQUENCY,     SPECTRUM/REAL,   SPECTRUM/IMAG
##SYMBOL=    X,             R,               I
##VAR_TYPE=  INDEPENDENT,   DEPENDENT,       DEPENDENT
##VAR_FORM=  AFFN,          ASDF,            ASDF
##VAR_DIM=   65536,         65536,           65536
##UNITS=     HZ,            ARBITRARY UNITS, ARBITRARY UNITS
##FACTOR=    0.620285442955139, 1,           1
##FIRST=     20137.2065510759, 0,            0
##LAST=      -20513.1999529892, 0,           0
##MIN=       -20513.1999529892, -40337517,   0
##MAX=       20137.2065510759, 430541339,    0
$$ Real data points
##PAGE= N=1
##DATA TABLE= (X++(R..R)), XYDATA
$$ [...]
##PAGE= N=2
##DATA TABLE= (X++(I..I)), XYDATA
$$ plain form
13001 973981 -33673 2367754 5428054 6092075 4943755 3938587 3217269 2441115 2445458
12992 2445458 3071130 2130725 -658290 -1564828 1738539 5097838 2654500 -4698656 -10245844
12983 -10245844 -10279334 -7402132 -4967539 -3211028 -2243683 -4036118 -8435321 -10714068
12975 -10714068 -6799323 917272 6250751 6580769 4659122 3870140 4666412 5710783
12967 5710783 5907535 4588862 1566107 -2086846 -4382248 -4170748 -2011136 608342
12959 608342 2206641 1962862 514160 -471547 -717909 -2202850 -5532673 -6835981 -2059164
12950 -2059164 5745096 8112234 1929895 -5883240 -7538885 -4179159 -2101935 -2687472
12942 -2687472 -2291445 -425151 -799112 -3566705 -3427465 2019004 7823978 8940070 6922706
$$ packed form
13001I73981j007654K401427L060300O64021j148320j005168p21318p76154M343
12992B445458O25672r40405k789015r06538L303367L359299k443338p353156n547188
12983a0245844l3490K877202K434593J756511R67345j792435m399203k278747
12975a0714068L914745P716595N333479L30018j921647p88982P96272J044371
12967E710783J96752j318673l022755l652953k295402K11500K159612K619478
12959F08342J598299k43779j448702r85707k46362j484941l329823j303308M776817
12950b059164P804260K367138o182339p813135j655645L359726K077224n85537
12942b687472L96027J866294l73961k767593J39240N446469N804974J116092k017364
$$ plain form
12933 6922706 5543321 4388261 1624801 -802841 -329265 841404 -594520 -2306645
12925 -2306645 219970 4948444 5210708 393502 -2564318 171339 4051424 4163790
12917 4163790 2171232 1441220 796483 -2007566 -4797428 -4312741 -2207758 -2583753 -5323768
12908 -5323768 -6570368 -4606275 -957238 3326282 8099494 11309589 10108006 5281107
12900 5281107 1191435 764061 3133362 6060289 7694979 6234079 1390275 -3490543
12892 -3490543 -4266333 -1483356 526817 584086 2274203 6946046 9927658 7373513 3006837
12883 3006837 2963915 6286968 6577024 2635934 823110 4562179 7404255 1526457 -10335605
12874 -10335605 -17646882 -15976794 -11958146 -12814999 -16584109 -16726791 -12550803 -9409843
$$ packed form
12933F922706j379385j155060k763460k427642M73576J170669j435924j712125
12925b306645K526615M728474K62264m817206k957820K735657L880085J12366
12917D163790j992558p30012o44737k804049k789862M84687K104983l75995k740015
12908e323768j246600J964093L649037M283520M773212L210095j201583m826899
12900E281107m089672m27374K369301K926927J634690j460900m843804m880818
12892c490543p75790K782977K010173N7269J690117M671843K981612k554145m366676
12883C006837m2922L323053K90056l941090j812824L739069K842076n877798j1862062
12874a0335605p311277J670088M018648q56853l769110j42682M175988L140960
$$ plain form
12866 -9409843 -9782060 -9850735 -6129885 -973610 1113489 -238061 -1706243 -1567322 -1544848
12857 -1544848 -3312637 -5377962 -4756359 -1186692 1804980 1176075 -1075656 -75784 4749787
12848 4749787 8104310 6736092 5155926 8760166 14112319 12926334 5036081 -373545
12840 -373545 1877777 6015661 5270961 1687672 619004 1389586 219115 -1712618 -194720
12831 -194720 4689785 9575738 13650616 17078490 16444879 9517951 2613999 4403345
12823 4403345 12652679 16092169 10508697 3883587 3028087 4251988 1886293 -2053339
12815 -2053339 -3008076 -2427523 -4212261 -6913437 -6271847 -2780271 -694780 -1458436 -3252475
12806 -3252475 -5114695 -6536825 -5008949 598268 5599805 4045942 -2762260 -7513682
$$ packed form
12866i409843l72217o8675L720850N156275K087099j351550j468182J38921K2474
12857a544848j767789k065325O21603L569667K991672o28905k251731R99872M825571
12848D749787L354523j368218j580166L604240N352153j185985p890253n409626
12840c73545K251322M137884p44700l583289j068668P70582j170471j931733J517898
12831a94720M884505M885953M074878L427874o33611o926928o903952J789346
12823D403345Q249334L439490n583472o625110q55500J223901k365695l939632
12815b053339r54737N80553j784738k701176O41590L491576K085491p63656j794039
12806c252475j862220j422130J527876N607217N001537j553863o808202m751422
$$ plain form
12798 -7513682 -6672546 -3955560 -3233466 -2780596 1197993 8472949 14690919 16163405 13463153
12789 13463153 10495957 9897014 9557574 5689536 -311257 -1983564 2721495 6517370
12781 6517370 2358896 -5483120 -6821108 -489636 3987757 483216 -5734610 -7104666
12773 -7104666 -4107380 -1628450 -21674 4057088 10279004 13905919 12251069 7726792
12765 7726792 4020405 2321164 2070558 3056498 5390641 8353617 10293842 9815296 6967684
12756 6967684 3012391 -1046056 -4782874 -6622437 -3620148 4620918 12876282 14518437
12748 14518437 9127145 2945797 1183591 2799802 3685354 1793373 -2269074 -6731985
12740 -6731985 -9032976 -7377560 -3518249 -1263713 -839714 1887193 8696489 15381835
$$ packed form
12798g513682Q41136K716986P22094M52870L978589P274956O217970J472486k700252
12789A3463153k967196n98943l39440l868038o000793j672307M705059L795875
12781F517370m158474p842016j337988O331472M477393l504541o217826j370056
12773g104666K997286K478930J606776M078762O221916L626915j654850m524277
12765G726792l706387j699241k50606R85940K334143K962976J940225m78546k847612
12756F967684l955293m058447l736818j839563L002289Q241066Q255364J642155
12748A4518437n391292o181348j762206J616211Q85552j891981m062447m462911
12740f731985k300991J655416L859311K254536M23999K726907O809296O685346
$$ plain form
12732 15381835 17580708 16367013 14510497 11164414 5182048 379005 1255110 5166210
12724 5166210 5163260 243104 -3417400 -2011980 1112184 1816827 830295 530137 714097
12715 714097 603107 1233708 2596110 1649667 -3094603 -7376080 -5570173 1735877 7940692
12706 7940692 7932840 2680101 -3683485 -8645829 -11872218 -12463627 -8091437 1651283 11802754
12697 11802754 14881800 9100955 1666024 822116 5853599 8689220 4794892 -2016448
12689 -2016448 -6007612 -5893213 -3273874 531257 3499707 3076058 618631 1729928
12681 1729928 8152691 12925365 8663583 -1849716 -8893353 -8180003 -4157517 -1289029
12673 -1289029 1564431 6102816 9393587 7810470 3429199 2340588 6994057 13144665
$$ packed form
12732A5381835K198873j213695j856516l346083n982366m803043Q76105L911100
12724E166210k950m920156l660504J405420L124164P04643r86532l00158J83960
12715G14097j10990O30601J362402r46443m744270m281477J805907P306050O204815
12706G940692p852n252739o363586m962344l226389n91409M372190R742720J0151471
12697A1802754L079046n780845p434931q43908N031483K835621l894328o811340
12689b016448l991164J14399K619339L805131K968450m23649k457427J111297
12681A729928O422763M772674m261782j0513299p043637P13350M022486K868488
12673a289029K853460M538385L290771j583117m381271j088611M653469O150608
$$ plain form
12665 13144665 15025820 11593239 6301200 1934659 -1730645 -4577958 -3712885 2256206
12657 2256206 8284867 7288326 -7696 -4692004 -1224008 5413264 7382960 4392110
12649 4392110 1877214 2308592 3725832 4740120 5499147 4913676 2147715 125682 2512305
12640 2512305 7544242 9636854 6927436 2665516 -492626 -2671819 -3477786 -1668615
12632 -1668615 1573825 3730111 5075408 6741115 5732149 -1252403 -9295965 -9063438
12624 -9063438 -967898 3245808 -2990340 -11237695 -10531528 -2648130 2370636 772641
12616 772641 -2718213 -4094890 -3717817 -2019282 1771184 6434249 9013311 8448907 6029615
12607 6029615 3371827 2477455 5309217 10123043 11205209 6005925 -722199 -3970819
$$ packed form
12665A3144665J881155l432581n292039m366541l665304k847313Q65073N969091
12657B256206O028661r96541p296022m684308L467996O637272J969696k990850
12649D392110k514896M31378J417240J014288P59027n85471k765961k022033K386623
12640B512305N031937K092612k709418m261920l158142k179193q05967J809171
12632a668615L242440K156286J345297J665707j008966o984552q043562K32527
12624i063438Q095540M213706o236148q247355P06167P883398N018766j597995
12616G72641l490854j376677L77073J698535L790466M663065K579062n64404k419292
12607F029615k657788q94372K831762M813826J082166n199284o728124l248620
$$ plain form
12599 -3970819 -5550770 -8815464 -10925064 -7929785 -3973554 -6044158 -11184274 -9343984
12591 -9343984 232791 6047620 1200983 -6371418 -6125502 519672 4992896 5082029 5358898
12582 5358898 7318103 7414705 4437146 1803075 1412122 816922 -1510549 -2568015 700253
12573 700253 6323394 9788626 9835500 8671328 7333036 4445172 293216 -1328642 2118967
12564 2118967 7506727 9778293 8957012 9289489 11410958 10356750 3469384 -4266818
12556 -4266818 -6563786 -4190231 -2505272 -2975484 -2357382 576652 2789696 2050019 -138010
12547 -138010 -1835438 -3248931 -4664763 -5063071 -4469275 -4915776 -7047970 -7870973 -4147558
12538 -4147558 3014861 8916220 10397129 8901534 8074004 9149658 10000250 9057550 8174788
$$ packed form
12599c970819j579951l264694k109600K995279L956231k070604n140116J840290
12591i343984R576775N814829m846637p572401K45916O645174M473224Q9133K76869
12582E358898J959205R6602k977559k634071l90953n95200k327471j057466L268268
12573G00253N623141L465232M6874j164172j338292k887864m151956j621858L447609
12564B118967N387760K271566q21281L32477K121469j054208o887366p736202
12556d266818k296968K373555J684959m70212O18102K934034K213044p39677k188029
12547a38010j697428j413493j415832l98308N93796m46501k132194q23003L723415
12538d147558P162419N901359J480909j495595q27530J075654Q50592r42700q82762
$$ plain form
12529 8174788 9305557 10014575 6546862 1011335 -121268 3791017 5066465 -1100194
12521 -1100194 -8913410 -10546415 -6925895 -3546785 -718133 3730547 5992365 459650
12513 459650 -9282548 -13490988 -10134357 -6424187 -6372776 -6742390 -6392008 -8886337 -13032282
12504 -13032282 -11633261 -4146719 -251529 -5023901 -10489432 -9082161 -5921083 -8564835
12496 -8564835 -12922074 -10387032 -2969580 362522 -1432600 -1846427 154563 -923365
12488 -923365 -5504533 -7388048 -5082394 -4560777 -8278628 -10740185 -8406541 -5458279
12480 -5458279 -5238766 -3684443 2985001 10255189 11541416 8069085 6031622 6901673
12472 6901673 7115627 5723205 5699879 7492372 7261917 3368973 -108951 806588 3947153
$$ packed form
12529H174788J130769P09018l467713n535527j132603L912285J275448o166659
12521a100194p813216j633005L620520L379110K828652M448680K261818n532715
12513D59650r742198m208440L356631L710170N1411l69614L50382k494329m145945
12504a3032282J399021P486542L895190m772372n465531J407271L161078k643752
12496h564835m357239K535042P417452L332102j795122m13827K000990j077928
12488i23365m581168j883515K305654N21617l717851k461557K333644K948262
12480e458279K19513J554323O669444P270188J286227l472331k037463Q70051
12472F901673K13954j392422k3326J792493k30455l892944l477924R15539L140565
$$ plain form
12463 3947153 4195355 871340 -1707876 -538554 2714359 5334416 7259000 9218092
12455 9218092 9666078 6609906 1540569 -1407810 -428205 1892053 1823116 -1568132 -5715396
12446 -5715396 -6782279 -3299128 1438937 2316226 -651909 -1094771 4747277 10920526
12438 10920526 9107489 1179203 -2635092 1784981 7251351 6492296 1481636 -1928374
12430 -1928374 -2423714 -1758447 -70892 2289033 2294620 -1506400 -5559383 -6408049 -5816375
12421 -5816375 -6616276 -7313275 -5693459 -4045167 -5195536 -6599899 -4471726 -1131668
12413 -1131668 -1661269 -5020452 -5322645 -1310005 2008193 1592772 427842 2121799 6046406
12404 6046406 9197336 9576211 7066013 3631778 2437848 4147179 5055917 1862544
$$ packed form
12463C947153K48202l324015k579216J169322L252913K620057J924584J959092
12455I218092M47986l056172n069337k948379R79605K320258o8937l391248m147264
12446e715396j066883L483151M738065Q77289k968135m42862N842048O173249
12438A0920526j813037p928286l814295M420073N466370p59055n010660l410010
12430a928374m95340O65267J687555K359925N587l801020m052983q48666N91674
12421e816375p99901o96999J619816J648292j150369j404363K128173L340058
12413a131668n29601l359183l02193M012640L318198m15421j164930J693957L924607
12404F046406L150930L78875k510198l434235j193930J709331R08738l193373
$$ plain form
12396 1862544 -3102700 -4945762 -3231687 -2075510 -3974333 -7055829 -7934428 -4652928
12388 -4652928 1998773 7885391 8555909 5171514 3940208 6935796 8519139 5052748
12380 5052748 1840972 3580651 4191205 -3935135 -14864284 -15182747 -3904186 5543847
12372 5543847 4440718 -1105006 -1996265 1860699 5738371 8026841 8973319 7553929
12364 7553929 3950037 726402 -990601 -2279267 -2718800 -1407541 -1480478 -6395942 -11754447
12355 -11754447 -9639929 -1880264 1244365 -2457118 -3461916 2305764 5029511 -2761995
12347 -2761995 -12519278 -12113901 -3377621 3275823 4775833 4968966 3908342 -639394
12339 -639394 -4393799 -823099 7123883 9806665 4990522 -6479 -109561 2231751
$$ packed form
12396A862544m965244j843062J714075J156177j898823l081496q78599L281500
12388d652928O651701N886618O70518l384395j231306K995588J583343l466391
12380E052748l211776J739679O10554q126340j0929149l18463J1278561R448033
12372E543847j103129n545724q91259L856964L877672K288470R46478j419390
12364G553929l603892l223635j717003j288666m39533J311259p2937m915464n358505
12355a1754447K114518P759665L124629l701483j004798N767680K723747p791506
12347b761995r757283M05377Q736280O653444J500010J93133j060624m547736
12339f39394l754405L570700P946982K682782m816143m997001j03082K341312
$$ plain form
12331 2231751 3830600 4652637 4213076 1539556 -713964 688674 2388030 -1575632
12323 -1575632 -8129621 -6973287 3571547 12161214 10591514 5456765 6661888 11651257
12315 11651257 10528185 2755469 -1768463 1790266 6158041 3716995 -1914278 -1761226
12307 -1761226 5036803 10182800 7972138 2243471 -171800 1519275 2953307 1812200
12299 1812200 73344 -64183 1143039 2478198 2956804 1247178 -3301021 -8486114
12291 -8486114 -10571669 -8386961 -4126858 -65950 3238835 5720090 7396361 8882354
12283 8882354 9752333 7587572 2059756 -1920267 -193547 3174221 1089698 -4786639
12275 -4786639 -5712223 111611 4625626 3553963 2891265 6942086 9869458 6367633
$$ packed form
12331B231751J598849Q22037m39561k673520k253520J402638J699356l963662
12323a575632o553989J156334J0544834Q589667j569700n134749J205123M989369
12315A1651257j123072p772716m523932L558729M367775k441046n631273J53052
12307a761226O798029N145997k210662n728667k415271J691075J434032j141107
12299A812200j738856j37527J207222J335159M78606j709626m548199n185093
12291h486114k085555K184708M260103M060908L304785K481255J676271J485993
12283H882354Q69979k164761n527816l980023J726720L367768k084523n876337
12275d786639r25584N823834M514015j071663o62698M050821K927372l501825
$$ plain form
12267 6367633 1699806 2047331 2811150 -2663301 -9223636 -7339983 -85398 1048552
12259 1048552 -4327002 -4475831 4377211 10653995 5011461 -6093210 -11125995 -8820227
12251 -8820227 -5360274 -3178052 -673931 1419766 1307961 1378845 5253368 10669659 11452599
12242 11452599 6687998 2649012 4341394 9224088 11295456 8467272 3386799 -1180587
12234 -1180587 -4605982 -6356798 -5138209 -1746051 -135601 -2607343 -5464575 -3251787
12226 -3251787 3284603 7805838 7196037 4948569 4603976 5095117 4912122 5418973 6497228
12217 6497228 4215650 -2398335 -6965872 -3788617 3456308 6865820 4934828 2153219
12209 2153219 1098145 1256846 2988597 6045589 6633275 2746196 -232516 3182155
$$ packed form
12267F367633m667827L47525P63819n474451o560335J883653P254585J133950
12259A048552n375554j48829Q853042O276784n642534j1104671n032785K305768
12251h820227L459953K182222K504121K093697j11805P0884L874523N416291P82940
12242A1452599m764601m038986J692382M882694K071368k828184n080473m567386
12234a180587l425395j750816J218589L392158J610450k471742k857232K212788
12226c251787O536390M521235o09801k247468l44593M91141j82995N06851J078255
12217F497228k281578o613985m567537L177255P244925L409512j930992k781609
12209B153219j055074J58701J731751L056992N87686l887079k978712L414671
$$ plain form
12201 3182155 8419605 6941815 505002 -1130466 3525104 5175058 -247070 -4396703
12193 -4396703 -376536 6012393 5888728 803042 -1184392 1823773 4333970 2441599
12185 2441599 -2249834 -6693301 -9540056 -10226731 -8122555 -3265970 2878210 7313505
12177 7313505 7111380 2927825 -326979 855750 3716744 3510559 604899 -1410616
12169 -1410616 -2389221 -4165794 -4526276 -511622 3473017 162828 -7729343 -9413517
12161 -9413517 -2677760 2064470 -1832750 -7512100 -7091648 -3905780 -4549617 -7049630
12153 -7049630 -5815631 -2074136 -567404 -682550 845315 2296943 -233290 -5526094
12145 -5526094 -9316286 -10390303 -8965032 -3557989 4334501 7760720 3824402 333748
$$ packed form
12201C182155N237450j477790o436813j635468M655570J649954n422128m149633
12193d396703M020167O388929j23665n085686j987434L008165K510197j892371
12185B441599m691433m443467k846755o86675K104176M856585O144180M435295
12177G313505k02125m183555l254804J182729K860994k06185k905660k015515
12169a410616r78605j776573l60482M014654L984639l310189p892171j684174
12161i413517O735757M742230l897220n679350M20452L185868o43837k500013
12153g049630J233999L741495J506732j15146J527865J451628k530233n292804
12145e526094l790192j074017J425271N407043P892490L426219l936318l490654
$$ plain form
12137 333748 4705828 11625756 11461217 6078984 4817941 8072166 7689864 2766830 1913381
12128 1913381 7962970 12376802 8683401 1521166 -2182107 -2746656 -3907284 -6204655
12120 -6204655 -8136166 -8280475 -3977697 5729462 14206688 12279726 1833603 -4381629
12112 -4381629 -484994 4310706 1105532 -4437567 -2155774 5662781 8366194 3852524
12104 3852524 159862 1399375 2709693 502702 -1553658 -56427 1921721 464675
12096 464675 -2573707 -3149697 -1652707 -1469222 -3105151 -3901927 -2541069 -101909 3046352
12087 3046352 7815363 13157045 15406766 12620274 7377469 3204426 51482 -3850996
12079 -3850996 -6948416 -5232993 1281418 6791963 6343830 1325818 -3689361 -6449932
$$ packed form
12137C33748M372080O919928j64539n382233j261043L254225l82302m923034q53449
12128A913381O049589M413832l693401p162235l703273n64549j160628k297371
12120f204655j931511j44309M302778R707159Q477226j926962j0446123o215232
12112d381629L896635M795700l205174n543099K281793P818555K703413m513670
12104C852524l692662J239513J310318k206991k056360J497231J978148j457046
12096D64675l038382n75990J496990J83485j635929p96776J360858K439160L148261
12087C046352M769011N341682K249721k786492n242805m173043l152944l902478
12079c850996l097420J715423O514411N510545m48133n018012n015179k760571
$$ plain form
12071 -6449932 -6525639 -2712863 4330228 8901766 5425735 -3261313 -7996923 -4529471
12063 -4529471 2096054 5672127 6304485 7123180 8011190 6661406 3234216 124158 -1418636
12054 -1418636 -1479308 95671 2518335 2926771 -175289 -3451486 -2351024 2210249 4456163
12045 4456163 1365851 -3812024 -6617880 -6560134 -5375171 -3156102 616758 3809977
12037 3809977 3100587 -1085549 -4088939 -2702927 759940 1782799 -429013 -2527309
12029 -2527309 -2017006 -365222 -508640 -2901939 -5206920 -5234775 -3311063 -1810070 -2533920
12020 -2533920 -4457999 -4572003 -1573100 2104137 3205093 1718712 170435 -150464
12012 -150464 537244 3139791 8366428 12523216 9908879 1522196 -3974455 -1731643
$$ packed form
12071f449932p5707L812776P043091M571538l476031q687048m735610L467452
12063d529471O625525L576073O32358Q18695Q88010j349784l427190l110058j542794
12054a418636o0672J574979K422664M08436l102060l276197J100462M561273K245914
12045D456163l090312n177875k805856N7746J184963K219069L772860L193219
12037C809977p09390m186136l003390J386012L462867J022859k211812k098296
12029b527309N10303J651784j43418k393299k304981k7855J923712J500993p23850
12020b533920j924079j14004K998903L677237J100956j486381j548277l20899
12012a50464O87708K602547N226637M156788k614337q386683n496651K242812
$$ plain form
12004 -1731643 1990133 -545149 -6272135 -6401967 -897770 1657822 -1249861 -1539406
11996 -1539406 5781228 13141542 10946682 1646591 -3966165 -1197672 4689492 7421592
11988 7421592 6049123 2352994 -2525913 -7399666 -10498640 -10949317 -8932728 -4597722
11980 -4597722 1120846 5611594 7223092 7626166 8473356 7477210 2335048 -2841652 -1216697
11971 -1216697 6314484 11089929 9175706 7013623 10483219 14752614 11592931 2447265
11963 2447265 -3520240 -2434775 778878 1404690 72156 -1935245 -5249104 -7900511
11955 -7900511 -4808009 4472237 12803992 14494865 12700831 13132847 14504472 11208259
11947 11208259 3148791 -3150146 -2728765 3178222 10168954 14053850 11783656 3644753
$$ packed form
12004a731643L721776k535282n726986j29832N504197K555592k907683k89545
11996a539406P320634P360314k194860r300091n612756K768493N887164K732100
11988G421592j372469l696129m878907m873753l098974m50677K016589M335006
11980d597722N718568M490748J611498M03074Q47190r96146n142162n176700J624955
11971a216697P531181M775445j914223k162083L469596M269395l159683r145666
11963B447265n967505J085465L213653O25812j332534k007401l313859k651407
11955g900511L092502R280246Q331755J690873j794034M32016J371625l296213
11947A1208259q059468o298937M21381N906987O990732L884896k270194q138903
$$ plain form
11939 3644753 -4968818 -7686005 -3717032 2319998 6582099 8801049 9641247 9228553
11931 9228553 8435128 8248873 7881917 6413300 5321295 5886396 5696734 2337150 -1150103
11922 -1150103 -287525 2805423 2557244 418146 3490118 11617056 15376961 10388327
11914 10388327 4500462 5527383 10194370 11881153 11732182 13910023 15995055 13324169
11906 13324169 8527733 7377703 8074023 3942933 -4944380 -11823939 -13911456 -14138825
11898 -14138825 -12566443 -5516444 5171715 10887854 7653546 1853336 908313 3874126
11890 3874126 5102675 2737250 -358567 -1341578 -178394 733321 -1068124 -4241975
11882 -4241975 -3265086 4317919 11771198 10146702 940466 -5335547 -4283442 -3369614
$$ packed form
11939C644753q613571k717187L968973O037030M262101K218950Q40198m12694
11931I228553p93425j86255l66956j468617j092005N65101j89662l359584l487253
11922a150103Q62578L092948k48179k139098L071972Q126938L759905m988634
11914A0388327n887865J026921M666987J686783j48971K177841K085032k670886
11906A3324169m796436j150030O96320m131090q887313o879559k087517k27369
11898a4138825J572382P049999J0688159N716139l234308n800210r45023K965813
11890C874126J228549k365425l095817r83011J163184R11715j801445l173851
11882d241975R76889P583005P453279j624496r206236o276013J052105R13828
$$ plain form
11874 -3369614 -9226774 -16886379 -17617097 -11970340 -7944927 -9156552 -11653008 -11502979
11866 -11502979 -9592005 -8247633 -7554076 -6518043 -5198499 -4209257 -3394642 -1982001
11858 -1982001 223032 2065285 1866707 -361423 -2157484 -1446367 430029 516178 -1262631
11849 -1262631 -1901337 216756 3201249 4616930 4346672 3781461 3833981 4012193 2224323
11840 2224323 -3385556 -10267022 -11154789 -2048325 10686682 16319864 12799888 8404960
11832 8404960 9656236 13420718 13089041 7132669 -1498433 -9711630 -14494083 -13018295
11824 -13018295 -6591911 -1393115 -1522771 -3942015 -3673661 -1243133 -1060464 -4519330
11816 -4519330 -8768230 -11308478 -12335981 -12744323 -12246502 -9711515 -4579208 1567153
$$ packed form
11874c369614n857160p659605p30718N646757M025413j211625k496456J50029
11866a1502979J910974J344372O93557J036033J319544R89242Q14615J412641
11858a982001K205033J842253j98578k228130j796061P11117J876396Q6149j778809
11849a262631o38706K118093K984493J415681k70258n65211N2520J78212j787870
11840B224323n609879o881466q87767R106464J2735007N633182l519976m394928
11832H404960J251276L764482l31677n956372q631102q213197m782453J475788
11824a3018295O426384N198796j29656k419244K68354K430528J82669l458866
11816d519330m248900k540248j027503m08342M97821K534987N132307O146361
$$ plain form
11808 1567153 5257455 4938300 3894841 6117181 9775267 9518484 5510856 4145344
11800 4145344 7905905 10978343 8530061 4194313 3200845 3385964 -502838 -7247669
11792 -7247669 -10693854 -8776902 -4957973 -2097358 -478883 -724861 -3081727 -4383692
11784 -4383692 -1054532 4820595 7145257 3846823 -877639 -2681889 -1600871 87068
11776 87068 1085610 1142445 188066 -1753427 -4647379 -7788041 -8591636 -4521441 2335264
11767 2335264 5847985 3416949 -463407 -1097512 38764 -307104 -960081 67950 -27824
11758 -27824 -4138415 -8440746 -7909515 -5623404 -7653306 -10711611 -5588131 6594511
11750 6594511 12693477 5623809 -5576434 -8944460 -4652727 -552677 595552 1924632
$$ packed form
11808A567153L690302l19155j043459K222340L658086k56783m007628j365512
11800D145344L760561L072438k448282m335748r93468J85119l888802o744831
11792g247669l446185J916952L818929K860615J618475k45978k356866j301965
11784d383692L329160N875127K324662l298434m724462j804250J081018J687939
11776H7068R98542N6835r54379j941493k893952l140662q03595M070195O856705
11767B335264L512721k431036l880356o34105J136276l45868o52977J028031r5774
11758b7824m110591m302331N31231K286111k029902l058305N123480J2182642
11750F594511O098966p069668j1200243l368026M291733M100050J148229J329080
$$ plain form
11742 1924632 4767014 7412433 9396627 11273950 11717547 9604133 7330987 7636598
11734 7636598 8795159 7425927 4560700 4132596 6254240 6798389 3717289 -540999
11726 -540999 -3415119 -5002115 -5493331 -3763396 -482367 544684 -3031806 -8058685
11718 -8058685 -9402405 -6718417 -4677801 -6111764 -7940912 -5894913 -1268020 161851
11710 161851 -4375788 -11270585 -15220138 -14330269 -9426407 -1774892 5920583 9336370
11702 9336370 7147835 3806150 3719630 4550318 1222500 -4750463 -6275546 -1537699 2727338
11693 2727338 1332696 -1867638 -679976 3896801 6119737 4611973 3352282 4467383
11685 4467383 5209257 2954659 -536396 -1525073 1042157 4615879 5953960 4371677
$$ packed form
11742A924632K842382K645419J984194J877323M43597k113414k273146L05611
11734G636598J158561j369232k865227m28104K121644N44149l081100m258288
11726e40999k874120j586996m91216J729935L281029J027051l576490n026879
11718h058685j343720K683988K040616j433963j829148K045999M626893J429871
11710A61851m537639o894797l949553Q89869M903862P651515P695475L415787
11702I336370k188535l341685q6520Q30688l327818n972963j525083M737847M265037
11693B727338j394642l200334J187662M576777K222936j507764j259691J115101
11685D467383P41874k254598l491055r88677K567230L573722J338081j582283
$$ plain form
11677 4371677 2368152 2758502 5018536 5589000 2402118 -2546780 -6455151 -9620134
11669 -9620134 -13520292 -16199778 -13327966 -4833005 2615502 2414453 -3842486 -7849524
11661 -7849524 -4527513 2086782 4595761 1876325 -392692 1434265 3742133 1443199
11653 1443199 -4189342 -7209885 -5101511 -1342907 -102259 -1832412 -4553813 -6406087
11645 -6406087 -6079944 -3329318 16120 1607227 1435505 843534 -930365 -5501461 -10261260
11636 -10261260 -9340374 -1996059 4120791 1749676 -6678278 -12308902 -10563694 -4802769
11628 -4802769 -461377 647058 201133 555318 2573719 4577748 3707130 -211997 -3198057
11619 -3198057 -1587539 3060006 6089189 6003327 5577394 6881343 8445280 8274371 7027380
$$ packed form
11677D371677k003525L90350K260034N70464l186882m948898l908371l164983
11669i620134l900158k679486K871812Q494961P448507k01049o256939m007038
11661g849524L322011O614295K508979k719436k269017J826957K307868k298934
11653A443199n632541l020543K108374L758604J240648j730153k721401j852274
11645f406087L26143K750626L345438J591107j71722n91971j773899m571096m759799
11636a0261260R20886P344315O116850k371115q427954n630624J745208N760925
11628d802769M341392J108435m45925L54185K018401K004029q70618l919127k986060
11619c198057J610518M647545L029183q5862m25933J303949J563937j70909j246991
$$ plain form
11610 7027380 6681666 7650920 8480908 7383938 3423366 -2657433 -8202458 -10439618 -9180137
11601 -9180137 -6783361 -5114148 -3784132 -1840506 284824 1409357 1067575 -460750
11593 -460750 -2536810 -3883300 -3213012 -1090890 153613 -472649 -1069806 82070 1518547
11584 1518547 981798 -530978 -246237 1514968 1667468 -213043 -928989 610114 1096814
11575 1096814 -1159478 -2263491 1097941 5198941 4534318 1030746 1356876 5983222
11567 5983222 8201785 4864292 775827 13864 34801 -1597222 -1333759 3768401 9027431
11558 9027431 8512556 4377598 2550418 2374480 -1072955 -6154212 -5638965 771687 4135958
11549 4135958 -305797 -5373949 -2706834 4803757 7637235 3046411 -2605318 -3564082
$$ packed form
11610G027380l45714R69254Q29988j096970l960572o080799n545025k237160J259481
11601i180137K396776J669213J330016J943626K125330J124533l41782j528325
11593d60750k076060j346490O70288K122122J244503o26262n97157J151876J436477
11584A518547n36749j512776K84741J761205J52500j880511p15946J539103M86700
11575A096814k256292j104013L361432M101000o64623l503572L26130M626346
11567E983222K218563l337493m088465p61963K0937j632023K63463N102160N259030
11558I027431n14875m134958j827180j75938l447435n081257N15247O410652L364271
11549D135958m441755n068152K667115P510591K833478m590824n651729r58764
$$ plain form
11541 -3564082 -1031473 780258 566824 -175267 -859764 -2649847 -5324832 -5389649 111407
11532 111407 7868122 9887346 3257033 -4664316 -5018495 612115 2673680 -2349833
11524 -2349833 -6979185 -3964694 3326390 6011293 1630524 -3646008 -3392617 2079084
11516 2079084 6953113 6119423 189164 -4998039 -4420174 805014 5489507 6811934
11508 6811934 5943914 4113812 1315793 -651784 1397625 6798249 10368889 9249795
11500 9249795 6670832 6542746 8070466 8593938 8204179 8142381 7617632 5788226 4486200
11491 4486200 5524438 7289271 7146114 5390753 3971401 3222044 2651323 2995465 4636370
11482 4636370 5808790 5099004 3935356 4011222 4040602 1629825 -3106124 -7632034 -8965137
$$ packed form
11541c564082K532609J811731k13434p42091o84497j790083k674985o4817N501056
11532A11407P756715K019224o630313p921349l54179N630610K061565n023513
11524b349833m629352L014491P291084K684903m380769n276532K53391N471701
11516B079084M874029q33690n930259n187203N77865N225188M684493J322427
11508F811934q68020j830102k798019j967577K049409N400624L570640j119094
11500I249795k578963j28086J527720N23472l89759o1798n24749j829406j302026
11491D486200J038238J764833j43157j755361j419352p49357n70721L44142J640905
11482D636370J172420p09786j163648P5866K9380k410777m735949m525910j333103
$$ plain form
11473 -8965137 -4754887 4356110 12413804 12800282 7247167 4913659 9502822 13489983
11465 13489983 9892457 3331378 2336171 5921008 6523001 2981398 1292206 3668061
11457 3668061 5627310 4266988 1917933 917197 1212143 3244274 6789502 7392230
11449 7392230 1232717 -6614640 -6869369 333198 5055358 2444876 -989003 882581
11441 882581 4802150 5904063 6437328 9953408 12874789 9401241 1226490 -4323989
11433 -4323989 -3758414 198080 3760790 5115048 4042750 2434289 3538506 7572940
11425 7572940 10210497 8277289 4131290 1175154 -1693192 -6949522 -12483747 -13519069
11417 -13519069 -9074369 -2709567 1813810 2596331 -409806 -3994507 -2731453 4572649
$$ packed form
11473h965137M210250R110997Q057694L86478n553115k333508M589163L987161
11465A3489983l597526o561079r95207L584837O01993l541603j689192K375855
11457C668061J959249j360322k349055j000736K94946K032131L545228O02728
11449G392230o159513p847357k54729P202567M722160k610482l433879J871584
11441H82581L919569J101913N33265L516080K921381l473548q174751n550479
11433d323989N65575L956494L562710J354258j072298j608461J104217M034434
11425G572940K637557j933208m145999k956136k868346n256330n534225j035322
11417a3519069M444700O364802M523377P82521l006137l584701J263054P304102
$$ plain form
11409 4572649 11690313 12319655 8216016 5447112 5203807 4213228 2537164 4131623 9550054
11400 9550054 14289173 15400076 14421234 12826168 9981199 6873231 6130756 6306589 2150356
11391 2150356 -6025777 -9122523 -908884 11145928 13378520 2843557 -9441574 -12456082
11383 -12456082 -6951901 -1533377 -1452773 -4643381 -6522185 -5090976 -1555619 1472787
11375 1472787 1802054 -584891 -2845880 -1751542 2119718 3917204 -79248 -7338627
11367 -7338627 -11544774 -10158479 -6994240 -6387627 -7548743 -6989610 -4419416 -2701993
11359 -2701993 -2640851 -1734903 937135 2131167 -907312 -5660884 -7384366 -5689525 -4460282
11350 -4460282 -5126682 -3990515 1716638 8340005 10075436 7118729 5027931 5937470
$$ packed form
11409D572649P117664O29342m103639k768904k43305r90579j676064J594459N418431
11400I550054M739119J110903r78842j595066k844969l107968p42475J75833m156233
11391B150356q176133l096746Q213639J2054812K232592j0534963j2285131l014508
11383a2456082N504181N418524Q0604l190608j878804J431209L535357L028406
11375A472787L29267k386945k260989J094338L871260J797486l996452p259379
11367g338627m206147J386295L164239O06613j161116N59133K570194J717423
11359b701993O1142R05948K672038J194032l038479m753572j723482J694841J229243
11350d460282o66400J136167N707153O623367J735431k956707k090798R09539
$$ plain form
11342 5937470 5473775 566853 -4435103 -3844949 336390 1040587 -3501437 -7720982 -7087340
11333 -7087340 -2933772 1947532 6630320 8959510 5364551 -2343619 -5560076 251997
11325 251997 7561594 6031346 -3187750 -9429251 -7149438 -1190322 2406392 3237369
11317 3237369 2572471 -341143 -4606179 -5858552 -2194689 2084540 2346683 -227369
11309 -227369 -1886685 -2228740 -2788736 -2677325 -330370 2262100 1762151 -950550 -1561083
11300 -1561083 1665416 6084409 8457719 7417142 2968513 -2888942 -5630857 -2253778
11292 -2253778 3997507 6520273 3186623 -2122822 -5677688 -7442147 -8175096 -7814920
11284 -7814920 -8080813 -11735424 -16891491 -16884058 -9338360 -1080036 534920 -2288302 -1812492
$$ packed form
11342E937470m63695m906922n001956N90154M181339P04197m542024m219545O33642
11333g087340M153568M881304M682788K329190l594959p708170l216457N812073
11325B51997P309597j530248r219096o241501K279813N959116L596714Q30977
11317C237369o64898k913614m265036j252373L663863M279229K62143k574052
11309b27369j659316l42055n59996J11411K346955K592470m99949k712701o10533
11300a561083L226499M418993K373310j040577m448629n857455k741915L377079
11292b253778O251285K522766l333650n309445l554866j764459p32949L60176
11284g814920k65893l654611n156067P433P545698Q258324J614956k823222M75810
$$ plain form
11275 -1812492 3476366 7515378 6676670 4808208 6481795 10162697 11162796 8309810
11267 8309810 4468077 1968476 376590 -1437822 -3090715 -3348358 -2246214 -1361835
11259 -1361835 -1352059 -355159 3003340 5513175 2104178 -5981084 -10200653 -5414550 2485438
11250 2485438 4858309 2660268 3155534 6401861 4640914 -3574554 -8609411 -3913338
11242 -3913338 3370854 3133249 -2392140 -2579595 5519095 13518433 13426239 6079779 -2266280
11233 -2266280 -5959986 -2477046 5395458 9445726 3635484 -7319326 -12308681 -7797930
11225 -7797930 -1649475 -1108325 -3253567 -1362904 4448900 8539970 8650210 7668623 7460673
11216 7460673 6165951 2450596 -1391357 -2346952 -619974 929181 374802 -1341158
$$ packed form
11275a812492N288858M039012q38708j868462J673587L680902J000099k852986
11267H309810l841733k499601j591886j814412j652893k57643J102144Q84379
11259a361835R776R96900L358499K509835l408997q085262m219569M786103P899988
11250B485438K372871k198041M95266L246327j760947q215468n034857M696073
11242c913338P284192k37605n525389j87455Q098690P999338r2194p346460q346059
11233b266280l693706L482940P872504M050268n810242j0954810m989355M510751
11225g797930O148455N41150k145242J890663N811804M091070J10240r81587k07950
11216G460673j294722l715355l841953r55595J726978J549155n54379j715960
$$ plain form
11208 -1341158 -1885903 -417758 1251135 520608 -3095992 -7235101 -8638007 -5526632
11200 -5526632 1228308 8242931 11488002 9630008 5620803 3728611 5025314 7035725
11192 7035725 7438465 6202121 4107812 1538248 -450877 -4784 3027105 5747537
11184 5747537 5013143 1215670 -1804067 -720906 3682170 6978683 5520785 487145
11176 487145 -3498334 -4271981 -4859724 -8660849 -13724008 -14826502 -10559390 -5038824 -2227762
11167 -2227762 -1561640 -272081 2371433 4696218 5155946 4019030 2979886 3256038 3827527
11158 3827527 2607450 100148 -190980 3121044 6319868 5906103 4421699 6389834
11150 6389834 10355098 10881390 7838975 6991549 10307357 12381312 9063111 3620727
$$ packed form
11208a341158n44745J468145J668893p30527l616600m139109j402906L111375
11200e526632O754940P014623L245071j857994m009205j892192J296703K010411
11192G035725M02740j236344k094309k569564j989125M46093L031889K720432
11184E747537p34394l797473l019737J083161M403076L296513j457898n033640
11176D87145l985479p73647n87743l801125n063159j102494M267112N520566K811062
11167b227762O66122J289559K643514K324785M59728j136916j039144K76152N71489
11158C827527j220077k507302k91128L312024L198824m13765j484404J968135
11150F389834L965264N26292l042415q47426L315808K073955l318201n442384
$$ plain form
11142 3620727 770023 -142058 -1650273 -2208259 1308408 7828612 13128831 14854466
11134 14854466 13412944 10063348 6911577 6303852 7482896 6555276 2425057 -484503
11126 -484503 1482250 5618690 7149761 5849889 4448135 3587861 2682588 2933381 5008483
11117 5008483 6284533 4767341 3040023 3793946 4518878 1916175 -1343151 -336513
11109 -336513 3868772 5901784 4188702 1149582 -2741379 -8109260 -11457619 -8665933
11101 -8665933 -3229835 -2856953 -7316371 -7984916 -1126163 6617281 8802008 7471793
11093 7471793 7013868 6822914 4978407 3352732 3749310 3662994 1075475 -629434 2081977
11084 2081977 6040704 5274771 -500320 -6390445 -9601703 -11131197 -11065263 -7353700 -232439
$$ packed form
11142C620727k850704r12081j508215n57986L516667O520204N300219J725635
11134A4854466j441522l349596l151771o07725J179044r27620m130219k909560
11126d84503J966753M136440J531071j299872j401754q60274r05273K50793K075102
11117E008483J276050j517192j727318P53923P24932k602703l259326J006638
11109c36513M205285K033012j713082l039120l890961n367881l348359K791686
11101h665933N436098L72882m459418o68545O858753P743444K184727j330215
11093G471793m57925j90954j844507j625675L96578q6316k587519j704909K711411
11084B081977L958727p65933n775091n890125l211258j529494O5934L711563P121261
$$ plain form
11075 -232439 5824222 6550259 2846301 -179142 843189 3321266 1800286 -4348299
11067 -4348299 -8920320 -6888962 -1570425 599076 63171 2428273 7621223 8851882
11059 8851882 4101530 528911 3508254 8476063 8970037 6555247 6437058 8299592
11051 8299592 8488651 7389282 7428471 6817780 2811491 -1034844 1139351 7180808 8628741
11042 8628741 3162819 -2368294 -3078132 -2951868 -7219797 -13517142 -15127824 -9792874
11034 -9792874 -1543677 4377773 5811546 4281541 3107167 3953733 4758384 2738568
11026 2738568 -641276 -715248 3515943 6887380 4672579 -727222 -2657995 1221665
11018 1221665 6207351 6912202 4099420 3082345 5820974 7460169 2735744 -6116877
$$ packed form
11075b32439O056661P26037l703958l025443J022331K478077j520980o148585
11067d348299m572021K031358N318537K169501n35905K365102N192950J230659
11059H851882m750352l572619K979343M967809M93974k414790j18189J862534
11051H299592J89059j099369L9189o10691m006289l846335K174195O041457J447933
11042H628741n465922n531113p09838J26264m267929o297345j610682N334950
11034i792874Q249197N921450J433773j530005j174374Q46566Q04651k019816
11026B738568l379844p3972M231191L371437k214801n399801j930773L879660
11018A221665M985686P04851k812782j017075K738629J639195m724425q852621
$$ plain form
11010 -6116877 -11522838 -10235613 -6521350 -4858936 -4381574 -2918055 -1456700 -648832
11002 -648832 2324065 8025823 10257911 4276703 -3714777 -3721237 2959591 5273987 -349128
10993 -349128 -4270359 1364085 10923709 14473348 11583824 8705174 7717122 5348189
10985 5348189 1812233 1966129 7118397 11698571 10170972 3644484 -2147341 -3047550
10977 -3047550 644584 5600081 8271440 7140199 3567551 923935 2388945 8164702
10969 8164702 13988026 14115171 7957093 2093899 2224196 4578821 688229 -9437981
10961 -9437981 -15769377 -12206838 -5028015 -2649726 -3381553 -618902 4426031 4464748 -932852
10952 -932852 -3641538 307274 4586401 2574229 -3177782 -6132118 -5476905 -5377998 -7732062
$$ packed form
11010f116877n405961J287225L714263J662414M77362J463519J461355Q07868
11002f48832K972897N701758K232088n981208p991480o460O680828K314396n623115
10993c49128l921231N634444R559624L549639k889524k878650r88052k368933
10985E348189l535956J53896N152268M580174j527599o526488n791825r00209
10977c047550L692134M955497K671359j131241l572648k643616J465010N775757
10969H164702N823324J27145o158078n863194J30297K354625l890592j0126210
10961i437981o331396L562539P178823K378289p31827K762651N044933L8717n397600
10952i32852k708686L948812M279127k012172n752011k954336O55213R8907k354064
$$ plain form
10943 -7732062 -10938485 -14042405 -16940825 -17109451 -11220872 -1036333 6437342 6772789
10935 6772789 3314618 2220566 4470789 5920363 4315266 2452665 3304409 5229130
10927 5229130 4764545 2327696 1601244 3694646 5744470 6147208 7168995 9907472 10282169
10918 10282169 4392189 -3965970 -6211765 270893 8613581 11081740 7653220 3935263
10910 3935263 3506597 5351148 7389128 9492890 12822207 17641692 21876009 21592738
10902 21592738 14394892 3463109 -3555867 -1985361 4419089 7761794 5175667 945676
10894 945676 -548924 -602249 -3110589 -8295123 -12468469 -13214576 -11915054 -10651297 -8829521
10885 -8829521 -4337543 2813917 9301915 11162649 7514711 1674946 -1755395 -1333575
$$ packed form
10943g732062l206423l103920k898420j68626N888579J0184539P473675L35447
10935F772789l458171j094052K250223J449574j605097j862601Q51744J924721
10927E229130m64585k436849p26452K093402K049824M02738J021787K738477L74697
10918A0282169n889980q358159k245795O482658Q342688K468159l428520l717957
10910C935263m28666J844551K037980K103762L329317M819485M234317k83271
10902B1592738p197846j0931783p018976J570506O404450L342705k586127m229991
10894I45676j494600n3325k508340n184534m173346p46107J299522J263757J821776
10885h829521M491978P151460O487998J860734l647938n839765l430341M21820
$$ plain form
10877 -1333575 219905 81561 -884194 -404340 155992 -3211707 -10243871 -14666280 -12398401
10868 -12398401 -8073857 -8613529 -12310289 -10525209 -722683 8491312 8376736 1185180
10860 1185180 -4211399 -4459020 -3913084 -5923653 -7757614 -5603992 -405146 3839001
10852 3839001 5155326 4609003 3802869 3708420 5105583 7782564 9385113 7348933 2655207
10843 2655207 -340819 876820 3684808 4129004 2380548 1406870 1358605 -288401 -2702423
10834 -2702423 -1264102 4355634 7183081 2743630 -2751816 -533378 7779463 13167650
10826 13167650 12984514 12451390 12871604 9264118 2303149 1354203 9636568 16276239 11509900
10817 11509900 1702635 -778941 3643909 4581575 -615067 -4261570 -2528129 -539275
$$ packed form
10877a333575J553480j38344r65755M79854N60332l367699p032164m422409K267879
10868a2398401M324544n39672l696760J785080R802526R213995j14576p191556
10860A185180n396579k47621N45936k010569j833961K153622N198846M244147
10852C839001J316325n46323q06134r4449J397163K676981J602549k036180m693726
10843B655207k996026J217639K807988M44196j748456r73678m8265j647006k414022
10834b702423J438321N619736K827447m439451n495446K218438Q312841N388187
10826A3167650j83136n33124M20214l607486o960969r48946Q282365O639671m766339
10817A1509900r807265k481576M422850R37666n196642l646503J733441J988854
$$ plain form
10809 -539275 -1859426 -3096162 -1797621 -1169051 -3590898 -6390157 -6910182 -5700095 -2864739
10800 -2864739 2190302 5917402 3059036 -4014519 -6404215 -1865263 1586399 -1113843
10792 -1113843 -4357754 -2642965 18900 -1199453 -1905377 3810943 11839843 13979943
10784 13979943 11038697 10190979 12172258 11031601 5598946 1996086 4096463 8791997
10776 8791997 11454077 10212030 5064281 -1403686 -3163045 3079004 11415100 12901966
10768 12901966 7647362 3897741 5462188 7823902 7560743 7550490 10357577 13610883
10760 13610883 15142757 16387502 17178597 13263253 3647725 -4400178 -3077904 5822260
10752 5822260 12937747 12073048 5655075 373565 -120741 1956756 2344906 1021789 2534945
$$ packed form
10809e39275j320151j236736J298541O28570k421847k799259n20025J210087K835356
10800b864739N055041L727100k858366p073555k389696M538952L451662k700242
10792a113843l243911J714789K661865j218353p05924N716320Q028900K140100
10784A3979943k941246q47718J981279j140657n432655l602860K100377M695534
10776H791997K662080j242047n147749o467967j759359O242049Q336096J486866
10768A2901966n254604l749621J564447K361714k63159j0253K807087L253306
10760A3610883J531874J244745P91095l915344r615528q047903J322274Q900164
10752E822260P115487q64699o417973n281510m94306K077497L88150j323117J513156
$$ plain form
10743 2534945 8361254 12450156 9072137 2239219 423986 3383695 2815714 -3226711
10735 -3226711 -6080292 -117652 8090018 9932525 7028317 6584067 9867114 12489844
10727 12489844 12438661 10888820 7670439 2397775 -1871887 -2109672 -671975 -1387802 -2180367
10718 -2180367 1929365 9616853 13989437 12550178 9660325 8188310 5634139 968542
10710 968542 -1148649 2767189 8611927 10027327 7177674 5259874 5926855 5431950 1632330
10701 1632330 -1816554 -600378 3776383 5986833 4655809 4798794 10979317 20063077
10693 20063077 23674465 18085087 9237149 6229606 10978416 16612421 16353167 11674838
10685 11674838 9540943 12470064 14720876 10035089 477597 -6017196 -5709142 -2125430
$$ packed form
10743B534945N826309M088902l378019o832918j815233K959709n67981o042425
10735c226711k853581N962640Q207670J842507k904208m44250L283047K622730
10727A2489844n1183j549841l218381n272664m269662k37785J437697p15827p92565
10718b180367M109732P687488M372584j439259k889853j472015k554171m665597
10710I68542k117191L915838N844738J415400k849653j917800O66981m94905l799620
10701A632330l448884J216176M376761K210450j331024J42985O180523R083760
10693B0063077L611388n589378q847938l007543M748810N634005k59254m678329
10685A1674838k133895K929121K250812m685787r557492o494793L08054L583712
$$ plain form
10677 -2125430 1090643 4887882 9984529 12738964 10469040 6969904 7238927 9491289
10669 9491289 8312152 3656774 263916 -595195 -1858512 -3608040 -2574833 673576
10661 673576 1446426 -528921 501912 6877776 13312691 15146670 14119534 12439395
10653 12439395 8081534 792021 -3662968 -1192652 3787853 5160801 4114891 5055880
10645 5055880 6693698 4501319 -399116 -1930225 2097636 7480841 9658520 7974938
10637 7974938 4609104 2759769 4653229 8374098 8808793 4754820 1974580 5292011
10629 5292011 11050938 12377518 9005028 6212135 6098080 5895057 4042238 2444221
10621 2444221 2627340 3823971 4872761 5042962 3834459 2348337 2810651 4277695 2124737
$$ packed form
10677b125430L216073L797239N096647K754435k269924l499136K69023K252362
10669I491289j179137m655378l392858q59111j263317j749528J033207L248409
10661F73576P72850j975347J030833O375864O434915J833979j027136j680139
10653A2439395m357861p289513m454989K470316M980505J372948j045910R40989
10645E055880J637818k192379m900435j531109M027861N383205K177679j683582
10637G974938l365834j849335J893460L720869M34695m053973k780240L317431
10629E292011N758927J326580l372490k792893j14055k03023j852819j598017
10621B444221J83119J196631J048790J70201j208503j486122M62314J467044k152958
$$ plain form
10612 2124737 -4754043 -10051036 -7914932 -1174334 3403934 4535967 5148809 4868095
10604 4868095 840026 -5466035 -8839341 -7230550 -3026163 1314665 4141296 3307446
10596 3307446 -510551 -1367882 4972527 13359768 14901070 9097083 4050618 5170513
10588 5170513 9531332 11396335 8518538 3166108 390929 3805162 10286116 12303562
10580 12303562 8567761 6679903 10466153 12055404 4341894 -5787853 -7093239 -1302261
10572 -1302261 982204 -2234372 -3558479 -736353 813793 -443577 -108885 2151976
10564 2151976 1670038 -1407034 -1717023 1352491 3175248 3255867 5099532 7454449 6276877
10555 6276877 4357883 7618804 13064172 12716223 8201318 7939417 11101478 9566811
$$ packed form
10612B124737o878780n296993K136104O740598M578268J132033O12842k80714
10604D868095m028069o306061l373306J608791M204387M340828K826631q33850
10596C307446l817997q57331O340409Q387241J541302n803987n046465J119895
10588E170513M360819J865003k877797n352430k775179L414233O480954K017446
10580A2303562l735801j887858L786250J589251p713510j0129747j305386N790978
10572a302261K284465l216576j324107K822126J550146j257370L34692K260861
10564B151976m81938l077072l09989L069514J822757Q0619J843665K354917j177572
10555F276877j918994L260921N445368l47949m514905k61901L162061j534667
$$ plain form
10547 9566811 5392496 9297379 20129567 23503430 14642078 5457391 4148475 4856993
10539 4856993 3415950 6011593 14373021 18478727 12837478 5814945 4863393 6321123
10531 6321123 6725053 9407850 13012279 9335513 45988 -1010853 9784636 18271536
10523 18271536 15853185 12305504 15781707 18970540 16242296 15686405 21998505 25871172
10515 25871172 22290111 20310756 23413344 21465628 13768720 15551811 28091120 30032631
10507 30032631 15048860 7891284 22443169 36081509 30707149 25119923 36412525
10500 36412525 44829158 33307332 25457676 41541663 54612900 41147968 35133928
10493 35133928 69002739 102319501 90787227 88171093 168926943 263570736 205089915
$$ packed form
10547I566811m174315L904883J0832188L373863q861352r184687j308916P08518
10539D856993j441043K595643Q361428M105706n641249p022533r51552J457730
10531F321123M03930K682797L604429l676766r289525j056841J0795489Q486900
10523A8271536k418351l547681L476203L188833k728244n55891O312100L872667
10515B5871172l581061j979355L102588j947716p696908J783091J2539309J941511
10507C0032631j4983771p157576J4551885J3638340n374360n587226J1292602
10500C6412525Q416633j1521826p849656J6083987J3071237j3464932o014040
10493C5133928L3868811L3316762j1532274k616134Q0755850R4643793n8480821
$$ plain form
10486 205089915 -28481100 -243202400 -267517327 -158238490 -84062982 -92033823 -100553026
10479 -100553026 -67936505 -41966694 -52220883 -62355606 -46982560 -33317064 -41809971
10472 -41809971 -49659179 -38595010 -26878037 -29691194 -31444259 -20159957 -11781953 -18863843
10464 -18863843 -27650486 -25825364 -23767405 -30151434 -33536583 -25766383 -18926796 -22395930
10456 -22395930 -26118562 -22412385 -21753787 -30608158 -35236565 -25022565 -12332404 -11297968
10448 -11297968 -14546271 -9340514 -1135252 -2145623 -9338555 -12161918 -11778823 -15410957
10440 -15410957 -20186715 -18768694 -14107717 -13950105 -16602651 -15453738 -12207009 -13043364
10432 -13043364 -16172945 -14865596 -9320177 -5343864 -4433486 -4029023 -4376255 -7189855
$$ packed form
10486B05089915k33571015k14721300k4314927J09278837P4175508p970841q519203
10479a00553026L2616521K5969811j0254189j0134723J5373046J3665496q492907
10472d1809971p849208J1064169J1716973k813157j753065J1284302Q378004p081890
10464a8863843q786643J825122K057959o384029l385149P770200O839587l469134
10456b2395930l722632L706177O58598q854371m628407J0214000J2690161J034436
10448a1297968l248303N205757Q205262j010371p192932k823363L83095l632134
10440a5410957m775758J418021M660977J57612k652546J148913L246729q36355
10432a3043364l129581J307349N545419L976313R10378M04463l47232k813600
$$ plain form
10424 -7189855 -10583281 -12020080 -12866530 -14514992 -14543358 -12006637 -11136156 -14254649 -16804808
10415 -16804808 -15090411 -12706275 -13134170 -12504398 -6799077 -197085 1422401 121972
10407 121972 1367271 4220478 3544250 -1436588 -7308919 -11882536 -13717749 -10189017
10399 -10189017 -2072438 3520915 814679 -6865302 -11958739 -12130174 -10340847 -9030189
10391 -9030189 -8810504 -9827461 -10730019 -9565782 -7963575 -9568440 -12544211 -10684203
10383 -10684203 -4658928 -3319684 -9248708 -12824676 -7691470 -2374228 -6764838 -15368689
10375 -15368689 -15861016 -8539617 -4607243 -8148863 -12052744 -11118909 -8269916 -6857373
10367 -6857373 -5950563 -4894165 -5377085 -7600274 -9872917 -12126701 -14868814 -15819120 -13105197
$$ packed form
10424g189855l393426j436799q46450j648462k8366K536721Q70481l118493k550159
10415a6804808J714397K384136m27895O29772N705321O601992J619486j300429
10407A21972J245299K853207o76228m980838n872331m573617j835213L528732
10399a0189017Q116579N593353k706236p679981n093437j71435J789327J310658
10391i030189K19685j016957r02558J164237J602207j604865k975771J860008
10383a0684203O025275J339244n929024l575968N133206N317242m390610q603851
10375a5368689m92327P321399L932374l541620l903881R33835K848993J412543
10367f857373R06810J056398m82920k223189k272643k253784k742113r50306K713923
$$ plain form
10358 -13105197 -10227833 -11770952 -15664062 -16067561 -12469100 -9090465 -6595705 -2136584
10350 -2136584 2579287 1450395 -6046342 -11934650 -9535419 -1190197 6114596 8804908
10342 8804908 8430493 8437430 10670481 13075847 11048711 3377993 -4402459 -5910267 -1892219
10333 -1892219 1552772 1573044 902597 1998868 3371933 2507949 -794606 -4680038 -6773888
10324 -6773888 -5762990 -3100729 -1972091 -3083453 -3648348 -2170176 -946229 -1528800
10316 -1528800 -1835722 -1045478 -2640413 -7980423 -11615202 -8969024 -4474211 -5029188 -8814439
10307 -8814439 -8588237 -3868690 -1327887 -3682245 -6317178 -5632929 -3581165 -2565054
10299 -2565054 -1893721 -802912 -98478 158625 437828 -731627 -4712245 -8826273 -9032930
$$ packed form
10358a3105197K877364j543119l893110m03499L598461L378635K494760M459121
10350b136584M715871j128892p496737n888308K399231Q345222P304793K690312
10342H804908l74415O937K233051K405366k027136p670718p780452j507808M018048
10333a892219L444991K0272o70447J096271J373065q63984l302555l885432k093850
10324f773888J010898K662261J128638j111362n64895J478172J223947n82571
10316a528800l06922P90244j594935n340010l634779K646178M494813n54977l785251
10307h814439K26202M719547K540803k354358k634933O84249K051764J016111
10299b565054O71333J090809P04434K57103K79203j169455l980618m114028k06657
$$ plain form
10290 -9032930 -5779364 -2769821 -1346019 -763037 -1743965 -4144793 -3867297 1014014 3882895
10281 3882895 -2166229 -11715479 -12506626 -3145802 4935966 4288582 -178423 -2208394
10273 -2208394 -3324703 -6271894 -8017472 -5183563 -310694 2271290 1913819 -467301
10265 -467301 -4747229 -8891691 -9455109 -7499026 -8173525 -11917239 -12649144 -7591438 -1797315
10256 -1797315 646229 2566966 6510008 8969002 7203346 5077141 6132695 6903991
10248 6903991 3367287 -1457635 -2747305 -1717415 -1874470 -2179189 -437235 973477
10240 973477 -608147 -2415547 -1665317 -2347495 -8881595 -16505896 -16361815 -8186183 -168820
10231 -168820 2565937 2157515 1726070 1859250 2974208 5055316 5568958 3233119 2570321
$$ packed form
10290i032930L253566L009543J423802N82982r80928k400828K77496M881311K868881
10281C882895o049124r549250p91147R360824Q081768o47384m467005k029971
10273b208394j116309k947191j745578K833909M872869K581984l57471k381120
10265d67301m279928m144462n63418J956083o74499l743714p31905N057706N794123
10256a797315K443544J920737L943042K458994j765656k126205J055554P71296
10248F903991l536704m824922j289670J029890j57055l04719J741954J410712
10240I73477j581624j807400P50230o82178o534100p624301J44081Q175632Q017363
10231a68820K734757m08422m31445J33180J114958K081108N13642k335839o62798
$$ plain form
10222 2570321 8390918 16767388 18425387 11144480 2289897 -1386156 -192705 2870502
10214 2870502 6497000 9329920 9223909 6389985 3437167 1381981 -509728 -925009
10206 -925009 2527414 8121764 10999715 10214818 9495827 9855960 7330862 493164 -5285480
10197 -5285480 -4732489 251462 4114649 5107821 5578069 7016756 8156204 6924046 2288983
10188 2288983 -4522521 -9370027 -7894180 -661812 6293037 7962582 5773700 4733869
10180 4733869 6816814 9381329 9238200 6142571 2250084 -493133 -1883817 -2712808
10172 -2712808 -3033619 -2083625 -188801 753992 -75965 -775126 444948 2195080 2077691
10163 2077691 593444 -119826 -373079 -2045424 -4069259 -3047484 1004644 3706537
$$ packed form
10222B570321N820597Q376470J657999p280907q854583l676053J193451L063207
10214B870502L626498K832920j06011k833924k952818k055186j891709m15281
10206i25009L452423N594350K877951p84897p18991L60133k525098o837698n778644
10197e285480N52991M983951L863187R93172M70248J438687J139448j232158m635063
10188B288983o811504m847506J475847P232368O954849J669545k188882j039831
10180D733869K082945K564515j43129l095629l892487k743217j390684q28991
10172b712808l20811R49994J894824R42793q29957o99161J220074J750132j17389
10163B077691j484247p13270k53253j672345k023835J021775M052128K701893
$$ plain form
10155 3706537 2615169 705260 1350924 3140507 2665536 69037 -1695760 -2092980 -4047710
10146 -4047710 -9162836 -14127254 -13523721 -6088028 2740013 5518018 358675 -7187355
10138 -7187355 -10484303 -8680001 -5837145 -4876585 -5161394 -5412439 -5693823 -5819708 -4481166
10129 -4481166 -1267119 2143517 3833066 3514701 2100385 612963 -307359 -1068425 -3120597
10120 -3120597 -6753884 -9294919 -7564534 -2063334 3397410 6245977 7125030 7305132
10112 7305132 6745012 5424639 4347810 4186588 4429534 4410404 3903991 2800592 1680118
10103 1680118 2077779 4187464 5335580 3563130 1599546 3303386 6703245 5613483
10095 5613483 -989311 -6412959 -5239266 -175744 3021496 3137832 2175728 219322
$$ packed form
10155C706537j091368j909909O45664J789583m74971k596499j764797l97220j954730
10146d047710n115126m964418O03533P435693Q828041K778005n159343p546030
10138g187355l296948J804302K842856R60560k84809k51045k81384j25885J338542
10129d481166L214047L410636J689549l18365j414316j487422r20322p61066k052172
10120c120597l633287k541035J730385N501200N460744K848567Q79053J80102
10112G305132n60120j320373j076829j61222K42946j9130n06413j103399j120474
10103A680118L97661K109685J148116j772450j963584J703840L399859j089762
10095E613483o602794n423648J173693N063522L197240J16336r62104j956406
$$ plain form
10087 219322 -3397586 -6062021 -4254945 659204 3382789 1455407 -2509155 -5327130
10079 -5327130 -6336119 -5555278 -2528774 1428982 2799361 -97632 -4369101 -5808742
10071 -5808742 -3617246 -55288 3329325 6532419 8560684 7312237 3431273 1689655
10063 1689655 5587234 11657701 12602566 6500694 -368001 -1373592 2609556 5436153
10055 5436153 3475247 -1651240 -6431465 -8381247 -6538230 -2215309 1009893 745795
10047 745795 -1001606 -466118 2543196 4559327 3290649 -84630 -3080304 -3929087 -2177981
10038 -2177981 280586 72611 -2950914 -3948205 154030 4777277 4084342 764850 1832994
10029 1832994 5924020 4332878 -4061512 -9296899 -5897488 -1999358 -6006216 -12598370
$$ packed form
10087B19322l616908k664435J807076M914149K723585j927382l964562k817975
10079e327130j008989P80841L026504L957756J370379k896993m271469j439641
10071e808742K191496L561958L384613L203094K028265j248447l880964j741618
10063A689655L897579O070467R44865o101872o868695j005591L983148K826597
10055E436153j960906n126487m780225j949782J843017M322921L225202k64098
10047G45795j747401N35488L009314K016131j268678l375279k995674q48783J751106
10038b177981K458567k07975l023525r97291M102235M623247o92935l319492J068144
10029A832994M091026j591142q394390n235387L399411L898130m006858o592154
$$ plain form
10021 -12598370 -11240860 -2651302 3440544 3496948 2858196 4595480 5622989 4588860
10013 4588860 4645329 6179192 4561130 -1644263 -6697972 -5775665 -1938304 -973287 -3260004
10004 -3260004 -4910165 -4045303 -1776428 1151647 4605534 6666935 4695730 -497335
9996 -497335 -4012937 -1926638 3834487 7021964 3807992 -2816461 -6370317 -4176658
9988 -4176658 287018 2352476 1136656 -1412761 -3880078 -5736125 -6369463 -6186294 -6992997
9979 -6992997 -8806318 -8185960 -2933100 3216268 4610904 1622692 213632 3203045
9971 3203045 6065220 2991390 -5707410 -13871015 -15395239 -9080117 618594 7079382
9963 7079382 7411680 5169284 5607998 8650220 9178147 4527251 -1371689 -2792295 965632
$$ packed form
10021a2598370J357510Q589558O091846N6404o38752J737284J027509j034129
10013D588860N6469J533863j618062o205393n053709R22307L837361R65017k286717
10004c260004j650161Q64862K268875K928075L453887K061401j971205n193065
9996d97335l515602K086299N761125L187477l213972o624453l553856K193659
9988d176658M463676K065458j215820k549417k467317j856047o33338J83169q06703
9979f992997j813321O20358N252860O149368J394636k988212j409060K989413
9971C203045K862175l073830q698800q163605j524224O315122R698711O460788
9963G079382L32298k242396M38714L042222N27927m650896n898940j420606L757927
$$ plain form
9954 965632 5305945 5785097 2447405 -840241 -567476 2907324 5988273 5883524 3212053
9945 3212053 384871 -1120481 -1042941 356020 1852537 1747269 332758 93781 1788569
9936 1788569 2598210 420637 -2524643 -3415822 -3746407 -6820453 -12352340 -17540849 -21516694
9927 -21516694 -24192598 -22777495 -15253191 -6271717 -3218326 -6289333 -8788824 -7935481
9919 -7935481 -8389826 -12781372 -15551940 -10550042 22007 8628640 10970499 7926454
9911 7926454 2318877 -2301519 -2364190 2067682 5883251 4393603 -1193223 -6325852 -9078762
9902 -9078762 -10365907 -9943083 -6240419 -132215 4379263 4268940 520061 -3856649 -7679128
9893 -7679128 -11931950 -15950509 -15221052 -6164461 6787248 13461578 9995802 4036296
$$ packed form
9954I65632M340313M79152l337692l287646K72765L474800L080949j04749k671471
9945C212053k827182j505352P7540J398961J496517j05268j414511k38977J694788
9936A788569Q09641k177573k945280q91179l30585l074046n531887n188509l975845
9927b1516694k675904J415103P524304Q981474L053391l071007k499491Q53343
9919g935481m54345m391546k770568N001898J0572049Q606633K341859l044045
9911G926454n607577m620396o2671M431872L815569j489648n586826n132629k752910
9902i078762j287145M22824L702664O108204M511478j10323l748879m376710l822479
9893g679128m252822m018559P29457R056591J2951709O674330l465776n959506
$$ plain form
9885 4036296 3244306 3646653 -2323482 -9566875 -4049974 15465684 31012168 26727959
9877 26727959 8085956 -7063426 -9762470 -4584982 1342498 4872975 5013715 2634340
9869 2634340 1321997 2950186 4005138 1356325 -1149785 1891979 7920347 9408958
9861 9408958 4943685 194610 -1243944 -678555 1523268 6624895 11602978 10599181
9853 10599181 4512725 1689408 5812191 9974368 7061257 -64786 -4030525 -3698384
9845 -3698384 -3375032 -4567455 -4912957 -3930648 -3991433 -5505600 -6047220 -5142277 -5655979
9836 -5655979 -8525679 -9524012 -4413636 4205297 8608723 4972317 -1935449 -4743555
9828 -4743555 -2323223 98581 -1107286 -3643120 -3972984 -2644869 -2078454 -1705296 731870
$$ packed form
9885D036296p91990M02347n970135p243393N516901J9515658J5546484m284209
9877B6727959j8642003j5149382k699044N177488N927480L530477J40740k379375
9869B634340j312343J628189J054952k648813k506110L041764O028368J488611
9861I408958m465273m749075j438554N65389K201823N101627M978083j003797
9853A0599181o086456k823317M122783M162177k913111p126043l965739L32141
9845c698384L23352j192423l45502R82309o0785j514167n41620R04943n13702
9836e655979k869700r98333N110376Q618933M403426l636406o907766k808106
9828d743555K420332K421804j205867k535834l29864J328115N66415L73158K437166
$$ plain form
9819 731870 4133325 4349121 -60639 -5430533 -7239001 -4702925 -538003 2208942 2604724
9810 2604724 2194283 2962416 4466692 4185339 1475339 -1118765 -2209632 -4184861 -8332583
9801 -8332583 -10483052 -6430324 412760 2705968 -392613 -2933864 -2385197 -2870103 -6266170
9792 -6266170 -7387032 -2350091 4020703 4602811 -164980 -4235231 -4764233 -3431887 -1181895
9783 -1181895 2294756 4629920 2394022 -2548350 -3583343 1787177 7895009 8449180
9775 8449180 4820026 3219921 5531685 7165838 4322267 -275598 -1147997 2377999
9767 2377999 5473889 4633124 2139970 2103627 4368669 5289215 3554132 1825968 2183192
9758 2183192 3094762 2389796 738036 131764 689813 1293670 2254862 4783137 8077716
$$ packed form
9819G31870L401455K15796m409760n369894j808468K536076M164922K746945L95782
9810B604724m10441P68133J504276k81353k710000k594104j090867j975229m147722
9801h332583k150469M052728O843084K293208l098581k541251N48667m84906l396067
9792f266170j120862N036941O370794N82108m767791m070251n29002J332346K249992
9783a181895L476651K335164k235898m942372j034993N370520O107832N54171
9775H449180l629154j600105K311764J634153k843571m597865q72399L525996
9767B377999L095890q40765k493154l6343K265042R20546j735083j728164L57224
9758B183192R11570p04966j651760o06272N58049O03857R61192K528275L294579
$$ plain form
9749 8077716 9403302 7693369 5187956 4257759 3861852 1054830 -4035408 -6737559 -2885014
9740 -2885014 5460023 11299857 9977832 3477831 -2945559 -6218117 -6319143 -4226502
9732 -4226502 -1606675 -882723 -2466435 -2911523 763365 5536838 5303429 -270427 -4286734
9723 -4286734 -1789343 3754919 6105004 4790953 3743105 3723002 1510896 -3417478 -6500412
9714 -6500412 -4254901 1007502 5326269 8747483 12848732 14793599 9704751 -335278
9706 -335278 -5681083 -1232178 5498726 4163431 -3584270 -6631552 -1226169 3661734
9698 3661734 775360 -4148926 -2012611 5062266 7511588 3442359 585418 3356177
9690 3356177 6614330 4447334 -1822473 -7579570 -11337941 -13507433 -12842810 -8145612
$$ packed form
9749H077716J325586j709933k505413r30197l95907k807022n090238k702151L852545
9740b885014Q345037N839834j322025o500001o423390l272558j01026K092641
9732d226502K619827P23952j583712m45088L674888M773473k33409n573856m016307
9723d286734K497391N544262K350085j314051j047848k0103k212106m928374l082934
9714f500412K245511N262403M318767L421214M101249J944867n088848j0040029
9706c35278n345805M448905O730904j335295p747701l047282N405383M887903
9698C661734k886374m924286K136315P074877K449322m069229k856941K770759
9690C356177L258153k166996o269807n757097l758371k169492O64623M697198
$$ plain form
9682 -8145612 -1433582 3334365 3581699 -536345 -5958376 -7819711 -3980057 1225088
9674 1225088 1457399 -3100000 -6134157 -4626197 -2352054 -2385053 -2227716 418831 2780242
9665 2780242 2197111 1180172 2399305 3143570 383076 -2542948 -769141 3235908 2445425
9656 2445425 -4302785 -10897902 -12493905 -9753549 -4808121 1187257 5784112 5918578
9648 5918578 2425125 -271397 -182949 285627 -778044 -2029731 -2113410 -1557140 4200
9639 4200 4184449 9299453 9916705 4458286 -408700 2248079 9328439 10863253 3577989
9630 3577989 -4045951 -2907825 4322133 6557075 -1064017 -11068355 -13993854 -10405857
9622 -10405857 -8209598 -10543512 -12550671 -10538521 -7939648 -9003264 -11680838 -11607192
$$ packed form
9682h145612O712030M767947K47334m118044n422031j861335L839654N205145
9674A225088K32311m557399l034157J507960K274143l2999J57337K646547K361411
9665B780242n83131j016939J219133P44265k760494k926024J773807M005049p90483
9656B445425o748210o595117j596003K740356M945428N995378M596855J34466
9648E918578l493453k696522Q8448M68576j063671j251687q3679N56270J561340
9639D200M180249N115004O17252n458419m866986K656779P080360J534814p285264
9630C577989p623940J138126P229958K234942p621092j0004338k925499L587997
9622a0405857K196259k333914k007159K012150K598873j063616k677574P3646
$$ plain form
9614 -11607192 -9579099 -9288145 -9686131 -6201303 444394 3226313 -1086213 -6170189
9606 -6170189 -4372663 2779825 6868414 3829753 -1746827 -4024622 -3499238 -4573160
9598 -4573160 -7957569 -9593532 -7528970 -5914886 -9179579 -14610224 -15159820 -9250338
9590 -9250338 -2985538 -1244387 -1271253 1703239 6296565 7151939 3360870 -239770 -53036
9581 -53036 2164311 3001358 1956302 915550 1196272 2428387 3212365 2156949 -896957
9572 -896957 -4363072 -6263635 -6082145 -4786563 -3462814 -2603122 -2338567 -2795261 -4356031
9563 -4356031 -7230812 -10018580 -9799630 -5753658 -1638915 -1335050 -2558610 351334 7076010
9554 7076010 10540945 7543289 4106678 6322021 11158408 11498250 6162403 -389227
$$ packed form
9614a1607192K028093K90954l97986L484828O645697K781919m312526n083976
9606f170189J797526P152488M088589l038661n576580k277795N25384j073922
9598d573160l384409j635963K064562J614084l264693n430645n49596N909482
9590i250338O264800J741151k6866K974492M593326Q55374l791069l600640J86734
9581e3036K217347Q37047j045056j040752K80722J232115P83978j055416l053906
9572h96957l466115j900563J81490J295582J323749Q59692K64555m56694j560770
9563d356031k874781k787768K18950M045972M114743L03865j223560K909944O724676
9554G076010L464935k997656l436611K215343M836387L39842n335847o551630
$$ plain form
9546 -389227 -4777270 -5828195 -2542639 3371779 6299514 3916609 1967446 5448476
9538 5448476 9310892 6104351 -1042170 -3110037 -208887 -426047 -4530521 -4471751 1170372
9529 1170372 3153553 -2480392 -6373353 -733146 7752784 8328235 1801729 -3093842
9521 -3093842 -3313784 -2738355 -3550931 -4236998 -3865272 -2175511 2247400 8699804 12204395
9512 12204395 9676380 5091785 3640646 4383834 3910694 3237263 4978848 7264816 6885473
9503 6885473 5317723 5284097 4725642 1018487 -2428012 -1624968 -648944 -5604948 -12273263
9494 -12273263 -10244725 847439 9653889 9130192 4355745 1673585 -361667 -4638589
9486 -4638589 -8299255 -7722904 -4861417 -3363710 -3046166 -2566486 -2970870 -4333064 -3407660
$$ packed form
9546c89227m388043j050925L285556N914418K927735k382905j949163L481030
9538E448476L862416l206541p146521k067867K901150k17160m104474N8770N642123
9529A170372J983181n633945l892961N640207Q485930N75451o526506m895571
9521c093842k19942N75429q12576o86067L71726J689761M422911O452404L504591
9512A2204395k528015m584595j451139P43188m73140o73431J741585K285968l79343
9503F885473j567750l3626n58455l707155l446499Q03044R76024m956004o668315
9494a2273263K028538J1092164Q806450n23697m774447k682160k035252m276922
9486d638589l660666N76351K861487J497707L17544M79680m04384j362194R25404
$$ plain form
9477 -3407660 922689 4096794 2330955 -1301237 -1847850 288120 1962034 3363972
9469 3363972 5950242 7586759 5924088 4163432 6913634 11849134 12263142 7358397
9461 7358397 3149288 2702992 2475736 222378 -154844 4624428 10704586 11853970 7424541
9452 7424541 1417034 -3729527 -7988489 -10149022 -8220344 -3481306 -286444 -994306
9444 -994306 -3788849 -6117497 -7558815 -8229071 -6942785 -2933833 2040422 5088523 4847477
9435 4847477 1599606 -3935197 -10152307 -14008473 -13357927 -9737507 -6722297 -5433172
9427 -5433172 -3891163 -1164146 566323 -480881 -2413097 -2154713 206328 1938928
9419 1938928 1728749 818695 320978 -318965 -1720644 -3059555 -2745624 201977 5252720
$$ packed form
9477c407660M330349L174105j765839l632192n46613K135970J673914J401938
9469C363972K586270J636517j662671j760656K750202M935500M14008m904745
9461G358397m209109m46296k27256k253358l77222M779272O080158J149384m429429
9452G424541o007507n146561m258962k160533J928678M739038L194862p07862
9444i94306k794543k328648j441318o70256J286286M008952M974255L048101k41046
9435D847477l247871n534803o217110l856166O50546L620420L015210J289125
9427e433172J542009K727017J730469j047204j932216K58384K361041J732600
9419A938928k10179r10054m97717o39943j401679j338911L13931K947601N050743
$$ plain form
9410 5252720 9852934 10562965 6476096 1124083 -1006234 247726 958516 -1393959 -4974594
9401 -4974594 -6579404 -5394008 -3133222 -2316488 -4691027 -9205936 -11582290 -8931684
9393 -8931684 -4969364 -6387208 -12740508 -15074063 -7939883 2067675 4995280 1001242
9385 1001242 -1519124 911856 3376450 2310158 759929 1463804 1755478 -418976 -1129817
9376 -1129817 3425889 9374154 9610415 3704391 -1891968 -2334200 1489040 6196556 8602412
9367 8602412 5866384 -2106644 -10111251 -11860960 -7541176 -3554225 -4361305 -8257760
9359 -8257760 -11397270 -11692972 -8159237 -1205182 4992815 5237786 596178 -1603345 2449738
9350 2449738 7949043 9290793 8015176 8322164 8968567 5648436 -1084745 -6279366 -7648959
$$ packed form
9410E252720M600214P10031m086869n352013k130317J253960P10790k352475l580635
9401d974594j604810J185396K260786Q16734k374539m514909k376354K650606
9393h931684L962320j417844o353300k333555P134180J0007558K927605l994038
9385A001242k520366K430980K464594j066292j550229P03875K91674k174454p10841
9376a129817M555706N948265K36261n906024n596359m42232L823240M707516K405856
9367H602412k736028p973028q004607j749709M319784L986951q07080l896455
9359h257760l139510k95702L533735O954055O197997K44971m641608k199523M053083
9350B449738N499305J341750j275617L06988O46403l320131o733181n194621j369593
$$ plain form
9341 -7648959 -6729829 -4060253 995307 5717692 5130117 -1042086 -6911417 -7222777 -2154935
9332 -2154935 4961522 10560921 11009487 4771308 -3815429 -7174018 -3162279 2333413
9324 2333413 3387671 946658 -606444 -91441 694030 1276898 2892354 5633540 7910568
9315 7910568 8214780 5966474 1739235 -2221063 -3337929 -1796178 -469049 -533111 599559
9306 599559 5182002 11003547 13549064 11042531 5807341 1941373 2656175 7829944 12769693
9297 12769693 11714428 4461011 -2678154 -4521605 -3159326 -3785415 -6823885 -8143216
9289 -8143216 -6099171 -4112672 -5298172 -7562320 -6179687 -310755 5004054 4399519
9281 4399519 -867900 -3684086 44172 5750917 6463605 2498172 -143465 -163487 -2913749
$$ packed form
9341g648959R19130K669576N055560M722385n87575o172203n869331l11360N067842
9332b154935P116457N599399M48566o238179q586737l358589M011739N495692
9324B333413J054258k441013j553102N15003P85471N82868J615456K741186K277028
9315G910568L04212k248306m227239l960298j116866J541751J327129o4062J132670
9306E99559M582443N821545K545517k506533n235190l865968P14802N173769M939749
9297A2769693j055265p253417p139165j843451J362279o26089l038470j319331
9289h143216K044045J986499j185500k264148J382633N868932N314809o04535
9281D399519n267419k816186L728258N706745P12688l965433k641637k0022k750262
$$ plain form
9272 -2913749 -10143513 -14762556 -10509582 -1700181 2535762 432464 -2111526 -1512479
9264 -1512479 -471159 -1901578 -4232568 -4396334 -2289548 -631834 -1732138 -4940149
9256 -4940149 -6946515 -5377338 -2021946 -310718 269695 3229866 7798663 8285607 3582578
9247 3582578 1183372 6607192 14177103 14975251 9678327 5824741 5601461 5029953 3532625
9238 3532625 5081589 9628743 11916962 10067125 7690460 6072003 1938521 -4955509
9230 -4955509 -9531567 -9365474 -7906167 -6933846 -3232555 3533391 7243589 4842501 2584458
9221 2584458 6324491 11278768 9020840 865087 -3599068 219273 6850530 8768163
9213 8768163 4392786 -1866201 -3881023 1227584 9391354 12421496 7504540 1311314
$$ packed form
9272b913749p229764m619043M252974Q809401M235943k103298k543990N99047
9264a512479J041320j430419k330990j63766K106786J657714j100304l208011
9256d940149k006366J569177L355392J711228N80413K960171M568797M86944m703029
9247C582578k399206N423820P569911P98148n296924l853586k23280n71508j497328
9238C532625J548964M547154K288219j849837k376665j618457m133482o894030
9230d955509m576058J66093J459307R72321L701291O765946L710198k401088k258043
9221B584458L740033M954277k257928q155753m464155L818341O631257J917633
9213H768163m375377o258987k014822N108607Q163770L030142m916956o193226
$$ plain form
9205 1311314 897645 3921015 3616982 582418 1546798 6813787 7931294 936118 -5960364
9196 -5960364 -3774669 3720481 5551633 -31137 -3462112 769209 5154538 714188
9188 714188 -8561679 -10861707 -3769392 2735051 1690403 -1405608 755595 4926410
9180 4926410 3313666 -3158752 -6855712 -6165339 -6326711 -7763961 -3978609 6105378
9172 6105378 12971578 8858208 -1537060 -8106058 -7720343 -4377054 -1685442 -651831
9164 -651831 -1309689 -1630864 1938551 8578375 11483638 6669226 -630552 -3410040 -2612575
9155 -2612575 -3503515 -6163713 -6569654 -4506641 -3245992 -2954335 -1216508 1090348 1028243
9146 1028243 -394441 -54084 603069 -2073607 -5616504 -3474213 4146503 9407321 8160601
$$ packed form
9205A311314m13669L023370l04033l034564R64380N266989J117507o995176o896482
9196e960364K185695P495150J831152n582770l430975M231321M385329m440350
9188G14188r275867k300028P092315O504443j044648l096011K161203M170815
9180D926410j612744o472418l696960O90373j61372j437250L785352J0083987
9172F105378O866200m113370j0395268o568998L85715L343289K691612J033611
9164f51831o57858l21175L569415O639824K905263m814412p299778k779488P97465
9155b612575q90940k660198m05941K063013J260649K91657J737827K306856o2105
9146A028243j422684L40357O57153k676676l542897K142291P620716N260818j246720
$$ plain form
9137 8160601 4415465 1692646 -1829592 -6332658 -6709145 -963771 4511105 3849746 344588
9128 344588 165540 2425448 2309670 215438 202420 1553802 -398949 -5438648 -7660279
9119 -7660279 -4737350 -1852565 -3880167 -8317780 -9225916 -5191504 -94515 2515961
9111 2515961 2891141 3134017 3812321 3316373 134947 -4771917 -8371924 -8580533 -6387797
9102 -6387797 -4454311 -4104140 -4480041 -4241424 -3005362 -1068909 1256827 3430466 4298395
9093 4298395 2827174 -372872 -2746837 -2003171 1099408 3036353 1171444 -3585094
9085 -3585094 -8213758 -10478034 -9599665 -5853244 -1397393 38199 -2824145 -5781474
9077 -5781474 -3386224 3537165 7717063 3806742 -5510326 -12812518 -13141605 -7084837
$$ packed form
9137H160601l745136k722819l522238m503066l76487N745374N474876o61359l505158
9128C44588j79048K259908j15778k094232j3018J351382j952751n039699k221631
9119g660279K922929K884785k027602m437613r08136M034412N096989K610476
9111B515961L75180K42876O78304m95948l181426m906864l600007k08609K192736
9102f387797J933486L50171l75901K38617J236062J936453K325736K173639Q67929
9093D298395j471221l200046k373965P43666L102579J936945j864909m756538
9085c585094m628664k264276Q78369L746421M455851J435592k862344k957329
9077e781474K395250O923389M179898l910321r317068p302192l29087O056768
$$ plain form
9069 -7084837 739049 4804792 2603489 -2667202 -4919135 -2085152 1549788 1286965
9061 1286965 -1899454 -3278618 -573376 4137488 7531010 7833599 5441525 2768501
9053 2768501 2579801 4617056 5044001 1415211 -3103049 -3381182 548278 3383651 1736857
9044 1736857 -1952905 -3707841 -2962175 -1096031 2314508 8290508 14317243 15159647 9235129
9035 9235129 1904402 133101 4645901 9586090 9961357 6959414 4723335 4280698 3443253
9026 3443253 1533229 621367 1627678 2547028 2110173 2300965 4767307 7036322 5664060
9017 5664060 1941008 673465 3239944 5613613 4576411 2500949 3256552 5611340
9009 5611340 4455551 -1640337 -7533855 -7560884 -2221936 3131476 4857301 3795431 1966963
$$ packed form
9069g084837P823886M065743k201303n270691k251933K833983L634940k62823
9061A286965l186419j379164K705242M710864L393522L02589k392074k673024
9053B768501j88700K037255M26945l628790m518260k78133L929460K835373j646794
9044A736857l689762j754936P45666J866144L410539N976000O026735Q42404n924518
9035I235129p330727j771301M512800M940189L75267l001943k236079m42637q37445
9026C443253j910024r11862J006311R19350m36855J90792K466342K269015j372262
9017E664060l723052j267543K566479K373669j037202k075462P55603K354788
9009E611340j155789o095888n893518k7029N338948N353412J725825j061870j828468
$$ plain form
9000 1966963 -530153 -4080282 -7072258 -7011465 -3516891 1336978 5248252 6894606 5584477
8991 5584477 1807318 -1746398 -1951767 850668 2354705 -715217 -6078239 -8267255
8983 -8267255 -5382118 -1483923 -1238131 -3634528 -3251281 2160367 7830687 7602453 1938888
8974 1938888 -2583760 -1619663 2282305 4321348 3531955 1954654 314905 -2168545 -4902766
8965 -4902766 -6047249 -5273579 -4125083 -3983863 -5254444 -7257400 -7245802 -2136437 5781335
8956 5781335 8241379 1381027 -6049939 -2426695 9614856 14774399 5748697 -6899012
8948 -6899012 -10210370 -5692836 -3375370 -5730465 -7070565 -5283251 -4099788 -4563970
8940 -4563970 -3632481 -2180893 -5594236 -13663215 -17660051 -11841753 -1936659 2691902
$$ packed form
9000A966963k497116l550129k991976O0793L494574M853869L911274J646354j310129
8991E584477l777159l553716k05369K802435J504037l069922n363022k189016
8983h267255K885137L898195K45792k396397L83247N411648N670320k28234n663565
8974A938888m522648R64097L901968K039043p89393j577301j639749k483450k734221
8965d902766j144483P73670J148496J41220j270581k002956J1598N109365P917772
8956E781335K460044o860352p430966L623244J2041551N159543r025702j2647709
8948f899012l311358M517534K317466k355095j340100J787314J183463m64182
8940d563970R31489J451588l413343q068979l996836N818298R905094M628561
$$ plain form
8932 2691902 784051 -1988665 -2340059 -1740690 -1217367 582078 3760091 5612011 3845391
8923 3845391 -769519 -5363719 -7095423 -4760253 -128523 2749332 1528353 -1452978
8915 -1452978 -2119135 -156032 864290 -1095340 -3760849 -4232898 -3069639 -2875836 -4360160
8906 -4360160 -5815458 -5698117 -3812747 -396322 3977123 7576580 8616297 7695432 7284863
8897 7284863 7993508 7353239 3728502 -596516 -2550505 -2885442 -4472950 -6769829 -5888865
8888 -5888865 -867694 3869622 4214400 1598612 101280 623994 769950 -906633 -3204604
8879 -3204604 -3974459 -1464429 4786762 12114376 15130737 10839125 2681113 -3039116
8871 -3039116 -3962051 -2386820 -528018 1326593 2576721 2335711 2018576 4082463 7513104
$$ packed form
8932B691902j907851k772716l51394N99369N23323J799445L178013J851920j766620
8923C845391m614910m594200j731704K335170M631730K877855j220979k981331
8915a452978o66157J963103J020322j959630k665509m72049J163259J93803j484324
8906d360160j455298J17341J885370L416425M373445L599457J039717r20865m10569
8897G284863P08645o40269l624737m325018j953989l34937j587508k296879Q80964
8888e888865N021171M737316L44778k615788j497332N22714J45956j676583k297971
8879c204604p69855K510030O251191P327614L016361m291612q158012n720229
8871c039116r22935J575231J858802J854611J250128k41010l17135K063887L430641
$$ plain form
8862 7513104 8352944 5730727 3498280 4402842 6533445 7500770 8050717 8656166 6489889
8853 6489889 6585 -6231757 -6087781 63990 6041952 7936258 7351102 6707040 5584668
8844 5584668 3061534 576950 518732 3312506 6894869 8262034 5630708 337098 -3715710
8835 -3715710 -3946481 -1833376 -46593 1999261 6716613 12907889 15612685 12514673
8827 12514673 7170632 3956862 2621776 379717 -2835554 -4415093 -3240742 -684459
8819 -684459 2165936 5298093 7679304 7482050 5355847 4442394 5244593 3391906 -4145206
8810 -4145206 -12638080 -14183529 -8610968 -4508076 -7352101 -11818058 -10223914 -4368463
8802 -4368463 -2300383 -5293712 -5980371 -325055 6335984 8463984 8578196 11207571 14223463
$$ packed form
8862G513104Q39840k622217k232447R04562K130603R67325N49947O05449k166277
8853F489889o483304o238342J43976O151771N977962J894306n85156o44062j122372
8844E584668k523134k484584n8218K793774L582363J367165k631326n293610m052808
8835c715710k30771K113105J786783K045854M717352O191276K704796l098012
8827A2514673n344041l213770j335086k242059l215271j579539J174351K556283
8819f84459K850395L132157K381211j97254k126203r13453Q02199j852687p537112
8810d145206q492874j545449N572561M102892k844025m465957J594144N855451
8802d368463K068080k993329o86659N655316O661039K128000J14212K629375L015892
$$ plain form
8793 14223463 12749438 7752419 3655450 182343 -5738882 -11550714 -10938432 -4335802
8785 -4335802 588973 380602 -220551 1888032 2701291 -186942 -1216119 4341822 11211569
8776 11211569 11178102 5203354 942927 962316 1085621 -965085 -2816003 -3216564 -3690362
8767 -3690362 -3636518 -7767 6588711 10808948 9457844 5117447 1511366 -460987 -787477
8758 -787477 939454 2974011 1895916 -2078037 -4115648 -1475542 2431171 3240168 1503455
8749 1503455 512364 1193646 2201961 2837519 3098119 2559366 1339935 509364 120248
8740 120248 -958082 -2180902 -1377152 1017103 1539347 -549567 -1299267 1420533 3842860
8731 3842860 2384600 -464436 -850267 -202855 -1776515 -3855925 -2557944 887434 1987167
$$ packed form
8793A4223463j474025m997019m096969l473107n921225n811832O12282O602630
8785d335802M924775k08371o01153K108583Q13259k888233j029177N557941O869747
8776A1211569l3467n974748m260427J9389J23305k050706j850918m00561m73798
8767c690362N3844L628751O596478M220237j351104m340397l606081j972353l26490
8758g87477J726931K034557j078095l973953k037611K640106L906713Q08997j736713
8749A503455r91091O81282J008315O35558K60600n38753j219431q30571l89116
8740A20248j078330j222820Q03750K394255N22244k088914p49700K719800K422327
8731C842860j458260k849036l85831O47412j573660k079410J297981L445378J099733
$$ plain form
8722 1987167 621097 558864 2331608 2933029 2203466 3126715 5593170 6094838 4191169
8713 4191169 3181338 3583416 2166485 -1432476 -3488629 -3060025 -3648851 -6263472 -7553002
8704 -7553002 -6901956 -7952645 -10263276 -7821890 -331120 2845084 -3197679 -9056365
8696 -9056365 -4456775 5064153 6054185 -2330311 -7878350 -4332643 1247566 1877440 225124
8687 225124 522481 368515 -3056709 -5536731 -1941622 4268738 4791891 -1855523 -8356546
8678 -8356546 -8282216 -3251701 564721 6464 -2665646 -3585844 -1875564 162809 967623
8669 967623 2035679 4786784 6614493 3327397 -4205908 -9126043 -6122457 1990888
8661 1990888 7144764 4586159 -2832191 -8496603 -8894802 -6031651 -3297799 -577075
$$ packed form
8722A987167j366070o2233J772744O01421p29563R23249K466455N01668j903669
8713D191169j009831M02078j416931l598961k056153M28604n88826k614621j289530
8704g553002O51046j050689k310631K441386P490770L176204o042763n858686
8696i056365M599590R520928R90032q384496n548039L545707N580209O29874j652316
8687B25124K97357j53966l425224k480022L595109O210360N23153o647414o501023
8678h356546P4330N030515L816422n58257k672110r20198J710280K038373Q04814
8669I67623J068056K751105J827709l287096p533305m920135L003586Q113345
8661A990888N153876k558605p418350n664412l98199K863151K733852K720724
$$ plain form
8653 -577075 4351527 10272923 12570628 10362011 9029888 12005076 14347840 10127804
8645 10127804 2752433 562705 4063448 6154240 4862094 6052649 11120734 12146276
8637 12146276 4904320 -2098789 334704 7431680 7190939 -2011763 -10194042 -10738835
8629 -10738835 -7430527 -5904647 -6301799 -6869666 -8322162 -11184992 -13276147 -12890913 -11257783
8620 -11257783 -9558124 -6610118 -1872262 1880669 1481111 -2468087 -6120029 -6100817 -1943396
8611 -1943396 3815551 7398223 7022716 4622865 3024803 2065887 -137948 -2762848 -2678830
8602 -2678830 345572 2620710 2049794 1112241 2323967 4028638 3527689 1663746 788553
8593 788553 124431 -2671490 -6021704 -5120520 588195 4505254 602751 -7933102 -11702598
$$ packed form
8653e77075M928602N921396K297705k208617j332123K975188K342764m220036
8645A0127804p375371k189728L500743K090792j292146J190555N068085J025542
8637A2146276p241956p003109K433493P096976k40741r202702q182279n44793
8629a0738835L308308J525880l97152n67867j452496k862830k091155L85234J633130
8620a1257783J699659K948006M737856L752931l99558l949198l651942J9212M157421
8611a943396N758947L582672l75507k399851j598062r58916k203835k624900Q4018
8602b678830L024402K275138n70916r37553J211726J704671n00949j863943q75193
8593G88553o64122k795921l350214R01184N708715L917059l902503q535853l769496
$$ plain form
8584 -11702598 -6795895 382618 1958837 -1157674 -1964099 1601287 4136330 2012992
8576 2012992 -911959 -56040 2553338 2593605 1071963 1500310 2280611 -819361 -5816262
8567 -5816262 -6094968 -1404539 889468 -2092541 -3528483 1651469 7405516 5579899
8559 5579899 -827495 -1593769 5708444 12479974 11182244 4235687 -909191 -938261 1481080
8550 1481080 2331266 667021 -730800 1261208 5599250 7290587 3577641 -2068083
8542 -2068083 -4653539 -4321977 -4695296 -6161016 -5530438 -2197621 114900 -1224787 -4642302
8533 -4642302 -7951066 -11075573 -13203152 -11032470 -3110478 6431526 11681947 11176329
8525 11176329 7775963 3815693 -388553 -3789069 -4076402 -1172129 1289445 26178
$$ packed form
8584a1702598M906703P178513J576219l116511q06425L565386K535043k123338
8576B012992k924951Q55919K609378M0267j521642M28347P80301l099972m996901
8567e816262k78706M690429K294007k982009j435942N179952N754047j825617
8559E579899o407394p66274P302213O771530j297730o946557n144878k9070K419341
8550A481080Q50186j664245j397821J992008M338042J691337l712946n645724
8542b068083k585456L31562l73319j465720O30578L332817K312521j339687l417515
8533d642302l308764l124507k127579K170682P921992R542004N250421n05618
8525A1176329l400366l960270m204246l400516k87333K904273K461574j263267
$$ plain form
8517 26178 -3663908 -5904225 -5794702 -6189920 -8307825 -8620101 -3718914 3686175 7395520
8508 7395520 5853329 3633458 4274778 6016030 6461004 7015194 9325825 11073632 9722813
8499 9722813 7615549 8297299 9868149 7775232 3209730 2314441 6357727 8854696 4727502
8490 4727502 -2700491 -6788886 -5689592 -2250408 1017822 3496000 4915837 5069971
8482 5069971 4060982 1573572 -2379035 -5313347 -3855840 1102758 4096984 2099602
8474 2099602 -1266844 -1164391 1871060 4153357 5048493 6723949 9019680 8833335 4847653
8465 4847653 -95480 -1910419 1016021 6703090 10774965 9607606 3851262 -1893173
8457 -1893173 -3921342 -2595138 72903 3272986 5867101 5029755 -98898 -5370506
$$ packed form
8517B6178l690086k240317J09523l95218k117905l12276M901187P405089L709345
8508G395520j542191k219871O41320J741252M44974N54190K310631J747807j350819
8499I722813k107264O81750J570850k092917m565502q95289M043286K496969m127194
8490D727502p427993m088395J099294L439184L268230K478178J419837J54134
8482E069971j008989k487410l952607k934312J457507M958598K994226j997382
8474B099602l366446J02453L035451K282297Q95136J675456K295731j86345l985682
8465D847653m943133j814939K926440N687069M071875j167359n756344n744435
8457a893173k028169J326204K668041L200083K594115q37346n128653n271608
$$ plain form
8449 -5370506 -6018159 -2897200 -724993 -1127453 -1494422 -472002 -358863 -3032478 -6740459
8440 -6740459 -8443141 -7393585 -5373454 -4590167 -5650742 -6856594 -6209009 -4864720 -6494491
8431 -6494491 -11262209 -13144753 -6981912 3563112 9493093 7171855 1250956 -2596284
8423 -2596284 -3219824 -2142562 -964257 -1605686 -4897870 -7834545 -6266272 -1291638 1399583
8414 1399583 -247976 -1860486 120502 3347418 4346816 3607600 2587199 244406 -3273197
8405 -3273197 -3635507 1818516 8181908 8284600 2062283 -4252421 -6668750 -6122523 -3905163
8396 -3905163 -96008 3306799 2928967 -1075926 -4700127 -5741724 -6051245 -6993015 -6545681
8387 -6545681 -2956190 1804877 4574022 4746021 3416962 869619 -2547144 -4389320
$$ packed form
8449e370506o47653L120959K172207m02460l66969J022420J13139k673615l707981
8440f740459j702682J049556K020131P83287j060575j205852O47585J344289j629771
8431f494491m767718j882544O162841J0545024N929981k321238n920899l847240
8423b596284o23540J077262J178305o41429l292184k936675J568273M974634K691221
8414A399583j647559j612510J980988L226916R99398p39216j020401k342793l517603
8405c273197l62310N454023O363392J02692o222317o314704k416329N46227K217360
8396c905163L809155L402807l77832m004893l624201j041597l09521r41770M47334
8387f545681L589491M761067K769145J71999j329059k547343l416763j842176
$$ plain form
8379 -4389320 -1914502 3887112 8106790 6806155 1295448 -3514262 -4941120 -5362603
8371 -5362603 -8033819 -11201592 -9338000 -1049115 7338003 8706146 3718297 -698201
8363 -698201 -261854 2898727 5184354 6298886 7634912 8655904 7072873 1764586 -5446137
8354 -5446137 -10442833 -9558776 -3107816 4024739 6945202 5612242 3420401 1896330
8346 1896330 -174600 -2718931 -3467593 -2128355 -1697946 -3598916 -4745937 -2047895 2877664
8337 2877664 6484857 8561397 11213183 14007285 13910134 9866100 4282788 -312522 -3466603
8328 -3466603 -5280662 -5261191 -3696376 -2318857 -2410900 -3313934 -3598798 -2846458 -1599121
8319 -1599121 -135599 2095949 5768475 10211765 12777138 10870274 5423226 1071502
$$ packed form
8379d389320K474818N801614M219678j300635n510707m809710j426858m21483
8371e362603k671216l167773J863592Q288885Q387118J368143m987849m416498
8363f98201M36347L160581K285627J114532J336026J020992j583031n308287p210723
8354e446137m996696Q84057O450960P132555K920463j332960k191841j524071
8346A896330k070930k544331p48662J339238M30409j900970j147021K698042M925559
8337B877664L607193K076540K651786K794102r7151m044034n583312m595310l154081
8328c466603j814059J9471J564815J377519r2043r03034k84864P52340J247337
8319a599121J463522K231548L672526M443290K565373j906864n447048m351724
$$ plain form
8311 1071502 1373958 4802791 7184806 7044938 6051955 4901468 2250015 -1575103 -3263413
8302 -3263413 -1013705 2094886 1836514 -1537879 -4070357 -3606158 -1690839 -51230 1931286
8293 1931286 5173373 8433479 9577832 8313495 6292224 5004673 4595155 4311981 3163715
8284 3163715 536690 -2802894 -4678907 -3721750 -1423185 -426490 -608735 1169134 6383981
8275 6383981 11819892 13209476 10702674 8203070 7733376 7341131 5091643 2267814 1083163
8266 1083163 1466388 2050683 2518407 2693815 908510 -3748535 -8320637 -8410598 -4003153
8257 -4003153 126263 759585 225771 2304622 6387379 8386363 6575985 3764197 3062142
8248 3062142 3518330 1741547 -2557675 -4646710 126052 9981616 17541530 17600416 12225629
$$ packed form
8311A071502L02456L428833K382015j39868r92983j150487k651453l825118j688310
8302c263413K249708L108591k58372l374393k532478M64199J915319J639609J982516
8293A931286L242087L260106J144353j264337k021271j287551m09518k83174j148266
8284C163715k627025l339584j876013R57157K298565R96695j82245J777869N214847
8275F383981N435911J389584k506802k499604m69694l92245k249488k823829j184651
8266A083163L83225N84295M67724J75408j785305m657045m572102q9961M407445
8257d003153M129416O33322n33814K078851M082757J998984j810378k811788p02055
8248C062142M56188j776783m299222k089035M772762R855564P559914N8886n374787
$$ plain form
8239 12225629 7031795 4515721 3229209 1652090 -434149 -3602227 -8225327 -12189696
8231 -12189696 -12450961 -9253830 -5734438 -3253161 -845566 537454 -1788778 -6421344
8223 -6421344 -7645727 -3835470 -730611 -2316373 -3810288 376657 6218919 5400400
8215 5400400 -1336398 -4659011 -448893 4842502 4363474 -564343 -4774494 -6184827
8207 -6184827 -4982420 -907575 4649701 7547347 5727580 2531357 2209414 4704411
8199 4704411 7418350 9147339 9393219 6843809 2024017 -1066886 348023 3390489
8191 3390489 3286491 -73010 -2835371 -3176441 -3004525 -4213200 -6351606 -8039540 -8459894
8182 -8459894 -7479725 -5768151 -4349564 -3121592 -979388 1839870 3492946 3609267 4113694
$$ packed form
8239A2225629n193834k516074j286512j577119k086239l168078m623100l964369
8231a2189696k61265L197131L519392K481277K407595J383020k326232m632566
8223f421344j224383L810257L104859j585762j493915M186945N842262q18519
8215E400400o736798l322613M210118N291395m79028m927817m210151j410333
8207f184827J202407M074845N557276K897646j819767l196223l21943K494997
8199D704411K713939J728989K45880k549410m819792l090903J414909L042466
8191C390489j03998l359501k762361l41070J71916j208675k138406j687934m20354
8182h459894R80169J711574J418587J227972K142204K819258J653076J16321N04427
$$ plain form
8173 4113694 5539363 5392749 2185222 -1762165 -3742421 -3954108 -3224799 -1085247 1149824
8164 1149824 -326963 -5421342 -7184767 -507048 9535038 13784273 10851077 6787659
8156 6787659 5036741 3391045 97244 -3399761 -5864960 -7156175 -6086775 -2371072
8148 -2371072 364258 -1099623 -3730742 -2833244 -630402 -2698616 -7158445 -6540287 -673597
8139 -673597 2163029 -995067 -2979147 507221 2731492 -2860248 -11177652 -12931686
8131 -12931686 -7990053 -3527215 -2540021 -1739035 847589 2719634 1509420 -1417803
8123 -1417803 -2529375 269422 4938349 6230197 1761178 -3494725 -3050383 1441533
8115 1441533 2569061 -843733 -2240886 529286 914857 -4498664 -9000450 -6410975
$$ packed form
8173D113694J425669j46614l207527l947387j980256k11687P29309K139552K235071
8164A149824j476787n094379j763425O677719J0042086M249235k933196m063418
8156F787659j750918j645696l293801l497005k465199j291215J069400L715703
8148b371072K735330j463881k631119Q97498K202842k068214m459829O18158N866690
8139f73597K836626l158096j984080L486368K224271n591740q317404j754034
8131a2931686M941633M462838R87194Q00986K586624J872045j210214k927223
8123a417803j111572K798797M668927J291848m469019n255903M44342M491916
8115A441533J127528l412794j397153K770172L85571n413521m501786K589475
$$ plain form
8107 -6410975 -454978 2963102 4647375 5966513 2448303 -7121364 -13002572 -7027199
8099 -7027199 3332603 5202310 -525364 -2976197 -217666 -203336 -4377937 -4870361 727965
8090 727965 5088273 4374211 3683957 5697484 5169944 -513806 -5230333 -3917450 -167607
8081 -167607 959296 272625 102297 -271143 -592304 2016474 6600153 7222119 2303162
8072 2303162 -2015569 -1994333 -2171248 -6127137 -8977448 -5292284 1993638 6923065 8913541
8063 8913541 9613926 7233511 948489 -4012161 -2793971 1494402 2963601 1761338
8055 1761338 1551731 2279165 1897232 1562603 2790219 3198983 1264003 908159 4466135
8046 4466135 5840495 -1020496 -10981858 -14414466 -11689115 -10602147 -11579310 -7255832
$$ packed form
8107f410975N955997L418080J684273J319138l518210r569667n881208N975373
8099g027199J0359802J869707n727674k450833K758531J4330m174601m92424N598326
8090G27965M360308p14062o90254K013527n27540n683750m716527J312883L749843
8081a67607J126903o86671j70328l73440l21161K608778M583679O21966m918957
8072B303162m318731K1236j76915l955889k850311L685164P285922M929427J990476
8063H913541P00385k380415o285022m960650J218190M288373J469199j202263
8055A761338k09607P27434l81933l34629J227616M08764j934980l55844L557976
8046D466135J374360o860991r961362l432608K725351J086968r77163M323478
$$ plain form
8038 -7255832 2912360 9542763 7862817 4920709 7658255 12595174 12952134 8749717
8030 8749717 3685147 -2070171 -9175634 -13509184 -10370413 -2370925 2901482 2534628
8022 2534628 873632 2473669 6460171 8797292 7491099 4239563 2049425 2154663
8014 2154663 3356362 4198150 4768923 5270983 4077536 -148607 -4759698 -4962160 -378511
8005 -378511 3396145 1810669 -2636018 -4147866 -1661330 285990 -1498032 -4324891
7997 -4324891 -3533212 1044034 4821950 4275729 852324 -1549770 -1078232 1538720 5196985
7988 5196985 8693574 9913990 7876317 5244861 5484008 7642268 7966330 6890688 9102931
7979 9102931 14955699 17712153 12988094 5549444 1786252 372541 -3230778 -7128093
$$ packed form
8038g255832J0168192O630403j679946k942108K737546M936919L56960m202417
8030H749717n064570n755318p105463m333550L138771P999488N272407l66854
8022B534628j660996J600037L986502K337121j306193l251536k190138J05238
8014B154663J201699Q41788N70773N02060j193447m226143m611091k02462M583649
8005c78511L774656j585476m446687j511848K486536J947320j784022k826859
7997d324891P91679M577246L777916n46221l423405k402094M71538K616952L658265
7988E196985L496589J220416k037673k631456K39147K158260L24062j075642K212243
7979I102931N852768K756454m724059p438650l763192j413711l603319l897315
$$ plain form
7971 -7128093 -5795129 -267988 2851617 2014141 2123147 4677971 4758624 120520 -4228654
7962 -4228654 -4074016 -2278293 -2933394 -4555923 -3613682 -734454 876781 95980 -2363044
7953 -2363044 -5563988 -6874841 -2943233 4394096 7441829 2231587 -5032436 -5869173
7945 -5869173 -325365 5295555 7985347 9034585 8302607 4876154 2202055 4976464
7937 4976464 10838022 12583036 9522237 8734050 12703445 14105332 7816487 633470
7929 633470 1508603 7260742 7073769 -1041242 -7796887 -7225858 -4495079 -5527649 -6793949
7920 -6793949 -2138867 5149588 5368891 -3452014 -11713725 -10203006 -515940 8993855
7912 8993855 13304144 13100120 10107281 4920768 -752759 -3525679 -1524801 3347637
$$ packed form
7971g128093J332964N527141L119605q37476J09006K554824Q0653m638104m349174
7962d228654J54638J795723o55101j622529R42241K879228J611235p80801k459024
7953b363044l200944j310853L931608P337329L047733n210242p264023q36737
7945e869173N543808N620920K689792J049238p31978l426453k674099K774409
7937D976464N861558J745014l060799p88187L969395J401887o288845p183017
7929F33470Q75133N752139j86973q115011o755645N71029K730779j032570j266300
7920f793949M655082P288455K19303q820905q261711J510719R687066R509795
7912H993855M310289k04024k992839n186513n673527k772920K000878M872438
$$ plain form
7904 3347637 7191377 7459001 4625202 1623452 1629712 5219748 9463915 10782247 8837692
7895 8837692 6463090 5349438 3302948 -2582175 -10495669 -14015168 -9262413 -699874
$$ packed form
7904C347637L843740K67624k833799l001750O260L590036M244167J318332j944555
7895H837692k374602j113652k046490n885123p913494l519499M752755Q562539
$$ [...]
##END NTUPLES=NMR SPECTRUM
##END=
